##TITLE=1H_DE-80H_X3
 200.13MHz, d2o
 8 sc
 
 19ns.26.2.2025
##JCAMPDX= 6.0         $$ Bruker NMR JCAMP-DX V2.0
##DATA TYPE= NMR SPECTRUM
##DATA CLASS= NTUPLES
##ORIGIN= UXNMR, Bruker Analytische Messtechnik GmbH
##OWNER= pz
$$ XWIN-NMR		Version 3.5
$$ Mon Oct  6 11:50:26 2025 Russian Standard Time (UT+4h)  Yarkov@DPX200
##.OBSERVE FREQUENCY= 200.1313
##.OBSERVE NUCLEUS= ^1H
##.ACQUISITION MODE= SIMULTANEOUS
##.ACQUISITION SCHEME= undefined
##.AVERAGES= 8
##.DIGITISER RES= 18
##SPECTROMETER/DATA SYSTEM= spect
##.PULSE SEQUENCE= zg30
##.SOLVENT NAME= DMSO
##.SHIFT REFERENCE= (INTERNAL, DMSO, 0, 15.5012)
##AUDIT TRAIL= $$ (NUMBER, WHEN, WHO, WHERE, WHAT)
$$ ##TITLE= Audit trail, XWIN-NMR		Version 3.5
$$ ##JCAMPDX= 5.01
$$ ##ORIGIN= Bruker BioSpin GmbH
$$ ##OWNER= Yarkov
$$ C:/Bruker/XWIN-NMR/data/yarkov2/nmr/H-C/1/pdata/1/auditp.txt
$$ ##AUDIT TRAIL=  $$ (NUMBER, WHEN, WHO, WHERE, WHAT)
(   1,<2025-10-06 11:48:40.75 +0400>,<Yarkov>,<DPX200>,
      <created by zg, POWCHK disabled, PULCHK disabled
       configuration hash MD5:
       00 E9 B6 7A A2 85 ED C7 34 08 36 98 17 FE 4E 26
       data hash MD5: 16K
       6F 30 59 6E 6D 03 FE 4D FC 30 D0 42 51 F6 AC 09>)
(   2,<2025-10-06 11:48:55.48 +0400>,<Yarkov>,<DPX200>,
      <Start of raw data processing
       efp BC_mod = 2 LB = 0.25 FT_mod = 6 PKNL = 1 PHC0 = -2070.339 PHC1 = 13.79097 SI = 16K 
       data hash MD5: 16K
       A4 05 95 6A 7C B9 93 F2 98 39 D7 6E 15 84 79 72>)
(   3,<2025-10-06 11:48:59.87 +0400>,<Yarkov>,<DPX200>,
      <abs ABSG = 5 
       data hash MD5: 16K
       16 DF 8C 9C 7D 57 7C 89 FB 1D 5C 47 6B 49 2A 54>)
(   4,<2025-10-06 11:49:12.92 +0400>,<Yarkov>,<DPX200>,
      <pk PHC0 = -3.429174 PHC1 = -5.199999 
       data hash MD5: 16K
       CB 5F FF E9 14 B1 7D F0 20 74 61 C2 23 5A 82 89>)
(   5,<2025-10-06 11:49:19.89 +0400>,<Yarkov>,<DPX200>,
      <abs ABSG = 5 
       data hash MD5: 16K
       8F FF 56 E6 7C EB 64 0A A7 A1 C7 FC DE 45 E2 82>)
$$ ##END=
$$ 
$$ hash MD5
$$ 85 65 5A 77 62 1B F9 7D 33 AB 20 8A 61 39 E9 04
##$RELAX= 
##$RELAX= 
##$RELAX= 
##$RELAX= 
##$RELAX= 
##$RELAX= 
$$ Bruker specific parameters
$$ --------------------------
##$DU= <C:/Bruker/XWIN-NMR>
##$EXPNO= 1
##$NAME= <H-C>
##$PROCNO= 1
##$TYPE= <nmr>
##$USER= <yarkov2>
##$AMP= (0..31)
100 100 100 100 100 100 100 100 100 100 100 100 100 100 100 100 100 100 
100 100 100 100 100 100 100 100 100 100 100 100 100 100 
##$AQSEQ= 0
##$AQ_mod= 1
##$AUNM= <au_zg>
##$AUTOPOS= <>
##$BF1= 200.13
##$BF2= 200.13
##$BF3= 200.13
##$BF4= 200.13
##$BF5= 200.13
##$BF6= 200.13
##$BF7= 200.13
##$BF8= 200.13
##$BYTORDA= 1
##$CFDGTYP= 0
##$CFRGTYP= 5
##$CHEMSTR= <none>
##$CNST= (0..31)
1 1 145 1 1 1 1 1 1 1 1 1 1 1 1 1 1 1 1 1 1 1 1 1 1 1 1 1 1 1 1 1 
##$CPDPRG= <>
##$CPDPRG1= <>
##$CPDPRG2= <>
##$CPDPRG3= <>
##$CPDPRG4= <mlev>
##$CPDPRG5= <mlev>
##$CPDPRG6= <mlev>
##$CPDPRG7= <mlev>
##$CPDPRG8= <mlev>
##$CPDPRGB= <>
##$CPDPRGT= <>
##$D= (0..31)
0 0.7 0 0 0 0 0 0 0 0 0 0.03 0 0 0 0 0 0 0 0 0 0 0 0 0 0 0 0 0 0 0 0 
$$ [...]
##$SUBNAM3= <"">
##$SUBNAM4= <"">
##$SUBNAM5= <"">
##$SUBNAM6= <"">
##$SUBNAM7= <"">
##$SUBNAM8= <"">
##$SUBNAM9= <"">
##$SW= 18.0517328524113
##$SWIBOX= (0..15)
0 0 2 0 0 0 0 0 0 0 0 0 0 0 0 0 
##$SW_h= 3612.71676300578
##$TD= 16384
##$TD0= 1
##$TE= 0
##$TE2= 300
##$TE3= 300
##$TEG= 300
##$TL= (0..7)
0 120 120 120 120 120 120 120 
##$TP= (0..7)
150 150 150 150 150 150 150 150 
##$TP07= 0
##$TPNAME0= <>
##$TPNAME1= <>
##$TPNAME2= <>
##$TPNAME3= <>
##$TPNAME4= <>
##$TPNAME5= <>
##$TPNAME6= <>
##$TPNAME7= <>
##$TPOAL= (0..7)
0.5 0.5 0.5 0.5 0.5 0.5 0.5 0.5 
##$TPOFFS= (0..7)
0 0 0 0 0 0 0 0 
##$TUNHIN= 0
##$TUNHOUT= 0
##$TUNXOUT= 0
##$USERA1= <user>
##$USERA2= <user>
##$USERA3= <user>
##$USERA4= <user>
##$USERA5= <user>
##$V9= 5
##$VALIST= <valist>
##$VCLIST= <CCCCCCCCCCCCCCC>
##$VD= 0
##$VDLIST= <DDDDDDDDDDDDDDD>
##$VPLIST= <PPPPPPPPPPPPPPP>
##$VTLIST= <TTTTTTTTTTTTTTT>
##$WBST= 1024
##$WBSW= 4
##$XGAIN= (0..3)
0 0 0 0 
##$XL= 0
##$YL= 0
##$YMAX_a= 171801
##$YMIN_a= -144396
##$ZGOPTNS= <>
##$ZL1= 120
##$ZL2= 120
##$ZL3= 120
##$ZL4= 120
##$ABSF1= 15.49238
##$ABSF2= -2.559469
##$ABSG= 5
##$ABSL= 3
##$ALPHA= 0
##$AQORDER= 0
##$ASSFAC= 0
##$ASSFACI= 0
##$ASSFACX= 0
##$ASSWID= 0
##$AUNMP= <proc_1d>
##$AZFE= 0.1
##$AZFW= 0.1
##$BCFW= 0
##$BC_mod= 2
##$BYTORDP= 0
##$COROFFS= 0
##$CY= -3
##$DATMOD= 1
##$DC= 0
##$DFILT= <>
##$DTYPP= 0
##$F1P= 0
##$F2P= 0
##$FCOR= 1
##$FTSIZE= 16384
##$FT_mod= 6
##$GAMMA= 0
##$GB= 0
##$INTBC= 1
##$INTSCL= 3.241238e-09
##$ISEN= 128
##$LB= 0.25
##$LEV0= 0
##$LPBIN= 0
##$MAXI= 10000
##$MC2= 0
##$MEAN= 0
##$ME_mod= 0
##$MI= 1.114404
##$NCOEF= 0
##$NC_proc= -7
##$NLEV= 6
##$NOISF1= 3.799351
##$NOISF2= 2.8
##$NSP= 0
##$NTH_PI= 0
##$NZP= 0
##$OFFSET= 15.50121
##$PC= 1
##$PHC0= -2073.768
##$PHC1= 8.590971
##$PH_mod= 1
##$PKNL= yes
##$PPARMOD= 0
##$PSCAL= 0
##$PSIGN= 0
##$REVERSE= no
##$SF= 200.130004101244
##$SI= 16384
##$SIGF1= 3
##$SIGF2= 2
##$SINO= 0.751879
##$SIOLD= 32768
##$SREGLST= <19F.Aceton>
##$SSB= 0
##$STSI= 16384
##$STSR= 0
##$SW_p= 3612.71676300578
##$SYMM= 0
##$S_DEV= 0
##$TDeff= 16384
##$TDoff= 0
##$TI= <>
##$TILT= no
##$TM1= 0
##$TM2= 0
##$TOPLEV= 0
##$USERP1= <user>
##$USERP2= <user>
##$USERP3= <user>
##$USERP4= <user>
##$USERP5= <user>
##$WDW= 1
##$XDIM= 16384
##$YMAX_p= 290336403
##$YMIN_p= -403766
$$ End of Bruker specific parameters
$$ ---------------------------------
##NTUPLES= NMR SPECTRUM
##VAR_NAME=  FREQUENCY,     SPECTRUM/REAL,   SPECTRUM/IMAG
##SYMBOL=    X,             R,               I
##VAR_TYPE=  INDEPENDENT,   DEPENDENT,       DEPENDENT
##VAR_FORM=  AFFN,          ASDF,            ASDF
##VAR_DIM=   16384,         16384,           16384
##UNITS=     HZ,            ARBITRARY UNITS, ARBITRARY UNITS
##FACTOR=    0.220516191357247, 1,           1
##FIRST=     3102.2572634434, 0,             0
##LAST=      -510.459499562379, 0,           0
##MIN=       -510.459499562379, -403766,     0
##MAX=       3102.2572634434, 290336403,     0
$$ Real data points
##PAGE= N=1
##DATA TABLE= (X++(R..R)), XYDATA
$$ [...]
7525A572372r4484j51334j79372K8096m3519j01051j82972J0734n7280k30372
$$ 1572372 1477888 1326554 1147182 1175278 1131759 1030708 847736 858470 801190 570818
7515E70818j69202M0761p9715L3821j8653n5609r806j30128O6210R4421l0930
$$ 570818 401616 442377 362662 396483 377830 322221 312415 182287 248497 342918 311988
7504C11988R5868j08972l3010o8216n0606K7856o3858m426J21640P5636P3515
$$ 311988 407856 298884 265874 197658 147052 174908 111050 106624 228264 303900 377415
7493C77415j12817k79953N9607J33610J25577o3927r2264r0153O8198o0790M2413
$$ 377415 264598 -15355 44252 177862 303439 239512 147248 57095 125293 64503 106916
7482A06916R8121j22632k9203O0646k8246o5297j39127n951Q5990R7704l1065
$$ 106916 205037 82405 53202 113848 85602 20305 -118822 -124773 -38783 58921 27856
7471B7856j39207j46836J12580J28791P0770o4558J51651R3803p7671k2400J04072
$$ 27856 -111351 -258187 -145607 -16816 53954 -10604 141047 234850 157179 134779 238851
7460B38851o8178j15119P40j3339k4834j33676J81827j4737j95791m1345R9229
$$ 238851 170673 55554 56294 42955 18121 -115555 66272 51535 -144256 -185601 -86372
7449h6372K0336Q5364j26061m347J69058k4773l395p7344J989R3886L0718m7801
$$ -86372 -66036 19328 -106733 -111080 57978 33205 29810 -47534 -45545 48341 79059 31258
7437C1258N0399K0915J8658m6672q3238L1210q3420J5678p0386j7901Q7924n0512
$$ 31258 81657 102572 121230 74558 -8680 22530 -60890 -45212 -115598 -133499 -45575 -96087
7425i6087J03739Q2460P3635j22641r5038j12177L4379J03591o6085O4099j570
$$ -96087 7652 90112 163747 41106 -53932 -166109 -131730 -28139 -94224 -30125 -31695
7414c1695p5763k480J29315k4895R651o9988L6107P9215l1172j4911J54243p3948
$$ -31695 -107458 -109938 19377 -5518 4133 -65855 -29748 49467 18295 3384 157627 83679
7402H3679k9179J08304j55679j29231J4677M5846J5857j41047j3046J10871L7314
$$ 83679 54500 162804 7125 -122106 -107429 -61583 -45726 -186773 -199819 -88948 -51634
7391e1634M4889M9447q2508q2267m0910R3805K1048j05278R1035J08067m3936
$$ -51634 -6745 42702 -39806 -122073 -162983 -69178 -48130 -153408 -62373 45694 1758
7380A758l1089o8353j44109r462M8882j596N9084K5760o6734P975o362J85518
$$ 1758 -29331 -97684 -241793 -251255 -202373 -203969 -144885 -119125 -185859 -177884 -184246 1272
7368A272K2200q7856o4643L7389L0502n0294Q4153N386J539J1716j20714L3370
$$ 1272 23472 -64384 -129027 -91638 -61136 -111430 -27277 -21891 -20352 -8636 -129350 -95980
7356i5980q8052K7584L5791q0927J02800J9151L7960j2435l9728j90159M9352
$$ -95980 -184032 -156448 -120657 -201584 -98784 -79633 -41673 -54108 -93836 -283995 -234643
7345b34643J76984M9986m3403o6644K9312L1222O1480r2501k5462K4367M8178
$$ -234643 -57659 -7673 -51076 -117720 -88408 -57186 4294 -88207 -113669 -89302 -41124
7334d1124j34280p8976N5319J05775J3314m9429j8896n431P9337P7302o8546K482
$$ -41124 -175404 -254380 -199061 -93286 -79972 -129401 -148297 -153728 -74391 2911 -65635 -63153
7322f3153K2810o8940l81M3788N6415j17379M30J12278j4538k154O9371J51705
$$ -63153 -40343 -109283 -109664 -65876 -9461 -126840 -126410 -14132 -28670 -30824 38547 190252
7310A90252j305k06385J0154Q9074j8762q0383l6609j63218m19J05159J07112
$$ 190252 188947 -17438 -7284 81790 63028 -17355 -53964 -217182 -217601 -112442 -5330
7299e330J83968J1425k04339N4363O9914j61902m5145N4727m2654j46805N8963
$$ -5330 178638 190063 -14276 40087 110001 -51901 -97046 -42319 -84973 -231778 -172815
7288a72815N9249m0602M5435J31085l3121j52244l8295m1952N3978J12330J05200
$$ -172815 -113566 -154168 -108733 22352 -10769 -163013 -201308 -243260 -189282 -76952 28248
7277B8248n7718l5997N5459n5037J08078j46847j92341L3198J06881n4287k4300
$$ 28248 -29470 -65467 -10008 -65045 43033 -103814 -296155 -262957 -156076 -210363 -234663
7266b34663J04268Q790l6778j6408m9125M1962M8288K0566M6718j92833J8204
$$ -234663 -130395 -121605 -158383 -174791 -223916 -181954 -133666 -113100 -66382 -259215 -241011
7255b41011K08727M9098j13373l3136O9449K6601J6124M3622K9912j01390K137
$$ -241011 -32284 16814 -96559 -129695 -60246 -33645 -17521 26101 56013 -45377 -43240
7244d3240Q770L1421j06004l3103R812R4173J13484n4133m8746q5885J84399J6827
$$ -43240 -34470 -3049 -109053 -142156 -132344 -38171 75313 21180 -27566 -113451 70948 87775
7232H7775n6657J26966j00259k64617J3058j9504J9568N9101k8719J25386L2690
$$ 87775 31118 158084 57825 -206792 -193734 -213238 -193670 -134569 -163288 -37902 -5212
7221e212J0360k1942j7523M1879J431j32175L8059O3804j48524n4752j08259N7895
$$ -5212 5148 -16794 -34317 7562 8993 -123182 -85123 -21319 -169843 -224595 -332854 -274959
7209b74959J12561k9833j6173J20358J06671J1070q0713Q301J6929r7712J0454
$$ -274959 -162398 -192231 -208404 -88046 18625 29695 -51018 -42717 -25788 -123500 -113046
7198a13046p4200m5039M3812j1750l9253N6403Q6668P1552J6933j69148l7343
$$ -113046 -187246 -232285 -188473 -200223 -239476 -183073 -96405 -24853 -7920 -177068 -214411
7187b14411J99500r4164r9566Q6317N6047O2488k4734j0309l9016j09354J18946
$$ -214411 -14911 -109075 -208641 -122324 -66277 -3789 -28523 -38832 -77848 -187202 -68256
7176f8256N9105j8037j19551J171M8962j6729L9487K49644m7038k55616p6804
$$ -68256 -9151 -27188 -146739 -145568 -96606 -113335 -73848 175796 128758 -126858 -203662
7165b03662Q0329L7749J36228l5421j17928K8636j5735j05028j02932k0797K02714
$$ -203662 -123333 -85584 50644 15223 -102705 -74069 -89804 -194832 -297764 -318561 -115847
7154a15847N0262k29267n075K5617J48884P2324J06920o8891P0525j31640p1656
$$ -115847 -65585 -294852 -299927 -274310 -125426 -53102 53818 -15073 55452 -76188 -147844
7143a47844J4372j10619O7252O5444O6914J30252j96505r2443R1651N8257m8796
$$ -147844 -133472 -244091 -176839 -111395 -44481 85771 -110734 -203177 -111526 -53269 -102065
7132a02065j988r3212J25123l5434o1000M1919O8127o7342L7436J18759K3705
$$ -102065 -104053 -197265 -72142 -107576 -168576 -126657 -58530 -125872 -88436 30323 54028
7121E4028q745Q1191j50427j01262R1916P2327k23354j5990J51309J0249q0191
$$ 54028 45283 126474 -23953 -125215 -33299 39028 -184326 -200316 -49007 -38758 -118949
7110a18949o0042P4512O4M4260J6059l1254o8519Q4920n6634K3681p1261N0778
$$ -118949 -178991 -104479 -104415 -60155 -44096 -75350 -143869 -58949 -115583 -91902 -163163 -112385
7098a12385L5648l7534k4089j6878O4220R8538l6848L3156k5502O4543j85860
$$ -112385 -76737 -114271 -138360 -155238 -91018 7520 -29328 3828 -21674 42869 -142991
7087a42991l7243O4782Q0530j20784l227K5022K6538m4341Q3199M8394j02295
$$ -142991 -180234 -115452 -34922 -155706 -158933 -133911 -107373 -151714 -68515 -20121 -122416
7076a22416M6763J06621j6626j09906j1312o5272N7813J02449L2433j18241j51348
$$ -122416 -75653 30968 14342 -95564 -106876 -172148 -114335 -11886 20547 -97694 -249042
7065b49042M1180Q8512j2249l5282m8437R8159m700j71195J70513P040N1331K2833
$$ -249042 -207862 -119350 -131599 -166881 -215318 -117159 -121859 -293054 -122541 -115501 -64170 -41337
7053d1337k4300P2185j8751m2629q189Q8580r194j42152O1756j45031j51629J91305
$$ -41337 -65637 6548 -12203 -54832 -63021 25559 16365 -125787 -64031 -209062 -360691 -169386
7041a69386K3403J6846J6212m7126M3355m1732J1524j30776k8288J49814K9709
$$ -169386 -145983 -129137 -112925 -160051 -116696 -158428 -146904 -277680 -305968 -156154 -126445
7030a26445O0312N913p576r2393O1503L4919L544o6821K122O8507n3447j8030
$$ -126445 -66133 -60220 -67796 -160189 -98686 -63767 -60223 -127044 -124922 -56415 -109862 -127892
7018a27892p010l9988M1340L1525O4243o012j03537j10173p477J89634K1058j48933
$$ -127892 -134902 -174890 -133550 -102025 -37782 -43794 -147331 -257504 -264981 -75347 -54289 -203222
7006b03222j3395J00496M481n1461l8726j41369Q7292O473O3059J07396J42185
$$ -203222 -216617 -116121 -111640 -163101 -201827 -343196 -255904 -249431 -186372 -78976 63209
6995F3209j46691j59543p087n3668J52526M2082L5540P9112m5763o0832R088j03534
$$ 63209 -83482 -243025 -250112 -303780 -151254 -109172 -73632 5480 -40283 -101115 -92027 -195561
6983a95561j23025N0792p7170Q7071N4531O4867J86455p0875p1908M2418j3776
$$ -195561 -318586 -267794 -344964 -257893 -203362 -138495 47960 -22915 -94823 -52405 -66181
6972f6181R4681q0043j01781P9221M3565r869R854q2924q7144M7436P0622n6035
$$ -66181 28500 -51543 -153324 -74103 -30538 -40407 -30553 -113477 -200621 -153185 -82563 -138598
6960a38598J37305j5788J9001J44572r555j94690q737k1802j30833J03742l1284
$$ -138598 -1293 -17081 1920 146492 136937 -57753 -66490 -88292 -219125 -115383 -146667
6949a46667j14179P2529j6011m2106J12894M6654O725J7009l3013j12993R2152
$$ -146667 -260846 -188317 -204328 -246434 -133540 -86886 -80161 -63152 -96165 -209158 -117006
6938a17006P1305O6268p9746J3829j0694o4129L8278N9668m5730k4997K4338M7520
$$ -117006 -45701 20567 -59179 -45350 -56044 -120173 -81895 -22227 -67957 -92954 -68616 -21096
6926b1096k9816j06666R630L5585k848J06043k3431q4680n411j43678q6653P8871
$$ -21096 -50912 -157578 -147948 -112363 -115211 -9168 -32599 -117279 -122690 -266368 -353021 -274150
6914b74150N2206j7002K4252k9859Q3111J8614P7710L0680j9901l3570m0697M0420
$$ -274150 -221944 -238946 -214694 -244553 -161442 -142828 -65118 -34438 -54339 -87909 -128606 -88186
6902h8186n3814J16777o8073k48516R8421J70405Q8247j3492m7639Q5422r4560
$$ -88186 -142000 -25223 -93296 -341812 -243391 -72986 15261 1769 -45870 39552 -55008
6891e5008n1199p6098M6167R7617r808K8877m479L4270p7085j58288P0749Q298
$$ -55008 -106207 -182305 -136138 -38521 -48329 -19452 -23931 10339 -66746 -225034 -154285 -145987
6879a45987J33102n4771N1030n8784j70865j3041N0008M4999m5225J1361l5903
$$ -145987 -12885 -67656 -16626 -75410 -246275 -259316 -209308 -164309 -209534 -198173 -234076
6868b34076J5952J5050M7859n9906j20944J01400P2309J9974J06245J32292k05921
$$ -234076 -218124 -203074 -155215 -215121 -336065 -234665 -162356 -142382 -36137 96155 -109766
6857a09766p7336L4709J6955P6906j39338K4228N6472m2345p4088J3328R2924
$$ -109766 -187102 -152393 -135438 -58532 -197870 -173642 -117170 -159515 -233603 -220275 -127351
6846a27351q025M6325M5597J4204J5303r7386j29160J33493k1830k6026k7348
$$ -127351 -135376 -89051 -43454 -29250 -13947 -111333 -240493 -107000 -128830 -154856 -182204
6835a82204m7637J47464j03814N2645Q7838J484j6062J8233j08534j80148M5010
$$ -182204 -229841 -82377 -186191 -133546 -45708 -44224 -60286 -42053 -150587 -330735 -285725
6824b85725J53687j3367l3041J7423Q440o5451P4721K1091J2123n7523L5872J6240
$$ -285725 -132038 -145405 -178446 -161023 -152583 -218034 -143313 -122222 -110099 -167622 -131750 -115510
6812a15510M9175R8782j55199j51304p8604Q9827Q1873L9278R8836j55876L4056
$$ -115510 -66335 32447 -122752 -274056 -352660 -262833 -180960 -141682 -42846 -198722 -164666
6801a64666L0462j16471N8193k0831K14O2373o6822j86218J57627O1151O4143
$$ -164666 -134204 -250675 -192482 -213313 -213099 -150726 -217548 -403766 -246139 -184988 -120845
6790a20845N4904j04505M8088R9883j79901n9431M3289L0122J15966O6805q4957
$$ -120845 -65941 -170446 -122358 -22475 -202376 -261807 -218518 -188396 -72430 -5625 -90582
6779i0582o4256J16446j31922L4550J04147j24178l380J92727L8115m5338j14911
$$ -90582 -154838 -38392 -170314 -135764 -31617 -155795 -159175 33552 71667 26329 -88582
6768h8582j764L810L8750J17685J8649k68889R6611j2099K7434N5723j08485K834
$$ -88582 -90346 -86536 -47786 69899 88548 -180341 -83730 -95829 -68395 -12672 -121157 -118323
6756a18323J6013L3249O0234M74j61566j27991P4608O5662R2568K5409j4110k5718
$$ -118323 -102310 -69061 -8827 -8353 -169919 -297910 -223302 -157640 -65072 -39663 -53773 -79491
6744g9491q2116J372m6120N0904R953p2386K7238J326L755N1291j19049J36836
$$ -79491 -161607 -160235 -206355 -155451 -145498 -217884 -190646 -189320 -185565 -134274 -253323 -116487
6732a16487j56928L7598P2558j2570J91372j64919p8341P6919j195J008K9331
$$ -116487 -273415 -235817 -163259 -175829 15543 -149376 -227717 -150798 -151993 -150985 -121654
6721a21654q9315k437M1159P391J85784j45256m3302N1751R3276J3868j13232
$$ -121654 -210969 -213406 -172247 -164856 20928 -124328 -167630 -115879 -22603 -8735 -121967
6710a21967m343P5724Q4021L2387j28656k0520J2046k519l2113l4337N0892K2684
$$ -121967 -126310 -50586 33435 65822 -62834 -83354 -71308 -73827 -105940 -140277 -89385 -66701
6698f6701p2479m4271K9284K7261l6611K4546L4324J22983o2719o0469m7659L014
$$ -66701 -139180 -183451 -154167 -126906 -163517 -138971 -104647 18336 -44383 -104852 -152511 -149497
6686a49497N4409N1308q2835r0800n6004k5828J98671P9871j00132L193J07371
$$ -149497 -95088 -43780 -126615 -217415 -273419 -299247 -100576 -20705 -120837 -117644 -10273
6675a0273l7732Q40l8310J6595Q2693Q3236j03245k7257j13223Q1278K9269l7784
$$ -10273 -48005 -47165 -85475 -68880 13813 97049 -6196 -33453 -146676 -65398 -36129 -73913
6663g3913L9140P6939P2735j39585m6018L7940j00222m7295m7912J24488K8437
$$ -73913 -34773 42166 114901 -24684 -70702 -32762 -132984 -180279 -228191 -103703 -75266
6652g5266J5227p0923O1563k5420n209m9544M2130r7826q0083J64635O8528L0979
$$ -75266 -60039 -130962 -69399 -94819 -100028 -149572 -107442 -205268 -285351 -120716 -52188 -21209
6640b1209j44320j49402p933p3088M2186K68770r0446K191m3009p696P5898J13503
$$ -21209 -165529 -314931 -322864 -395952 -353766 -84996 -175442 -173251 -216260 -223956 -148058 -34555
6628c4555P104j02970n932j1275p9414N5381M4537l8482n8570R4888K6287n4242
$$ -34555 -27451 -130421 -136353 -147628 -227042 -171661 -127124 -165606 -224176 -129288 -103001 -157243
6616a57243O8710k6278J9711J74540o3906n1553j736k1249K6633l7778m9871p9191
$$ -157243 -88533 -114811 -95100 79440 15534 -36019 -37755 -59004 -32371 -70149 -120020 -199211
6604a99211N5804J10400n1903j62415L7869P3878j31542J2438P4098Q2122p4780
$$ -199211 -143407 -33007 -84910 -247325 -209456 -135578 -267120 -254682 -180584 -98462 -173242
6593a73242N8795R1278J4699j30698m4296M223j9809P801l840M7130J14915l192
$$ -173242 -114447 -23169 -8470 -139168 -183464 -179241 -199050 -191249 -195089 -147959 -33044 -36236
6581c6236j1923k1555M71J08196k9161p06l3326p7382K7461j15904P0355K6855
$$ -36236 -48159 -69714 -69243 38953 9792 9086 -24240 -101622 -74161 -190065 -119710 -92855
6569i2855j5145J6161m7250J15738L6332N7313q0865J20022k17859K0263R651
$$ -92855 -108000 -91839 -139089 -23351 12981 70294 -10571 109451 -108408 -88145 -78494
6558g8494r7804R1428N2113j5799p7323k130Q9217k1010P0006j24154J4060r48
$$ -78494 -176298 -84870 -32757 -48556 -125879 -128009 -38792 -59802 10204 -113950 -99890 -100838
6546a00838P8727R6283r0690k3756r2166N0845M5169n6740r5967J6490J1539J1008
$$ -100838 -22111 74172 -16518 -40274 -132440 -81595 -36426 -93166 -189133 -172643 -161104 -150096
6534a50096P6438L0901j11403M1773O9695o824n8152N211p7191k4992Q3577Q6917
$$ -150096 -73658 -42757 -154160 -112387 -42692 -49516 -107668 -102457 -179648 -204640 -121063 -34146
6522c4146p4735L0378O6400n5486L999J52638r017p8641J3808j3133n6302l3721
$$ -34146 -108881 -78503 -12103 -67589 -63590 89048 80031 1390 15198 2065 -54237 -87958
6510h7958m5388M7639J28139P028K6106k8950j05101j25074J44867N1863p5804
$$ -87958 -133346 -85707 42432 49460 75566 46616 -58485 -183559 -38692 13171 -62633
6499f2633j0992R9372Q0241n1431r5951K3214L7633O2314N1575m1962j10739R3424
$$ -62633 -73625 25747 105988 54557 -41394 -18180 19453 81767 133342 91380 -19359 74065
6487G4065O6236l6434r5781L5956J35798p2071J59740p235l1432j8316J9027o9082
$$ 74065 140301 103867 8086 44042 179840 107769 267509 260274 228842 210526 229553 160471
6475A60471L6376n3997r8371M1165M6316M897l505N7311n1282n0857J20733Q5641
$$ 160471 196847 142850 44479 85644 131960 136857 133352 190663 139381 88524 209257 294898
6463B94898J4776j1232Q8873R4732p9663J19060N44j58052Q5210j0598L6751N0386
$$ 294898 309674 298442 387315 482047 402384 521444 521988 363936 449146 438548 475299 525685
6451E25685J77754l5693j07091L4651k52065k412K6933Q7986Q0006J85619j4391
$$ 525685 703439 667746 560655 595306 343241 340829 367762 455748 535754 721373 706982
6440G06982j02026r8631k5197j4995L5501J00151n3788j3488Q3994j80060Q4632
$$ 706982 604956 506325 481128 466133 501634 601785 547997 534509 618503 438443 523075
6429E23075R9407p8709m3222N8698J32092j39382k09637J4879N6184n3545J885
$$ 523075 622482 543773 500551 559249 691341 551959 342322 357201 413385 359840 361725
6418C61725N2337J0518m1344r1081j3476J64506R575j72524j22770J11673p3477
$$ 361725 414062 424580 383236 292155 278679 443185 452760 280236 157466 269139 195662
6407A95662K9697k3037L7412O4577M5933r8640k7824M84N059j4978k2633L3227
$$ 195662 225359 202322 239734 304311 350244 251604 223780 224264 229323 214345 191712 224939
6395B24939J27084J12499K6521m422j12540p4526J974J15561n9333l4264J35603
$$ 224939 352023 464522 491043 486621 374081 299555 301529 417090 357757 323493 459096
6384D59096p8344n7375L8489j01727o0339k7464p7356L2564o0544P3856O8774
$$ 459096 380752 323377 361866 260139 199800 172336 94980 127544 67000 140856 209630
6373B09630r7445l8779J87615k4772K4697k6362l440K22583n8898n0912m8000
$$ 209630 112185 73406 261021 236249 260946 234584 231144 453727 394829 343917 295917
6362B95917L6033o245k9625r0738Q0563Q3655M6647j81577N2513K6333o1492l9265
$$ 295917 331950 325705 296080 205342 285905 369560 416207 234630 287143 313476 251984 212719
6350B12719O1771N5246j04192m7062P8142L0859r4413J76145Q8066n676j50234
$$ 212719 274490 329736 225544 178482 256624 287483 193070 369215 457281 451605 301371
6339C01371m6402R0188o242k8027M4621L3929J5302N2451j78159O5755M0691j72848
$$ 301371 254969 345157 338915 310888 355509 389438 404740 457191 279032 344787 385478 212630
6327B12630m161q0513J1676N0899M8314m3369P2104O1741j25371J02898J0346
$$ 212630 208469 127956 139632 190531 238845 195476 267580 329321 203950 306848 317194
6316C17194o575J21273K1801K3559M7807m0978j20019J5753L2351J02801k7699
$$ 317194 310619 431892 453693 477252 525059 484081 364062 379815 412166 514967 487268
6305D87268p1475J15068q154j30892k0649J46587P4385j99256O174m1709o0020
$$ 487268 415793 530861 522707 391815 371166 517753 592138 392882 399056 357347 297327
6294B97327R4557Q481m0392j06171k9367J0469j6121J02576O1436j00003j45753
$$ 297327 391884 400365 359973 253802 224435 234904 218783 321359 382795 282792 137039
6283A37039k6190Q3284l9152J5058P214K6740j00604Q2476K9621K6029q9965M1375
$$ 137039 110849 194133 154981 170039 177253 203993 103389 185865 215486 241515 151550 192925
6271A92925J01328R6796J13601n2439n6238J43171l9290M9444M8906J3817Q2691
$$ 192925 294253 391049 504650 452211 395973 539144 499854 549298 598204 612021 694712
6260F94712O0530m6489j1204N5093q3269J6608K0946j4991J51926Q5853j85046
$$ 694712 755242 708753 697549 752642 669373 685981 706927 691936 843862 929715 744669
6249G44669n7877N095P2483J62732J8660j44817M3556M3538k8841N0786R7598
$$ 744669 686792 691887 764370 927102 945762 800945 844501 888039 859198 909984 1007582
6238A007582J471N209j27133M6869J33490P3351o3724O1267J12158Q4969k9028
$$ 1007582 1009053 1014262 887129 933998 1067488 1140839 1077115 1138382 1250540 1335509 1306481
6227A306481M7038M047j0996K7823J3116J9329P0952k3386L7738l977M5081J15409
$$ 1306481 1353519 1357566 1346570 1374393 1387509 1406838 1477790 1454404 1492142 1488165 1533246 1648655
6215A648655p6163n7377O8005N5829j3539J96652P3859R3219j84971Q6368L3808
$$ 1648655 1572492 1515115 1583120 1638949 1625410 1822062 1895921 1989140 1804169 1890537 1924345
6204A924345l5060J96752J60199j39866j07213R2814J0609J09100J60589K6972
$$ 1924345 1889285 2086037 2246236 2106370 1999157 2091971 2102580 2211680 2372269 2399241
6194B399241O2747K14295l1887O8008k7217J25301L0906J96496r435N3335J28195
$$ 2399241 2461988 2676283 2644396 2712404 2685187 2810488 2841394 3037890 3028455 3081790 3209985
6183C209985j44556J30256J19552o5696L3749J24153J32405K89J90147J30918
$$ 3209985 3065429 3195685 3315237 3249541 3283290 3407443 3539848 3540137 3730284 3861202
6173C861202J09315N4699N1800K60198J82515J18489Q7166J63394J20561J82142
$$ 3861202 3970517 4025216 4077016 4337214 4519729 4638218 4725384 4888778 5009339 5191481
6163E191481J43249K39765L5184R6890J90958K07788K35864J17771J47566J85225
$$ 5191481 5334730 5574495 5609679 5706569 5897527 6105315 6341179 6458950 6606516 6791741
6153F791741L54543L30512M11371M77507L04312M38890N36256L22180L42384P49765
$$ 6791741 7146284 7476796 7888167 8365674 8669986 9108876 9645132 9967312 10309696 11059461
6143A1059461N19457L84295O93595P19083P44963P71105Q49631Q52584R92319
$$ 11059461 11578918 11963213 12656808 13375891 14120854 14891959 15741590 16594174 17586493
6134A7586493J190644J253513J238443J460274J530700J502883J719372J712815
$$ 17586493 18777137 20030650 21269093 22729367 24260067 25762950 27482322 29195137
6126B9195137J726633J567162J767371K018578K175725K204415K411875K493554
$$ 29195137 30921770 32488932 34256303 36274881 38450606 40655021 43066896 45560450
6118D5560450K794064L199046L517997L898831M359154M673817N141518N791816
$$ 45560450 48354514 51553560 55071557 58970388 63329542 68003359 73144877 78936693
6110G8936693O581066P536849Q272101R588237J0787756J1856471J2477880J2147167
$$ 78936693 85517759 93054608 101326709 110914946 121702702 133559173 146037053 158184220
6102A58184220J0453188Q127310N681013L406841J244118j798944m805633p808742
$$ 158184220 168637408 176764718 182445731 185852572 187096690 185297746 180492113 172683371
6094A72683371j0292688j1445750j1708792j1306966j0614160r914274r030426
$$ 172683371 162390683 150944933 139236141 127929175 117315015 107400741 98370315
6087I8370315q038684p020289o457901n694357n272559m996946m509145l918338
$$ 98370315 90331631 83311342 76853441 71159084 65886525 60889579 56380434 52462096
6079E2462096l446214l008409k871342k620041k146031k060724k025244j703369
$$ 52462096 49015882 46007473 43136131 40516090 38370059 36309335 34284091 32580722
6071C2580722j755879j538208j376764j313680j062782j192255r86482r48026
$$ 32580722 30824843 29286635 27909871 26596191 25533409 24341154 23354672 22406646
6063B2406646q80486p93541q15247p10303o03717o45305n28989p24777o45278
$$ 22406646 21526160 20732619 19917372 19207069 18603352 17958047 17429058 16704281 16059003
6054A6059003m87057m88199l07385k81867l24829m50604m10985l08083j98308
$$ 16059003 15571946 15083747 14776362 14494495 14169666 13719062 13308077 12999994 12801686
6045A2801686k48360k90183k90672k08182j62147l23422j79827j75342l15535
$$ 12801686 12553326 12263143 11972471 11764289 11602142 11278720 11098893 10923551 10608016
6036A0608016k28871j55345j86120j98600k45106k70870j10606k9263j74438n095
$$ 10608016 10379145 10223800 10037680 9839080 9593974 9323104 9212498 9183235 9008797 9003702
6026I003702r3716j92439j20123N5798P6214j63548l1470J30967p898o7446k4869
$$ 9003702 8909986 8717547 8597424 8653222 8729436 8565888 8534418 8665385 8657487 8590041 8565172
6015H565172J85925L5554J48808K6488k9913n4618p8474q1825j58850k02447k33972
$$ 8565172 8751097 8786651 8935459 8961947 8932034 8877416 8798942 8717117 8558267 8355820 8121848
6004H121848k61470k04634k9724o1767j67314j08304q7969l6099J1395j54449
$$ 8121848 7860378 7655744 7626020 7564253 7396939 7288635 7200666 7164567 7175962 7021513
5994G021513k4249K4110L3092m3532N725J06625O1112R1284P6187J35222J65k2408
$$ 7021513 6997264 7021374 7054466 7010934 7016659 7123284 7184396 7275680 7351867 7487089 7487254 7464846
5982G464846J58879J94998J7193j4139J9560J4339m6024j99824j18331m5657k62432
$$ 7464846 7623725 7818723 7835916 7821777 7841337 7855676 7809652 7609828 7491497 7445840 7183408
5971G183408N194n2504j28831j22678j07698o1603n9222j8627j95570k9580k981
$$ 7183408 7188602 7136098 7007267 6884589 6776891 6715288 6656066 6637439 6441869 6412289 6409308
5960F409308K1080O5201Q2609K9805k0653R910P7372J27267N8061n2136n8791
$$ 6409308 6430388 6495589 6578198 6608003 6587350 6597260 6674632 6801899 6859960 6807824 6749033
5949F749033R1381J34338N3180k1575Q4413j3034L3550L829l445N219P9317K4000
$$ 6749033 6840414 6974752 7027932 7006357 7090770 7077736 7111286 7115115 7111670 7116889 7196206 7220206
5937G220206j18536R5151N129M9940p3781N8467K1567j31840R179K10031p464
$$ 7220206 7101670 7196821 7201950 7251890 7178109 7236576 7258143 7126303 7135482 7345513 7338049
5926G338049J06384J24558J20794N2468J20386J05470M1441j29431L1115m5906
$$ 7338049 7444433 7568991 7689785 7742253 7862639 7968109 8009550 7880119 7911234 7865328
5916G865328Q3611j9902j16946P7975n0331p7559Q289q6414M6534O0365K4577
$$ 7865328 7948939 7929037 7812091 7890066 7839735 7762176 7770465 7684051 7730585 7790950 7815527
5905G815527J14370M8990M9554O996k7974m4927j35939k8109J94283J71878L1028
$$ 7815527 7929897 7978887 8028441 8035437 8007463 7962536 7826597 7798488 7992771 8164649 8195677
5894H195677k01067K8176M3750J6584O1214J79640j3760J00280P1875k4062R2456
$$ 8195677 7994610 8022786 8066536 8083120 8144334 8323974 8310214 8410494 8482369 8458307 8550763
5883H550763R990K10230L9928P8549Q4781O1406J98408J5318Q7853J43160N9610
$$ 8550763 8560753 8770983 8810911 8889460 8974241 9035647 9234055 9249373 9337226 9480386 9539996
5872I539996J81043J36222J25187K55322R6327J32586R0724J74522N2620J29425
$$ 9539996 9721039 9857261 9982448 10237770 10334097 10466683 10557407 10731929 10784549 10913974
5862A0913974R4475K09838J58262P1576J66286J85600J84734J41338J97402J81927
$$ 10913974 11008449 11218287 11376549 11448125 11614411 11800011 11984745 12126083 12323485 12505412
5852A2505412J85049J16681K59023J53670J48405J79862L91531J40467J27719
$$ 12505412 12690461 12807142 13066165 13219835 13368240 13548102 13939633 14080100 14207819
5843A4207819K22577J92770J66691K06994K40356K37680M17050K75094K05950
$$ 14207819 14430396 14623166 14789857 14996851 15237207 15474887 15891937 16167031 16372981
5834A6372981J42385K83650K75652J24675K46667N07127K48909K64719M45912
$$ 16372981 16515366 16799016 17074668 17199343 17446010 17953137 18202046 18466765 18912677
5825A8912677K84975K95924L16147J52592M27775N48224M23978K19199M03410
$$ 18912677 19197652 19493576 19809723 19962315 20390090 20938314 21362292 21581491 21984901
5816B1984901M50243L79224L18180L52754M35379N03769M52598M68164N34817
$$ 21984901 22435144 22814368 23132548 23485302 23920681 24424450 24877048 25345212 25880029
5807B5880029M68541N69540N16671M63933O33299O66999N14180N62097P38227
$$ 25880029 26348570 26918110 27434781 27898714 28532013 29199012 29713192 30275289 31013516
5798C1013516O54408P01499O91934Q02824P70658P01868O81063R01371R65471
$$ 31013516 31667924 32369423 33061357 33864181 34634839 35336707 36017770 36919141 37884612
5789C7884612R28809Q74462R29231R74274R76075R54415J063453J134062J064207
$$ 37884612 38813421 39687883 40617114 41591388 42567463 43521878 44585331 45719393 46783600
5780D6783600J297044J188891J252291J250439J269585J358654J531485J395256
$$ 46783600 48080644 49269535 50521826 51772265 53041850 54400504 55931989 57327245
5772E7327245J569500J562324J584368J726153J728996J803359J890718J912852
$$ 57327245 58896745 60459069 62043437 63769590 65498586 67301945 69192663 71105515
5764G1105515K045473J962732K160691K245701K199470K294008K325733K508928
$$ 71105515 73150988 75113720 77274411 79520112 81719582 84013590 86339323 88848251
5756H8848251K375556K615874K639009K723048K930579K817722K969292L112413
$$ 88848251 91223807 93839681 96478690 99201738 102132317 104950039 107919331 111031744
5748A11031744L319239L169221L299314L399452L454603L543052L553482L800743
$$ 111031744 114350983 117520204 120819518 124218970 127673573 131216625 134770107 138570850
5740A38570850L836679L838774L764285L837815L943565L910333M095368M189320
$$ 138570850 142407529 146246303 150010588 153848403 157791968 161702301 165797669 169986989
5732A69986989L986879L930333L879849L889272L810746L761528L598717L504022
$$ 169986989 173973868 177904201 181784050 185673322 189484068 193245596 196844313 200348335
5724B00348335L484991L166007K943070K830011K466330K204066K101609J890731
$$ 200348335 203833326 206999333 209942403 212772414 215238744 217442810 219544419 221435150
5716B21435150J439259J003418P95548M03263L1194j70223n45159r16259j287237
$$ 221435150 222874409 223877827 224673375 225076638 225107832 224937609 224392450 223476191 222188954
5707B22188954j534596j779297k284059k341965k695255k817094l028288l120995
$$ 222188954 220654358 218875061 216591002 214249037 211553782 208736688 205708400 202587405
5699B02587405l393055l441269l591748l640530l817361l910967l929880l738960
$$ 202587405 199194350 195753081 192161333 188520803 184703442 180792475 176862595 173123635
5691A73123635l864886l954578l815135l816054l789498l780145l636382l635732
$$ 173123635 169258749 165304171 161489036 157672982 153883484 150103339 146466957 142831225
5683A42831225l499114l578008l395264l355868l372340l115032k949811k867131
$$ 142831225 139332111 135754103 132358839 129002971 125630631 122515599 119565788 116698657
5675A16698657k970670k788907k710880k639532k510773k422866k477761k441901
$$ 116698657 113727987 110939080 108228200 105588668 103077895 100655029 98177268 95735367
5667I5735367k211224k339361k122443k205506k161888k128886k163609j954787
$$ 95735367 93524143 91184782 89062339 86856833 84694945 82566059 80402450 78447663
5659G8447663j856768j948257j784254j673412j606062j747391j556428j633934
$$ 78447663 76590895 74642638 72858384 71184972 69578910 67831519 66275091 64641157
5651F4641157j389020j430102j333209j434649j141229j167895j353328j199099
$$ 64641157 63252137 61822035 60488826 59054177 57912948 56745053 55391725 54192626
5643E4192626j185327j050674j081806j098463j104249j005390r00895j083841
$$ 54192626 53007299 51956625 50874819 49776356 48672107 47666717 46765822 45681981
5635D5681981q72177o52304q95555p55198p84341p92302r12792p51059o98773
$$ 45681981 44809804 44157500 43261945 42506747 41722406 40930104 40017312 39266253 38567480
5626C8567480p29096p07623o43606o64705o87092o46606o54210n91862o13161
$$ 38567480 37838384 37130761 36487155 35822450 35135358 34488752 33834542 33242680 32629519
5617C2629519m75652o86442m98698m38047m89508m45551m87684m67364l65757
$$ 32629519 32153867 31467425 30968727 30530680 30041172 29595621 29107937 28640573 28274816
5608B8274816l71940n07097n69410l98142l43357m51184l15412l08691k77577
$$ 28274816 27902876 27395779 26826369 26428227 26084870 25633686 25318274 25009583 24732006
5599B4732006n19844l59147l44150m15293m34812l24623j56469k15027l94270
$$ 24732006 24212162 23853015 23508865 23093572 22658760 22334137 22177668 21962641 21568371
5590B1568371l54606j77220j68259l93223l03495l25697l52210k47619j81561
$$ 21568371 21213765 21036545 20868286 20475063 20171568 19845871 19493661 19246042 19064481
5581A9064481k09794l44474l59378j03622j97881l07717j76830q8160k03948j76076
$$ 19064481 18854687 18510213 18150835 18047213 17849332 17541615 17364785 17276625 17072677 16896601
5571A6896601l06598k15579q0113j50707j44723k24439r9484k38028k10177k35406
$$ 16896601 16590003 16374424 16294311 16143604 15998881 15774442 15674958 15436930 15226753 14991347
5561A4991347j17274j16197j33957j43656r1534j84093j62280j56063L6067o5939
$$ 14991347 14874073 14757876 14623919 14480263 14388729 14204636 14042356 13886293 13922360 13856421
5551A3856421k90329j48670p134n5962j11190K46j91940j54466K7409n8239k52305
$$ 13856421 13566092 13417422 13410288 13354326 13243136 13243382 13051442 12896976 12924385 12866146 12613841
5540A2613841N1978q4612k34790j03795j19592j22556r1765j37804j34574L14
$$ 12613841 12665819 12581207 12346417 12242622 12123030 12000474 11908709 11770905 11636331 11636645
5530A1636645j69798j74932Q3361o8995j41890k0504m9107l9648j72402j41838
$$ 11636645 11466847 11291915 11375276 11306281 11164391 11143887 11094780 11055132 10882730 10740892
5520A0740892J8450j3681l6202r1256k15324j03379j13448j30403j35335j60287
$$ 10740892 10759342 10745661 10709459 10618203 10402879 10299500 10186052 10055649 9920314 9760027
5510I760027k7507j87306j59764j25542j28605j00935o7884N0526q1172o3206
$$ 9760027 9732520 9545214 9385450 9259908 9131303 9030368 8962484 9013010 8931838 8868632
5500H868632j17901n3830p7442j40747n1603j64005j47763j67928p234m0459q0919
$$ 8868632 8750731 8696901 8619459 8478712 8427109 8263104 8115341 7947413 7940179 7899720 7818801
5489G818801j47599j40355j06888j50930m8648Q5821K8182k05966o5353p3800
$$ 7818801 7671202 7530847 7423959 7273029 7224381 7310202 7338384 7132418 7067065 6993265
5479F993265j15096p6292q0122L3752n5886l3998l07832p9238J53789j17160o904
$$ 6993265 6878169 6801877 6721755 6755507 6699621 6665623 6357791 6278553 6432342 6315182 6308278
5468F308278k4684l5544q1460J3385j05700j34478p2977j31534m7128k6375M5980
$$ 6308278 6283594 6248050 6166590 6179975 6074275 5939797 5866820 5735286 5688158 5661783 5707763
5457E707763M9912r3665j29457j36710P3580J4596k2788k5429j64233k955o3675
$$ 5707763 5757675 5664010 5534553 5397843 5471423 5486019 5463231 5437802 5273569 5270614 5206939
5446E206939j7359o0695P586j42693r3972j2517k119j41081M5917j42945p1522
$$ 5206939 5189580 5128885 5136471 4993778 4899806 4887289 4885170 4744089 4790006 4647061 4575539
5435D575539K61999l3804q192j2137j16687o6522J8779o8152j83617n4124J12501
$$ 4575539 4837538 4803734 4795542 4783405 4666718 4600196 4618975 4550823 4367206 4313082 4425583
5424D425583M0484L3123n5109R09M7814r4122N305J2708j88832P8362j61754J55818
$$ 4425583 4466067 4499190 4444081 4444990 4492804 4398682 4403987 4416695 4227863 4306225 4144471 4300289
5412D300289O356j32997K2136N5686j21836j7409m8446j0913j33143K2440k407
$$ 4300289 4306645 4173648 4195784 4251470 4129634 4112225 4063779 4052866 3919723 3942163 3939756
5401C939756K6911n8643j14013R9135m3104m1012j44960j4000K03799K2895J7040
$$ 3939756 3966667 3908024 3794011 3893146 3850042 3809030 3664070 3650070 3853869 3876764 3893804
5390C893804m0549m3723Q2209j72945n2414k9985q1274k4118J34113k770q6243
$$ 3893804 3853255 3809532 3891741 3718796 3666382 3636397 3555123 3531005 3665118 3662348 3576105
5379C576105l6065K9354J1981J116k30606r983j05961l931N9377M3515L0329l2007
$$ 3576105 3540040 3569394 3581375 3582491 3351885 3341902 3235941 3232010 3291387 3334902 3365231 3333224
5367C333224k7419K8432j03354n2759J4622j907j38034n0836O9717m7337P8726
$$ 3333224 3305805 3334237 3230883 3178124 3192746 3190839 3052805 3001969 3071686 3024349 3103075
5356C103075J9585K5538R4548j25627l9449k1219J23P8587q1656r8506q4757o8838
$$ 3103075 3122660 3148198 3242746 3117119 3077670 3056451 3056574 3135161 3053505 2954999 2870242 2801404
5344B801404J17096K8838j35223j0273J030M4121O6076J51158j02064j87765P7585
$$ 2801404 2918500 2947338 2812115 2801842 2802872 2846993 2913069 3064227 2962163 2774398 2851983
5333B851983J51098m1947r8046K6712M810r8524n4430N6837K7898n9317n7567
$$ 2851983 3003081 2961134 2863088 2889800 2894610 2796086 2741656 2798493 2826391 2767074 2709507
5322B709507M2608j63004o8356J24903K2792N1363l1960j5076o3707k8885J8639
$$ 2709507 2752115 2589111 2520755 2645658 2668450 2719813 2687853 2672777 2609070 2580185 2598824
5311B598824j15698L3665o0755o3318J80521R5136J5391r0531j494P4085m705
$$ 2598824 2483126 2516791 2456036 2392718 2573239 2668375 2683766 2593235 2591741 2665826 2661121
5300B661121n4816k2664r7077O2905n6677O7481n8916q3195p5910m9921J03063
$$ 2661121 2606305 2583641 2486564 2549469 2492792 2560273 2501357 2418162 2342252 2292331 2395394
5289B395394j7234l6439j7638J13679r796p3246n9378j32403q9216R1152N6035
$$ 2395394 2378160 2341721 2324083 2437762 2427966 2354720 2295342 2162939 2073723 2164875 2220910
5278B220910N1779N2478j28677l6809R6005q7569J26643j6883k34011J8308q1
$$ 2220910 2272689 2325167 2196490 2159681 2255686 2168117 2294760 2277877 2043866 2062174 2062093
5267B062093M1383J1476J3399j57481p9460Q1996m3738J38949o5128J8776p152
$$ 2062093 2103476 2114952 2128351 1970870 1891410 1973406 1929668 2068617 2003489 2022265 2015113
5256B015113l9187L448L2789N2191j19484m8530N4266O3417L4387J14q5119M0158
$$ 2015113 1975926 1979374 2012163 2064354 1944870 1896340 1950606 2014023 2048410 2048524 1963405 2003563
5244B003563L2272l9208j3942M3005j47779k01039K08042N0068k4987O5629m9510
$$ 2003563 2035835 1996627 1982685 2025690 1877911 1676872 1884914 1934982 1909995 1975624 1926114
5233A926114J4848K1701O6091Q9999k9030j21501r9969O3419R3815p4529J50991
$$ 1926114 1940962 1962663 2028754 2118753 2089723 1968222 1868253 1931672 2025487 1950958 2101949
5222B101949P207n8426m618N3631J38644j0859J66578k07713k3357J9439Q3003
$$ 2101949 2109156 2050730 2046112 2099743 2238387 2227528 2394106 2186393 2163036 2182475 2265478
5211B265478Q9200Q4883M064n9618K7765J83004Q3875R9210J11815R0945l689
$$ 2265478 2354678 2439561 2443625 2384007 2411772 2594776 2678651 2777861 2889676 2980621 2976932
5200B976932o3437J86214J44398R6782K27461J88441K38133L94124J67713L66809
$$ 2976932 2913495 3099709 3244107 3340889 3568350 3756791 3994924 4389048 4556761 4923570
5190D923570M20750L35848L44722L29954O4217P9759N0213j45676k36595k84858
$$ 4923570 5344320 5680168 6024890 6354844 6419061 6498820 6549033 6403357 6166762 5881904
5180E881904m26517k54958l55485l30966k86322j17175k21621k61230k61971j23064
$$ 5881904 5455387 5200429 4844944 4513978 4227656 4110481 3888860 3627630 3365659 3242595
5170C242595n7645j13832j57008j21220j1066k06474k8024J60092l2647N9216
$$ 3242595 3184950 3071118 2914110 2792890 2781824 2575350 2547326 2707418 2674771 2733987
5160B733987n0716j64990J32855k19744j43063k9251j57613O3077K2333M3940
$$ 2733987 2683271 2518281 2651136 2431392 2288329 2259078 2101465 2164542 2186875 2230815
5150B230815K156n0803j53911l8563J3026J06830O4526J7409k5355K7714P9496
$$ 2230815 2232971 2182168 2028257 1989694 2002720 2109550 2174076 2191485 2166130 2193844 2273340
5139B273340j22164M5209R6224J4370P5632q2068r5717Q0634l2796n7121o4062
$$ 2273340 2151176 2196385 2292609 2306979 2382611 2300543 2204826 2285460 2252664 2195543 2131481
5128B131481P8480P0755R2860n1590P2057p8627k4114M5630j11042L2983m8747
$$ 2131481 2209961 2280716 2373576 2321986 2394043 2315416 2291302 2336932 2225890 2258873 2210126
5117B210126R4557N7971J2680p1563O2554N6787p9058n071J946j9793J11010R3456
$$ 2210126 2304683 2362654 2375334 2303771 2366325 2423112 2344054 2338983 2340929 2321136 2432146 2525602
5105B525602Q1206o8200r2918Q5875O5984K01252k4418q9083R3558j3234J19028
$$ 2525602 2606808 2538608 2445690 2531565 2597549 2798801 2774383 2685300 2778858 2765624 2884652
5094B884652K41556N0505Q4610P6067J39025R9939l8789J32595J11521n3433L6851
$$ 2884652 3126208 3176713 3261323 3337390 3476415 3576354 3537565 3670160 3781681 3728248 3765099
5083C765099K2556K6638j05996K3056j77820k39217k06361j5131j11256k74039
$$ 3765099 3787655 3814293 3708297 3731353 3553533 3314316 3107955 3092824 2981568 2707529
5073B707529M8674L2685j08368j59451j40975o6814o0532r1707j09769p4563J86191
$$ 2707529 2756203 2788888 2680520 2521069 2380094 2313280 2252748 2161041 2051272 1976709 2162900
5062B162900q1551j80367n4013N3172N932N6647J8165l8263r8753j58236k4016
$$ 2162900 2081349 1900982 1846969 1900141 1906073 1962720 1980885 1942622 1843869 1685633 1661617
5051A661617Q428K9967j21400k2254k3352l1434n1944L5844K5488l6938J92961
$$ 1661617 1670045 1700012 1578612 1556358 1533006 1501572 1449628 1485472 1510960 1474022 1666983
5040A666983N563j46785l6766M750r0777j41473J12190J83454m5530p2102p3184
$$ 1666983 1672546 1525761 1488995 1493745 1402968 1261495 1373685 1557139 1511609 1439507 1366323
5029A366323m3218N0952k2559o829k83298l0044Q5759J98392j04264J9617J6982
$$ 1366323 1323105 1374057 1351498 1344669 1061371 1031327 1117086 1315478 1211214 1230831 1247813
5018A247813j14248P6536O0333k62877p6437R5459J26624J01294P6585j51178
$$ 1247813 1133565 1210101 1270434 1007557 931120 1026579 1153203 1254497 1331082 1179904
5008A179904j09017j2887j15373O1025K3145L1655n0363J59140K4999n676K1217
$$ 1179904 1070887 1058000 942627 1003652 1026797 1058452 1008089 1167229 1192228 1186552 1207769
4997A207769K7821j4169J675o5847j1516l5435Q9128j14686L3809k0188l3351
$$ 1207769 1235590 1221421 1223096 1157249 1145733 1110298 1199426 1084740 1118549 1098361 1065010
4986A065010j08606J18301J11197P6631r5483N3525k5575k65576P7443R6966J5075
$$ 1065010 956404 1074705 1185902 1262533 1167050 1220575 1195000 929424 1006867 1103833 1118908
4975A118908K9433K3747k3634m5633p4306R4152R6106j14997N6098j11472K7460
$$ 1118908 1148341 1172088 1148454 1102821 1028515 1122667 1218773 1103776 1159874 1048402 1075862
4964A075862J9783L4239K9007N0078l7911M2262R4913n6618N4021o2127L7959
$$ 1075862 1095645 1129884 1158891 1208969 1171058 1213320 1308233 1251615 1305636 1243509 1281468
4953A281468l2510m2157J09741N1501k5985m3527k3413J65877l530P6701J24100
$$ 1281468 1248958 1206801 1316542 1368043 1342058 1298531 1275118 1440995 1437465 1514166 1638266
4942A638266N1915q658m1999R0545J28937J75513J44973J30088K20913N1697L49858
$$ 1638266 1690181 1681523 1639524 1730069 1859006 2034519 2179492 2309580 2530493 2582190 2932048
4931B932048R2731L9349P6503p4959j37460k5040n3395j89756j20710k39300j28016
$$ 2932048 3024779 3064128 3140631 3065672 2928212 2903172 2849777 2660021 2539311 2300011 2171995
4920B171995j73975k39134j1115Q6780j13920o086o8871k18995P8295P6985r4733
$$ 2171995 1998020 1758886 1747771 1834551 1720631 1714545 1645674 1426679 1504974 1581959 1487226
4909A487226o9523J6212K4240o4525J1917k4115k0287R0985N2250n8052j19691
$$ 1487226 1417703 1433915 1458155 1393630 1405547 1381432 1361145 1452130 1504380 1446328 1326637
4898A326637J16567K9888k29796p698R8017J3765O8743k7854j50671J8749k4498
$$ 1326637 1443204 1473092 1243296 1235598 1333615 1347380 1416123 1388269 1237598 1256347 1231849
4887A231849m6489m499l924Q2040P923j21316j08616J52699M7019o1536k1344
$$ 1231849 1185360 1180861 1176937 1258977 1266900 1145584 1036968 1189667 1236686 1175150 1153806
4876A153806o0854q9547N3456n9265l3819Q2625k7207j360K5958J2749N9210j5304
$$ 1153806 1092952 1003405 1056861 997596 963777 1046402 1019195 1017835 1043793 1056542 1115752 1100448
4864A100448j79311q9540L2254j31332J3978J22661J22279O0370j05385j94688
$$ 1100448 921137 831597 863851 732519 746497 869158 991437 1051807 946422 751734
4854G51734l2622J9834O9156P5639o4050K3106N1114q816j522p5913j08170M9382
$$ 751734 719112 738946 808102 883741 819691 842797 893911 885095 883573 807660 699490 748872
4842G48872L0780Q474M9149P6346q3412r1392Q9148J74052k11853K5033k2308
$$ 748872 779652 788126 837275 913621 830209 738817 827965 1002017 790164 815197 792889
4831G92889L0496J20163n6729J88340M8761p5136M5235R4752q7924j02128m3050
$$ 792889 823385 943548 886819 1075159 1123920 1048784 1094019 1188771 1100847 998719 955669
4820I55669J39405P5427o5456L8937P3196J19442m9800k7935O9156L0619R2710
$$ 955669 1095074 1170501 1105045 1143982 1217178 1336620 1286820 1258885 1328041 1358660 1451370
4809A451370O1146J14224J30713J07699L03N9842N3924Q9875J20311J12389K09812
$$ 1451370 1512516 1626740 1757453 1865152 1865455 1925297 1979221 2069096 2189407 2301796 2511608
4798B511608J79365R6599O0045J85867L37243K24482R2493J52718K28741J00154
$$ 2511608 2690973 2787572 2847617 3033484 3370727 3595209 3687702 3840420 4069161 4169315
4788D169315O5169P2436m2411k26393n2105j65558k43278k36252k29943j78133
$$ 4169315 4234484 4306920 4264509 4038116 3986011 3820453 3577175 3340923 3110980 2932847
4778B932847j22007m7086j37358j80130j49720j36079o1125j01590j71091l4960
$$ 2932847 2810840 2763754 2626396 2446266 2296546 2160467 2099342 1997752 1826661 1791701
4768A791701j9224L2805q1704l4784r9074q0433p3976p1978J39973n1228K0465
$$ 1791701 1772477 1805282 1723578 1688794 1589720 1509287 1435311 1363333 1503306 1452078 1472543
4757A472543j10176m8946J06578n3981q810q9340R0310L9886j18019L8217L7470
$$ 1472543 1362367 1313421 1419999 1366018 1357208 1267868 1358178 1398064 1280045 1318262 1355732
4746A355732r3741K7626q9616q2309m038K3426O6897p0058J3234J28995l8899
$$ 1355732 1261991 1289617 1200001 1117692 1113654 1137080 1203977 1133919 1147153 1276148 1237249
4735A237249q9635m7125L7736K7645Q4196q6202N9786P2286q3459q3901N6737
$$ 1237249 1147614 1100489 1138225 1165870 1250066 1163864 1223650 1295936 1212477 1128576 1185313
4724A185313l4996J02491l7516Q2773j01750J10474N3379r5703k1057M2189l4350
$$ 1185313 1150317 1252808 1215292 1298065 1196315 1306789 1360168 1264465 1243408 1285597 1251247
4713A251247M3114K7824o7913j3668j14322R1527o5587M2712M0570l8795M8883
$$ 1251247 1294361 1322185 1254272 1240604 1126282 1217809 1152222 1194934 1235504 1196709 1245592
4702A245592j5319P2784O8223M4120O3260j15217q2436k98052Q8862J07463o5412
$$ 1245592 1230273 1303057 1371280 1415400 1478660 1363443 1281007 982955 1071817 1179280 1113868
4691A113868N5862j057r4643K7833o2495P9265O9416Q7035J31705O3052K685J04056
$$ 1113868 1169730 1168673 1074030 1101863 1039368 1118633 1188049 1275084 1406789 1469841 1472526 1576582
4679A576582k35704j65782J13518L87047K70619J38127k5326n9463J09927j9416
$$ 1576582 1340878 1175096 1288614 1675661 1946280 2084407 2059081 1999618 2109545 2090129
4669B090129J86524O2621J12927J77127o8703K8807K16871J56158l4744n1104
$$ 2090129 2276653 2339274 2452201 2629328 2560625 2589432 2806303 2962461 2927717 2876613
4659B876613K70278J06344R7007J95567J81932J66245J57752n3988J74043K48757
$$ 2876613 3146891 3253235 3350242 3545809 3727741 3893986 4051738 3997750 4171793 4420550
4649D420550J78639L10058J42192J66236K56623L74874J94513K81293K28283K28514
$$ 4420550 4599189 4909247 5051439 5217675 5474298 5849172 6043685 6324978 6553261 6781775
4639F781775L99309N31142L98711N48949N40800N09864P23340P64882P66094Q81525
$$ 6781775 7181084 7712226 8110937 8659886 9200686 9710550 10433890 11198772 11964866 12846391
4629A2846391R32901J200171J301407J387751J637802J398367J335724R48318
$$ 12846391 13779292 14979463 16280870 17668621 19306423 20704790 22040514 22988832
4621B2988832R34418R79661N28565M26294Q5417P8016n4823r7183N0470K02294
$$ 22988832 23923250 24902911 25431476 25857770 25943187 26021203 25966380 25869197 25919667 26121961
4611B6121961L47785M96432Q38366J126957J359076J327296J343926J400276J698997
$$ 26121961 26469746 26966178 27804544 28931501 30290577 31617873 32961799 34362075 36061072
4602C6061072J747004J798214J971231K106886K102233J867688J891966J934213
$$ 36061072 37808076 39606290 41577521 43684407 45786640 47654328 49546294 51480507
4594E1480507J704890J808798J681364J697549J485461J097097Q08050N27975
$$ 51480507 53185397 54994195 56675559 58373108 59858569 60955666 61763716 62291691
4586F2291691L18782L40240O0435l42995l31060n07550j101267j332122j325923
$$ 62291691 62610473 62950713 63011148 62668153 62337093 61829543 60728276 59396154 58070231
4577E8070231j753701j570898j497116j661487j836765j912903k086389k123293
$$ 58070231 56316530 54745632 53248516 51587029 49750264 47837361 45750972 43627679
4569D3627679j928828j925778j851197j710116j644904j599887j576846j416079
$$ 43627679 41698851 39773073 37921876 36211760 34566856 32966969 31390123 29974044
4561B9974044j157735j220382q76266r20995o66764l54665l34981q6500j84038
$$ 29974044 28816309 27595927 26719661 25798666 25131902 24777237 24442256 24355756 24171718
4552B4171718P4503J82143J38962L34247M25742N31765P89673P58291Q74736R88433
$$ 24171718 24246221 24428364 24567326 24901573 25327315 25859080 26648753 27407044 28281780 29270213
4542B9270213J174808J328458J428346J735660J785824J956143K019529K363257
$$ 29270213 30445021 31773479 33201825 34937485 36723309 38679452 40698981 43062238
4534D3062238K454045K445847K469548K544684K727429L014760L271740L493748
$$ 43062238 45516283 47962130 50431678 52976362 55703791 58718551 61990291 65484039
4526F5484039L705840M113770M565873N169341N621900O178168O828694P638858
$$ 65484039 69189879 73303649 77869522 83038863 88660763 94838931 101667625 109306483
4518A09306483Q607243R472584J0927166J2175446J3629869J5142400J6571217
$$ 109306483 117913726 127386310 138313476 150488922 164118791 179261191 195832408
4511A95832408J7129789J7265546J6513433J4984312J2601430R276048N357420
$$ 195832408 212962197 230227743 246741176 261725488 274326918 283602966 288960386
4504B88960386J376017k469625o699326j0492196j3454758j5474366j6807714
$$ 288960386 290336403 287866778 281167452 270675256 257220498 241746132 224938418
4497B24938418j7249401j6695406j5723720j4469801j3373009j2141717j0740473
$$ 224938418 207689017 190993611 175269891 160800090 147427081 135285364 124544891
4490A24544891r799867q639237q173397p185033o560169n899940n281270m775748
$$ 124544891 114745024 106105787 97932390 90747357 84187188 78287248 73005978 68230230
4482F8230230m253551l957127l594826l317820k861023k641090k331994k289859
$$ 68230230 63976679 60019552 56424726 53106906 50245883 47604793 45272799 42982940
4474D2982940k182272j987255j855874j640609j532636j452671j254791j154363
$$ 42982940 40800668 38813413 36957539 35316930 33784294 32331623 31076832 29922469
4466B9922469j098068j224953j157245q54942p39456q08196j012429p67901p84310
$$ 29922469 28824401 27599448 26442203 25587261 24847805 24039609 23027180 22259279 21474969
4457B1474969p77007o16389m98650o05295o98978m64978m88674n92873m78084
$$ 21474969 20697962 20081573 19582923 18977628 18278650 17813672 17324998 16732125 16254041
4448A6254041l45195l29232n31065m15888l79949k53504k36850l38307k99891
$$ 16254041 15908846 15579614 15048549 14632661 14252712 13999208 13762358 13424051 13124160
4439A3124160k75472l00031l39409j23259j82807j26067j25303k01925l56304
$$ 13124160 12848688 12548657 12209248 12085989 11903182 11777115 11651812 11449887 11093583
4430A1093583q2095j78922n4331k54898j53049o5692j9157O6856o713j03330R2180
$$ 11093583 11011488 10832566 10778235 10523337 10370288 10304596 10285439 10352295 10345582 10242252 10334432
4419A0334432O2261k3222p5495j3815J06281L5912J45543K15779J98175L919J47368
$$ 10334432 10396693 10373471 10297976 10284161 10390442 10426354 10571897 10787676 10985851 10989770 11137138
4408A1137138K89195P4646J34507L31728K67339J82471M71596N93518M34039N69498
$$ 11137138 11426333 11500979 11635486 11967214 12234553 12417024 12888620 13482138 13916177 14485675
4398A4485675P32951P17125Q56280J184473J167546J219259J304204J489751J408847
$$ 14485675 15218626 15935751 16792031 17976504 19144050 20363309 21667513 23157264 24566111
4389B4566111J176681J054785P63537O35081K20482k69641m76073r25356j116524
$$ 24566111 25742792 26797577 27561114 28196195 28416677 28147036 27670963 26745607 25629083
4380B5629083j228502j427245j475448j610615j507453j118209j194632j093192
$$ 25629083 24400581 22973336 21497888 19887273 18379820 17261611 16066979 14973787
4372A4973787r31313j014295q96142o49515n26193o73078l48719m92496n73733
$$ 14973787 14042474 13028179 12132037 11482522 10956329 10283251 9934532 9442036 8868303
4363H868303m23784k86036k92269l66238k75329l49052k90215j68234j29007k15235
$$ 8868303 8444519 8158483 7866214 7499976 7224647 6875595 6585380 6417146 6288139 6072904
4353F072904k16083j81256o9846j34211k16128r1126o1006q9172j42661n9469
$$ 6072904 5856821 5675565 5605719 5471508 5255380 5164254 5103248 5014076 4871415 4811946
4343D811946r1717j17625l2977o3509K1414q362K2216l0163j62088J2291o3813
$$ 4811946 4720229 4602604 4569627 4506118 4527532 4519170 4541386 4511223 4349135 4361426 4297613
4332D297613l2005N7625j04569j1861J08561k4301j16059o2949k02683m9967o176
$$ 4297613 4265608 4323233 4218664 4206803 4315364 4291063 4175004 4112055 3909372 3859405 3853229
4321C853229N2054r4854J3878m2687j49530l7897j2204q0345j14998K189J7346
$$ 3853229 3905283 3810429 3824307 3781620 3632090 3594193 3581989 3501644 3386646 3388835 3406181
4310C406181j93446j17502m5458j7417K1470j22117m4520J69430j09917r1042
$$ 3406181 3212735 3095233 3049775 3032358 3053828 2931711 2887191 3056621 2946704 2855662
4300B855662q8806j54253j6173R4500q76J06486j32801j09088N5657j1036J11425
$$ 2855662 2766856 2612603 2596430 2690930 2690054 2796540 2663739 2554651 2610308 2599272 2710697
4289B710697j43503j8959J7025L6624l5353n9382Q351p8023n9380k5747O8067
$$ 2710697 2567194 2548235 2565260 2601884 2566531 2507149 2515500 2437477 2378097 2352350 2420417
4278B420417L7070r0934J34429J48717j35783j11794J5290L3103j01052Q2718
$$ 2420417 2457487 2366553 2500982 2649699 2513916 2402122 2417412 2450515 2349463 2432181
4268B432181N8392m8310j12904O492j5245p4216m2068N5062M9595o3436k2244
$$ 2432181 2490573 2442263 2329359 2335851 2320606 2246390 2204322 2259384 2308979 2245543 2223299
4257B223299M2116r7786o4376P5416l8418M9310j85090l7970Q8030L926j10895
$$ 2223299 2265415 2167629 2103253 2178669 2140251 2189561 2004471 1966501 2054531 2058457 1947562
4246A947562L6887M5909j30153P9518l125n4977k0234K1353R6641Q7565j26264
$$ 1947562 1984449 2030358 1900205 1979723 1976598 1921621 1901387 1922740 2019381 2106946 1980682
4235A980682n5601P644o7772P7097P1039J52352l7949K1521m7597P8346O712J54786
$$ 1980682 1925081 1932725 1864953 1942050 2013089 2165441 2127492 2149013 2101416 2179762 2186474 2341260
4223B341260L11731K4792O551o9820K22173P5013Q046Q4965l0334J06621j32787
$$ 2341260 2652991 2677783 2684334 2614514 2836687 2911700 2919746 3004711 2974377 3080998 2948211
4212B948211p9360k6757p3501q7050J37351j28370l09607j56391Q6179m3376o3956
$$ 2948211 2868851 2842094 2768593 2681543 2818894 2690524 2380917 2224526 2310705 2267329 2203373
4201B203373j47590j44702J8522j04153M2891N4486p0310j00593j22968M934j3190
$$ 2203373 2055783 1911081 1929603 1825450 1868341 1922827 1852517 1751924 1628956 1633890 1620700
4190A620700q721n667l814L1341J4625k3733r7614K9836J7419l8545p1380o2651
$$ 1620700 1611979 1606312 1602498 1633839 1648464 1624731 1527117 1556953 1574372 1535827 1464447 1401796
4178A401796J88181J37882j73925q6159m5922o9023r146J03492m64p6788J1580
$$ 1401796 1589977 1727859 1553934 1467775 1421853 1352830 1343684 1447176 1446712 1369924 1381504
4167A381504m8426M1761L5449P3574k446Q911j20497N8043O2293M2944O8797k0405
$$ 1381504 1333078 1374839 1410288 1483862 1481416 1490327 1369830 1427873 1490166 1533110 1601907 1581502
4155A581502p2581j10842R6981K6083j02705L9842m6645r7845k3318l0570j28044
$$ 1581502 1508921 1398079 1495060 1521143 1418438 1458280 1411635 1313790 1290472 1259902 1131858
4144A131858n0080q080Q9332M9608J143k8752r8639O5856K7033j6859j01860N7827
$$ 1131858 1081778 1073698 1163030 1212638 1213781 1185029 1086390 1152246 1179279 1162420 1060560 1118387
4132A118387P4076J65377j21520j09989P5721q5495l7224l9676j5124J70681O975
$$ 1118387 1192463 1357840 1236320 1126331 1202052 1116557 1079333 1039657 1024533 1195214 1202189
4121A202189O8775j17459K7487o3228P1670J9356j07181m6780Q5742L8390o5087
$$ 1202189 1270964 1153505 1180992 1117764 1189434 1208790 1101609 1054829 1140571 1178961 1113874
4110A113874K1002K5661P9809O4618o9597K4407j4037P580j42962m4741P1187
$$ 1113874 1134876 1160537 1240346 1304964 1235367 1259774 1245737 1253317 1110355 1065614 1136801
4099A136801P1283K1860P8326O8454o8833J50597K9127j01477K1595J35107L5431
$$ 1136801 1208084 1229944 1308270 1376724 1307891 1458488 1487615 1386138 1407733 1542840 1578271
4088A578271K3532k7242k3485j36756R4511Q4621k4152m1317R9647K36483o216
$$ 1578271 1601803 1574561 1551076 1414320 1508831 1593452 1569300 1527983 1627630 1864113 1857897
4077A857897R1816R7312J24115O8891J9706O6140k8713j05812J93458K75477N7162
$$ 1857897 1949713 2047025 2171140 2240031 2259737 2325877 2297164 2191352 2384810 2660287 2717449
4066B717449P4309J93685K42039K37219J40619K33825K01615J22196K42323L54923
$$ 2717449 2791758 2985443 3227482 3464701 3605320 3839145 4040760 4162956 4405279 4760202
4056D760202L13778J66519M11394M21975K11567N42281O91660P31263P48948M75825
$$ 4760202 5073980 5240499 5651893 6073868 6285435 6827716 7519376 8250639 8999587 9475412
4046I475412K26254J71902J83073j3406r7404k80202o64310o18678n71719n10315
$$ 9475412 9701666 9873568 10056641 10043235 9945831 9665629 9001319 8382641 7810922 7300607
4036G300607l34936n01061l97340l04491j92889k38274l25917l37511k09038j41469
$$ 7300607 6965671 6464610 6067270 5762779 5569890 5331616 5005699 4668188 4459150 4317681
4026D317681k69585k11413k11018k75230q8467l6183j04420j59599o5061k04184
$$ 4317681 4048096 3836683 3625665 3350435 3261968 3225785 3121365 2961766 2896705 2692521
4016B692521l8551k02216k8743k21847j19124L1933j36593L0847j55179r3779
$$ 2692521 2653970 2451754 2423011 2201164 2082040 2113973 1977380 2008227 1853048 1759269
4006A759269M3822N131q0636r5602j29372J3590j8438j13610J4032K5717m2867
$$ 1759269 1803091 1808222 1727586 1631984 1502612 1516202 1497764 1384154 1398186 1423903 1381036
3995A381036M4018n7394j16004j23460l1989q364l9846J7239n1328n2892L7754
$$ 1381036 1425054 1367660 1251656 1128196 1096207 1087843 1047997 1065236 1013908 961016 998770
3984I98770J72154L9244K4476J50p3013o880p3622J2795k0022q2287n1361J6023
$$ 998770 1170924 1210168 1234644 1234794 1161781 1154901 1081279 1094074 1074052 991765 940404 956427
3972I56427L7151j05324l1377o5971J8766Q4029K6862r4551K4986n6530N8384
$$ 956427 993578 888254 856877 790906 809672 893701 920563 826012 850998 794468 852852
3961H52852m322J8797m1217J7815r6752O0094o7191N6438O6363j01096L6976K7872
$$ 852852 848530 867327 826110 843925 747173 807267 740076 796514 862877 761781 798757 826629
3949H26629L5509o7471J6408J60952r2233j27226m5151L6863J02415j84318n2015
$$ 826629 862138 794667 811075 972027 879794 752568 707417 744280 846695 662377 610362
3938F10362k6258R8044P949q8220J3802Q1383k5092L4022n8096J25604q8360k1660
$$ 610362 584104 682148 690097 601877 615679 697062 671970 705992 647896 773500 685140 663480
3926F63480o3066N3669J961J59558p112p9170M9602l8995m1083j76997M5841K413
$$ 663480 600414 654083 656044 815602 808490 729320 778922 739927 698844 521847 567688 570101
3914E70101J4706L1984J3801o7870n4148K3387j2777J07676Q813j6012O154O8958
$$ 570101 584807 616791 630592 562722 508574 531961 519184 626860 635673 619661 625815 694773
3902F94773k2321l1536r1457j3923m585M9890m4932n4747L7344J09387M0798R8680
$$ 694773 672452 640916 549459 535536 530951 580841 535909 481162 518506 627893 668691 767371
3890G67371q1544j25081M7743N1389r2629K8554r2340J04188J59305j93423n7500
$$ 767371 685827 560746 608489 659878 567249 595803 503463 607651 766956 573533 516033
3879E16033j09731N7120m3807N0713J18823M3072r0669j38356K4754k6307L0193
$$ 516033 406302 463422 419615 470328 589151 632223 541554 403198 427952 401645 431838
3868D31838j5797J30853J52015p7235j22340l3617O952J4957L3752p6430j1377
$$ 431838 416041 546894 698909 621674 499334 465717 472669 487626 521378 444948 433571
3857D33571k8725J3836N0424L2882j23415l476J73206N7167j13135q7113j823
$$ 433571 404846 418682 469106 501988 378573 375097 548303 605470 492335 405222 403399
3846D03399K11394L1117j81043M6530N5886n7141j1881K3056j06424J6830n0366
$$ 403399 614793 645910 464867 511397 567283 510142 498261 521317 414893 431723 381357
3835C81357M188m8845j1412K50133J3197p7596j9096m7781L2274k2639r6107L9294
$$ 381357 385545 336700 325288 575421 588618 511022 491926 444145 476419 453780 357673 396967
3823C96967O6180N5926p8251j03881k4585J37635N276M777j12706R5133Q1579
$$ 396967 463147 519073 440822 336941 312356 449991 455267 460044 347338 442471 524050
3812E24050k5083J03742N3509j10698k10953J50707O0294j54572P7373m495K9035
$$ 524050 498967 602709 656218 545520 334567 485274 545568 390996 468369 463874 492909
3801D92909j42041l5090J07939O927Q3865J8358P891J0441m6498N1617k2258m6558
$$ 492909 350868 315778 423717 430644 514509 532867 540758 551199 504701 556318 534060 487502
3789D87502j1387L662L8867m269P179N1466M8608n3409l678j26644j02922J55779
$$ 487502 476115 479777 518644 514375 521554 573020 621628 568219 564541 437897 334975 490754
3777D90754J0979K2011m5520K3514l2518p8231K713j5480L7386M5139j25971N0373
$$ 490754 501733 523744 478224 501738 469220 390989 393702 378222 415608 460747 334776 385149
3765C85149Q5373Q4354Q118j16523j03242n907J09539n8052R7609o9458L691O8252
$$ 385149 470522 554876 562994 446471 343229 337322 446861 388809 486418 416960 420651 488903
3753D88903k15013J09089M1628m743K0593k4955p5527j0720J37081l3609j53595
$$ 488903 273890 382979 424607 419864 440457 415502 339975 329255 466336 432727 279132
3742B79132O5634P4205j00461J09420n5491J39470j66234L2724M8001q4567O6863
$$ 279132 344766 418971 318510 427930 372439 511909 345675 378399 426400 341833 408696
3731D08696P6604q4712j8230J70498j08562k2846j03490O5495N4799o1129k8552
$$ 408696 485300 400588 382358 552856 444294 421448 317958 383453 438252 377123 348571
3720C48571l6824m3047j0408J15507M0920O4107P139J51370r6167j48044o3788
$$ 348571 311747 268700 258292 373799 414719 478826 485965 637335 541168 393124 329336
3709C29336N218k1037L4358k0666J409Q6986r117n1525N8109k8340m074o2451
$$ 329336 334554 313517 347875 327209 328618 415604 406487 354962 413071 384731 380657 318206
3697C18206J6660J01309M8393m3642n0440Q0199p7519p3814L9657L3545N9321
$$ 318206 334866 436175 484568 440926 390486 470685 393166 319352 359009 392554 451875
3686D51875J1834r8631J5365N5059K0558p1844j25612O7302J21184l6396k3925
$$ 451875 463709 365078 380443 435502 456060 384216 258604 325906 447090 410694 386769
3675C86769M4548J9506j16271J7583L5274j1441J35420P6808k82748K3993k4252
$$ 386769 431317 450823 334552 352135 387409 375968 511388 588196 305448 329441 305189
3664C05189J0192J62240j5785n5262l5427j12361j7292L2612O1613P9444k2794
$$ 305189 315381 477621 461836 406574 371147 258786 241494 274106 335719 415163 392369
3653C92369K3049j416K0247n7351O1404O650M1074n2948k1698J7803K1504j3120
$$ 392369 415418 414002 434249 376898 438302 444952 486026 433078 411380 429183 450687 437567
3641D37567q6151k8667P5627o5573J07937J00110j55273n5664K3695m8509K9037
$$ 437567 351416 322749 398376 332803 440740 540850 385577 329913 353608 305099 334136
3630C34136l3648j74214J77692N6240l7367n5853M0759J11921J08143K573j41740
$$ 334136 300488 126274 303966 360206 322839 266986 307745 419666 527809 530382 388642
3619C88642J4567K0170o1404P5497r0808Q8235M7330O3141k6479m1311R80j36348
$$ 388642 403209 423379 361975 437472 346664 434899 482229 545370 518891 477580 478560 342212
3607C42212Q2298k2425m1640m88P9550j8187j45212N3160J00376o2108R0046o398
$$ 342212 424510 402085 360445 359957 439507 421320 276108 329268 429644 367536 457582 451184
3595D51184o217R152K8825O075o186l9738j3547k7422q2821K6627J23244J36014
$$ 451184 444967 454119 482944 489019 482833 443095 429548 402126 319305 345932 469176 605190
3583F05190l8489L5716J28821p4134p5092K7654j73195J7750q8141M3500o4278
$$ 605190 566701 602417 731238 657104 582012 609666 436471 454221 366080 409580 345302
3572C45302j29492L2406J94206Q6127r6360k0007n3345K9316p9313n0911n3613
$$ 345302 215810 248216 442422 528549 432189 412182 358837 388153 308840 257929 204316
3561B04316J262J19947J40098K1099j10257J0331r202O3662Q467j0702l5063O8542
$$ 204316 205578 325525 465623 486722 376465 386796 377594 441256 449723 439021 403958 472500
3549D72500q7411J55251O1792j36895j5715J20506J43805k13630j75315n0688
$$ 472500 385089 540340 602132 465237 449522 570028 713833 500203 324888 274200
3539B74200m8341J36934M9874k968K8101J2867l966m113p686J8877p3122j30627
$$ 274200 225859 362793 412667 409699 437800 450667 446701 442588 434902 453779 380657 250030
3527B50030P7624j33014N8277J0935J19099M023Q7493R593K632o1586j54061J8406
$$ 250030 327654 194640 252917 263852 382951 386974 474467 484060 486692 425106 271045 289451
3515B89451K00314l3419n8176P3233K9908J5086n4418r9885k1684P3107N8287
$$ 289451 489765 456346 398170 471403 501311 516397 461979 362094 340410 413517 471804
3504D71804K5230n9662m319M2201p6590R647N7707q3504J29866R1060n7209p6538
$$ 471804 497034 437372 433053 475254 398664 408311 466018 382514 512380 603440 546231 469693
3492D69693R1737J4015p7312L5899L377N8230j17167o4786R1975M4073O5649r890
$$ 469693 561430 575445 498133 534032 537409 595639 478472 413686 505661 549734 615383 605493
3480F05493P781k2222j08115J86153n9021n8380J13718n0646j30106q1497Q0102
$$ 605493 613274 591052 482937 669090 610069 551689 665407 614761 484655 403158 483260
3469D83260J33586M0076J1063K8506k0600m1232p5538M5286o306J30644q573M1213
$$ 483260 616846 656922 667985 696491 675891 634659 559121 604407 598101 728745 720172 761385
3457G61385J01262N650L0750p0312j13025j2M3797J07470J25311J06311J210J37953
$$ 761385 862647 868297 899047 828735 715710 715698 759495 866965 992276 1098587 1099797 1237750
3445A237750n9257o8571O6673Q7160L0078J69456J29657j46845Q8519K14921o985
$$ 1237750 1178493 1109922 1176595 1263755 1293833 1463289 1592946 1446101 1534620 1749541 1742556
3434A742556j00937O6403Q9403K57590J34835L2670J45309K35734J84298J13039
$$ 1742556 1641619 1708022 1797425 2055015 2189850 2222520 2367829 2603563 2787861 2900900
3424B900900M4404J28054K30936L04953J94800J06617K98364J79833P6363J27113
$$ 2900900 2945304 3073358 3304294 3609247 3804047 3910664 4209028 4388861 4465224 4592337
3414D592337J71742J30763J5584j88730j11845j23470j94909j041l11656j90496
$$ 4592337 4764079 4894842 4910426 4721696 4609851 4486381 4291472 4290431 3978775 3788279
3404C788279k04761j81961M7584j18140k2684k9608K8254j1168K4098J72151J92805
$$ 3788279 3583518 3401557 3449141 3331001 3308317 3278709 3306963 3295795 3319893 3492044 3684849
3393C684849P9057R0353L10874L47884K13131M42786L71713L00398L66289L55813
$$ 3684849 3763906 3854259 4165133 4513017 4726148 5168934 5540647 5841045 6207334 6563147
3383F563147L34250R4451J82330l5374j95201l28980l30806j98935l52153n59702
$$ 6563147 6897397 6991848 7174178 7138804 6943603 6614623 6283817 6084882 5732729 5173027
3373E173027k63390k85716k65514k77378k79636j73945k06304k26714k2844l7366
$$ 5173027 4909637 4623921 4358407 4081029 3801393 3627448 3421144 3194430 3171586 3134220
3363C134220m654n5354N2090J50394m0525J5727M4444K09729K05183N870M1324
$$ 3134220 3129566 3074212 3126302 3276696 3236171 3251898 3296342 3506071 3711254 3717124 3758448
3352C758448J56308P1015J72255o8302j00748J4879p8847k95897k49942j27710
$$ 3758448 3914756 3985771 4158026 4089724 3988976 4003855 3925008 3629111 3379169 3251459
3342C251459j13001k49072k80179j66217k45593n1184l5666k61995j89264n4868
$$ 3251459 3138458 2889386 2609207 2442990 2197397 2146213 2110547 1848552 1659288 1604420
3332A604420o5784j3205k3051j83744L2813k973l7574N782j06420o1164P2571
$$ 1604420 1538636 1525431 1502380 1318636 1351449 1348476 1310902 1316684 1210264 1149100 1221671
3321A221671q3324K9364N6536j57810j11164q1899j06150J72399Q7037l2092L0476
$$ 1221671 1138347 1167711 1224247 1066437 955273 873374 767224 939623 1026660 994568 1025044
3310A025044q9662j11105j61392K3220K09402j39309n0374k4793K8345J82870
$$ 1025044 935382 824277 662885 686105 895507 756198 705824 681031 709376 892246
3300H92246j01887j17459O3781K1557J31L153l8318K8528l3868j83842Q5678O4368
$$ 892246 790359 672900 736681 758238 758369 761522 723204 751732 717864 534022 619700 684068
3288F84068j5317M9550n682n1222j18231l0854k5165N5672q5705n616J05273O18
$$ 684068 668751 718301 712619 661397 543166 512312 487147 542819 457114 451498 556771 557389
3276E57389N8388m7954N4655R7665j33766J8677L2739p649J9586P9098J3930m6183
$$ 557389 615777 567823 622478 720143 586377 605054 637793 630144 649730 728828 742758 696575
3264F96575N2958o7584k2856m0474j56032J01466o9993l876J0273J4415m0386
$$ 696575 749533 681949 659093 618619 462587 564053 494060 490184 500457 514872 474486
3253D74486K3141P5112j33198O2000j1572j14241k0144P5436P8884n518P4756
$$ 474486 497627 572739 439541 501541 489969 375728 355584 431020 509904 504386 579142
3242E79142j10811k4635M7942L0522r4033R8044J40718j03538J12098K2880j18025
$$ 579142 468331 443696 491638 522160 428127 526171 666889 563351 675449 698329 580304
3231E80304j65377R755J3585J51028J23014j47111L2382j108P4899J0661l8380
$$ 580304 414927 424682 438267 589295 712309 565198 597580 596472 671371 682032 643652
3220F43652j47223j38543Q7655N2157P7193N314m8834K4963k18306k1972J60964
$$ 643652 496429 357886 445541 497698 574891 580205 531371 556334 338028 316056 477020
3209D77020p2025K7470M3270P4015K51j91265O9103J61032P998p5811l4782k1394
$$ 477020 404995 432465 475735 549750 550001 358736 427839 588871 596869 521058 486276 464882
3197D64882p6689q2563M1983j8177M0132n1612o9115j4475J50022j6889l940l707
$$ 464882 388193 305630 347613 329436 369568 317956 248841 234366 384388 367499 363559 359852
3185C59852O6249n6552j02429J8515K6166N8336J841J34539q2223k0401j52400
$$ 359852 426101 369549 267120 285635 311801 370137 371978 506517 424294 403893 251493
3174B51493O6723p9935j40323J61233R7561r4957J28497m3115j16416l7653P6784
$$ 251493 318216 238281 97958 259191 356752 261795 390292 347177 230761 193108 269892
3163B69892P5749P7158j02697p2472k1764l7430M9949o7555M8149P8712K8739
$$ 269892 345641 422799 320102 247630 225866 188436 238385 170830 218979 297691 326430
3152C26430J0444M1899l6007j63259J5464l1626J72493J6118M8212K651J4172
$$ 326430 336874 378773 342766 179507 194971 163345 335838 351956 400168 402819 416991
3141D16991j15042q7643N6924l3085K06467j00879l3139J8260r365J1255P5471
$$ 416991 301949 214306 271230 238145 444612 343733 310594 328854 319489 330744 406215
3130D06215j16533p5302P3654q3623Q6370L1539R1220j62262J210J06437k9034
$$ 406215 289682 214380 288034 204411 290781 322320 413540 251278 252488 358925 329891
3119C29891J25257q5979P9058K8800L7007L9952m6408p8475o1613k8770R8470
$$ 329891 455148 369169 448227 477027 514034 553986 507578 429103 367490 338720 437190
3108D37190O3855n3525o0162J10244N3664j6597L8511j01481j60404l4388J63361
$$ 437190 501045 447520 387358 497602 551266 534669 573180 471699 311295 276907 440268
3097D40268m3824Q1659K26504L5811n7039O3706m6220j13486o5634R4120J53234
$$ 440268 396444 478103 704607 740418 683379 747085 700865 587379 521745 615865 769099
3086G69099o5105j38541M0010J23257k8024l6601r8372J19171j0025k6402j07551
$$ 769099 703994 565453 605463 728720 700696 664095 565723 684894 674869 648467 540916
3075E40916K1870M1407N383N5749J0641Q2657N6083j50200o6762O322J3868J1130
$$ 540916 562786 604193 609576 665325 675966 758623 814706 664506 597744 604066 617934 629064
3063F29064K1709L1684Q5748j13625n5860P5797N4058p2071n834k1142j00589
$$ 629064 650773 682457 768205 654580 598720 674517 728575 656504 650670 629528 528939
3052E28939P2493M4940J8733l7648N9353m1301q6581j15902p6522J07874R9723
$$ 528939 601432 646372 665105 627457 686810 645509 558928 443026 366504 474378 574101
3041E74101m1617n1565M7257R8029j47449p4730P8069M0832r4782P1223m0986
$$ 574101 532484 480919 528176 626205 478756 404026 482095 522927 428145 499368 458382
3030D58382j3325P9579n9766j38286O0137j4550N7889N5428j81879m2426m7501
$$ 458382 445057 524636 464870 326584 386721 372171 430060 485488 303609 261183 213682
3019B13682J05292j2246n659Q1546j15375m7285J37916J08260j29049j55238M1798
$$ 213682 318974 306728 301069 382615 267240 219955 357871 466131 337082 181844 223642
3008B23642k1024Q623Q5910m7347m9051L4869M5536M4604o3471o6337j20087j4576
$$ 223642 202618 211241 297151 249804 200753 235622 281158 325762 262291 195954 75867 61291
2996F1291R8215q640J263M0319l2397n1179J31250l33N0743N1885m1431j55556
$$ 61291 159506 150866 152129 192448 160051 108872 240122 239789 290532 342417 300986 145430
2984A45430J0102M9869q1069J39473P1077k7830p1329n599R5352l6657j11550
$$ 145430 155532 205401 124332 263805 334882 307052 235723 230124 325476 288819 177269
2973A77269p2112q767Q0804j05593J8828m489j4615P3208p0401L5092p2442J4248
$$ 177269 105157 96390 177194 71601 90429 85940 71325 144533 74132 109224 36782 51030
2961E1030J57140k9839J60563j26564j32620J07896L4021n7878n899q7428R142
$$ 51030 208170 178331 338894 212330 79710 187606 221627 163749 157850 70422 79564
2950G9564J20114m8446n0794p8547J3833N1088L7034p017j02254l3836Q52J27016
$$ 79564 199678 151232 100438 21891 35724 86812 123846 116829 14575 -19261 -18409 108607
2938A08607n7096J7625o1341j81627J05595M8688J64306K4176K9370m1247j06812
$$ 108607 51511 69136 7795 -173832 -68237 -19549 144757 168933 198303 157056 50244
2927E0244J10542j174r8745k3509J00545J1617K0562N7460j33586J44596k780
$$ 50244 160786 159612 60867 37358 137903 149520 170082 227542 93956 238552 235772
2916B35772j28490j16111J9911p4378o394J26512k0165l1763J43607J36077q5913
$$ 235772 107282 -8829 11082 -63296 -69690 56822 36657 4894 148501 284578 198665
2905A98665L6947j05388k17827P8519K9619K882Q087N2256O3524o1344j09378
$$ 198665 235612 130224 -87603 -9084 20535 23417 31504 83760 147284 85940 -23438
2894b3438j14769L9109J63951N4559j65482q2115j9444J79112L6795n7455J10364
$$ -23438 -138207 -99098 64853 119412 -46070 -128185 -147629 31483 68278 10823 121187
2883A21187n3368N242j975j16655K6359J14821j49595O4921l5655j1690k9839
$$ 121187 67819 73061 71086 -45569 -19210 95611 -53984 10937 -24718 -36408 -66247
2872f6247J97154j2729j11252K39919j2618j84033j44700P7701Q1979J7698J7815
$$ -66247 130907 118178 6926 246845 234227 50194 -94506 -16805 65174 82872 100687
2861A00687k7178j23591M1609q121R0345j4892n4741j71566M1939R9783K1542
$$ 100687 73509 -50082 -8473 -16594 73751 58859 4118 -167448 -125509 -25726 -4184
2850d184j9288L0438J9530n3659L7322K877r7506N0209J08744O4677K5526J8580
$$ -4184 -23472 6966 26496 -27163 10159 13036 -84470 -34261 74483 139160 164686 183266
2838A83266M0687k70911l0422J91482j20877l7823J324l1383r5385P483O9364
$$ 183266 223953 -46958 -77380 114102 -6775 -44598 -43274 -74657 -170042 -162559 -93195
2827i3195J82476J8492j45783N2357k2897l5434R452j4646P6600M8889k4247j5446
$$ -93195 89281 107773 -38010 14347 -8550 -43984 -34532 -49178 27422 76311 52064 36618
2815C6618M6063o3440R242J59498J0226k5131o3120j62804l60P98M3579q7234
$$ 36618 82681 19241 28483 187981 198207 173076 109956 -52848 -53208 -52410 -8831 -96065
2803i6065J18343o0550j14602J43723j29147P4348M1839j12616r7299J16829o7703
$$ -96065 22278 -38272 -152874 -9151 -138298 -63950 -22111 -134727 -232026 -115197 -182900
2792a82900J05201M7185J72263q8292j62893Q4587j109J47341L6708o9815r7783
$$ -182900 -77699 -30514 141749 53457 -109436 -24849 -25958 121383 158091 88276 -9507
2781i507k8372L3156P8683j1644j5351N7489r9453q3195K2662N3336j25758Q8747
$$ -9507 -37879 -4723 73960 62316 46965 104454 5001 -78194 -55532 -2196 -127954 -39207
2769c9207M7260Q0634J9732q6103j044p5870J87571L3939j45949K0656J2258J02253
$$ -39207 8053 88687 108419 22316 21272 -54598 132973 166912 20963 41619 53877 156130
2757A56130j31346k6156M3932q1424J12166k5947j19686M1405L6506j56602J19699
$$ 156130 24784 -1372 42560 -38864 73302 47355 -72331 -30926 5580 -151022 -31323
2746c1323Q03N2460J30868o0930j42751L5477O0825j3982l4947p962o3944J8510
$$ -31323 -30520 21940 152808 91878 -50873 -15396 45429 31447 -3500 -11462 -75406 -56896
2734e6896n9867M0299J08540K6779j27862o9927J31179P5825L9529k10987l5965
$$ -56896 -116763 -76464 32076 58855 -69007 -138934 -7755 68070 107599 -103388 -139353
2723a39353K7172j036N4145L8777J6928n4335J29694j8270m8760r3197k325n9716
$$ -139353 -112181 -113217 -59072 -20295 -3367 -57702 71992 53722 4962 -88235 -90560 -150276
2711a50276N6204J15984j16917J30426m3974j05528M8792J6297p154l2025K6318
$$ -150276 -94072 21912 -95005 35421 -8553 -114081 -65289 -48992 -56146 -88171 -61853
2700f1853l0994J00128Q1482j41363k9133L4514K9196j25590q93J45945J1198
$$ -61853 -92847 7281 88763 -52600 -81733 -47219 -18023 -143613 -144506 1439 12637
2689A2637K0653L9150j16935M9253J42774J19784j06136l2915J5396j00214K6097
$$ 12637 33290 72440 -44495 4758 147532 267316 161180 128265 143661 43447 69544
2678F9544J6152o5442n4003j07073j3919L5693R1004R6206q883l6641q0695j13100
$$ 69544 85696 20254 -33749 -140822 -154741 -119048 -28044 68162 59279 22638 -58057 -171157
2666a71157J67317O987l8608p0180p1627P3663j15494O0690P4093N4402M0178
$$ -171157 -3840 3147 -35461 -105641 -177268 -103605 -219099 -158409 -84316 -29914 10264
2655A0264l054k5141O2412L1488j6888k6080K1403O3125O3404r844j00906M8298
$$ 10264 7210 -17931 44481 75969 59081 33001 54404 117529 180933 171089 70183 118481
2643A18481N1544p4881k3504m4099p5581J1340k35827Q1823J50457L3486m612
$$ 118481 170025 95144 71640 27541 -48040 -36700 -272527 -190704 -40247 -6761 -11373
2632a1373j02910o4203k5971J68750J44127q4222n4275n4869O8122P5936j18701
$$ -11373 -114283 -178486 -204457 -35707 108420 24198 -30077 -84946 -16824 59112 -59589
2621e9589j16786J10311J33651k9038n7763J3662J5185j33122J06420L5628r1156
$$ -59589 -176375 -66064 67587 38549 -19214 -5552 9633 -123489 -17069 18559 -72597
2610g2597j9738J8389J32581k0196j61744M1797Q0387J60423k79138N4878L5833
$$ -72597 -92335 -73946 58635 38439 -123305 -81508 -1121 159302 -119836 -64958 -29125
2599b9125n495n5585J1846p8936j18317R3517j962l5991J9576J09691J2658M1169
$$ -29125 -34620 -90205 -78359 -157295 -275612 -182095 -184057 -220048 -200472 -90781 -78123 -36954
2587c6954r5233k2440K7294M9360J09682p2687l8392K5954K8789J4927M498O955
$$ -36954 -132187 -154627 -127333 -77973 31709 -40978 -79370 -53416 -24627 -9700 -5202 1753
2575A753q0138r1104O1441l7804N2065Q1770Q2815R3828j15678Q8543N3056k8836
$$ 1753 -78385 -169489 -108048 -145852 -93787 -12017 70798 164626 48948 137491 190547 161711
2563A61711l33323P5077P3029k8144J63225r9810q0108q121P0409O3821j5855
$$ 161711 -171612 -96535 -23506 -51650 111575 11765 -68343 -76464 -6055 57766 41911
2552D1911k1460J5467k4207j20804l555K5122L1105N601p1337J43138j0374j36156
$$ 41911 20451 35918 11711 -109093 -112648 -87526 -56421 -50820 -122157 20981 10607 -125549
2540a25549R9228N540L454p1893r8288J06726L449K9802P8501j10591o3899N5207
$$ -125549 -26321 -20781 -17327 -89220 -187508 -80782 -77333 -47531 30970 -79621 -143520 -88313
2528h8313J1450L1664m4831K833L7309n3322R3956m2327j20011j166K5982K5099
$$ -88313 -76863 -45199 -90030 -87197 -49888 -103210 -9254 -51581 -171592 -172758 -146776 -121677
2516a21677L7902J43642M9806j33683P5249k8539K319R013q124K2783r2998K2309
$$ -121677 -83775 59867 109673 -24010 51239 22700 25019 34032 25908 48691 -44307 -21998
2504b1998L7455J9555K7722r9153j69564L5408J65615m2547L5407L5584n2675
$$ -21998 15457 35012 62734 -36419 -205983 -170575 -4960 -47507 -12100 23484 -29191
2493b9191L3909K8385L1113O1359k7312m3580p0634o4741O2762J02249K375r433
$$ -29191 4718 33103 64216 125575 98263 54683 -15951 -80692 -17930 84319 86694 77261
2481G7261l8104r2091J8993q1441K24874Q5919j27787k3514p8472J22030N0690
$$ 77261 39157 -52934 -33941 -115382 109492 195411 67624 44110 -34362 87668 138358
2470A38358j3611K8322n8543O0609m7473j49935N8988J11273j00306p1167K0055
$$ 138358 124747 153069 94526 155135 107662 -42273 16715 127988 27682 -43485 -23430
2459b3430n523q6254L0608J02128p039o7070r4361J2029l3684J37123J03845J0359
$$ -23430 -28953 -115207 -84599 17529 10490 -56580 -150941 -138912 -172596 -35473 68372 78731
2447G8731j21592j04207N9282O2019O7855J00456k6630l0306K9607j04929K5894
$$ 78731 -42861 -147068 -87786 -25767 42088 142544 115914 85608 115215 10286 36180
2436C6180J8922l4679j40501O3394L5897l3998r4942J4012Q7145j2770N5116o8681
$$ 36180 55102 20423 -120078 -56684 -20787 -54785 -149727 -135715 -48570 -61340 -6224 -74905
2424g4905R7534p4569L640J06450r3415n5708J3130j36318N4581R0527q9575L9212
$$ -74905 22629 -51940 -48300 58150 -35265 -90973 -77843 -214161 -159580 -69053 -158628 -119416
2412a19416O2832P4117o6165j9727n6486J5759J4348k6882r17j0378n469O0081
$$ -119416 -56584 17533 -48632 -68359 -124845 -109086 -94738 -121620 -122537 -132915 -138384 -78303
2400g8303o2581K3469J20520P0157o4213j32380Q8419l6439r1915l9639P8414
$$ -78303 -140884 -117415 3105 73262 9049 -123331 -34912 -71351 -163266 -202905 -124491
2389a24491K4087m1567o1328n1171J17115O009O2103k5863n6273N1668N6409k3315
$$ -124491 -100404 -141971 -203299 -254470 -137355 -131346 -69243 -95106 -151379 -99711 -43302 -66617
2377f6617q9949j3411K7125J07186R453r1523Q669N1724m780J8718o3984p518
$$ -66617 -156566 -169977 -142852 -35666 -26213 -117736 -109067 -57343 -62123 -43405 -107389 -114907
2365a14907J44703k6339j17920k590J30487o916j8149j6676o9647M4844J91624
$$ -114907 29796 3457 -114463 -117053 13434 6518 -11631 -28307 -97954 -53110 138514
2354A38514j20015p7807J1941k7118N8896J2183N42R0117j1499q9164n6439m7409
$$ 138514 18499 -59308 -47367 -74485 -15589 -3406 -2864 87253 75754 -13410 -69849 -117258
2342a17258O6614k1603P0581J7520M0633J18961L4490j49775j12579J71650m7320
$$ -117258 -50644 -72247 -1666 15854 56487 175448 209938 60163 -52416 119234 71914
2331G1914L0180R4779j46587o8675N3273K4967n0623J14725r6699M8866K2792
$$ 71914 102094 196873 50286 -18389 34884 59851 9228 123953 27254 76120 98912
2320I8912m7676r7279J83088K8684j6580l3882n5887j18338J71503J18712j40799
$$ 98912 51236 -46043 137045 165729 149149 115267 59380 -58958 112545 231257 90458
2309I0458Q4189P225P7895J31832J01666L7097K8259j31431k3133n0149r366J14712
$$ 90458 174647 181872 259767 391599 493265 530362 558621 427190 404057 353908 344542 459254
2297D59254l5064q9457l154o5096j31756O4898r29o698Q9672j88149J3585m2684
$$ 459254 424190 334733 331579 266483 134727 199625 198696 191998 281670 93521 107106 64422
2285F4422L7239L0879n9065L4191o9845K7785q6948L1016L0221j47851K6380P0856
$$ 64422 101661 132540 73475 107666 37821 65606 -21342 9674 39895 -107956 -81576 -10720
2273a0720J34260j5223N4001r0223k60712J40588P5565K099n036p0758R6961R6332
$$ -10720 123540 108317 162318 72095 -188617 -48029 27536 29635 24599 -46159 50802 147134
2261A47134p9328j87766l0313N7411j20820p7345J5071R8668M9233L3443J06113
$$ 147134 67806 -119960 -150273 -92862 -213682 -291027 -275956 -177288 -128055 -94612 11501
2250A1501n3251l545l4012K575O5221M0594m0250M2142O0676P3440j31749k5508
$$ 11501 -41750 -45295 -79307 -76732 -11511 29083 -11167 30975 91651 165091 33342 7834
2238G834j4732J1418r7263M3638R2528O1981l8982k20070l5523n8715J11827N8771
$$ 7834 -6898 4520 -92743 -49105 43423 105404 66422 -153648 -189171 -247886 -136059 -77288
2226g7288Q6424j12166M0285K8449J17168N9505r5610l3664J17532r7934q6694
$$ -77288 9136 -103030 -62745 -34296 82872 142377 46767 13103 130635 32701 -53993
2215e3993l9464J9892j2906j24776q6979k9723K40993R6414o815l8812J0093q4500
$$ -53993 -93457 -73565 -86471 -211247 -298226 -327949 -86956 9458 2643 -36169 -26076 -110576
2203a10576l080P1832K471P8781q6249K9792P8418o3103k1688q5437m2238N254
$$ -110576 -113656 -41824 -39353 39428 -46821 -17029 61389 -1714 -23402 -108839 -151077 -145823
2191a45823M9664K2201j07183k4955R8773Q447j19950m0713Q9313k7794p584O2017
$$ -145823 -96159 -73958 -181141 -206096 -107323 -98876 -218826 -259539 -170226 -198020 -205604 -143587
2179a43587J42924m372n2266j00452N8940J01769r6404O337J05387n277o8549
$$ -143587 -663 -5035 -57301 -157753 -98813 2956 -93448 -87111 18276 12999 -55550
2168e5550k1660M3058L7752p5421o88O2217j57206r7032j1986J71367J14066q0349
$$ -55550 -77210 -34152 3600 -71821 -72509 -10292 -167498 -264530 -276516 -105149 8917 -71432
2156g1432Q0372R4870L3369l0357k7874l222n4319j27165j19949J50795J00287
$$ -71432 8940 103810 137179 106822 78948 75726 21407 -105758 -225707 -74912 25375
2145B5375M5687m7022j59615p6113K5791Q1468J27989l2944k6593K9944p2747
$$ 25375 71062 24040 -135575 -211688 -185897 -104429 23560 -9384 -35977 -6033 -78780
2134g8780q6305K188P8212l8246R094k3103J64662j51105l5776m1018J16564Q0331
$$ -78780 -165085 -162897 -84685 -122931 -113837 -136940 27722 -123383 -159159 -200177 -83613 -3282
2122c282n2404K255Q3424q9495M6168l9621m7985J55734o9059m5118k8201J10399
$$ -3282 -55686 -53431 29993 -59502 -13334 -52955 -100940 54794 -14265 -59383 -87584 22815
2110B2815n9548L7849J4824q8705N5990P7343L5347j0601j13310o1369k7693J05347
$$ 22815 -36733 1116 15940 -72765 -16775 60568 95915 85314 -27996 -89365 -117058 -11711
2098a1711j50615m3772J85155J6901J8380Q6463j64257J4480j4610O8098P3770
$$ -11711 -162326 -206098 -20943 -4042 14338 100801 -63456 -48976 -63586 4512 78282
2087G8282k01828J16727O5655j36857P829K0274k7295M5610O6092p9553p1442
$$ 78282 -123546 -6819 58836 -78021 -70192 -49918 -77213 -31603 34489 -45064 -116506
2076a16506R8723m6612K2776p4547J57237j25501j6145N8261J069J38302p9693
$$ -116506 -17783 -64395 -41619 -116166 41071 -84430 -100575 -42314 -41245 97057 17364
2065A7364o0475k8258J8666j09354J41696O3025q4181j4967j3272n8698q568L6500
$$ 17364 -43111 -71369 -52703 -162057 -20361 42664 -41517 -56484 -69756 -128454 -137022 -100522
2053a00522N7462j7813m9054J53360k5388R7602k0577j20358O1897k5076j05608
$$ -100522 -43060 -60873 -109927 43433 18045 115647 95070 -25288 36609 11533 -94075
2042i4075J38731N0182l4628L8215n1016j04257j33952l858M5877P7057q941q1450
$$ -94075 44656 94838 60210 98425 47409 -56848 -190800 -194658 -148781 -71724 -80665 -162115
2030a62115M0882P1599k7616K9650K360P648J9948n7938n7511O3523J2465J35479
$$ -162115 -121233 -49634 -77250 -47600 -45240 -37592 -17644 -75582 -133093 -69570 -57105 78374
2018G8374j14451J1206P816N2276k2734N9079p8307k4633K6234J0301K0207L0814
$$ 78374 -36077 -24871 -17055 35221 12487 71566 -6741 -31374 -5140 5161 25368 56182
2006E6182p7542q7710l9220n2001J67788K5365J03060j15862L1663j0552k4014
$$ 56182 -21360 -109070 -148290 -200291 -32503 -7138 95922 -19940 11723 1171 -22843
1995b2843J67331N1803o4549j12894k51394p459J65349N989L0343n5307M3657
$$ -22843 144488 196291 131742 18848 -232546 -240005 -74656 -68667 -38324 -93631 -49974
1984d9974M0272n7023K8144O565o0365m188J45455r2455L3945K7254J8238R245
$$ -49974 -9702 -66725 -38581 -32016 -92381 -96569 48886 -43569 -9624 17630 35868 45113
1972D5113j01902j01706j7871N0610K4817J42347R0464j26160q1644M6874O712
$$ 45113 -56789 -158495 -176366 -125756 -100939 41408 131872 5712 -75932 -29058 -22346
1961b2346q0961p8665m366M7870k408J07028K7631o4945P1474R1028j48299l4448
$$ -22346 -103307 -181972 -186338 -138468 -140876 -33848 -6217 -71162 312 91340 -56959 -91407
1949i1407Q5136M1003r1752N7050l1464K0455J5267j19305j2832n0591l1874L3556
$$ -91407 -6271 34732 -57020 30 -31434 -10979 4288 -115017 -127849 -178440 -210314 -176758
1937a76758Q0887j7685k7121l758J31800J0725j31616k8001J05665q2891Q966
$$ -176758 -95871 -113556 -140677 -144435 -12635 -1910 -133526 -161527 -55862 -138753 -129787
1926a29787J15064j1826N0677N2729j29716m5718Q3663j4905J5641l7763J4695
$$ -129787 -14723 -26549 24128 76857 -52859 -98577 -14914 -29819 -14178 -51941 -37246
1915c7246o6796M2419R676J03020N4607j6369m5937k15946K6606r1697J15060
$$ -37246 -104042 -61623 -51947 51073 105680 89311 43374 -172572 -145966 -237663 -122603
1904a22603m0950M7058J22160R920j03138J42841q1132n2129M2390p6841n5455
$$ -122603 -163553 -116495 5665 15585 -87553 55288 -25844 -77973 -35583 -112424 -167879
1893a67879J9977P4663M6016j2229J45571N5088k74603P7368L3663O6407j87704
$$ -167879 -147902 -73239 -27223 -39452 106119 161207 -113396 -36028 -2365 64042 -123662
1882a23662R352P1205Q769L8678J1367m6327p6058R5240j51779J6120J42356k4430
$$ -123662 -114310 -43105 -34336 4342 15709 -30618 -106676 -11436 -163215 -147095 -4739 -29169
1870b9169O8291q7012k1873K06531m8145n3241j20895L2484n1910r7802R5821
$$ -29169 39122 -47890 -69763 136768 88623 35382 -85513 -53029 -104939 -202741 -106920
1859a06920L0949k9944K2256o1534J91806K0378r9776J223M9276l3917L0599j2237
$$ -106920 -75971 -105915 -83659 -145193 46613 66991 -32785 -31562 17714 -16203 14396 2159
1847B159l8417L3537n0890J9731j6412L6445O4875p2458m0217l4410q7374P9754
$$ 2159 -36258 -2721 -53611 -33880 -50292 -13847 51028 -21430 -61647 -96057 -183431 -103677
1835a03677o3401K22720l6901j90284J01893Q9646j0846q1215l7875Q8240L6727
$$ -103677 -167078 55642 18741 -171543 -69650 19996 9150 -72065 -109940 -21700 15027
1824A5027j17195k4561J41802k9262j096j00699q8259R658L0268J4243N7363P9557
$$ 15027 -102168 -126729 15073 -14189 -15285 -115984 -204243 -194585 -164317 -150074 -92711 -13154
1812a3154N1621k0387k6318j14240K5671J26251J0879j42861n1412M3404m1751
$$ -13154 38467 18080 -8238 -122478 -96807 29444 40323 -102538 -153950 -110546 -152297
1801a52297o3251M1492J7762l4405l4274R2013K3888k5222j43807M9525O2994
$$ -152297 -215548 -174056 -156294 -190699 -224973 -132960 -109072 -134294 -278101 -228576 -165582
1790a65582K3322O9651P3891k7844j18379M0639O8963j068O9864N1755O6354p0496
$$ -165582 -142260 -72609 1282 -26562 -144941 -104302 -35339 -36407 33457 85212 151566 81070
1778H1070k00605J0231L4683M5877Q3221p7425j3158K9447N5451N2214k9001j07047
$$ 81070 -119535 -109304 -74621 -28744 54477 -22948 -36106 -6659 48792 101006 72005 -35042
1766c5042j33461O1823M7858k10q9742J1389N579P9682k0460n3899R63N1413p2665
$$ -35042 -168503 -106680 -58822 -59032 -148774 -137385 -131806 -52124 -72584 -126483 -125520 -74107 -146772
1753a46772M8230l0762q934P4663R6377n9484n281j76710J77500K5032m8965m6672
$$ -146772 -98542 -129304 -138238 -63575 32802 -26682 -31963 -208673 -31173 -6141 -55106 -101778
1741a01778j13689M6386j4051R1373j7666R2277M8108q5120p2984k0502P7356
$$ -101778 -215467 -169081 -183132 -91759 -109425 -17148 30960 -54160 -127144 -147646 -70290
1730g0290Q5322j5129k7815k7855l4106o0297k1608K0546p1397J47527o4325p2983
$$ -70290 15032 -97 -27912 -55767 -89873 -150170 -171778 -151232 -222629 -75102 -139427 -212410
1718b12410J15117K7786J7784o5707m4119O1641O8397K2538K7284q309j85054
$$ -212410 -97293 -69507 -51723 -117430 -161549 -99908 -31511 -8973 18311 10002 -175052
1707a75052j168M4361l7228N3323J08870J3739j23522J00833R8296k3271n2986
$$ -175052 -176220 -131859 -169087 -115764 -6894 6845 -116677 -15844 82452 59181 6195
1696F195Q106R727J04381j19245L138j4619k9771j41733J9968P6530J11208M0448
$$ 6195 14301 24028 128409 9164 12302 -2317 -32088 -173821 -153853 -77323 33885 74333
1684G4333k6320p4323j1524q9957k5003l5788Q7984o685M4800J62575p6986n818
$$ 74333 48013 -26310 -37834 -127791 -152794 -188582 -100598 -107283 -62483 100092 23106 17288
1672A7288o9294N0804m3398P891Q9560Q0183r8883l9997j4488R9783M4727q9747
$$ 17288 -52006 -1202 -44600 -36709 52851 133034 34151 -5846 -20334 79449 124176 34429
1660C4429J3223l3837K5133J3247r012n9289m8925J95075L1944k00732J1848O3676
$$ 34429 47652 13815 38948 52195 43183 -16106 -65031 130044 161988 -38744 -26896 36780
1648C6780k34130k69j1461m6028K7051K21251M2456j02390j32194N3210L6527
$$ 36780 -197350 -197619 -209080 -255108 -228057 -6806 35650 -66740 -198934 -145724 -109197
1637a09197L3543j0669O0723O7879j03931j04064M8669J15575o909P3756j24199
$$ -109197 -75654 -86323 -25600 42279 -61652 -165716 -117047 -1472 -8381 65375 -58824
1626e8824J9260j04803M5478R7371j1859L7572l7830r8429k2082J40838R963M4634
$$ -58824 -39564 -144367 -98889 -1518 -13377 24195 -13635 -112064 -134146 6692 16655 61289
1614F1289n2018j44302R9264l3569m4709M7448N7179K5598J30759n7300j3710
$$ 61289 9271 -135031 -35767 -69336 -114045 -66597 -9418 16180 146939 89639 75929
1603G5929R619p203m9753k9319p5235P8011k0052m4410K1149m3207m7634J15568
$$ 75929 85548 78345 28592 -727 -75962 2049 -18003 -62413 -41264 -84471 -132105 -16537
1591a6537o9121j06033Q2647j21981Q376N927J636J29609K7670M0347K5746j21813
$$ -16537 -85658 -191691 -109044 -231025 -222649 -216722 -215086 -85477 -57807 -17460 8286 -113527
1579a13527K4432J12512j09433L0227J2061q5614R945J0566J15291l1928J1231
$$ -113527 -89095 23417 -86016 -55789 -43728 -129342 -119397 -108831 6460 -25468 -14237
1568a4237M4563r5012n8614O8109M660O797r3504J0769M7800o9137l1429J70961
$$ -14237 30326 -64686 -123300 -55191 -50531 -43734 -137238 -126469 -78669 -147806 -179235 -8274
1556h274J6068k04003l9138J9309o9273K10211J17479j5411J4471l092n5326j4605
$$ -8274 7794 -196209 -235347 -216038 -285311 -75100 42379 26968 41439 38347 -16979 -31584
1544c1584J16612o5532q3088J02823n9111j06590J57561m2889j35219M0009m6007
$$ -31584 85028 19496 -63592 39231 -19880 -126470 31091 -11798 -147017 -107008 -153015
1533a53015J4363L3240P435J3191o1019J8035L1216j5922M9198K6161m9972l4798
$$ -153015 -138652 -105412 -97977 -84786 -145805 -127770 -96554 -112476 -63278 -37117 -87089 -121887
1521a21887k8451K9135L087J6429M8147J26280J5423m9955q5271M8053L0712K3366
$$ -121887 -150338 -121203 -118116 -101687 -53540 72740 88163 38208 -47063 990 31702 55068
1509E5068j5138M468r6450p4327r18R2583l6751l6739P0969j28003N1475J26487
$$ 55068 39930 44398 -52052 -126379 -127297 -34714 -71465 -108204 -37235 -165238 -113763 12724
1497A2724o376o984n1973j54662J8209J29314L8646j18858J23863J13084m5556
$$ 12724 6348 -636 -52609 -207271 -189062 -59748 -21102 -139960 -16097 96987 51431
1486E1431p7529o4555o1190N5587J17991J12225j29806J0259m3619R6422K7897
$$ 51431 -26098 -90653 -151843 -96256 21735 133960 4154 14413 -29206 67216 95113
1475I5113n4855q8544J30572j26629p2914J25217Q878j10142J12032k9483k09331
$$ 95113 40258 -48286 82286 -44343 -117257 7960 16838 -93304 18728 -10755 -220086
1464b20086L6903J21331L3633l6819q1730l2626P6381k3526N7287J0151j6658
$$ -220086 -183183 -61852 -28219 -65038 -146768 -179394 -103013 -126539 -69252 -59101 -75759
1453g5759p287r660J9533q2494k8010J25601j20420N5665R9086P6807k43738o4840
$$ -75759 -83046 -92706 -73173 -155667 -183677 -58076 -178496 -122831 -23745 53062 -190676 -255516
1441b55516J96344n9255m2243P2720K153O8299O4381r9328o4471O5583R5564k3603
$$ -255516 -59172 -118427 -160670 -87950 -85797 -17498 46883 -52445 -116916 -51333 44231 20628
1429B0628j98427M6183J44697l0485M2274M6276j08791J36100k20483O0697j4181
$$ 20628 -177799 -131616 13081 -17404 24870 71146 -37645 98455 -122028 -61331 -75512
1418g5512l4150O0093r0842N2857O2290L0074K6213o6397P9659J4193j64200L5579
$$ -75512 -109662 -49569 -140411 -87554 -25264 4810 31023 -35374 44285 58478 -105722 -70143
1406g0143J9594J9611R4986q1843j4315j71321Q1269N4471q8321J68109n6908
$$ -70143 -50549 -30938 64048 -17795 -32110 -203431 -122162 -67691 -156012 12097 -44811
1395d4811l9788k6760J17727q5747L1505m082j3752R7649j01752j0892R107N4896
$$ -44811 -84599 -111359 6368 -79379 -47874 -51956 -65708 31941 -69811 -80703 -71596 -16700
1383a6700j747j06431m2985J21812j09079M3956M9769K1519j05059N6368L7712
$$ -16700 -18447 -124878 -167863 -46051 -155130 -111174 -61405 -39886 -144945 -88577 -50865
1372e0865o9872J39315q3208k4380M9529j25453O8574J75543j92922l0021J03018
$$ -50865 -120737 18578 -64630 -89010 -39481 -164934 -96360 79183 -113739 -143760 -40742
1361d0742M1989J01900J9670j39801j18121k2604J20011l7751N1769K5569j14262
$$ -40742 1247 103147 122817 -16984 -135105 -157709 -37698 -75449 -23680 1889 -112373
1350a12373l0333L1045J50079N7745K7981M9852j84799O1306q6245O4486j19556
$$ -112373 -142706 -111661 38418 96163 124144 173996 -10803 50503 -35742 28744 -90812
1339i0812n3114L7066L5873J20378Q546l4330N0513L872p21j01128M1325j68834
$$ -90812 -143926 -106860 -70987 49391 57937 23607 74120 77992 77271 -23857 17468 -151366
1327a51366n9344P3548R5644m2806j4945j04054L4843J98003j22364L0219J52491
$$ -151366 -210710 -137162 -41518 -84324 -99269 -203323 -168480 29523 -92841 -62622 89869
1316H9869l0808J3969R0679l9060j04007j86083J41082K9412K9163j27323P1831
$$ 89869 59061 73030 163709 124649 20642 -165441 -24359 5053 34216 -93107 -21276
1305b1276n9133L6212M7577q965l6878L9728j39208K6351O1246m459N3290l9437
$$ -21276 -80409 -44197 3380 -5585 -42463 -2735 -141943 -115592 -54346 -58805 -5515 -44952
1293d4952j5191O8342Q1595N3423m8479j02781K4586p8136k8917N5160K1215M5926
$$ -44952 -60143 8199 89794 143217 94738 -8043 16543 -61593 -90510 -35350 -14135 31791
$$ [...]
##END NTUPLES=NMR SPECTRUM
##END=
