##TITLE=1H_DE-80H_X3
 200.13MHz, d2o
 8 sc
 
 19ns.26.2.2025
##JCAMPDX= 6.0         $$ Bruker NMR JCAMP-DX V2.0
##DATA TYPE= NMR SPECTRUM
##DATA CLASS= NTUPLES
##ORIGIN= UXNMR, Bruker Analytische Messtechnik GmbH
##OWNER= pz
$$ XWIN-NMR		Version 3.5
$$ Mon Oct 20 10:15:16 2025 Russian Standard Time (UT+4h)  Yarkov@DPX200
##.OBSERVE FREQUENCY= 200.1313
##.OBSERVE NUCLEUS= ^1H
##.ACQUISITION MODE= SIMULTANEOUS
##.ACQUISITION SCHEME= undefined
##.AVERAGES= 8
##.DIGITISER RES= 18
##SPECTROMETER/DATA SYSTEM= spect
##.PULSE SEQUENCE= zg30
##.SOLVENT NAME= CDCl3
##.SHIFT REFERENCE= (INTERNAL, CDCl3, 0, 15.4858)
##AUDIT TRAIL= $$ (NUMBER, WHEN, WHO, WHERE, WHAT)
$$ ##TITLE= Audit trail, XWIN-NMR		Version 3.5
$$ ##JCAMPDX= 5.01
$$ ##ORIGIN= Bruker BioSpin GmbH
$$ ##OWNER= Yarkov
$$ C:/Bruker/XWIN-NMR/data/yarkov2/nmr/H-C/1/pdata/1/auditp.txt
$$ ##AUDIT TRAIL=  $$ (NUMBER, WHEN, WHO, WHERE, WHAT)
(   1,<2025-10-20 10:13:37.65 +0400>,<Yarkov>,<DPX200>,
      <created by zg, POWCHK disabled, PULCHK disabled
       configuration hash MD5:
       00 E9 B6 7A A2 85 ED C7 34 08 36 98 17 FE 4E 26
       data hash MD5: 16K
       AB 1B 03 21 8C 14 23 2D A9 95 90 85 D7 02 90 41>)
(   2,<2025-10-20 10:13:44.29 +0400>,<Yarkov>,<DPX200>,
      <Start of raw data processing
       efp BC_mod = 2 LB = 0.25 FT_mod = 6 PKNL = 1 PHC0 = -3625.24 PHC1 = 8.821912 SI = 16K 
       data hash MD5: 16K
       93 CF C7 39 8E AA 67 73 77 9B 54 C3 10 37 1A D1>)
(   3,<2025-10-20 10:14:16.31 +0400>,<Yarkov>,<DPX200>,
      <pk PHC0 = -245.9655 PHC1 = 2.800001 
       data hash MD5: 16K
       5C 7D 1B 79 15 DF 5B FD F5 F6 7C BB E5 93 94 2D>)
(   4,<2025-10-20 10:14:19.82 +0400>,<Yarkov>,<DPX200>,
      <abs ABSG = 5 
       data hash MD5: 16K
       5E 42 F2 34 57 1A C3 83 9D C7 54 8A D2 D2 6D 1B>)
$$ ##END=
$$ 
$$ hash MD5
$$ 8F 23 BC 97 0E 06 C3 CF BD 69 1E B4 64 75 5F 35
##$RELAX= 
##$RELAX= 
##$RELAX= 
##$RELAX= 
##$RELAX= 
##$RELAX= 
$$ Bruker specific parameters
$$ --------------------------
##$DU= <C:/Bruker/XWIN-NMR>
##$EXPNO= 1
##$NAME= <H-C>
##$PROCNO= 1
##$TYPE= <nmr>
##$USER= <yarkov2>
##$AMP= (0..31)
100 100 100 100 100 100 100 100 100 100 100 100 100 100 100 100 100 100 
100 100 100 100 100 100 100 100 100 100 100 100 100 100 
##$AQSEQ= 0
##$AQ_mod= 1
##$AUNM= <au_zg>
##$AUTOPOS= <>
##$BF1= 200.13
##$BF2= 200.13
##$BF3= 200.13
##$BF4= 200.13
##$BF5= 200.13
##$BF6= 200.13
##$BF7= 200.13
##$BF8= 200.13
##$BYTORDA= 1
##$CFDGTYP= 0
##$CFRGTYP= 5
##$CHEMSTR= <none>
##$CNST= (0..31)
1 1 145 1 1 1 1 1 1 1 1 1 1 1 1 1 1 1 1 1 1 1 1 1 1 1 1 1 1 1 1 1 
##$CPDPRG= <>
##$CPDPRG1= <>
##$CPDPRG2= <>
##$CPDPRG3= <>
##$CPDPRG4= <mlev>
##$CPDPRG5= <mlev>
##$CPDPRG6= <mlev>
##$CPDPRG7= <mlev>
##$CPDPRG8= <mlev>
##$CPDPRGB= <>
##$CPDPRGT= <>
##$D= (0..31)
0 0.7 0 0 0 0 0 0 0 0 0 0.03 0 0 0 0 0 0 0 0 0 0 0 0 0 0 0 0 0 0 0 0 
##$DATE= 1760940817
##$DBL= (0..7)
120 120 120 120 120 120 120 120 
##$DBP= (0..7)
150 150 150 150 150 150 150 150 
##$DBP07= 0
##$DBPNAM0= <>
##$DBPNAM1= <>
$$ [...]
##$SUBNAM3= <"">
##$SUBNAM4= <"">
##$SUBNAM5= <"">
##$SUBNAM6= <"">
##$SUBNAM7= <"">
##$SUBNAM8= <"">
##$SUBNAM9= <"">
##$SW= 18.0517328524113
##$SWIBOX= (0..15)
0 0 2 0 0 0 0 0 0 0 0 0 0 0 0 0 
##$SW_h= 3612.71676300578
##$TD= 16384
##$TD0= 1
##$TE= 0
##$TE2= 300
##$TE3= 300
##$TEG= 300
##$TL= (0..7)
0 120 120 120 120 120 120 120 
##$TP= (0..7)
150 150 150 150 150 150 150 150 
##$TP07= 0
##$TPNAME0= <>
##$TPNAME1= <>
##$TPNAME2= <>
##$TPNAME3= <>
##$TPNAME4= <>
##$TPNAME5= <>
##$TPNAME6= <>
##$TPNAME7= <>
##$TPOAL= (0..7)
0.5 0.5 0.5 0.5 0.5 0.5 0.5 0.5 
##$TPOFFS= (0..7)
0 0 0 0 0 0 0 0 
##$TUNHIN= 0
##$TUNHOUT= 0
##$TUNXOUT= 0
##$USERA1= <user>
##$USERA2= <user>
##$USERA3= <user>
##$USERA4= <user>
##$USERA5= <user>
##$V9= 5
##$VALIST= <valist>
##$VCLIST= <CCCCCCCCCCCCCCC>
##$VD= 0
##$VDLIST= <DDDDDDDDDDDDDDD>
##$VPLIST= <PPPPPPPPPPPPPPP>
##$VTLIST= <TTTTTTTTTTTTTTT>
##$WBST= 1024
##$WBSW= 4
##$XGAIN= (0..3)
0 0 0 0 
##$XL= 0
##$YL= 0
##$YMAX_a= 297998
##$YMIN_a= -251253
##$ZGOPTNS= <>
##$ZL1= 120
##$ZL2= 120
##$ZL3= 120
##$ZL4= 120
##$ABSF1= 18.13091
##$ABSF2= 0.07901382
##$ABSG= 5
##$ABSL= 3
##$ALPHA= 0
##$AQORDER= 0
##$ASSFAC= 0
##$ASSFACI= 0
##$ASSFACX= 0
##$ASSWID= 0
##$AUNMP= <proc_1d>
##$AZFE= 0.1
##$AZFW= 0.1
##$BCFW= 0
##$BC_mod= 2
##$BYTORDP= 0
##$COROFFS= 0
##$CY= -3
##$DATMOD= 1
##$DC= 0
##$DFILT= <>
##$DTYPP= 0
##$F1P= 0
##$F2P= 0
##$FCOR= 1
##$FTSIZE= 16384
##$FT_mod= 6
##$GAMMA= 0
##$GB= 0
##$INTBC= 1
##$INTSCL= 3.241238e-09
##$ISEN= 128
##$LB= 0.25
##$LEV0= 0
##$LPBIN= 0
##$MAXI= 10000
##$MC2= 0
##$MEAN= 0
##$ME_mod= 0
##$MI= 1.114404
##$NCOEF= 0
##$NC_proc= -7
##$NLEV= 6
##$NOISF1= 3.799351
##$NOISF2= 2.8
##$NSP= 0
##$NTH_PI= 0
##$NZP= 0
##$OFFSET= 15.48576
##$PC= 1
##$PHC0= -3871.206
##$PHC1= 11.62191
##$PH_mod= 1
##$PKNL= yes
##$PPARMOD= 0
##$PSCAL= 0
##$PSIGN= 0
##$REVERSE= no
##$SF= 200.13000719155
##$SI= 16384
##$SIGF1= 3
##$SIGF2= 2
##$SINO= 0.751879
##$SIOLD= 32768
##$SREGLST= <19F.Aceton>
##$SSB= 0
##$STSI= 16384
##$STSR= 0
##$SW_p= 3612.71676300578
##$SYMM= 0
##$S_DEV= 0
##$TDeff= 16384
##$TDoff= 0
##$TI= <>
##$TILT= no
##$TM1= 0
##$TM2= 0
##$TOPLEV= 0
##$USERP1= <user>
##$USERP2= <user>
##$USERP3= <user>
##$USERP4= <user>
##$USERP5= <user>
##$WDW= 1
##$XDIM= 16384
##$YMAX_p= 326799972
##$YMIN_p= -543314
$$ End of Bruker specific parameters
$$ ---------------------------------
##NTUPLES= NMR SPECTRUM
##VAR_NAME=  FREQUENCY,     SPECTRUM/REAL,   SPECTRUM/IMAG
##SYMBOL=    X,             R,               I
##VAR_TYPE=  INDEPENDENT,   DEPENDENT,       DEPENDENT
##VAR_FORM=  AFFN,          ASDF,            ASDF
##VAR_DIM=   16384,         16384,           16384
##UNITS=     HZ,            ARBITRARY UNITS, ARBITRARY UNITS
##FACTOR=    0.220516191357247, 1,           1
##FIRST=     3099.16520715366, 0,            0
##LAST=      -513.551555852117, 0,           0
##MIN=       -513.551555852117, -543314,     0
##MAX=       3099.16520715366, 326799972,    0
$$ Real data points
##PAGE= N=1
##DATA TABLE= (X++(R..R)), XYDATA
$$ [...]
$$ plain form
6547 1202885 1232147 1236512 1174260 1144007 1169697 995634 939726 992077 1054534 1067181 1176758
6536 1176758 1171152 1181840 1204815 1030033 1152014 1302938 1288112 1371119 1314412 1317049 1468062
6525 1468062 1488526 1558019 1722116 1890929 1878982 1998742 2042312 2060960 2307449 2406313 2454783
6514 2454783 2318516 2326635 2166844 2095315 2018216 1908758 1736033 1627152 1642198 1537897
6504 1537897 1494304 1444684 1339810 1395088 1378627 1197046 1184539 1205909 1316142 1180678 1127641
6493 1127641 1072039 1258358 1399442 1218981 1461546 1472389 1543833 1758723 1729018 1924028
6483 1924028 2067545 2186476 2379401 2611651 2744363 2731718 2797532 2784478 2834754 2859133
6473 2859133 2789471 2737632 2577325 2428003 2437697 2424567 2406759 2224457 2176497 2179772 2084724
$$ packed form
6547A202885K9262M365o2252l0253K5690j74063n5908N2351O2457J2647J09577
6536A176758n606J0688K2975j74782J21981J50924j4826Q3007n6707K637J51013
6525A468062K0464O9493J64097J68813j1947J19760M3570J8648K46489R8864M8470
6514B454783j36267Q119j59791p1529p7099j09458j72725j08881J5046j04301
6504A537897m3593m9620j04874N5278j6461j81581j2507K1370J10233j35464n3037
6493A127641n5602J86319J41084j80461K42565J0843P1444K14890k9705J95010
6483A924028J43517J18931J92925K32250J32712j2645O5814j3054N0276K4379
6473B859133o9662n1839j60307j49322R694j3130j7808j82302m7960L275r5048
$$ plain form
6462 2084724 1944059 1729271 1655478 1617499 1520281 1340585 1420313 1401881 1351567 1251638 1135381
6451 1135381 1011889 1029174 1014420 961991 1033704 872911 831917 842138 964250 950936 870579
6440 870579 763113 748209 749715 829114 763960 755649 798589 798147 885178 691042 611100 641236
6428 641236 838713 942505 871497 813751 654587 566029 575866 557429 483698 460236 503612
6417 503612 605459 641005 609624 624663 536770 585006 462640 366673 342509 224715 273008
6406 273008 381538 302496 326002 320820 294102 239500 232613 156372 186672 197609 155104 240581
6394 240581 256775 264693 210902 145964 122033 155688 190518 160244 296637 339277 234150
6383 234150 258344 338824 379305 347854 269458 307129 274925 232623 339110 285465 215245
$$ packed form
6462B084724j40665k14788p3793l7979r7218j79696P9728j8432n0314r9929j16257
6451A135381j23492J7285j4754n2429P1713j60793m0994J0221J22112j3314q0357
6440H70579j07466j4904J506P9399o5154q311M2940m42Q7031j94136p9942L0136
6428F41236J97477J03792p1008n7746j59164q8558R837j8437p3731k3462M3376
6417E03612J01847L5546l1381J5039q7893M8236j22366r5967k4164j17794M8293
6406B73008J08530p9042K3506n182k6718n4602o887p6241L0300J0937m2505Q5477
6394B40581J6194P918n3791o4938k3931L3655L4830l0274J36393M2640j05127
6383B34150K4194Q0480M0481l1451p8396L7671l2204m2302J06487n3645p0220
$$ plain form
6372 215245 126033 155527 258843 259880 342950 391552 222888 314051 293319 110359 276662
6361 276662 249508 241890 216121 89122 217831 325575 247101 299383 302476 138427 165758
6350 165758 304146 403382 328271 346493 418511 409650 475675 510768 365896 350579 211833
6339 211833 233863 358719 459157 297314 277709 350108 408004 551872 500507 504344 493959
6328 493959 620255 674139 726356 827301 769058 601646 648903 648163 708714 626139 479753
6317 479753 418690 527917 460455 456866 459634 496158 535789 535995 657790 625929 712747 693661
6305 693661 703120 697324 572994 556058 701598 801924 799909 703095 746098 595649 513979
6294 513979 389706 441067 465875 453732 421636 414558 436276 526729 461912 404727 417083 512726
$$ packed form
6372B15245q9212K9494J03316J037Q3070M8602j68664R1163k0732j82960J66303
6361B76662k7154p618k5769j26999J28709J07744p8474N2282L093j64049K7331
6350A65758J38388R9236p5111J8222P2018q861O6025L5093j44872j5317j38746
6339B11833K2030J24856J00438j61843j9605P2399N7896J43868n1365L837j0385
6328D93959J26296N3884N2217J00945n8243j67412M7257p40O0551q2575j46386
6317D79753o1063J09227o7462l589K768L6524L9631K06J21795l1861Q6818j9086
6305F93661R459n796j24330j6936J45540J00326k015r6814M3003j50449q1670
6294E13979j24273N1361K4808j2143l2096p078K1718R0453o4817n7185J2356R5643
$$ plain form
6282 512726 465243 454809 411335 342932 444222 525764 595246 644733 592049 535228 622056
6271 622056 676315 658477 564672 528159 469646 532694 624440 464513 237511 434325 395842
6260 395842 598278 568286 508240 464150 553578 701602 701685 776870 662650 783225 773434 733340
6248 733340 749536 737238 815748 867314 734636 677703 847999 1013656 907540 973609 990692
6237 990692 1032883 1100330 1013137 1092076 1056367 935648 881919 946115 977054 941082 896571
6226 896571 814057 863986 1027426 831096 892912 867476 910586 984132 971185 861124 779259
6215 779259 776472 773291 818126 802245 844332 892963 928680 879465 864474 913564 946078 904037
6203 904037 989803 1113578 1131351 1092320 1053558 1147187 1026869 927113 1052426 1147623 1300582
$$ packed form
6282E12726m7483j0434m3474o8403J01290Q1542O9482M9487n2684n6821Q6828
6271F22056N4259j7838r3805l6513n8513O3048R1746j59927k27002J96814l8483
6260C95842K02436k9992o0046m4090Q9428J48024Q3P5185j14220J20575r791m0094
6248G33340J6196j2298P8510N1566j32678n6933J70296J65657j06116O6069J7083
6237I90692M2191O7447q7193P8939l5709j20719n3729O4196L0939l5972m4511
6226H96571q2514M9929J63440j96330O1816k5436M3110P3546j2947j10061q1865
6215G79259k787l181M4835j5881M2087M8631L5717m9215j4991M9090L2514m2041
6203I04037Q5766J23775J7773l9031l8762R3629j20318r9756J25313R5197J52959
$$ plain form
6192 1300582 1398901 1393580 1326125 1436889 1719163 1688054 1474970 1305220 1375485 1454586 1440096
6181 1440096 1399139 1650476 1557947 1422695 1420245 1502413 1633940 1736270 1856853 1698572
6171 1698572 1720780 1799104 1834582 1850405 1883670 1871195 1871707 1977457 2018635 2092537 2292135
6160 2292135 2274299 2531239 2471807 2362226 2307581 2412052 2513216 2665092 2738410 2582261
6150 2582261 2666033 2691024 2742069 2755520 2703800 2760901 2815409 2878238 2845578 2765800 2747968
6139 2747968 2678268 2628355 2595613 2689354 2862179 2766023 2860055 2985884 2979891 2963596 3034472
6128 3034472 3013710 3067981 3071735 3186504 3180848 3230860 3378849 3419985 3492418 3450203 3378694
6117 3378694 3477538 3493590 3548112 3525485 3612180 3571145 3601844 3590011 3560063 3665925 3587474
$$ packed form
6192A300582R8319n321o7455J10764K82274l1109k13084j69750P0265P9101j4490
6181A440096m0957K51337r2529j35252k450Q2168J31527J02330J20583j58281
6171A698572K2208P8324L5478J5823L3265j2475N12J05750M1178P3902J99598
6160B292135j7836K56940n9432j09581n4645J04471J01164J51876P3318j56149
6150B582261Q3772K4991N1045J3451n1720N7101N4508O2829l2660p9778j7832
6139B747968o9700m9913l2742R3741J72825r6156R4032J25829n993j6295P0876
6128C034472k0762N4271L754J14769n656N0012J47989M1136P2433m2215p1509
6117C378694R8844J6052N4522k2627Q6695m1035L0699j1833k9948J05862p8451
$$ plain form
6106 3587474 3666000 3677468 3655179 3668862 3760234 3836096 3864888 3815457 3942804 3953458 3953506 4074939
6094 4074939 4440199 4517739 4538674 4861809 5086868 5111284 5171967 5441028 5737835 5919134
6084 5919134 6222083 6517171 6900653 7098408 7314198 7751197 8212020 8629082 9088772 9679291
6074 9679291 10293368 10900225 11368245 11936171 12834314 13546649 14339567 15356386 16626915
6065 16626915 17857470 19182880 20693177 22542029 24518586 26683952 28871728 30990875
6057 30990875 33083254 34807322 35946272 36567613 36810947 36497579 35677097 34777333 33812517
6048 33812517 32934705 32207462 31604513 31219458 30943740 30958162 31189033 31673835 32234717 32872733
6038 32872733 33742015 34779060 35958964 37470374 39221650 41102216 43272988 45749983
$$ packed form
6106C587474P8526J1468k2289J3683R1372P5862K8792m9431J27347J0654M8J21433
6094D074939L65260P7540K0935L23135K25059K4416O0683K69061K96807J81299
6084E919134L02949K95088L83482J97755K15790M36999M60823M17062M59690N90519
6074I679291O14077O06857M68020N67926Q98143P12335P92918J016819J270529
6065A6626915J230555J325410J510297J848852J976557K165366K187776K119147
6057C0990875K092379J724068J138950O21341K43334l13368q20482q99764r64816
6048C3812517q77812p27243o02949l85055k75718J4422K30871M84802N60882O38016
6038C2872733Q69282J037045J179904J511410J751276J880566K170772K476995
$$ plain form
6030 45749983 48713050 52110761 55661975 59340224 62984923 66435237 69092877 70768129
6022 70768129 71420572 70687248 68681670 66093944 63069737 59768923 56747547 53894400
6014 53894400 51327622 49073801 47148201 45551066 44055440 42927941 41904635 41015994
6006 41015994 40318951 39533305 39003460 38648382 38393405 38480825 38663665 39199229 39970333 41001073
5996 41001073 42155947 43709793 45041670 46306997 47277039 47630394 47478812 46696067 45285980
5987 45285980 43238508 41037368 38843148 36707387 34533149 32641452 30842888 29002767
5979 29002767 27356902 25914689 24808625 23658944 22597151 21427122 20453760 19672049
5971 19672049 18801951 18252835 17618077 16892527 16263983 15767982 15356446 14825591 14388073
$$ packed form
6030D5749983K963067L397711L551214L678249L644699L450314K657640J675252
6022G0768129O52443p33324k005578k587726l024207l300814l021376k853147
6014E3894400k566778k253821j925600j597135j495626j127499j023306q88641
6006D1015994o97043p85646n29845l55078k54977Q7420J82840N35564P71104J030740
5996D1001073J154874J553846J331877J265327R70042L53355j51582p82745j410087
5987D5285980k047472k201140k194220k135761k174238j891697j798564j840121
5979B9002767j645865j442213j106064j149681j061793j170029r73362p81711
5971A9672049q70098n49116o34758p25550o28544m96001m11536n30855m37518
$$ plain form
5962 14388073 14070621 13687792 13395683 13234014 12914068 12612473 12384860 12016690 11734546
5953 11734546 11667726 11510814 11273829 11186270 11126768 10885402 10663557 10578925 10434270 10203107
5943 10203107 10082832 10007086 9906665 9897122 9810523 9769841 9579430 9625765 9581545 9628692 9596959
5932 9596959 9585413 9531068 9171946 9046480 8911334 8783010 8738174 8586167 8498181 8339748
5922 8339748 8177292 8139182 8090858 8179820 8125448 8041930 8096645 8156629 8141291 7914857 7829095
5911 7829095 7694176 7628169 7427145 7419140 7661306 7635963 7482097 7357081 7337244 7255731 7228712
5900 7228712 7257062 7265830 7179067 7061293 7076615 7217853 7259900 7401458 7394046 7393141 7523429
5889 7523429 7556220 7493922 7455897 7423621 7294123 7299067 7218060 7084870 6991300 6861968 6815652
$$ packed form
5962A4388073l17452l82829k92109j61669l19946l01595k27613l68170k82144
5953A1734546o6820j56912k36985q7559n9502k41366k21845q4632j44655k31163
5943A0203107j20275p5746j00421r543q6599m0682j90411M6335m4220M7147l1733
5932I596959j1546n4345l59122j25466j35146j28324m4836j52007q7986j58433
5922H339748j62456l8110m8324Q8962n4372q3518N4715N9984j5338k26434q5762
5911G829095j34919o6007k01024q005K42166k5343j53866j25016j9837q1513k7019
5900G228712K8350Q768q6763j17774J5322J41238M2047J41558p412r05J30288
5889G523429L2791o2298l8025l2276j29498M944q1007j33190r3570j29332m6316
$$ plain form
5878 6815652 6642576 6516060 6435645 6368139 6274977 6236522 6089803 5987451 5890849 5848862 5904926
5867 5904926 5837781 5690580 5480228 5342703 5191151 5172521 5179897 5092684 4891990 4889776 4842578
5856 4842578 4834384 4810754 4674985 4488676 4494498 4374534 4248311 4274755 4222470 4136105 4137797
5845 4137797 4213933 4193974 4151815 4162902 4157001 3943034 4004395 4022380 3949922 3964360 3879089
5834 3879089 3865683 3720030 3681596 3740399 3788263 3687801 3611325 3495680 3521105 3541141 3472446
5823 3472446 3531521 3524074 3499044 3503945 3443872 3431126 3565594 3671928 3713083 3585699 3551500
5812 3551500 3560414 3585964 3413874 3417701 3406442 3500391 3429719 3407060 3354880 3376904 3516245
5801 3516245 3334029 3302386 3402024 3315954 3354197 3436630 3406742 3288300 3252065 3346824 3418761
$$ packed form
5878F815652j73076j26516q0415o7506r3162l8455j46719j02352r6602m1987N6064
5867E904926o7145j47201k10352j37525j51552j8630P376q7213k00694k214m7198
5856D842578q194k3630j35769j86309N822j19964j26223K6444n2285q6365J692
5845D137797P6136j9959m2159J1087n901k13967O1361J7985p2458J4438q5271
5834C879089j3406j45653l8434N8803M7864j00462p6476j15645K5425K0036o8695
5823C472446N9075p447k5030M901o0073j2746J34468J06334M1155j27384l4199
5812C551500Q914K5550j72090L827j1259R3949p0672k2659n2180K2024J39341
5801C516245j82216l1643R9638q6070L8243Q2433k9888j18442l6235R4759P1937
$$ plain form
5790 3418761 3390725 3426968 3374920 3285275 3055184 3108988 3035235 2915856 3044339 2859828 2579426
5779 2579426 2669077 2728991 2685611 2651425 2564608 2595449 2516456 2494967 2513663 2514699 2545382 2503989
5767 2503989 2408198 2390512 2333762 2326572 2238666 2295295 2289180 2408522 2432091 2546759 2555730 2402211
5755 2402211 2331556 2338031 2484650 2510014 2489222 2450470 2347225 2442396 2502647 2714078 2761538
5744 2761538 2645493 2663959 2750495 2747492 2839512 2852042 2889254 3001529 3018446 2983145 3141963
5733 3141963 3282920 3323139 3470816 3556639 3564431 3823644 3903703 4122546 4493881 4655444
5723 4655444 4764115 4966299 5187751 5201961 5111378 5063503 5095660 5126504 5260274 5215220 5145701
5712 5145701 5104004 5076011 5111736 5029841 4957474 5201949 5268128 5397702 5526394 5862888 6138839
$$ packed form
5790C418761k8036L6243n2048q9645k30091N3804p3753j19379J28483j84511k80402
5779B579426Q9651N9914m3380l4186q6817L0841p8993k1489J8696J036L0683m1393
5767B503989r5791j7686n6750p190q7906N6629o115J19342K3569J14668Q971j53519
5755B402211p0655O475J46619K5364k0792l8752j03245R5171O0251K11431M7460
5744B761538j16045J8466Q6536l003R2020J2530L7212J12275J6917l5301J58818
5733C141963J40957M0219J47677Q5823P792K59213Q0059K18843L71335J61563
5723D655444J08671K02184K21452J4210r0583m7875L2157L0844J33770m5054o9519
5712E145701m1697k7993L5725q1895p2367K44475O6179J29574J28692L36494K75951
$$ plain form
5701 6138839 6420718 6709705 6926985 7182159 7432794 7849955 8282950 8534762 8645503 8640950
5691 8640950 8437194 8163704 7691852 7464794 7325431 7081066 6930031 6829016 6741354 6595205
5681 6595205 6641406 6708291 6758125 6797702 6855254 6977130 7101375 7252374 7313381 7503561 7778908
5670 7778908 8152395 8676213 8936107 9455815 9862970 10224569 10568392 10948428 11309328 11569695
5660 11569695 11647346 11376448 10997764 10711951 10389786 10065221 9855995 9714416 9794481 9838145
5650 9838145 9871782 9865615 9872924 10205767 10531355 10751856 11215150 11801233 12212477 12766233
5640 12766233 13606343 14466293 15446200 16602910 17867113 19049391 20440354 22165659 23976388
5631 23976388 25730357 27753959 29738875 31639731 33422803 35419909 37722318 40347481
$$ packed form
5701F138839K81879K88987K17280K55174K50635M17161M32995K51812J10741m553
5691H640950k03756k73490m71852k27058j39363k44365j51035j01015q7662j46149
5681F595205M6201O6885M9834L9577N7552J21876J24245J50999O1007J90180K75347
5670G778908L73487N23818K59894N19708M07155L61599L43823L80036L60900K60367
5660A1569695P7651k70898l78684k85813l22165l24565k09226j41579Q0065M3664
5650I838145L3637o167P309L32843L25588K20501M63294N86083M11244N53756
5640A2766233Q40110Q59950R79907J156710J264203J182278J390963J725305J810729
5631B3976388J753969K023602J984916J900856J783072J997106K302409K625163
$$ plain form
5623 40347481 43546345 47147368 51222234 55634327 60506833 65952241 71632532 77737346
5615 77737346 84089837 90393597 96647931 102438286 107506094 111893887 115282903 117361935
5607 117361935 118102643 117402368 115379561 112317430 108719281 104944140 100922222 96837342
5599 96837342 92623094 88367668 84258884 80366239 76667556 73402748 70759868 68354066
5591 68354066 66443572 65008958 63966823 63109328 62594062 62332254 62111242 61946745 61599684
5582 61599684 61373800 60819055 59854389 58711451 57040439 55184475 53194329 50996292 48833709
5573 48833709 46706002 44493812 42314800 40269688 38268688 36310123 34363824 32781511
5565 32781511 31277505 29819024 28451387 27156816 26018751 24844868 23853407 22894649
$$ packed form
5623D0347481L198864L601023M074866M412093M872506N445408N680291O104814
5615G7737346O352491O303760O254334N790355N067808M387793L389016K079032
5607A17361935P40708p00275k022807l062131l598149l775141m021918m084880
5599I6837342m214248m255426m108784l892645l698683l264808k642880k405802
5591F8354066j910494j434614j042135q57495n15266k61808k21012j64497l47061
5582F1599684k25884n54745r64666j142938j671012j855964j990146k198037k162583
5573D8833709k127707k212190k179012k045112k001000j958565j946299j582313
5565C2781511j504006j458481j367637j294571j138065j173883r91461r58758
$$ plain form
5557 22894649 22023036 21288669 20528709 19766958 19016399 18431505 17889807 17286669 16805638
5548 16805638 16251630 15826240 15390962 15011546 14648049 14183933 13812298 13406725 13110313
5539 13110313 12716120 12334644 12023297 11667232 11344422 11152392 10897994 10672754 10365374
5530 10365374 9915093 9668870 9498660 9094387 8852118 8647591 8549690 8309465 8091640 7891268
5520 7891268 7645715 7563572 7536029 7364723 7208192 6999008 6951895 6937890 6726079 6483706
5510 6483706 6286711 6214801 6108101 6193379 5957999 5722422 5742311 5664555 5606792 5605906 5438641
5499 5438641 5279118 5369302 5408084 5402052 5378702 4980924 5004452 4955473 4926920 4817361 4851304
5488 4851304 4800094 4646087 4512286 4619978 4646906 4530406 4393833 4260694 4286953 4152931
$$ packed form
5557B2894649q71613p34367p59960p61751p50559n84894n41698o03138m81031
5548A6805638n54008m25390m35278l79416l63497m64116l71635m05573k96412
5539A3110313l94193l81476l11347l56065l22810j92030k54398k25240l07380
5530A0365374m50281k46223j70210m04273k42269k04527r7901k40225k17825k00372
5520G891268k45553q2143k7543j71306j56531k09184m7113j4005k11811k42373
5510F483706j96995p1910j06700Q5278k35380k35577J9889p7756n7763q86j67265
5499E438641j59523R0184L8782o032k3350l97778K3528m8979k8553j09559L3943
5488D851304n1210j54007j33801J07692K6928j16500j36573j33139K6259j34022
$$ plain form
5478 4152931 4045234 3937127 4093968 4025104 3861960 3757018 3778844 3684314 3546146 3429699
5468 3429699 3412242 3424655 3442168 3489613 3416760 3371949 3379295 3397385 3279991 3361331 3296885
5457 3296885 3252860 3286765 3172925 3014314 3023017 3083265 3090800 3162898 3081458 3045769 3112677
5446 3112677 3021860 3059023 3174624 3180718 3176787 3072561 3086627 3087407 3207178 3186657 3150540 3215628
5434 3215628 3135552 3199750 3233457 3369913 3467139 3606840 3775305 3795280 3837964 3873941 4056249
5423 4056249 4165317 4331797 4413225 4703011 4966749 5298147 5694175 6242734 6761484 7119188
5413 7119188 7404859 7977134 8614397 9018226 9044219 8560746 7751583 6967599 6498929 6044937
5403 6044937 5625984 5312919 4965737 4692263 4491182 4188323 4063378 3919636 3642829 3411025
$$ packed form
5478D152931j07697j08107J56841o8864j63144j04942K1826r4530j38168j16447
5468C429699j7457J2413J7513M7445p2853m4811P346J8090j17394Q1340o4446
5457C296885m4025L3905j13840j58611Q703O0248P535P2098q1440l5689O6908
5446C112677r0817L7163J15601O094l931j04226J4066P80J19771k0521l6117O5088
5434C215628q0076O4198L3707J36456R7226J39701J68465J9975M2684L5977J82308
5423D056249J09068J66480Q1428K89786K63738L31398L96028N48559N18750L57704
5413G119188K85671N72275O37263M03829K5993m83473q09163p83984m68670m53992
5403F044937m18953l13065l47182k73474k01081l02859j24945j43742k76807k31804
$$ plain form
5393 3411025 3338820 3360065 3245691 3083981 2967440 2901253 2931372 2770040 2698818 2625580 2599022
5382 2599022 2757158 2681321 2499156 2360220 2238782 2357877 2325871 2262002 2115084 2163196
5372 2163196 2105144 1981416 2007335 1964958 1943627 1930401 1958584 1972146 1937661 2018163 1847668
5361 1847668 1747268 1816854 1742348 1704831 1644321 1742352 1768472 1704588 1623975 1593322 1300327
5350 1300327 1338267 1493865 1390196 1456520 1473607 1490588 1355487 1274218 1353170 1237300 1315564
5339 1315564 1289835 1225303 1328919 1278642 1166055 1180738 1277181 1212083 1282470 1274411 1163304
5328 1163304 1242941 1263938 1290605 1368435 1260980 1284414 1266258 1292428 1267691 1172255 1224602
5317 1224602 1201393 1225761 1160610 1243535 1299674 1315086 1402531 1504381 1458978 1381820 1426131
$$ packed form
5393C411025p2205K1245j14374j61710j16541o6187L0119j61332p1222p3238k6558
5382B599022J58136p5837j82165j38936j21438J19095l2006o3869j46918M8112
5372B163196n8052j23728K5919m2377k1331j3226K8183J3562l4485Q0502j70495
5361A847668j00400O9586p4506l7517o0510R8031K6120o3884q0613l0653k92995
5350A300327L7940J55598j03669O6324J7087J6981j35101q1269P8952j15870P8264
5339A315564k5729o4532J03616n0277j12587J4683R6443o5098P0387q059j11107
5328A163304P9637K0997K6667P7830j07455K3434j8156K6170k4737r5436N2347
5317A224602k3209K4368o5151Q2925N6139J5412Q7445J01850m5403p7158M4311
$$ plain form
5306 1426131 1536590 1603137 1629921 1505262 1410977 1428432 1442272 1526843 1459725 1317792 1306043
5295 1306043 1354532 1294829 1276902 1311909 1222753 1198541 1188591 1188953 1176693 1068319 835970 942387
5283 942387 1040627 1045235 1062024 1195809 1175113 1180417 1271308 1238535 1319103 1329570 1294711 1309116
5271 1309116 1229084 1184002 1158673 1293719 1290033 1182443 1281590 1259246 1207401 1157852 1246488
5260 1246488 1321852 1357116 1296081 1230271 1248417 1275249 1219315 1195059 1229059 1407327 1433961
5249 1433961 1451873 1361268 1287986 1269083 1273974 1255479 1212334 1382864 1456121 1455133 1533996 1479062
5237 1479062 1463987 1328935 1508069 1487683 1493571 1589425 1563419 1514007 1654684 1482068 1647850
5226 1647850 1800108 1754252 1689661 1649323 1704734 1655722 1545197 1474405 1498982 1537746 1546974
$$ packed form
5306A426131J10459O6547K6784j24659r4285J7455J3840Q4571o7118j41933j1749
5295A306043M8489n9703j7927L5007q9156k4212r950L62j2260j08374k32349J06417
5283I42387R8240M608J6789J33785k0696N304R0891l2773Q0568J0467l4859J4405
5271A309116q0032m5082k5329J35046l686j07590R9147k2344n1845m9549Q8636
5260A246488P5364L5264o1035o5810J8146K6832n5934k4256L4000J78268K6634
5249A433961J7912r0605p3282j8903M891j8495m3145J70530P3257r88P8863n4934
5237A479062j5075j35052J79134k0386N888R5854k6006m9412J40677j72616J65782
5226A647850J52258m5856o4591m0338N5411m9012j10525p0792K4577L8764R228
$$ plain form
5215 1546974 1580210 1737468 1639558 1655369 1659153 1686018 1620002 1662621 1600563 1562760 1703318
5204 1703318 1660501 1598560 1564094 1563947 1665880 1560955 1556476 1597439 1524249 1616732 1645520 1605009
5192 1605009 1698866 1585143 1524609 1478858 1453619 1393231 1444166 1508485 1482653 1569595 1669539
5181 1669539 1513888 1540104 1545241 1542313 1594181 1660933 1509598 1510459 1553119 1458098 1571996 1547530
5169 1547530 1549029 1638532 1597045 1650785 1704955 1536392 1590225 1724716 1613116 1723332 1746803
5158 1746803 1866399 1869170 1885370 1944978 1979467 1966685 1919154 1998953 2047877 1946518 1980457
5147 1980457 2092927 2045726 2085557 2191667 2179671 2285390 2225471 2174115 2230451 2240028 2257724
5136 2257724 2181774 2115306 2161900 2310068 2334460 2402617 2344716 2425582 2374269 2446744 2449218
$$ packed form
5215A546974L3236J57258r7910J5811L784K6865o6016M2619o2058l7803J40558
5204A703318m2817o1941l4466j47J01933j04925m479M0963p3190R2483K8788m0511
5192A605009R3857j13723o0534m5751k5239o0388N0935O4319k5832Q6942R9944
5181A669539j55651K6216N137k928N1868O6752j51335Q61M2660r5021J13898k4466
5169A547530J499Q9503m1487N3740N4170j68563N3833J34491j11600J10216K3471
5158A746803J19596K771J6200N9608L4489j2782m7531P9799M8924j01359L3939
5147A980457J12470m7201L9831J06110j1996J05719n9919n1356N6336R577J7696
5136B257724p5950o6468M6594J48168K4392O8157n7901Q0866n1313P2475K474
$$ plain form
5125 2449218 2392302 2458686 2539062 2597386 2623940 2649071 2833027 2741502 2803746 3008384 2948351
5114 2948351 2786083 2791437 2926956 2856374 2844067 2975450 2959218 2958709 2989121 3020683 3059193
5103 3059193 3058906 2968450 2965155 3045331 3130922 3048687 3124859 3162247 3061728 3200888 3330897
5092 3330897 3337651 3303762 3279207 3201567 3258992 3207066 3041807 3050672 3149706 3031126 3067860
5081 3067860 3107507 3206110 3231159 3110568 3227139 3257254 3261125 3291589 3246829 3230012 3367355
5070 3367355 3346961 3289495 3401942 3471085 3523615 3453659 3396488 3428658 3383395 3310262 3308210
5059 3308210 3488716 3570879 3599053 3611892 3508078 3672712 3754987 3781179 3811625 3896265 4081976
5048 4081976 4055643 4099874 4082528 4079314 4238174 4291839 4363264 4336477 4355468 4478832 4436896
$$ packed form
5125B449218n6916O6384Q0376N8324K6554K5131J83956r1525O2244K04638o0033
5114B948351j62268N354J35519p0582j2307J31383j6232n09L0412L1562L8510
5103C059193k87r0456l295Q0176Q5591q2235P6172L7388j00519J39160J30009
5092C330897O754l3889k4555p7640N7425n1926j65259Q865R9034j18580L6734
5081C067860L9647R8603K5049j20591J16571L0115L871L0464m4760j6817J37343
5070C367355k0394n7466J12447O9143N2530o9956n7171L2170m5263p3133k052
5059C308210J80506Q2163K8174J2839j03814J64634Q2275K6192L0446Q4640J85711
5048D081976k6333M4231j7346l214J58860N3665P1425k6787J8991J23364m1936
$$ plain form
5037 4436896 4611563 4812687 4964001 4878871 4901137 5094842 5154621 5244646 5316690 5560383
5027 5560383 5622250 5692557 5710971 5840861 5891962 6018069 6208283 6358656 6528618 6657900
5017 6657900 6957930 7119476 7130278 7101816 7272924 7433176 7779855 8045610 8293491 8540557
5007 8540557 8704174 8978642 9193717 9461192 9773691 10148321 10654874 11132778 11766449 12256272
4997 12256272 12737931 13242886 13778523 14570291 15562171 16406924 17454292 18619990 19623265
4988 19623265 20795302 22118122 23421374 24850785 26535210 28458196 30231189 32159607
4980 32159607 34590261 37103119 39902146 42785277 45783574 48762754 51540885 53833674
4972 53833674 55763594 56987153 57476873 57595557 57245259 56707526 56182040 55644087 55232831
$$ packed form
5037D436896J74667K01124J51314q5130K2266J93705N9779R0025P2044K43693
5027E560383O1867P0307J8414J29890N1101J26107J90214J50373J69962J29282
5017F657900L00030J61546J0802k8462J71108J60252L46679K65755K47881K47066
5007H540557J63617K74468K15075K67475L12499L74630N06553M77904O33671M89823
4997A2256272M81659N04955N35637P91768R91880Q44753J047368J165698J003275
4988A9623265J172037J322820J303252J429411J684425J922986J772993J928418
4980C2159607K430654K512858K799027K883131K998297K979180K778131K292789
4972E3833674J929920J223559M89720J18684l50298n37733n25486n37953m11256
$$ plain form
4963 55232831 55092747 55312199 55746633 56381569 57346137 58675197 60262820 62311271 64860199
4954 64860199 67705071 70721139 74404985 78153947 82359420 87110030 92344591 97977066
4946 97977066 103865187 110196855 116581613 122641643 128432723 133418544 137137069 139553233
4938 139553233 140663457 140689683 140057436 139100115 138338623 137812651 137770758 138192691 138875947
4929 138875947 139934566 141101779 142461644 143880632 145328395 146635952 148146612 149652105
4921 149652105 151252953 152939590 154693152 156407918 157947493 159144416 159799639 159722372
4913 159722372 158855962 157312969 155105292 152277972 149044872 145709448 142256465 138758502
4905 138758502 135420614 132339299 129550531 127203660 125277757 123195596 120954728 118252679
$$ packed form
4963E5232831j40084K19452M34434O34936R64568J329060J587623K048451K548928
4954F4860199K844872L016068L683846L748962M205473M750610N234561N632475
4946I7977066N888121O331668O384758O060030N791080M985821L718525K416164
4938A39553233J110224K6226o32247r57321p61492n25972m1893M21933O83256
4929A38875947J058619J167213J359865J418988J447763J307557J510660J505493
4921A49652105J600848J686637J753562J714766J539575J196923O55223p7267
4913A59722372q66410j542993k207677k827320l233100l335424l452983l497963
4905A38758502l337888l081315k788768k346871j925903k082161k240868k702049
$$ plain form
4897 118252679 114730527 110293402 105341356 100283033 95357968 90893504 86835341 83180969
4889 83180969 79996664 77107104 74536177 72293068 70269241 68574259 67226536 66027184
4881 66027184 64892019 63954328 63120952 62400432 61769860 60988380 60267797 59455367 58480193
4872 58480193 57295073 56291256 55432730 54477136 53643698 53037063 52584701 52056867 51777459
4863 51777459 51573932 51437576 51440727 51494710 51460021 51580788 51798370 51883535 52244520 52680082
4853 52680082 53121368 53642343 54152987 54717418 55341268 55797341 56121050 56282482 56369983 56542892
4843 56542892 56886411 57336113 57911014 58729925 59830918 61133049 62811912 64746178 66858694
4834 66858694 69010500 71190662 73325340 74875497 75731192 76089547 75793218 74723402 72799188
$$ packed form
4897A18252679l522152m437125m952046n058323m925065m464464m058163l654372
4889H3180969l184305k889560k570927k243109k023827j694982j347723j199352
4881F6027184j135165r37691q33376p20520o30572p81480p20583q12430r75174
4872E8480193j185120j003817q58526r55594q33438o06635m52362n27834k79408
4863E1777459k03527j36356L151N3983l4689J20767K17582Q5165L60985M35562
4853E2680082M41286N20975N10644N64431O23850M56073L23709J61432Q7501J72909
4843E6542892L43519M49702N74901Q18911J100993J302131J678863J934266K112516
4834F6858694K151806K180162K134678J550157Q55695L58355k96329j069816j924214
$$ plain form
4825 72799188 70396783 67726607 64827160 61717933 58721806 55791623 52962385 50358689
4817 50358689 48024503 45877853 43644577 41583997 39758340 38305670 36681084 35281982
4809 35281982 34042231 32779737 31595563 30646979 29851337 29056310 28232773 27654325 27076591
4800 27076591 26385612 25670479 25162423 24881923 24364864 23840049 23393677 23100721 22677493
4791 22677493 22339379 21849569 21412499 21203373 20951821 20712933 20459567 20286512 20041187
4782 20041187 19827092 19653446 19619795 19539765 19455110 19364162 19174677 19181472 19203054 19011704 19006473
4771 19006473 18741878 18603711 18600081 18417329 18088362 17919807 17771521 17612483 17369267 17199150
4761 17199150 17071996 16979601 16762868 16767009 16795875 16661569 16634073 16399219 16369477 16489445
$$ packed form
4825G2799188k402405k670176k899447l109227k996127k930183k829238k603696
4817E0358689k334186k146650k233276k060580j825657j452670j624586j399102
4809C5281982j239751j262494j184174r48584p95642p95027q23537n78448n77734
4800B7076591o90979p15133n08056k80500n17059n24815m46372k92956m23228
4791B2677493l38114m89810m37070k09126k51552k38888k53366j73055k45325
4782B0041187k14095j73646l3651q0030q4655r0948j89485O795K1582j91350n231
4771A9006473k64595j38167l630j82752l28967j68555j48286j59038k43216j70117
4761A7199150j27154r2395k16733M141K8866j34306k7496k34854k9742J19968
$$ plain form
4751 16489445 16624358 16657513 16655917 16774391 16902649 16904519 16941717 16824364 16765764 16762517 16701746
4740 16701746 16755244 16700318 16676219 16590629 16641772 16522798 16324652 16291769 16174438 16303019
4730 16303019 16270851 16231140 16098766 16012693 15898055 15884358 15819202 15893765 15916795 15972406 16244853
4719 16244853 16219167 16296946 16456282 16428463 16398082 16542268 16715819 16680589 16893055 17074091
4709 17074091 17190717 17365976 17455156 17596499 17751951 17971158 18183200 18104066 18171144 18202218
4699 18202218 17960799 17858119 17843132 17887069 18045077 18168433 18330467 18533641 18844804 19048034
4689 19048034 19082795 19311806 19691721 20089331 20513796 21089178 21726796 22352425 23029620 23744742
4679 23744742 24457461 25141066 26091167 26984925 27861228 28870013 30024181 31417219 33017983
$$ packed form
4751A6489445J34913L3155j596J18474J28258J870L7198j17353n8600l247o0771
4740A6701746N3498n4926k4099q5590N1143j18974j98146l2883j17331J28581
4730A6303019l2168l9711j32374q6073j14638j3697o5156P4563K3030N5611K72447
4719A6244853k5686P7779J59336k7819l0381J44186J73551l5230K12466J81036
4709A7074091J16626J75259Q9180J41343J55452K19207K12042p9134O7078L1074
4699A8202218k41419j02680j4987M3937J58008J23356J62034K03174L11163K03230
4689A9048034L4761K29011L79915L97610M24465N75382O37618O25629O77195P15122
4679B3744742P12719O83605R50101Q93758Q76303J008785J154168J393038J600764
$$ plain form
4670 33017983 34877047 36969477 39148474 41610882 44484396 47676005 51253704 55240342
4662 55240342 59774335 64787157 70370770 76298808 82873830 90060956 98283748 107948129
4654 107948129 119344688 132932746 148678088 165857895 183159973 199282361 213064624
4647 213064624 223607483 229120598 227561975 219519995 207525140 194901417 182837754
4640 182837754 171970497 162579711 154347150 147381225 140970871 135006527 129665708 124944876
4632 124944876 121271889 118805967 117230219 116405175 115915167 115420636 114812370 113665643 110895668
4623 110895668 106459671 101148641 95836912 90762338 86102328 81853305 77778055 74166224
4615 74166224 70940015 68002001 65066482 62469581 60061761 57744682 55738498 53893229
$$ packed form
4670C3017983J859064K092430K178997K462408K873514L191609L577699L986638
4662E5240342M533993N012822N583613N928038O575022P187126Q222792R664381
4654A07948129J1396559J3588058J5745342J7179807J7302078J6122388J3782263
4647B13064624J0542859N513115j558623q041980j1994855j2623723j2063663
4640A82837754j0867257r390786q232561o965925o410354n964344n340819m720832
4632A24944876l672987k465922j575748q25044m90008m94531o08266j146727k769975
4623A10895668m435997n311030n311729n074574m660010m249023m075250l611831
4615G4166224l226209k938014k935519k596901k407820k317079k006184j845269
$$ plain form
4607 53893229 52019441 50548271 49108726 47763930 46551520 45459109 44425721 43200224
4599 43200224 42220711 41248584 40300687 39365040 38260218 37343261 36474503 35646414 34933684
4590 34933684 34364578 33848367 33135877 32507891 31932459 31445438 31051160 30758423 30332162
4581 30332162 29780023 29388661 28770134 28039494 27525483 26995081 26302924 25669721 25286044
4572 25286044 24875272 24497549 24087582 23817060 23532739 23120091 22758145 22432468 22259380
4563 22259380 22049181 21925984 21741463 21551065 21345851 20987964 20725871 20623313 20532669 20369565
4553 20369565 20038927 19734504 19553410 19276973 19168722 19012895 18752833 18540918 18399632
4544 18399632 18317635 18473718 18343933 18376668 18465444 18557851 18546032 18701988 18862374 18982159
$$ packed form
4607E3893229j873788j471170j439545j344796j212410j092411j033388j225497
4599D3200224r79513r72127r47897r35647j104822r16957q68758q28089p12730
4590C4933684n69106n16211p12490o27986n75432m87021l94278k92737m26261
4581C0332162n52139l91362o18527p30640n14011n30402o92157o33203l83677
4572B5286044m10772l77723m09967k70522k84321m12648l61946l25677j73088
4563B2259380k10199j23197j84521j90398k05214l57887k62093j02558r0644j63104
4553B0369565l30638l04423j81094k76437j08251j55827k60062k11915j41286
4544A8399632q1997J56083j29785L2735Q8776R2407j1819J55956J60386J19785
$$ plain form
4534 18982159 19275906 19514511 19920579 20270544 20602688 21083763 21572588 21930575 22175766
4525 22175766 22344327 22588444 22607969 22419614 22266219 22098504 21964558 21699999 21483902 21177373
4515 21177373 20952058 20727138 20580056 20484726 20299433 20090842 19854502 19889599 19882119 19718259
4505 19718259 19393092 19365197 19521180 19549495 19834730 19906341 19802931 19893537 19935152 19893038
4495 19893038 19854259 19626792 19355517 19003074 18572342 18267413 17839903 17455895 16944540 16608595
4485 16608595 16278522 16121564 15700521 15445860 15338591 15075544 14853839 14685992 14543222
4476 14543222 14435749 14197344 13894102 13751973 13591969 13471454 13419887 13169066 12923708 12779473
4466 12779473 12683866 12546213 12434441 12544350 12543130 12338922 12164855 12113791 11963594 11828599
$$ packed form
4534A8982159K93747K38605M06068L49965L32144M81075M88825L57987K45191
4525B2175766J68561K44117J9525j88355j53395j67715j33946k64559k16097l06529
4515B1177373k25315k24920j47082r5330j85293k08591k36340L5097p480j63860
4505A9718259l25167k7895J55983K8315K85235P1611j03410R0606M1615m2114
4495A9893038l8779k27467k71275l52443m30732l04929m27510l84008n11355l35945
4485A6608595l30073j56958m21043k54661j07269k63047k21705j67847j42770
4476A4543222j07473k38405l03242j42129j60004j20515n1567k50821k45358j44235
4466A2779473r5607j37653j11772J09909j220k04208j74067n1064j50197j34995
$$ plain form
4456 11828599 11616590 11352913 11185769 11258293 11231431 11145797 11046353 10899046 10767640 10731253
4446 10731253 10705553 10684437 10626806 10523700 10563364 10468996 10302670 10241281 10100657 9879303
4436 9879303 9875739 9873553 9877148 9637148 9642017 9729685 9572189 9606118 9591492 9824339 9897572 9855210
4424 9855210 10114716 10367669 10504379 10798203 11227203 11394363 11580480 11916659 12058518 12206847
4414 12206847 12300164 12193990 11926545 11604142 11351412 11141641 10843308 10498286 10388795 10334762
4404 10334762 10198019 9968388 9804562 9564669 9393646 9074817 8951043 8818594 8694690
4395 8694690 8562745 8385701 8351196 8249029 8313920 8323032 8358687 8305810 8310880 8198116 8190439
4384 8190439 8422019 8353775 8288683 8331800 8328184 8418570 8253490 8109474 8212669 8113018 7989902
$$ packed form
4456A1828599k12009k63677j67144P2524k6862q5634r9444j47307j31406l6387
4446A0731253k5700k1116n7631j03106L9664r4368j66326o1389j40624k21354
4436I879303l564k186L595k40000M869Q7668j57496L3929j4626K32847P3233m2362
4424I855210K59506K52953J36710K93824M29000J67160J86117L36179J41859J48329
4414A2206847R3317j06174k67445l22403k52730k09771k98333l45022j09491n4033
4404A0334762j36743k29631j63826k39893j71023l18829j23774j32449j23904
4395H694690j31945j77044l4505j02167O4891R112L5655n2877N070j12764p677
4384H190439K31580o8244o5092M3117l616R0386j65080j44016J03195r9651j23116
$$ plain form
4373 7989902 8106494 8144403 8222922 8209370 8240438 8400758 8441496 8643465 8919278 8946278 9008593
4362 9008593 9268032 9589121 9980668 10208420 10192443 10269311 10377312 10256446 10166941 9977726
4352 9977726 9666234 9561797 9355190 9046758 8857939 8743776 8498954 8411305 8347647 8213260
4342 8213260 8147274 8074528 7899595 7735054 7418734 7249921 7271341 7155277 7034806 7047440
4332 7047440 6935045 6751517 6739995 6546104 6524795 6552126 6571787 6528801 6490496 6442204 6414794
4321 6414794 6648484 6453490 6354475 6436675 6444000 6302002 6286941 6256436 6192116 6209500 6201006
4310 6201006 6076440 6088340 6179648 6185511 6106734 6221916 6423532 6435022 6380176 6353791 6455340
4299 6455340 6549541 6754670 6913912 6961412 7039360 7048224 6919284 6800225 6684979 6625090 6632303
$$ packed form
4373G989902J16592L7909P8519j3552L1068J60320M0738K01969K75813K7000O2315
4362I008593K59439L21089L91547K27752j5977P6868J08001j20866q9505j89215
4352I977726l11492j04437k06607l08432j88819j14163k44822q7649o3658j34387
4342H213260o5986p2746j74933j64541l16320j68813K1420j16064j20471J2634
4332G047440j12395j83528j1522j93891k1309K7331J9661m2986l8305m8292k7410
4321F414794K33690j94994r9015Q2200P325j41998j5061l0505o4320J7384q494
4310F201006j24566J1900R1308N863p8777J15182K01616J1490n4846k6385J01549
4299F455340R4201K05129J59242M7500P7948Q864j28940j19059j15246n9889P213
$$ plain form
4288 6632303 6691643 6740230 6735899 6782959 6800657 6811560 6914033 6801877 6877316 6918843 6966560
4277 6966560 6979603 7059254 7067177 7069364 7016094 7068201 7143790 7190074 7102012 7117154 7012962 7123832
4265 7123832 7246800 7120869 7286717 7341202 7184672 7104990 7113998 7184293 7045219 7148221
4255 7148221 7403640 7448832 7450895 7456962 7520432 7506587 7523495 7584359 7759950 7807560 7856745
4244 7856745 8040075 8161157 8208870 8235986 8279377 8358794 8433499 8471629 8665393 8954879 9193772
4233 9193772 9456552 9774873 9918944 10258330 10483407 10853754 11362261 11522384 11924221 12434893
4223 12434893 12886501 13345434 14068281 14757994 15484327 16200633 17036354 17937518 18855090
4214 18855090 19899991 20977503 22128977 23364818 24586166 25986916 27467355 28937790
$$ packed form
4288F632303N9340M8587m331M7060J7698J0903J02473j12156P5439M1527M7717
4277F966560J3043P9651P923K187n3270N2107P5589M6284q8062J5142j04192J10870
4265G123832J22968j25931J65848N4485j56530p9682R008P0295j39074J03002
4255G148221K55419M5192K063O067O3470j3845J6908O0864J75591M7610M9185
4244G856745J83330J21082M7713K7116M3391P9417P4705L8130J93764K89486K38893
4233I193772K62780L18321J44071L39386K25077L70347N08507J60123M01837N10672
4223A2434893M51608M58933P22847O89713P26333P16306Q35721R01164R17572
4214A8855090J044901J077512J151474J235841J221348J400750J480439J470435
$$ plain form
4206 28937790 30534834 32520164 34358491 36449936 38518509 40621326 42936332 45317532
4198 45317532 47758807 50268922 52844299 55467145 58212533 60814214 63605255 66327511
4190 66327511 69070113 72063953 74972835 77949804 80812077 83693438 86672692 89567627
4182 89567627 92194574 94617147 97153779 99590347 101762888 103810460 105766056 107549290
4174 107549290 109118616 110548750 112073152 113448941 114567783 115307999 115773299 116161069
4166 116161069 116227467 115980921 115666110 115038034 114244592 113134918 111882311 110514130 109092211
4157 109092211 107580970 105975606 104172614 102129243 100176428 97980646 95576468 93032655
4149 93032655 90412193 87730469 84971627 82401395 79630652 76916037 74140665 71619578
$$ packed form
4206B8937790J597044J985330J838327K091445K068573K102817K315006K381200
4198D5317532K441275K510115K575377K622846K745388K601681K791041K722256
4190F6327511K742602K993840K908882K976969K862273K881361K979254K894935
4182H9567627K626947K422573K536632K436568K172541K047572J955596J783234
4174A07549290J569326J430134J524402J375789J118842P40216M65300L87770
4166A16161069O6398k46546l14811o28076p93442j109674j252607j368181j421919
4157A09092211j511241j605364j802992k043371j952815k195782k404178k543813
4149I3032655k620462k681724k758842k570232k770743k714615k775372k521087
$$ plain form
4141 71619578 69064602 66411641 63945410 61436870 58923299 56514467 54161545 51966263
4133 51966263 49707236 47443316 45420965 43472306 41596089 39801192 38207021 36599778
4125 36599778 35014781 33487230 32193044 31017823 29739496 28453782 27571022 26460977
4117 26460977 25458261 24634454 23804612 23004303 22289353 21594042 20970688 20325551 19694980
4108 19694980 19230293 18721259 18284346 17858513 17297925 16848191 16579263 16311261 16079135
4099 16079135 15689318 15366707 15162069 14760102 14482415 14406748 14238922 13935508 13719716 13633064
4089 13633064 13500618 13258104 13023075 12913626 12769649 12442968 12278266 12204233 12109986 11912620
4079 11912620 11784669 11706113 11568824 11378386 11163253 10925876 10813627 10566827 10459632 10322537
$$ packed form
4141G1619578k554976k652961k466231k508540k513571k408832k352922k195282
4133E1966263k259027k263920k022351j948659j876217j794897j594171j607243
4125C6599778j584997j527551j294186j175221j278327j285714q82760j110045
4117B6460977j002716q23807q29842q00309p14950o95311o23354o45137o30571
4108A9694980m64687n09034m36913m25833n60588m49734k68928k68002k32126
4099A6079135l89817l22611k04638m01967k77687p5667j67826l03414k15792q6652
4089A3633064j32446k42514k35029j09449j43977l26681j64702p4033r4247j97366
4079A1912620j27951p8556j37289j90438k15133k37377j12249k46800j07195j37095
$$ plain form
4069 10322537 10226397 10190102 9969856 10013237 9946463 9847346 9671418 9480687 9327829 9211408
4059 9211408 9206385 9242124 9123184 9116046 9014976 8784338 8658735 8693817 8626369 8606272 8693566
4048 8693566 8537602 8252717 8093517 8109315 8128750 8095572 8056905 8003376 7983740 7944583 7996585
4037 7996585 7965144 7939960 7866661 7858445 7911746 7860924 7835174 7714437 7542672 7624481 7537764
4026 7537764 7549952 7540592 7596869 7587755 7430576 7525274 7436406 7523627 7615630 7689925 7643885 7553906
4014 7553906 7573239 7641204 7745606 7714921 7702830 7691074 7696941 7603268 7555707 7613719 7769975
4003 7769975 7763231 7644767 7776786 7892402 7705025 7645516 7657881 7565693 7703906 7789568 7671841
3992 7671841 7579942 7705162 7696604 7580295 7624242 7704161 7793381 7863290 7871373 7847766 7898580
$$ packed form
4069A0322537r6140l6295k20246M3381o6774r9117j75928j90731j52858j16421
4059I211408n023L5739j18940p138j01070k30638j25603L5082o7448k0097Q7294
4048H693566j55964k84885j59200J5798J9435l3178l8667n3529j9636l9157N2002
4037G996585l1441k5184p3299q216N3301n0822k5750j20737j71765Q1809q6717
4026G537764J2188r360N6277r114j57179R4698q8868Q7221R2003P4295m6040q9979
4014G553906J9333O7965J04402l0685j2091j1756N867r3673m7561N8012J56256
4003G769975o744j18464J32019J15616j87377n9509J2365r2188J38213Q5662j17727
3992G671841r1899J25220q558j16309M3947P9919Q9220O9909Q083k3607N0814
$$ plain form
3981 7898580 8100231 8420915 8533065 8581629 8695075 8751178 8703333 8882593 8995179 8932101
3971 8932101 8988724 9023306 9187099 9287803 9323240 9421534 9354952 9364249 9369417 9398117 9536505
3960 9536505 9588060 9577928 9570362 9501002 9290779 9373073 9340478 9237308 9070436 8966947 8931560
3949 8931560 8765862 8906391 9043817 9031382 9123414 9147446 9073982 8976835 9018792 9075273 9204185
3938 9204185 9112102 9083263 9077385 9110407 9225885 9350149 9523098 9556876 9673234 9813830 9975376
3927 9975376 10150443 10273723 10397902 10418443 10523069 10592412 10690917 10764953 10950483 11231945
3917 11231945 11244779 11233060 11292586 11413405 11431383 11459147 11544037 11441524 11394082 11507961 11507966
3906 11507966 11518076 11420256 11332545 11383455 11419836 11513125 11448936 11392914 11384277 11377158 11485177
$$ packed form
3981G898580K01651L20684J12150M8564J13446N6103m7845J79260J12586o3078
3971H932101N6623L4582J63793J00704L5437R8294o6582R297N168K8700J38388
3960I536505N1555j0132p566o9360k10223Q2294l2595j03170j66872j03489l5387
3949H931560j65698J40529J37426j2435R2032K4032p3464r7147M1957N6481J28912
3938I204185r2083k8839n878L3022J15478J24264J72949L3778J16358J40596J61546
3927I975376J75067J23280J24179K0541J04626O9343R8505P4036J85530K81462
3917A1231945J2834j1719N9526J20819J7978K7764Q4890j02513m7442J13879N
3906A1507966J0110r7820q7711N0910L6381R3289o4189n6022q637p119J08019
$$ plain form
3895 11485177 11674752 11714250 11683695 11853042 12037361 12408454 12695372 12717688 12897433 13161342
3885 13161342 13594319 13959892 14344099 14756209 15215710 15637120 16151225 16710460 17393207
3876 17393207 18099624 18728282 19746790 20754520 21630432 22553640 23670304 24879104 25960617
3867 25960617 27155843 28364410 29576428 30829913 32002899 33184174 34495251 35811264
3859 35811264 36916080 38179274 39243203 40327157 41425280 42295754 42963192 43817503 44612457
3850 44612457 45041542 45533971 46033941 46382009 46640853 46725177 46748604 46700564 46595729 46329358
3840 46329358 45959821 45736628 45448861 45194076 44958172 44630255 44528936 44518140 44461405 44363040
3830 44363040 44573038 44767835 45097524 45643540 46225792 47052014 48022659 49270128 50837543
$$ packed form
3895A1485177J89575L9498l0555J69347J84319L71093K86918K2316J79745K63909
3885A3161342M32977L65573L84207M12110M59501M21410N14105N59235O82747
3876A7393207P06417O28658J018508J007730Q75912R23208J116664J208800J081513
3867B5960617J195226J208567J212018J253485J172986J181275J311077J316013
3859C5811264J104816J263194J063929J083954J098123Q70474O67438Q54311P94954
3850D4612457M29085M92429M99970L48068K58844Q4324K3427m8040j04835k66371
3840D6329358l69537k23193k87767k54785k35904l27917j01319j0796n6735r8365
3830D4363040K09998J94797L29689N46016N82252Q26222R70645J247469J567415
$$ plain form
3821 50837543 52665083 54645034 56837933 59191483 61690601 64657645 67932135 71348407
3813 71348407 74764589 78584366 82604479 86712207 91079699 95567539 99950384 104432065
3805 104432065 108829780 113074951 117360963 121506688 125620238 129628269 133505363 137193207
3797 137193207 140743087 144102450 147245220 150147408 152722529 154804555 156711010 158357330
3789 158357330 159454696 160316336 161013086 161332326 161533630 161699002 162004509 162259913 162438955
3780 162438955 162632812 162769657 162999049 163436008 163940099 164489820 165279480 166393183 167731101
3771 167731101 169114392 170952861 173071948 175416406 178215660 181430653 185125891 188925854
3763 188925854 193241455 197989672 203057878 208236592 213198865 217903886 222035330 225581929
$$ packed form
3821E0837543J827540J979951K192899K353550K499118K967044L274490L416272
3813G1348407L416182L819777M020113M107728M367492M487840M382845M481681
3805A04432065M397715M245171M286012M145725M113550M008031L877094L687844
3797A37193207L549880L359363L142770K902188K575121K082026J906455J646320
3789A58357330J097366Q61640O96750L19240K01304J65372L05507K55404J79042
3780A62438955J93857J36845K29392M36959N04091N49721P89660J113703J337918
3771A67731101J383291J838469K119087K344458K799254L214993L695238L799963
3763A88925854M315601M748217N068206N178714M962273M705021M131444L546599
$$ plain form
3755 225581929 228642263 230919605 232582674 233924600 234949306 235986183 237078376 238042884
3747 238042884 239213291 240431388 241594194 242671731 243717181 244764629 245785402 246985903
3739 246985903 248593038 250700044 253599566 257366914 262191189 268207672 275074825 282880689
3731 282880689 290833256 298924583 306514727 313013897 318546646 322400481 324976429 326400735
3723 326400735 326799972 326431888 325687772 324720426 323834125 323016581 321862137 320063318 317369178
3714 317369178 313592651 308283938 301319936 292908583 282976111 271884884 260029531 247841046
3706 247841046 235788707 224225098 213146990 202844745 193359394 184547474 176372453
3699 176372453 168843741 162028819 155608270 149590093 143932433 138735226 133815581 129159869
$$ packed form
3755B25581929L060334K277342J663069J341926J024706J036877J092193R64508
3747B38042884J170407J218097J162806J077537J045450J047448J020773J200501
3739B46985903J607135K107006K899522L767348M824275O016483O867153P805864
3731B82880689P952567Q091327P590144O499170N532749L853835K575948J424306
3723C26400735L99237l68084p44116r67346q86301q17544j154444j798819k694140
3714C17369178l776527n308713o964002q411353r932472j1091227j1855353j2188485
3706B47841046j2052339j1563609j1078108j0302245r485351q811920q175021
3699A76372453p528712o814922o420549o018177n657660n197207m919645m655712
$$ plain form
3691 129159869 124538187 120250016 116214480 112378163 108829982 105312117 101893784 98787937
3683 98787937 95616188 92422082 89277522 86220920 83252939 80506476 77784819 75077814
3675 75077814 72598026 70047363 67444109 65086934 62885188 60807502 58928894 57015146
3667 57015146 55240331 53453349 51717750 50290236 48841434 47476691 46218110 45040975
3659 45040975 43988771 42969895 41936254 40952549 39963755 39053701 38299228 37420528 36621979
3650 36621979 35874959 35231187 34595854 33927991 33413639 32803100 32149471 31620196 31088415
3641 31088415 30487598 30037791 29761744 29383441 28942930 28477575 28194798 28038448 27556144
3632 27556144 27138816 26723401 26230592 25977765 25726487 25412893 25229367 24934798 24620091
$$ packed form
3691A29159869m621682m288171m035536l836317l548181l517865l418333l105847
3683I8787937l171749l194106l144560l056602k967981k746463k721657k707005
3675G5077814k479788k550663k603254k357175k201746k077686j878608j913748
3667E7015146j774815j786982j735599j427514j448802j364743j258581j177135
3659D5040975j052204j018876j033641r83705r88794r10054p54473q78700p98549
3650C6621979p47020o43772o35333o67863n14352o10539o53629n29275n31781
3641C1088415o00817m49807k76047l78303m40511m65355k82777j56350m82304
3632B7556144m17328m15415m92809k52827k51278l13594j83526k94569l14707
$$ plain form
3623 24620091 24323449 24055585 23797957 23409491 23226322 23082811 22752790 22533294 22276354
3614 22276354 22016774 21759903 21547227 21278936 20962749 20912927 20760413 20539067 20232526 19891115
3604 19891115 19577946 19457781 19430560 19289142 19056793 18836116 18663267 18535479 18401573 18147763
3594 18147763 18090849 17838805 17703847 17620471 17352305 17216929 16991874 16935829 16861003 16715841
3584 16715841 16680642 16629928 16337677 16389853 16247969 16078119 15998984 15774950 15715232 15729000
3574 15729000 15643218 15432827 15447494 15247001 15192729 15122850 15057392 14910053 14767698 14631439
3564 14631439 14600642 14684109 14567922 14418071 14119565 13982488 14052201 14137632 14026112 13985651
3554 13985651 13912777 13723206 13723559 13765283 13553068 13597564 13552320 13443187 13334263 13234942 13295747
$$ packed form
3623B4620091k96642k67864k57628l88466j83169j43511l30021k19496k56940
3614B2276354k59580k56871k12676k68291l16187m9822j52514k21346l06541l41411
3604A9891115l13169j20165k7221j41418k32349k20677j72849j27788j33906k53810
3594A8147763n6914k52044j34958q3376k68166j35376k25055n6045p4826j45162
3584A6715841l5199n0714k92251N2176j41884j69850p9135k24034n9718J3768
3574A5729000q5782k10391J4667k00493n4272o9879o5458j47339j42355j36259
3564A4631439l0797Q3467j16187j49851k98506j37077O9713Q5431j11520m0461
3554A3985651p2874j89571L53M1724k12215M4496m5244j09133j08924r9321O0805
$$ plain form
3543 13295747 13253099 13069648 13104410 13060194 12963880 12907500 12804207 12724466 12714376 12712582 12644318
3532 12644318 12585264 12476126 12452159 12479921 12338528 12299770 12274431 12197683 12164679 12159938 12203466
3521 12203466 12169392 12232110 12221716 12336070 12188892 12090486 12148682 12348807 12387886 12481236 12518896
3510 12518896 12409498 12496616 12498274 12392445 12470848 12452418 12408052 12495051 12637599 12806682 12848420
3499 12848420 12777799 12920015 13222700 13196707 13076176 13191896 13322978 13533393 13805102 13999117
3489 13999117 14144774 14391723 14640372 14841791 15051028 15350816 15515554 15634691 15734732
3480 15734732 15908947 16091340 16352310 16423440 16563869 16711756 16936346 17210123 17143326 17333794
3470 17333794 17615138 17685281 17454276 17366202 17205887 17149623 16963785 16868555 16761329 16874354
$$ packed form
3543A3295747m2648j83451L4762m4216r6314n6380j03293p9741j0090j794o8264
3532A2644318n9054j09138k3967K7762j41393l8758k5339p6748l3004m741M3528
3521A2203466l4074O2718j0394J14354j47178r8406N8196K00125L9079R3350L7660
3510A2518896j09398Q7118J658j05829P8403j8430m4366Q6999J42548J69083M1738
3499A2848420p0621J42216L02685k5993j20531J15720J31082K10415K71709J94015
3489A3999117J45657K46949K48649K01419K09237K99788J64738J19137J00041
3480A5734732J74215J82393K60970P1130J40429J47887K24590K73777o6797J90468
3470A7333794K81344P0143k31005q8074j60315n6264j85838r5230j07226J13025
$$ plain form
3460 16874354 16812951 16807600 16839527 16766911 17065125 17337666 17645005 18025270 18421553 18800110
3450 18800110 19312022 19845466 20173385 19963147 19442079 19153773 18749785 18246655 17712290
3441 17712290 17340579 17154363 16790940 16530125 16418993 16364543 16359570 16211481 16231630 16411701
3431 16411701 16542267 16739483 17086210 17427401 17748348 18285740 18892619 19628662 20378065
3422 20378065 21303937 22326546 23069257 24057750 25123059 25899657 26271258 25482876 24288981
3413 24288981 23384558 22516449 21598110 20720012 19741805 18833309 17998834 17351761 16785023
3404 16785023 16285595 15985979 15677009 15465904 15272176 15257686 15191031 15187816 15218657 15153437
3394 15153437 15270020 15346163 15404760 15756288 16254879 16441051 16751923 17303419 17829273 18265151
$$ packed form
3460A6874354o1403n351L1927p2616K98214K72541L07339L80265L96283L78557
3450A8800110N11912N33444L27919k10238n21068k88306m03988n03130n34365
3441A7712290l71711j86216l63423k60815j11132n4450m973j48089K0149J80071
3431A6411701J30566J97216L46727L41191L20947N37392O06879P36043P49403
3422B0378065R25872J022609P42711R88493J065309P76598L71601p88382j193895
3413B4288981r04423q68109r18339q78098r78207r08496q34475o47073n66738
3404A6785023m99428k99616l08970k11105j93728j4490o6655l215L0841o5220
3394A5153437J16583P6143N8597L51528M98591J86172L10872N51496N25854M35878
$$ plain form
3384 18265151 18295222 17655760 16614168 15700886 14812572 14298746 13569955 12857156 12464601
3375 12464601 12100057 11752615 11382816 11144759 10812368 10450421 10262144 9967991 9837600
3366 9837600 9792130 9430690 9282372 9212727 9207406 8950132 8850242 8745373 8722321 8600817 8548875
3355 8548875 8608666 8336998 8194796 8232720 8149861 7876277 7885525 7796888 7694422 7569904 7571997
3344 7571997 7448123 7396885 7422322 7308784 7247457 7326960 7340844 7208938 7108188 7076793 6968951
3333 6968951 6933998 6941775 6953322 7027815 7003113 7055240 7169120 7172313 7125196 7087830 7055103 6866695
3321 6866695 6658771 6594379 6651491 6558859 6427448 6474874 6577683 6695658 6505787 6454559
3311 6454559 6433003 6323938 6097743 6236808 6322067 6339014 6305034 6132919 6246177 6275116
$$ packed form
3384A8265151L0071o39462j041592r13282q88314n13826p28791p12799l92555
3375A2464601l64544l47442l69799k38057l32391l61947j88277k94153j30391
3366I837600m5470l61440j48318o9645n321k57274r9890j04869k3052j21504n1942
3355H548875N9791k71668j42202L7924q2859k73584R248q8637j02466j24518K093
3344G571997j23874n1238K5437j13538o1327P9503J3884j31906j00750l1395j07842
3333F968951l4953P777J1547P4493k4702N2127J13880L193m7117l7366l2727j88408
3321F866695k07924o4392N7112r2632j31411M7426J02809J17975j89871n1228
3311F454559k1556j09065k26195J39065Q5259J6947l3980j72115J13258K8939
$$ plain form
3301 6275116 6240614 6314443 6237085 6084802 6147807 6182059 6162164 6095337 6229557 6137557 6011654
3290 6011654 5944238 5858853 5996819 5996433 5860086 5847650 5905692 5851403 5859211 5851138 5793814 5637649
3278 5637649 5737135 5942745 5967599 5951271 5948431 5905580 5888320 5949701 5922210 5834992 5751867
3267 5751867 5714490 5763303 5633059 5635688 5642523 5759284 5716916 5677666 5716394 5562822 5539303
3256 5539303 5467364 5456308 5369700 5352813 5394273 5425861 5385683 5331935 5278566 5251561 5317078
3245 5317078 5295057 5383255 5284847 5253946 5106805 5122418 5095693 5078622 5103465 4976388 5042474
3234 5042474 5193816 5164709 5092963 4943683 4914834 4851189 4776351 4715418 4681515 4828106 4698049
3223 4698049 4608836 4503500 4478255 4487581 4539030 4538792 4483593 4502129 4389885 4381182 4518605 4480041
$$ packed form
3301F275116l4502P3829p7358j52283O3005L4252j9895o6827J34220r2000j25903
3290F011654o7416q5385J37966l86j36347j2436N8042n4289P808q073n7324j56165
3278E637649R9486K05610K4854j6328k840m2851j7260O1381k7491q7218q3125
3267E751867l7377M8813j30244K629O835J16761m2368l9250L8728j53572k3519
3256E539303p1939j1056q6608j6887M1460L1588m0178n3748n3369k7005O5517
3245E317078k2021Q8198r8408l0901j47141J5613k6725j7071K4843j27077O6086
3234E042474J51342k9107p1746j49280k8849o3645p4838o0933l3903J46591j30057
3223D698049q9213j05336k5245R326N1449k38n5199J8536j12244q703J37423l8564
$$ plain form
3211 4480041 4461214 4259714 4277021 4323138 4280975 4283623 4232354 4176133 4287374 4129316 4238119
3200 4238119 4272583 4141709 4123818 4015710 4022716 4146991 4152164 4147198 4166834 4069750 4015488
3189 4015488 4053948 4036088 3892499 3950653 4042705 4015508 3955575 3839687 3827186 3868172 3862827
3178 3862827 3811818 3923876 3735338 3717906 3622322 3646801 3699061 3717548 3707467 3846005 3943000
3167 3943000 3779704 3686995 3729664 3561827 3495573 3601866 3587928 3530464 3540146 3589919 3555258
3156 3555258 3534783 3527285 3505480 3540803 3580567 3638954 3628917 3523933 3691751 3652152 3554942
3145 3554942 3487834 3486014 3451065 3403858 3291503 3394677 3666620 3790092 3776870 3560701 3464611
3134 3464611 3495194 3589727 3712862 3669631 3738817 3652229 3686044 3628721 3520106 3572973 3534084
$$ packed form
3211D480041j8827k01500J7307M6117m2163K648n1269n6221J11241j58058J08803
3200D238119L4464j30874j7891j08108P006J24275N173m966J9636r7084n4262
3189D015488L8460j7860j43589N8154R2052k7197n9933j15888j2501M0986n345
3178C862827n1009J12058j88538j7432r5584K4479N2260J8487j0081J38538R6995
3167C943000j63296r2709M2669j67837o6254J06293j3938n7464R682M9773l4661
3156C555258k0475p498k1805L5323L9764N8387j0037j04984J67818l9599r7210
3145C554942o7108j820l4949m7207j12355J03174K71943J23472j3222k16169r6090
3134C464611L0583R4533J23135m3231O9186q6588L3815n7323j08615N2867l8889
$$ plain form
3123 3534084 3633376 3643210 3367507 3471547 3484622 3554303 3394670 3338784 3297305 3116117 3080045
3112 3080045 3215199 3283875 3330353 3225543 3266379 3368064 3328926 3193311 3298905 3266886
3102 3266886 3361096 3334161 3283919 3247546 3321498 3449963 3457312 3402494 3197375 3097453 3143345
3091 3143345 3097112 3124597 3039928 2995587 3053034 3029994 3013888 3119736 3142394 3044580 3021572
3080 3021572 3012791 3024358 3102804 3096472 3015536 2945627 2814848 2799788 2801274 2861941 2652352 2630343
3068 2630343 2767184 2766539 2605282 2645041 2632998 2824230 2725957 2624089 2683249 2657451 2617137
3057 2617137 2622100 2664050 2564896 2610915 2579916 2430159 2572068 2621244 2633578 2682025 2762129
3046 2762129 2720891 2597015 2516517 2588025 2625491 2538878 2502379 2563321 2403747 2425208 2451273
$$ packed form
3123C534084R9292R834k75703J04040J3075O9681j59633n5886m1479j81188l6072
3112C080045J35154O8676M6478j04810M0836J01685l9138j35615J05594l2019
3102C266886R4210k6935n0242l6373P3952J28465P349n4818k05119r9922M5892
3091C143345m6233K7485q4669m4341N7447k3040j6106J05848K2658r7814k3008
3080C021572q781J1567P8446o332q0936o9909j30779j5060J486O0667k09589k2009
3068B630343J36841o45j61257L9759j2043J91232r8273j01868N9160k5798m0314
3057B617137M963M1950r9154M6019l0999j49757J41909M9176J2334M8447Q0104
3046B762129m1238j23876q0498P1508L7466q6613l6499O0942j59574K1461K6065
$$ plain form
3035 2451273 2425892 2542908 2727624 2551703 2416781 2389755 2444678 2552131 2400709 2325306
3025 2325306 2472673 2496921 2465168 2477587 2461001 2413711 2412819 2371065 2425737 2307491 2267347
3014 2267347 2309781 2286881 2274425 2202473 2160647 2144995 2010383 1963367 2035727 2090584 2191151
3003 2191151 2253675 2353537 2265539 2276344 2227665 2197285 2108586 2077864 2133919 2089046 2012833
2992 2012833 2035762 2263061 2194373 2084963 2109610 2000378 2002818 2070275 2030709 2087126 2093616
2981 2093616 2049286 2165909 2154366 2135748 2197158 2116765 2128109 2050286 2021609 2019730 2169933
2970 2169933 2151985 2121968 1998422 1861642 1980778 2003626 1956620 2016167 1935493 1829988 1980038
2959 1980038 1934734 1831196 1739824 1839917 1791428 1906287 2009382 1962145 1907989 1955700 1923578
$$ packed form
3035B451273k5381J17016J84716j75921j34922k7026N4923J07453j51422p5403
3025B325306J47367K4248l1753J2419j6586m7290q92m1754N4672j18246m0144
3014B267347M2434k2900j2456p1952m1826j5652j34612m7016P2360N4857J00567
3003B191151O2524R9862q7998J0805m8679l0380q8699l0722N6055m4873p6213
2992B012833K2929K27299o8688j09410K4647j09232K440O7457l9566N6417O490
2981B093616m4330J16623j1543j8618O1410q0393J1344p7823k8677j879J50203
2970B169933j7948l0017j23546j36780J19136K2848m7006N9547q0674j05505J50050
2959A980038m5304j03538r1372J00093m8489J14859J03095m7237n4156M7711l2122
$$ plain form
2948 1923578 1926634 1778470 1918031 1922482 1932258 1910556 2058075 1977115 1936699 1799010 1810676
2937 1810676 1766057 1701012 1855957 1734435 1728334 1670006 1713701 1850691 1869243 1843917 1825047
2926 1825047 1724126 1548399 1584146 1756237 1774992 1891602 2046916 1905088 1764463 1731691
2916 1731691 1541358 1652333 1707373 1716728 1606876 1659854 1865311 1813653 1694964 1720345 1671158
2905 1671158 1652632 1582205 1584697 1685545 1610655 1646623 1625457 1617166 1649120 1637437 1678986 1647777
2893 1647777 1742813 1652668 1506022 1606158 1735966 1610518 1541788 1579890 1533044 1610567 1611011
2882 1611011 1443357 1497042 1646028 1646926 1673310 1574635 1533140 1636753 1780576 1712071 1561057
2871 1561057 1659151 1672091 1523276 1519582 1623409 1472867 1447004 1498674 1572436 1515125 1521439
$$ packed form
2948A923578L056j48164J39561M451R776k1702J47519q0960m0416j37689J1666
2937A810676m4619o5045J54945j21522o101n8328M3695J36990J8552k5326j8870
2926A825047j00921j75727L5747J72091J8755J16610J55314j41828j40625l2772
2916A731691j90333J10975N5040R355j09852N2978K05457n1658j18689K5381m9187
2905A671158j8526p0427K492J00848p4890L5968k1166q291L1954j1683M1549l1209
2893A647777R5036r0145j46646J00136J29808j25448o8730L8102m6846P7523M44
2882A611011j67654N3685J48986Q98K6384r8675m1495J03613J43823o8505j51014
2871A561057R8094J2940j48815l694J03827j50542k5863N1670P3762n7311O314
$$ plain form
2860 1521439 1598648 1528929 1574496 1465606 1452314 1494354 1638852 1695643 1605928 1581237 1506106
2849 1506106 1465195 1567495 1580361 1432998 1306114 1499092 1639099 1442569 1324154 1325605
2839 1325605 1380258 1372481 1294135 1408533 1435003 1397847 1373782 1371968 1373644 1409689 1434074 1407590
2827 1407590 1343888 1238626 1298411 1264508 1336695 1371688 1265574 1262415 1266045 1205841 1317941
2816 1317941 1324721 1266071 1325353 1449245 1482412 1523557 1478165 1395070 1162958 1129262 1233715
2805 1233715 1183002 1195371 1281737 1234693 1229697 1301802 1321082 1300275 1334316 1307722 1343224 1236611
2793 1236611 1324370 1366751 1357310 1365464 1181436 1190978 1347398 1329119 1295939 1286441 1228420 1289236
2781 1289236 1229030 1312623 1290770 1250415 1352742 1308179 1217896 1332444 1282154 1140314 1227360
$$ packed form
2860A521439P7209o9719M5567j08890j3292M2040J44498N6791q9715k4691p5131
2849A506106m0911J02300J2866j47363j26884J92978J40007j96530j18415J451
2839A325605N4653p777p8346J14398K6470l7156k4065j814J676L6045K4385k6484
2827A407590o3702j05262N9785l3903P2187L4993j06114l159L630o0204J12100
2816A317941O780n8650N9282J23892L3167M1145m5392q3095k32112l3696J04453
2805A233715n0713J2369Q6366m7044m996P2105J9280k0807L4041k6594L5502j06613
2793A236611Q7759M2381r441Q154j84028R542J56420j8279l3180r498n8021O0816
2781A289236o0206Q3593k1853m0355J02327m4563r0283J14548n0290j41840Q7046
$$ plain form
2770 1227360 1259622 1167339 1213292 1216244 1189936 1233209 1407410 1323249 1314673 1347272 1257911 1211102
2758 1211102 1273697 1299943 1237234 1249533 1169749 1267665 1304098 1231588 1353410 1202615 1132836
2747 1132836 1291291 1217245 1157460 1186715 1210273 1173722 1215556 1256155 1136657 1160192 1301067
2736 1301067 1392065 1292742 1186994 1185685 1234781 1238778 1229587 1191058 1049886 1077311 1125870 1051105
2724 1051105 1013715 1136848 1210419 1081834 971664 968968 1008747 1000920 1162059 1120421 1077296
2713 1077296 1131874 1101704 1072632 1176135 1328823 1357299 1247725 1133941 1087920 1122454 1048299
2702 1048299 953210 975290 1089985 1252576 1193378 1100298 1072561 1200779 1127161 1112962 1083135
2691 1083135 1078171 1141745 1016930 1151861 1032833 905890 948418 1024472 940669 961697 1000151
$$ packed form
2770A227360L2262r2283M5953K952k6308M3273J74201q4161q576L2599q9361m6809
2758A211102O2595K6246o2709J2299p9784R7916L6433p2510J21822j50795o9779
2747A132836J58455p4046n9785K9255K3558l6551M1834M0599j19498K3535J40875
2736A301067R0998r9323j05748j309M9096L997r191l8529j41172K7425M8559p4765
2724A051105l7390J23133P3571j28585j10170k696L9779p827J61139m1638m3125
2713A077296N4578l0170k9072J03503J52688K8476j09574j13784m6021L4534p4155
2702A048299r5089K2080J14695J62591n9198r3080k7737J28218p3618j4199k9827
2691A083135m964O3574j24815J34931j19028j26943M2528P6054q3803K1028L8454
$$ plain form
2680 1000151 962939 1021992 1003787 1002296 951758 1105209 1098431 1035863 1052768 1096283 980917
2669 980917 1094266 955602 903292 1029934 1135242 1198900 1187061 1159171 1024118 1041627 1067993
2658 1067993 1088837 1130036 1162590 1054720 887377 952876 999695 934282 883182 756184 885328
2647 885328 1004915 871697 824119 975934 867110 927849 1009479 1058130 1074690 1090435 1070492
2636 1070492 1023708 1038205 943520 979791 896024 922343 994393 1107904 1077166 1053519 1031312
2625 1031312 992665 955730 840330 893656 948684 934072 951116 961262 949927 1000222 976329
2614 976329 1095789 1085510 1061439 1006422 996743 1029323 1000267 1039706 1068902 1080219 1091814 1179386
2602 1179386 1120466 1054060 1096914 1114220 1141725 1213157 1206981 1198717 1165376 1218810 1095593 1053761
$$ packed form
2680A000151l7212N9053j8205j491n0538J53451o778o2568J6905M3515j15366
2669I80917J13349j38664n2310J26642J05308O3658j1839k7890j35053J7509K6366
2658A067993K0844M1199L2554j07870j67343O5499M6819o5413n1100j26998J29144
2647H85328J19587j33218m7578J51815j08824O0739Q1630M8651J6560J5745j9943
2636A070492m6784J4497r4685L6271q3767K6319P2050J13511l0738k3647k2207
2625A031312l8647l6935j15400N3326N5028j4612J7044J0146j1335N0295k3893
2614I76329J19460j0279k4071n5017r679L2580k9056L9439K9196J1317J1595Q7572
2602A179386n8920o6406M2854J7306K7505P1432o176q264l3341N3434j23217m1832
$$ plain form
2590 1053761 1049696 928039 821063 793045 963513 1009298 1005949 975238 1113439 1070496 1032048
2579 1032048 1156471 1032780 985876 1089728 996251 967726 1065104 1095758 999456 848490 787151
2568 787151 932258 1013391 983849 1007420 1011107 916269 869037 1009584 1065067 1045607 978613
2557 978613 908130 901981 814550 966282 1036410 1039620 929465 910150 847071 843220 985505 933770
2545 933770 1043850 1018275 1091736 1014762 985678 840176 753943 882910 835454 807309 949521
2534 949521 1003534 1015085 1107178 998401 890635 895401 921758 893277 915781 934184 972817
2523 972817 994152 829407 791469 727265 661571 738193 792799 695526 855510 902971 901729
2512 901729 788558 751195 832492 692551 663775 868003 915478 808876 744036 694430 677489
$$ packed form
2590A053761m065j21657j06976k8018J70468M5785l349l0711J38201m2943l8448
2579A032048J24423j23691m6904J03852r3477k8525R7378L0654r6302j50966o1339
2568G87151J45107Q1133k9542K3571L687r4838m7232J40547N5483j9460o6994
2557I78613p0483o149q7431J51732P0128L210j10155j9315o3079l851J42285n1735
2545I33770J10080k5575P3461p6974k9084j45502q6233J28967m7456k8145J42212
2534I49521N4013J1551R2093j08777j07766M766K6357k8481K2504J8403L8633
2523I72817K1335j64745l7938o4204o5694P6622N4606r7273J59984M7461j242
2512I01729j13171l7363Q1297j39941k8776K04228M7475j06602o4840m9606j6941
$$ plain form
2501 677489 777023 728540 707607 937722 999460 909536 800435 810479 803474 788018 768099
2490 768099 810086 835648 832279 864241 828850 864055 902885 772639 761509 896932 797038
2479 797038 883692 905040 924358 1003017 715115 692135 852342 849093 848747 791065 695084 894807
2467 894807 997721 943667 866849 701804 738868 799506 796504 795033 761137 757989 853038 786588
2455 786588 756978 729466 686263 776319 904502 1075440 880016 757085 747571 743558 702969
2444 702969 750293 717716 840252 947461 892585 816508 924736 893201 865387 803968 771983
2433 771983 777394 733808 727318 655597 609253 589632 630755 566094 643365 677193 578746 597413
2421 597413 703763 775900 743676 744798 781960 810818 806813 843985 828884 950802 892881 980329
$$ packed form
2501F77489R9534m8483k0933K30115O1738q9924j09101J0044p005j5456j9919
2490G68099M1987K5562l369L1962l5391L5205L8830j30246j1130J35423r9894
2479G97038Q6654K1348J9318P8659k87902k2980J60207l249l46n7682r5981J99723
2467H94807J02914n4054p6818j65045L7064O0638l002j471l3896l148R5049o6450
2455G86588k9610k7512m3203R0056J28183J70938j95424j22931r514m013m0589
2444G02969M7324l2577J22536J07209n4876p6077J08228l1535k7814o1419l1985
2433G71983N411m3586o490p1721m6344j9621M1123o4661P7271L3828r8447J8667
2421E97413J06350P2137l2224J122L7162K8858m005L7172j5101J21918n7921Q7448
$$ plain form
2409 980329 962901 757014 716060 847001 869843 870651 914979 977986 1013454 1036991 1055564 1006208
2397 1006208 999677 909403 1005584 1071656 1038334 1013972 1059382 1031931 1049759 1164334 1094429
2386 1094429 1013689 1129126 1173145 1224275 1314234 1245460 1178936 1450548 1543416 1551796 1487566
2375 1487566 1466708 1575288 1536338 1446687 1542232 1653824 1800802 1799457 1849686 1908401 2030920
2364 2030920 2210346 2139955 2409282 2674972 2708315 2951930 3180192 3420328 3793171 4200401
2354 4200401 4483609 4954726 5415738 5787715 6463910 7275966 8070175 8881766 9874401 10872218
2344 10872218 11932475 12975970 13981620 14907668 16434813 18428988 20551993 23678715
2336 23678715 28008739 33392062 38946657 43589871 47432766 50995467 53151798 51893804
$$ packed form
2409I80329j7428k05887m0954J30941K2842Q08M4328O3007L5468K3537J8573m9356
2397A006208o531r0274R6181O6072l3322k4362M5410k7451J7828J14575o9905
2386A094429q0740J15437M4019N1130Q9959o8774o6524K71612R2868Q380o4230
2375A487566k0858J08580l8950q9651R5545J11592J46978j345N0229N8715J22519
2364B030920J79426p0391K69327K65690L3343K43615K28262K40136L72843M07230
2354D200401K83208M71117M61012L71977O76195Q12056P94209Q11591R92635R97817
2344A0872218J060257J043495J005650R26048J527145J994175K123005L126722
2336B3678715M330024N383323N554595M643214L842895L562701K156331j257994
$$ plain form
2328 51893804 46726508 41144052 35969243 31683492 28248561 25337296 22991011 20887594
2320 20887594 19323166 17702536 16308651 15147823 14036715 13057255 12357892 11432825 10669975
2311 10669975 10155862 9486253 9062369 8521113 7967473 7766065 7379458 6844114 6505565
2302 6505565 6209674 6019602 5870486 5667358 5495697 5218071 4977326 4904766 4776794 4568727
2292 4568727 4354372 4152429 4016041 3892894 3706463 3587316 3451983 3275025 3177732 3094830
2282 3094830 3021382 2958778 2921441 2798996 2750463 2731178 2660953 2570827 2723087 2484752 2352722
2271 2352722 2347338 2340072 2407594 2215501 2130277 2027040 2071368 2030471 2027991 2060544 1956362
2260 1956362 1843388 1961626 1912906 1727895 1694567 1742789 1716575 1691396 1802100 1712537 1669402
$$ packed form
2328E1893804n167296n582456n174809m285751l434931k911265k346285k103417
2320B0887594j564428j620630j393885j160828j111108r79460o99363r25067p62850
2311A0669975n14113o69609m23884n41256n53640k01408l86607n35344l38549
2302F505565k95891j90072j49116k03128j71661k77626k40745p2560j27972k08067
2292D568727k14355k01943j36388j23147j86431j19147j35333j76958r7293q2902
2282C094830p3448o2604l7337j22445m8533j9285p0225r0126J52260k38335j32030
2271B352722n384p266O7522j92093q5224j03237M4328m0897k480L2553j04182
2260A956362j12974J18238m8720j85011l3328M8222k6214k5179J10704q9563m3135
$$ plain form
2249 1669402 1694271 1651056 1549971 1686632 1609440 1516452 1538906 1425597 1370826 1526473 1535348
2238 1535348 1512645 1375624 1405818 1478129 1453601 1344843 1413904 1395783 1477757 1458102 1369626
2227 1369626 1370101 1272293 1303104 1372627 1423933 1331595 1315816 1308534 1181632 1256969 1200402 1194626
2215 1194626 1286014 1153845 1221294 1178908 1029373 1008649 1072884 1241604 1224653 1140252 1101328
2204 1101328 1045177 970989 927536 975077 1035846 1130589 1040654 1065849 1001509 988152 949326
2193 949326 966393 963240 852683 888012 942807 958649 937372 835448 837488 976375 1042286
2182 1042286 981704 945692 875625 803475 868527 822702 910205 900693 823844 797261 965880
2171 965880 865888 916015 920769 910939 913042 1017919 899388 805690 783965 688248 836629 878010
$$ packed form
2249A669402K4869m3215j01085J36661p7192r2988K2454j13309n4771J55647Q875
2238A535348k2703j37021L0194P2311k4528j08758O9061j8121Q1974j9655q8476
2227A369626M75r7808L0811O9523N1306r2338j5779p282j26902P5337n6567n776
2215A194626R1388j32169O7449m2386j49535k0724O4235J68720j6951q4401l8924
2204A101328n6151p4188m3453M7541O0769R4743q9935K5195o4340j3357l8826
2193I49326J7067l153j10557L5329N4795J5842k1277j01924K040J38887O5911
2182A042286o0582l6012p0067p2150O5052m5825Q7503r512p6849k6583J68619
2171I65880r9992N0127M754r830K103J04877j18531r3698k1725r5717J48381M1381
$$ plain form
2159 878010 834226 699587 943941 1007883 855493 796445 775431 837256 826285 818039 864975
2148 864975 576115 639555 648843 670229 658493 702727 627625 545565 552559 756560 701462 711467
2136 711467 679073 647401 671169 834605 896410 850826 718594 741662 722028 614666 554453
2125 554453 573597 580412 590201 547295 503305 651911 662794 599167 552836 730664 690070 655979
2113 655979 517002 502691 640830 537904 575044 441964 612553 724913 675380 648002
2103 648002 648204 632871 626595 680851 649162 589266 622493 750426 629945 560264 568700 564306
2091 564306 592934 561673 575578 763313 802234 711777 559809 725605 679521 694283 612628
2080 612628 529421 521580 714521 618638 642260 678309 738989 673841 661612 667436 747189 821325
$$ packed form
2159H78010m3784j34639K44354O3942j52390n9048k1014O1825j0971q246M6936
2148H64975k88860O3440R288K1386j1736M4234p5102q2060O994K04001n5098J0005
2136G11467l2394l1672K3768J63436O1805m5584j32232K3068j9634j07362o0213
2125E54453J9144O815R789m2906m3990J48606J0883o3627m6331J77828m0594l4091
2113F55979j38977j4311J38139j02926L7140j33080J70589J12360m9533k7378
2103F48002K02j5333o276N4256l1689n9896L3227J27933j20481o9681Q436m394
2091E64306K8628l1261J3905J87735L8921r0457j51968J65796m6084J4762q1655
2080F12628q3207p841J92941r5883K3622L6049O0680o5148j2229N824P9753P4136
$$ plain form
2068 821325 672633 792716 812867 649308 649941 749849 790252 763741 720951 769294 747229
2057 747229 712179 829642 694578 565476 721677 661490 652926 674505 530029 594306 622187
2046 622187 600779 637039 591308 551301 597065 743849 659954 619179 498384 426325 398723
2035 398723 502791 619525 587938 616002 493076 478381 636422 680449 666898 528243 483227
2024 483227 622788 573699 536859 522388 494828 562386 471925 339759 426360 534801 577554
2013 577554 604313 658633 551670 554643 484730 640966 627510 473670 428977 621171 641170
2002 641170 529125 502745 468811 494450 515332 452201 419580 565975 644470 563078 506115
1991 506115 546179 512543 595178 460257 340991 381492 460976 559418 580191 312445 442701
$$ packed form
2068H21325j48692J20083K0151j63559O33R9908M0403k6511m2790M8343k2065
2057G47229l5050J17463j35064j29102J56201o0187q564K1579j44476O4277K7881
2046F22187k1408L6260m5731m0007M5764J46784q3895m0775j20795p2059k7602
2035C98723J04068J16734l1587K8064j22926j4695J58041M4027j3551j38655m5016
2024D83227J39561m9089l6840j4471k7560O7558r0461j32166Q6601J08441M2753
2013E77554K6759N4320j06963K973o9913J56236j3456j53840m4693J92194J9999
2002F41170j12045k6380l3934K5639K0882o3131l2621J46395P8495q1392n6963
1991E06115M0064l3636Q2635j34921j19266M0501P9484R8442K0773k67746J30256
$$ plain form
1980 442701 447575 529066 566400 464471 570375 559339 374341 346898 320533 468348 465713
1969 465713 385786 435880 421662 354527 387036 386572 420250 385413 401711 500040 632734 575329
1957 575329 586403 507064 411672 506937 537799 668623 551641 434370 335777 393513 390657
1946 390657 296089 357492 301275 401866 425130 398288 290934 377047 412369 485882 560422
1935 560422 460747 353076 294413 370193 346722 524640 342123 386514 480649 415634 465047
1924 465047 469284 514528 493871 332450 329819 358035 373417 301385 300373 379253 396787 316562
1912 316562 497058 506772 329848 243480 225548 281019 472510 446035 409648 362048 456646
1901 456646 452100 432992 428379 369928 423477 431162 469142 219735 109390 187106 285728 332792
$$ packed form
1980D42701M874Q1491L7334j01929J05904j1036j84998k7443k6365J47815k635
1969D65713p9927N0094j4218o7135L2509m64L3678l4837J6298R8329J32694n7405
1957E75329J1074p9339r5392R5265L0862J30824j16982j17271r8593N7736k856
1946C90657r4568O1403n6217J00591K3264k6842j07354Q6113L5322P3513P4540
1935E60422r9675j07671n8663P5780k3471J77918j82517M4391R4135o5015M9413
1924D65047M237M5244k0657j61421k631K8216J5382p2032j012P8880J7534q0225
1912C16562J80496R714j76924q6368j7932N5471J91491k6475l6387m7600R4598
1901D56646m546j9108m613n8451N3549P685L7980k49407j10345P7716R8622M7064
$$ plain form
1889 332792 268977 259125 395502 499533 426751 355130 458483 425853 402172 379032 419007
1878 419007 486503 363167 371694 401819 379474 328386 309558 436359 350941 269104 232207
1867 232207 204247 373670 328235 317084 499997 542603 408948 368087 388979 305548 328060
1856 328060 446615 431011 389968 354077 398451 385290 402039 451667 413473 413247 408721 520651
1844 520651 485127 469271 359726 303482 254842 246308 277927 212434 387549 406442 277594
1833 277594 311596 416139 395358 305093 233639 182012 408324 469013 480171 316081 303078
1822 303078 365533 397319 235239 193525 296650 356299 257715 323723 426265 331756 269594
1811 269594 239128 318366 337341 299320 370728 434997 350136 288766 222784 179248 195246 296537
$$ packed form
1889C32792o3815r852J36377J04031p2782p1621J03353l2630k3681k3140L9975
1878D19007O7496j23336Q527L0125k2345n1088j8828J26801q5418q1837l6897
1867B32207k7960J69423m5435j1151J82913M2606j33655m0861K0892q3431K2512
1856C28060J18555j5604m1043l5891M4374j3161J6749M9628l8194k26m526J11930
1844E20651l5524j5856j09545n6244m8640q534L1619o5493J75115J8893j28848
1833B77594L4002J04543k0781r0265p1454n1627K26312O0689J1158j64090j3003
1822C03078O2455L1786j62080m1714J03125N9649r8584O6008J02542r4509o2162
1811B69594l0466P9238J8975l8021P1408O4269q4861o1370o5982m3536J5998J01291
$$ plain form
1799 296537 224926 207460 293250 361993 351888 310205 381877 278753 327954 411366 241392
1788 241392 306904 432555 414183 410816 462830 300238 304970 229784 284628 401629 381372
1777 381372 308743 365848 263174 242687 251749 91616 125524 167851 363304 340648 318266
1766 318266 325191 322640 202163 152742 251252 236806 304876 325697 400642 286051 317672 461236
1754 461236 552602 512840 516749 442595 410604 423702 441116 376121 370396 423375 440246 250869
1742 250869 154936 294769 275618 189762 259388 369943 366131 303459 227908 288654 236200
1731 236200 384532 609340 552690 615914 653663 459529 314973 345462 223480 258230 373404
1720 373404 273045 259575 262327 274769 263437 371274 357936 273594 262235 181479 173418 278563
$$ packed form
1799B96537p1611j7466Q5790O8743j0105m1683P1672j03124M9201Q3412j69974
1788B41392O5512J25651j8372l367N2014j62592M732p5186N4844J17001k0257
1777C81372p2629N7105j02674k0487R062j60133L3908M2327J95453k2656k2382
1766C18266O925k551j20477m9421R8510j4446O8070K0821P4945j14591L1621J43564
1754D61236R1366l9762L909p4154l1991J3098J7414o4995n725N2979J6871j89377
1742B50869r5933J39833j9151q5856O9626J10555l812o2672p5551O0746n2454
1731B36200J48332K24808n6650O3224L7749j94134j44556L0489j21982L4750J15174
1720C73404j00359j3470K752J2442j1332J07837j3338q4342j1359q0756q061J05145
$$ plain form
1708 278563 418515 390046 302631 333263 404968 251482 280730 358936 314514 305720 209546
1697 209546 259885 253552 234386 121897 232248 252115 300128 377354 367231 413172 364949
1686 364949 297669 226022 135467 154542 43511 125629 161112 70054 87330 137887 179681
1675 179681 231429 272995 147926 118931 121889 47731 116912 153073 144095 111228 224728 232763
1663 232763 194035 196033 155701 275628 269385 177002 191009 84992 53755 234748 309174
1652 309174 338934 282301 32629 147070 302719 260468 177840 82287 80372 28184 40384
1641 40384 145707 259158 222746 325389 206466 142969 181944 255644 240522 118715 177192
1630 177192 56514 108679 318431 338820 253658 295567 408161 456720 394515 286819 320634
$$ packed form
1708B78563J39952k8469q7415L0632P1705j53486K9248P8206m4422q794r6174
1697B09546N0339o333j9166j12489J10351J9867M8013P7226j0123M5941m8223
1686C64949o7280p1647r0555J9075j11031Q2118L5483r1058J7276N0557M1794
1675A79681N1748M1566j25069k8995K958p4158O9181L6161q978l2867J13500Q035
1663B32763l8728J998m0332J19927o243r2383J4007j06017l1237J80993P4426
1652C09174K9760n6633k49672J14441J55649m2251q2628r5553j915n2188J2200
1641D0384J05323J13451l6412J02643j18923o3497L8975P3700j5122j21807N8477
1630A77192j20678N2165K09752K0389q5162M1909J12594M8559o2205j07696L3815
$$ plain form
1619 320634 371420 230982 262423 275654 317171 354711 359924 206807 181591 203039 143348
1608 143348 214249 134409 61972 105226 192667 279650 420515 346868 212740 126824 246498
1597 246498 163292 170330 239075 115608 43960 85395 166429 328461 291576 138317 175470
1586 175470 302347 384856 316593 262221 111289 187543 239027 154691 185531 90241 55753
1575 55753 147478 147891 71183 192206 220164 156981 206849 211573 155422 173612 183406 95042
1563 95042 16829 134570 249282 194622 222444 206693 130503 191806 6070 -49070 3928
1552 3928 28487 66441 92275 7129 7351 75907 68513 127827 195860 295562 202318 198723 148710
1539 148710 7379 -11953 7687 152150 223923 277819 223096 199838 177893 175318 268376
$$ packed form
1619C20634N0786j40438L1441J3231M1517L7540N213j53117k5216K1448n9691
1608A43348P0901p9840p2437M3254Q7441Q6983J40865p3647j34128q5916J19674
1597B46498q3206P038O8745j23467p1648M1435Q1034J62032l6885j53259L7153
1586A75470J26877Q2509o8263n4372j50932P6254N1484q4336L0840r5290l4488
1575E5753R1725M13p6708J21023K7958o3183M9868M724n6151J8190R794q8364
1563I5042p8213J17741J14712n4660K7822j5751p6190O1303j85736n5140N2998
1552C928K4559L7954K5834q5146K22O8556p394N9314O8033R9702r3244l595n0013
1539A48710j41331j9332J9640J44463P1773N3896n4723k3258k1945k575R3058
$$ plain form
1528 268376 314504 357179 304786 351485 362306 272072 193701 199468 187657 201511 165851 210494
1516 210494 193449 176952 215036 179181 259627 190621 96855 83597 54566 51389 165427 236716
1504 236716 262510 302182 159589 83591 197817 168840 158079 162627 159775 190726 175794 192116
1492 192116 14531 -12791 36303 96367 149934 199952 135502 64697 6427 -32569 82192
1481 82192 200395 323479 238096 231141 251309 246227 256981 260849 205373 235970 158291 135858
1469 135858 280313 276368 246042 180869 293259 405633 440296 274386 110421 112933 116720
1458 116720 131813 117867 177263 299190 231939 196989 248480 188947 188904 171437 201157 190973
1446 190973 341831 272795 134495 213020 175373 178091 205754 330111 250797 101312 39556
$$ packed form
1528B68376M6128M2675n2393M6699J0821r0234p8371N767j1811J3854l5660M4643
1516B10494j7045j6497L8084l5855Q0446o9006r3766j3258k9031l177J14038P1289
1504B36716K5794L9672j42593p5998J14226k8977j0761M548k852L0951j4932J6322
1492A92116j77585k7322M9094O0064N3567N0018o4450p0805n8270l8996J14761
1481H2192J18203J23084q5383o955K0168n082J0754L868n5476L0597p7679k2433
1469A35858J44455l945l0326o5173J12390J12374L4663j65910j63965K512L787
1458A16720J5093j3946N9396J21927o7251l4950N1491n9533m3j7467K9720j0184
1446A90973J50858o9036j38300P8525l7647K718K7663J24357p9314j49485o1756
$$ plain form
1435 39556 -17502 52610 111150 32128 85447 107165 113739 214486 260601 205013 188598 145950
1423 145950 289010 193857 147960 71990 121524 189890 217320 246242 190748 141321 131993 82478
1411 82478 226914 353046 300067 120883 51111 162672 23057 58894 161967 136967 -19361
1400 -19361 76357 182560 190792 50257 4976 63965 143254 88755 154635 169155 93564 135823
1388 135823 276721 262702 231058 143876 106128 56719 3568 122839 115143 126551 33593
1377 33593 72320 80428 85867 109349 2134 42755 210042 142498 36211 142499 58410
1366 58410 -1755 111636 169525 195328 220129 179633 274144 317694 279606 211044 38288
1355 38288 119738 156759 31937 -9865 135053 78939 77758 70222 60398 100310 143447 186214
$$ packed form
1435C9556n7058P0112N8540p9022N3319K1718O574J00747M6115n5588j6415m2648
1423A45950J43060r5153m5897p5970M9534O8366K7430K8922n5494m9427r328m9515
1411H2478J44436J26132n2979j79184o9772J11561j39615L5837J03073k5000j56328
1400a9361R5718J06203Q232j40535m5281N8989P9289n4499O5880J4520p5591M2259
1388A35823J40898j4019l1644q7182l7748m9409n3151J19271p696J1408r2958
1377C3593L8727Q108N439K3482j07215M0621J67287o7544j06287J06288q4089
1366E8410o0165J13391N7889K5803K4801m0496R4511M3550l8088o8562j72756
1355C8288Q1450L7021j24822m1802J44918n6114j181p536r824L9912M3137M2767
$$ plain form
1343 186214 176451 146834 161240 125855 137532 317458 172227 152945 82886 149875 19193
1332 19193 109629 180247 180146 260627 214444 269491 181992 267512 215358 224731 85199 -79981
1320 -79981 158294 225933 139398 103595 140352 47729 27853 50282 53129 7374 149 41705
1308 41705 93541 143975 144300 221342 106570 94771 172145 188146 138459 58467 128421 148996
1296 148996 82041 1119 45380 164245 142475 80865 77390 138188 135801 160092 105983 100067
1284 100067 216103 216243 212535 138171 50757 88093 142831 106681 198999 102967 121075 86666
1272 86666 70576 147019 141923 100217 73554 184896 136216 74130 111502 171901 237499 193648
1260 193648 185484 215804 184753 65692 72484 207280 242318 138211 45210 68817 72350 150683
$$ packed form
1343A86214r763k9617J4406l5385J1677J79926j45231j9282p0059O6989j30682
1332A9193R0436P0618j01Q0481m6183N5047q7499Q5520n2154R373j39532j65180
1320g9981K38275O7639q6535l5803L6757r2623j9876K2429K847m5755p225M1556
1308D1705N1836N0434L25P7042j14772j1799P7374J6001m9687p9992O9954K0575
1296A48996o6955q0922M4261J18865k1770o1610l475O0798k387K4291n4109n916
1284A00067J16036J40l708p4364q7414L7336N4738l6150R2318r6032J8108l4409
1272H6666j6090P6443n096m1706k6663J11342m8680o2086L7372O0399O5598m3851
1260A93648q164L0320l1051j19061O792J34796L5038j04107r3001K3607L533P8333
$$ plain form
1248 150683 236544 136160 90338 84375 73558 166776 207005 234410 193466 221044 115109
1237 115109 77534 -20385 56680 13183 100093 240781 204213 19601 6329 110781 186808
1226 186808 167445 55845 71842 -13391 66580 -46965 -17280 26594 119706 306794 150774
1215 150774 165081 102723 177150 11519 13046 131553 86787 59896 86716 108884 104137 63104
1203 63104 69480 149800 148524 120873 82039 68412 -16857 121655 167229 112430 -47791 -67282
1191 -67282 64850 199275 113535 -120718 -69844 128743 105632 -61051 -134606 -4946 67028
1180 67028 26652 187889 141059 98247 170135 113875 27136 71743 52179 19344 57783 230783
1168 230783 258880 168933 112334 4342 46817 91081 57285 36712 48347 56465 7953 17768
$$ packed form
1248A50683Q5861j00384m5822n963j0817R3218M0229K7405m0944K7578j05935
1237A15109l7575r7919P7065m3497Q6910J40688l6568j84612j3272J04452P6027
1226A86808j9363j11600J5997q5233P9971j13545K9685M3874R3112J87088j56020
1215A50774J4307o2358P4427j65631J527J18507m4766k6891K6820K2168m747m1033
1203F3104O376Q0320j276k7651l8834j3627q5269J38512M5574n4799j60221j9491
1191f7282J32132J34425q5740k34253N0874J98587k3111j66683p3555J29660P1974
1180F7028m0376J61237m6830m2812P1888n6260q6739M4607j9564l2835L8439J73000
1168B30783K8097q9947n6599j07992M2475M4264l3796k0573J1635Q118m8512R815
$$ plain form
1156 17768 102265 186319 206122 126345 158994 96699 213625 160837 183478 144417 133387 68221
1144 68221 90161 114322 65187 88117 63612 113025 165721 166441 35955 -46727 -74382 51775
1132 51775 9967 20420 71571 72814 152743 220468 229595 150377 73315 62010 122831 124888
1120 124888 75291 24120 60999 116739 129203 104542 11291 -57367 -172425 -134276 -18718
1109 -18718 8366 8035 -1442 -18649 39800 38546 -1846 9057 -23973 -70594 -71404 30376 59813
1096 59813 -15468 69528 130503 126466 104435 7 62573 111889 38116 -44501 115952 128282
1084 128282 72255 -70759 -31993 -29952 -12118 70118 -10376 -127599 -141261 -12138 -2776
1073 -2776 -65401 -3805 78610 -92603 -137610 -65387 -90308 -48530 40139 13404 139655 -23344
$$ packed form
1156A7768Q4497Q4054J9803p9777L2649o2295J16926n2788K2641l9061j1030o5166
1144F8221K1940K4161m9135K2930k4505M9413N2696P20j30486q2682k7655J26157
1132E1775m1808J0453N1151J243P9929O7725R127p9218p7062j1305O0821K057
1120A24888m9597n1171L6879N5740J2464k4661r3251o8658j15058L8149J15558
1109a8718K7084l31r477j7207N8449j254m0392J0903l3030m6621q10J01780K9437
1096E9813p5281Q4996O0975m037k2031j04428O2566M9316p3773q2617J60453J2330
1084A28282n6027j43014L8766K041J7834Q2236q0494j17223j3662J29123R362
1073b776o2625O1596Q2415j71213m5007P2223k4921M1778Q8669k6735J26251j62999
$$ plain form
1061 -23344 -138542 -23332 51193 146837 43509 -3522 -3954 47292 -60184 -79982 23144
1050 23144 152511 39712 -41472 -43635 4556 39176 -59347 3750 31302 7560 65840 148513
1038 148513 41190 -35796 117248 159667 211840 190131 69899 28889 97829 9880 16558
1027 16558 -43247 -113030 -6797 29070 -1446 131953 275752 215722 134846 17769 -112720
1016 -112720 -15486 18171 -20283 52791 5487 -82377 -72708 12848 -57925 27161 -91075 -40691
1004 -40691 13663 60991 81748 3876 6223 75794 -40516 -148192 -117057 101419 22650
993 22650 -9463 -78816 -36503 -27851 136680 56478 -25789 10618 25346 87978 125634 17626
981 17626 31566 -125863 -126631 -50614 50 -60773 -61528 -74867 -94825 -96622 -114219 24746 -7812
$$ packed form
1061b3344j15198J15210P4525R5644j03328m7031m32N1246j07476j9798J03126
1050B3144J29367j12799q1184k163M8191L4620r8523O3097K7552k3742N8280Q2673
1038A48513j07323p6986J53044M2419N2173k1709j20232m1010O8940q7949O678
1027A6558n9805o9783J06233L5867l0516J33399J43799o0030q0876j17077j30489
1016a12720R7234L3657l8454P3074m7304q7864R669Q5556p0773Q5086j18236N0384
1004d0691N4354M7328K0757p7872K347O9571j16310j07676L1135K18476p8769
993B2650l2113o9353M2313Q652J64531q0202q2267L6407J4728O2632L7656j08008
981A7626J3940j57429p68P6017N0664o0823p55j3339j9958j797j7597J38965l2558
$$ plain form
968 -7812 -3637 -24863 -12362 -148965 -23409 -67668 31972 -42527 9925 78360 -29379 -109577
956 -109577 -58111 29443 -75154 -119219 -89601 -148650 30545 69971 112333 42337 -19707
945 -19707 95954 -79604 -7066 40319 -34763 -200701 -134856 89950 -70652 -79696 -116542
934 -116542 -43431 671 -41155 -90528 -37921 19962 48113 25753 -122596 -143469 -22445
923 -22445 53518 44560 63412 -107227 -120238 61259 44507 -37088 -93298 -96069 -119153 -14499
911 -14499 -54374 -77683 123364 138878 152710 100615 -100898 -115854 -23167 46397 39015 37635
899 37635 -51091 -19680 44876 5771 41824 -97282 -124212 11650 7410 -103094 -154741 46080
887 46080 -44960 -136035 2557 -59286 -76988 -189204 -205340 -179491 -224508 -195533 -134857 -34232
$$ packed form
968g812M175k1226J2501j36603J25556m4259R9640p4499N2452O8435j07739q0198
956a09577N1466Q7554j04597m4065K9618n9049J79195L9426M2362o9996o2044
945a9707J15661j75558P2538M7385p5082j65938O5845K24806j60602r044l6846
934a16542P3111M4102m1826m9373N2607N7883K8151k2360j48349k0873J21024
923b2445P5963q958J8852j70639j3011J81497j6752q1595n6210k771k3084J04654
911a4499l9875k3309K01047J5514J3832n2095k01513j4956R2687O9564p382j380
899C7635q8726L1411O4556l9105L6053j39106k6930J35862m240j10504n1647K00821
887D6080r1040r1075J38592o1843j7702j12216j6136K5849m5017K8975O0676J00625
$$ plain form
875 -34232 -1309 45359 -43527 -91918 -77721 -92200 -145972 -70878 -47600 -21894 30187 69287
863 69287 -18638 52173 -85522 -216047 -112756 -85485 -97506 -115379 -174232 -138095 -227604
852 -227604 -110344 -51917 -75201 -25930 -23018 74045 62376 29709 -140087 -138317 -116634 -1313
840 -1313 -25608 -131282 76548 41986 -82515 -48561 -10929 -39144 -96018 -42572 -52941 66278
828 66278 51873 7039 53600 -38759 -128931 -57619 56180 38340 -39180 -78852 -152071 -85929
816 -85929 -66107 -28816 13564 -36171 -95795 58918 118 -140968 -188558 -12056 32985
805 32985 -63682 -177552 -48333 8722 -37480 -59443 92941 97016 -52630 -118643 -53549
794 -53549 -79138 -63092 8413 -1414 -64504 -167417 -182458 -22098 -33354 -87439 -105642 -109909
$$ packed form
875c4232L2923M6668q8886m8391J4197j4479n3772P5094K3278K5706N2081L9100
863F9287q7925P0811j37695j30525J03291K7271j2021j7873n8853L6137q9509
852b27604J17260N8427k3284M9271K912R7063j1669l2667j69796J770K1683J15321
840a313k4295j05674K07830l4562j24501L3954L7632k8215n6874N3446j0369J19219
828F6278j4405m4834M6561r2359r0172P1312J13799j7840p7520l9672p3219O6142
816h5929J9822L7291M2380m9735n9624J54713n8800j41086m7590J76502M5041
805C2985r6667j13870J29219N7055m6202k1963J52384M075j49646o6013O5094
794e3549k5589J6046P1505r827o3090j02913j5041J60360j1256n4085j8203m267
$$ plain form
782 -109909 -83344 -83228 -89976 -92417 -69406 -52690 25089 39999 65168 74766 31897 4764 73012
769 73012 17741 46440 104707 100240 108233 64977 -65218 -130282 18896 -30979 -1681 -92090
757 -92090 -88253 -7084 -67695 -45758 -71397 9151 -87991 -55688 -92108 -72682 -94410 13220
745 13220 81399 -27807 -14439 -10589 -29864 -69090 -184131 -138825 -41675 -32945 18816 111966
733 111966 22401 -60090 17550 -52138 -34364 -8373 -147006 -206359 -262175 -60635 -47763
722 -47763 -125588 -111971 -161334 -231265 -123862 49573 -64237 -232362 -143285 -92381 -75118
711 -75118 -38103 80637 143405 171616 161767 26281 -59324 -3689 -34227 -86453 -177541 -170168
699 -170168 -141511 -232638 -191066 -146407 -234141 -297724 -132304 -139937 -206526 -186131 -316895 -191593
$$ packed form
782a09909K6565J16o748k441K3011J6716P7779J4910K5169R598m2869k7133O8248
769G3012n5271K8699N8267m467P993m3256j30195o5064J49178m9875K9298r0409
757i2090L837Q1169o0611K1937k5639Q0548r7142L2303l6420J9426k1728J07630
745A3220O8179j09206J3368L850j9275l9226j15041M5306R7150Q730N1761R3150
733A11966q9565q2491P7640o9688J7774K5991j38633n9353n5816K01540J2872
722d7763p7825J3617m9363o9931J07403J73435j13810j68125Q9077N0904J7263
711g5118L7015J18740O2768K8211r849j35486q5605N5635l0538n2226r1088P373
699a70168K8657r1127M1572M4659q7734o3583J65420p633o6589K0395j30764J25302
$$ plain form
687 -191593 -49170 -52967 -145510 -211534 -278312 -280383 -136031 -43371 -69396 -167571 -101732 8589
675 8589 -41282 -23641 56168 55443 -44447 -178535 -131032 -134413 -252413 -167916 -117565 -162141
663 -162141 -138707 -39138 -13010 -14274 -91302 -67652 52543 -75116 -63096 -55226 -23217 -31183
651 -31183 -5253 -66434 -81408 -141216 -137095 -69344 -82087 -72522 -211365 -128248 -35717 -228800
639 -228800 -322826 -255247 -271383 -109421 58388 -102786 -180536 -109986 18649 -28964 -969
628 -969 -109772 -111168 -68711 -102633 -100224 57572 180506 148459 -4578 26794 -55101 -214426
616 -214426 -159404 -133545 -103477 -78764 -85412 -157857 -222811 -63198 -41031 -204623 -31820
605 -31820 57523 3318 -80737 -175047 -116175 -114587 -162937 -75680 -51205 -419 10035 -83829
$$ packed form
687a91593J42423l797r2543o6024o6778k071J44352R2660k6025r8175O5839J10321
675H589m9871J7641P9809p25r9890j34088M7503l381j18000Q4497N0351m4576
663a62141K3434R9569K6128j264p7028K3650J20195j27659J2020P870L2009p966
651c1183K5930o1181j4974n9808M121O7751j2743R565j38843Q3117R2531j93083
639b28800r4026O7579j6136J61962J67809j61174p7750P0550J28635m7613K7995
628i69j08803j396M2457l3922K409J57796J22934l2047j53037L1372q1895j59325
616b14426N5022K5859L0068K4713o648p2445o4954J59613K2167j63592J72803
605c1820Q9343n4205q4055r4310N8872J588m8350Q7257K4475N0786J0454r3864
$$ plain form
593 -83829 -53392 -53685 -120142 -165587 -217684 -155085 -133373 -100776 -115971 57660 12102 50355
$$ packed form
593h3829L0437k93o6457m5445n2097O2599K1712L2597j5195J73631m5558L8253
$$ [...]
##END NTUPLES=NMR SPECTRUM
##END=
