##TITLE=1H_DE-80H_X3
 200.13MHz, d2o
 8 sc
 
 19ns.26.2.2025
##JCAMPDX= 6.0         $$ Bruker NMR JCAMP-DX V2.0
##DATA TYPE= NMR SPECTRUM
##DATA CLASS= NTUPLES
##ORIGIN= UXNMR, Bruker Analytische Messtechnik GmbH
##OWNER= pz
$$ XWIN-NMR		Version 3.5
$$ Mon Oct 20 10:20:52 2025 Russian Standard Time (UT+4h)  Yarkov@DPX200
##.OBSERVE FREQUENCY= 200.1313
##.OBSERVE NUCLEUS= ^1H
##.ACQUISITION MODE= SIMULTANEOUS
##.ACQUISITION SCHEME= undefined
##.AVERAGES= 8
##.DIGITISER RES= 18
##SPECTROMETER/DATA SYSTEM= spect
##.PULSE SEQUENCE= zg30
##.SOLVENT NAME= CDCl3
##.SHIFT REFERENCE= (INTERNAL, CDCl3, 0, 15.4858)
##AUDIT TRAIL= $$ (NUMBER, WHEN, WHO, WHERE, WHAT)
$$ ##TITLE= Audit trail, XWIN-NMR		Version 3.5
$$ ##JCAMPDX= 5.01
$$ ##ORIGIN= Bruker BioSpin GmbH
$$ ##OWNER= Yarkov
$$ C:/Bruker/XWIN-NMR/data/yarkov2/nmr/H-C/1/pdata/1/auditp.txt
$$ ##AUDIT TRAIL=  $$ (NUMBER, WHEN, WHO, WHERE, WHAT)
(   1,<2025-10-20 10:19:58.73 +0400>,<Yarkov>,<DPX200>,
      <created by zg, POWCHK disabled, PULCHK disabled
       configuration hash MD5:
       00 E9 B6 7A A2 85 ED C7 34 08 36 98 17 FE 4E 26
       data hash MD5: 16K
       AB 9E 2A E6 A9 5C 9E 1D 1A 9B DB CA 06 C3 51 2B>)
(   2,<2025-10-20 10:20:04.56 +0400>,<Yarkov>,<DPX200>,
      <Start of raw data processing
       efp BC_mod = 2 LB = 0.25 FT_mod = 6 PKNL = 1 PHC0 = -3871.206 PHC1 = 11.62191 SI = 16K 
       data hash MD5: 16K
       43 D1 17 27 21 32 59 F8 FE FF 1B B3 ED 17 F7 8B>)
(   3,<2025-10-20 10:20:25.17 +0400>,<Yarkov>,<DPX200>,
      <pk PHC0 = -204.8097 PHC1 = 2.599999 
       data hash MD5: 16K
       7E 4F 94 88 D6 CE 62 84 35 68 14 0C 2A 34 55 57>)
(   4,<2025-10-20 10:20:27.89 +0400>,<Yarkov>,<DPX200>,
      <abs ABSG = 5 
       data hash MD5: 16K
       3A 57 A6 C4 19 5D 4B 02 79 82 C6 88 D8 3B F2 18>)
$$ ##END=
$$ 
$$ hash MD5
$$ 15 31 6B E2 02 E8 BA 33 39 5F 68 50 33 EF 02 18
##$RELAX= 
##$RELAX= 
##$RELAX= 
##$RELAX= 
##$RELAX= 
##$RELAX= 
$$ Bruker specific parameters
$$ --------------------------
##$DU= <C:/Bruker/XWIN-NMR>
##$EXPNO= 1
##$NAME= <H-C>
##$PROCNO= 1
##$TYPE= <nmr>
##$USER= <yarkov2>
##$AMP= (0..31)
100 100 100 100 100 100 100 100 100 100 100 100 100 100 100 100 100 100 
100 100 100 100 100 100 100 100 100 100 100 100 100 100 
##$AQSEQ= 0
##$AQ_mod= 1
##$AUNM= <au_zg>
##$AUTOPOS= <>
##$BF1= 200.13
##$BF2= 200.13
##$BF3= 200.13
##$BF4= 200.13
##$BF5= 200.13
##$BF6= 200.13
##$BF7= 200.13
##$BF8= 200.13
##$BYTORDA= 1
##$CFDGTYP= 0
##$CFRGTYP= 5
##$CHEMSTR= <none>
##$CNST= (0..31)
1 1 145 1 1 1 1 1 1 1 1 1 1 1 1 1 1 1 1 1 1 1 1 1 1 1 1 1 1 1 1 1 
##$CPDPRG= <>
##$CPDPRG1= <>
##$CPDPRG2= <>
##$CPDPRG3= <>
##$CPDPRG4= <mlev>
##$CPDPRG5= <mlev>
##$CPDPRG6= <mlev>
##$CPDPRG7= <mlev>
##$CPDPRG8= <mlev>
##$CPDPRGB= <>
##$CPDPRGT= <>
##$D= (0..31)
0 0.7 0 0 0 0 0 0 0 0 0 0.03 0 0 0 0 0 0 0 0 0 0 0 0 0 0 0 0 0 0 0 0 
##$DATE= 1760941198
##$DBL= (0..7)
120 120 120 120 120 120 120 120 
##$DBP= (0..7)
150 150 150 150 150 150 150 150 
##$DBP07= 0
##$DBPNAM0= <>
##$DBPNAM1= <>
$$ [...]
##$SUBNAM3= <"">
##$SUBNAM4= <"">
##$SUBNAM5= <"">
##$SUBNAM6= <"">
##$SUBNAM7= <"">
##$SUBNAM8= <"">
##$SUBNAM9= <"">
##$SW= 18.0517328524113
##$SWIBOX= (0..15)
0 0 2 0 0 0 0 0 0 0 0 0 0 0 0 0 
##$SW_h= 3612.71676300578
##$TD= 16384
##$TD0= 1
##$TE= 0
##$TE2= 300
##$TE3= 300
##$TEG= 300
##$TL= (0..7)
0 120 120 120 120 120 120 120 
##$TP= (0..7)
150 150 150 150 150 150 150 150 
##$TP07= 0
##$TPNAME0= <>
##$TPNAME1= <>
##$TPNAME2= <>
##$TPNAME3= <>
##$TPNAME4= <>
##$TPNAME5= <>
##$TPNAME6= <>
##$TPNAME7= <>
##$TPOAL= (0..7)
0.5 0.5 0.5 0.5 0.5 0.5 0.5 0.5 
##$TPOFFS= (0..7)
0 0 0 0 0 0 0 0 
##$TUNHIN= 0
##$TUNHOUT= 0
##$TUNXOUT= 0
##$USERA1= <user>
##$USERA2= <user>
##$USERA3= <user>
##$USERA4= <user>
##$USERA5= <user>
##$V9= 5
##$VALIST= <valist>
##$VCLIST= <CCCCCCCCCCCCCCC>
##$VD= 0
##$VDLIST= <DDDDDDDDDDDDDDD>
##$VPLIST= <PPPPPPPPPPPPPPP>
##$VTLIST= <TTTTTTTTTTTTTTT>
##$WBST= 1024
##$WBSW= 4
##$XGAIN= (0..3)
0 0 0 0 
##$XL= 0
##$YL= 0
##$YMAX_a= 517691
##$YMIN_a= -691198
##$ZGOPTNS= <>
##$ZL1= 120
##$ZL2= 120
##$ZL3= 120
##$ZL4= 120
##$ABSF1= 15.48577
##$ABSF2= -2.566079
##$ABSG= 5
##$ABSL= 3
##$ALPHA= 0
##$AQORDER= 0
##$ASSFAC= 0
##$ASSFACI= 0
##$ASSFACX= 0
##$ASSWID= 0
##$AUNMP= <proc_1d>
##$AZFE= 0.1
##$AZFW= 0.1
##$BCFW= 0
##$BC_mod= 2
##$BYTORDP= 0
##$COROFFS= 0
##$CY= -3
##$DATMOD= 1
##$DC= 0
##$DFILT= <>
##$DTYPP= 0
##$F1P= 0
##$F2P= 0
##$FCOR= 1
##$FTSIZE= 16384
##$FT_mod= 6
##$GAMMA= 0
##$GB= 0
##$INTBC= 1
##$INTSCL= 3.241238e-09
##$ISEN= 128
##$LB= 0.25
##$LEV0= 0
##$LPBIN= 0
##$MAXI= 10000
##$MC2= 0
##$MEAN= 0
##$ME_mod= 0
##$MI= 1.114404
##$NCOEF= 0
##$NC_proc= -6
##$NLEV= 6
##$NOISF1= 3.799351
##$NOISF2= 2.8
##$NSP= 0
##$NTH_PI= 0
##$NZP= 0
##$OFFSET= 15.48577
##$PC= 1
##$PHC0= -4076.016
##$PHC1= 14.22191
##$PH_mod= 1
##$PKNL= yes
##$PPARMOD= 0
##$PSCAL= 0
##$PSIGN= 0
##$REVERSE= no
##$SF= 200.13000719155
##$SI= 16384
##$SIGF1= 3
##$SIGF2= 2
##$SINO= 0.751879
##$SIOLD= 32768
##$SREGLST= <19F.Aceton>
##$SSB= 0
##$STSI= 16384
##$STSR= 0
##$SW_p= 3612.71676300578
##$SYMM= 0
##$S_DEV= 0
##$TDeff= 16384
##$TDoff= 0
##$TI= <>
##$TILT= no
##$TM1= 0
##$TM2= 0
##$TOPLEV= 0
##$USERP1= <user>
##$USERP2= <user>
##$USERP3= <user>
##$USERP4= <user>
##$USERP5= <user>
##$WDW= 1
##$XDIM= 16384
##$YMAX_p= 323939790
##$YMIN_p= -332066
$$ End of Bruker specific parameters
$$ ---------------------------------
##NTUPLES= NMR SPECTRUM
##VAR_NAME=  FREQUENCY,     SPECTRUM/REAL,   SPECTRUM/IMAG
##SYMBOL=    X,             R,               I
##VAR_TYPE=  INDEPENDENT,   DEPENDENT,       DEPENDENT
##VAR_FORM=  AFFN,          ASDF,            ASDF
##VAR_DIM=   16384,         16384,           16384
##UNITS=     HZ,            ARBITRARY UNITS, ARBITRARY UNITS
##FACTOR=    0.220516191357247, 1,           1
##FIRST=     3099.16730660099, 0,            0
##LAST=      -513.549456404791, 0,           0
##MIN=       -513.549456404791, -332066,     0
##MAX=       3099.16730660099, 323939790,    0
$$ Real data points
##PAGE= N=1
##DATA TABLE= (X++(R..R)), XYDATA
$$ [...]
6545A0225184m73376n39332n65322p25979o35826n09201m21252l40025l98888
6536E615983l75444k50176k03145k36331k01128j49891j41576k09195o0633l9229
6526C749235p6940j28149j43359J59K343q1400q9460l3801q4754p4153j6648j19974
6514B903099K7086j21570n0516N9685J44113K12413J83602J78257J69752O523
6504C712444L4832J68463P9382q8094j12541r3915j24842j36237l55567r7399
6494B986526o9599l3708j40729m1452o2573j19130n1939J05201J3943k4295L1249
6483B593494n5752J02969N1372J64654J26274J15820Q0891J48115K01293K62357
6473C791487J37081J65980J11996J52439J12722K2240o6824j88954l11867j76008
$$ plain form
6545 10225184 9751808 9212476 8647154 7921175 7285349 6776148 6354896 6014871 5615983
6536 5615983 5240539 4990363 4787218 4550887 4349759 4199868 4058292 3849097 3788464 3749235
6526 3749235 3672295 3544146 3400787 3400946 3403289 3321889 3232429 3198628 3113874 3039721 3023073 2903099
6514 2903099 2930185 2808615 2758099 2817784 2961897 3174310 3357912 3536169 3705921 3712444
6504 3712444 3747276 3915739 3995121 3907027 3794486 3700571 3575729 3439492 3083925 2986526
6494 2986526 2916927 2883219 2742490 2701038 2638465 2519335 2467396 2572597 2586540 2562245 2593494
6483 2593494 2537742 2640711 2692083 2856737 2983011 3098831 3179722 3327837 3529130 3791487
6473 3791487 3928568 4094548 4206544 4358983 4471705 4493945 4427121 4238167 3926300 3750292
6463C750292j43922l16045j80015k80973j52240j31288r3524j10006o5000j55766
6453B121513j30446r162q8994r4757l1193k0190j25337K9659j39531j14449K7987
6442A425100n3813j21350j03352o0117L8501p203k0043j19983l4971K2606j61341
6431H04034O9696Q269o2649j35244P6833J06732o2582q4742j56368M3445J81720
6420G89144r3426r0773O1279p307q9811p1690P8597N4150j24622o9064J1397N6782
6408E04656J30370o9794j54739k4390q22J18553K122j8597q9817q111n952K06
6396C83685K7686R2409J03832q9534p1233M1123k9080o8573l1165K9259Q4196
6385D72605k6443R6210l3899j1803L3636p291l0381p0635n4870k667M8958o4488
$$ plain form
6463 3750292 3606370 3290325 3110310 2829337 2677097 2545809 2452285 2342279 2277279 2121513
6453 2121513 1991067 1981905 1892911 1798154 1766961 1746771 1621434 1651093 1511562 1397113 1425100
6442 1425100 1371287 1249937 1146585 1086468 1124969 1117766 1097723 977740 942769 965375 804034
6431 804034 873730 881999 819350 684106 760939 867671 805089 720347 563979 607424 789144
6420 789144 695718 604945 666224 658917 569106 497416 576013 630163 505541 436477 447874 504656
6408 504656 635026 565232 410493 386103 385281 503834 505956 487359 397542 389431 383479 383685
6396 383685 411371 503780 607612 518078 446845 487968 458888 390315 359150 388409 472605
6385 472605 446162 542372 508473 496670 530306 523015 492634 421999 367129 364462 413420 348932
6373C48932p8Q9403N0668P498J6639k3369J9517K5433n7364N4005N5626j27100
6361D59810K0096M0054r1512P5663j4285J4581k133J12245j08984K6895j27856
6350D04574K8309O5828o534q750L5970J0139l5669K2788J00185k2992m402L8452
6338F27898l2542J4611Q7313M1578p2789K6625K4707Q4226o7154j5643o0101J6181
6326F74910n0787K0827L8122l6053l108k309R8069o3806R532k5441q5846j9670
6314E54440o380J18642P6385q9234m4650R3329N1387m3725O7598O1168j07920
6303G31040J71664o257n3407R353M3240n1022k1591P2000j7465k5468N289l8861
6291H18515q1370J743k19R0777J05350m3917l203o9028O6362R303m8383J16753
$$ plain form
6373 348932 348854 438257 488925 496423 513062 489693 509210 534643 477279 531284 586910 459810
6361 459810 479906 519960 428448 504111 489826 504407 502274 614519 505535 532430 404574
6350 404574 432883 498711 492177 483427 519397 529536 493867 516655 616840 593848 589446 627898
6338 627898 595356 609967 697280 738858 666069 692694 717401 801627 734473 718830 658729 674910
6326 674910 624123 644950 683072 647019 643911 641602 739671 675865 685397 659956 574110 554440
6314 554440 548060 666702 743087 653853 609203 702532 753919 710194 777792 838960 731040
6303 731040 902704 896447 843040 852393 895633 844611 823020 895020 877555 852087 857376 818515
6291 818515 737145 738888 738669 829446 934796 890879 887676 818648 885010 894313 845930 962683
6279I62683R0525j0158J65819M0560n845O1194M9897J42414R7250J24764J05027
6268A824130J71833R6848Q5991J05306J13457j5588j05960j1624j74867j8263
6258B071263j2077j14210o6312o9892n21M0964N7507P9806L5794J37102P7269
6247B236693q008J22900R2433Q1157J34408P476J93506K37332J37763R5405K64817
6236C595882K20870K04392K24206R5644P7474O6225j33131l53762j79802j50529
6226C667469l14273k38129L4819k6702j62627q1804m5613j00844N9436P00q5291
6215B707141K6008p712L3906J31859J58362P3239L2254J62599K19172J57647J09954
6204C804429J49052K16766P3378K38771K57437K3234K2655K9107K45500J90876
$$ plain form
6279 962683 1053208 1043050 1208869 1249429 1243584 1304778 1354675 1497089 1594339 1719103 1824130
6268 1824130 1995963 2092811 2178802 2284108 2397565 2381977 2276017 2264393 2089526 2071263
6258 2071263 2059186 1944976 1878664 1808772 1808251 1849215 1906722 1986528 2022322 2159424 2236693
6247 2236693 2228685 2351585 2444018 2525175 2659583 2667059 2860565 3097897 3235660 3331065 3595882
6236 3595882 3816752 4021144 4245350 4340994 4418468 4484693 4351562 3997800 3817998 3667469
6226 3667469 3353196 3115067 3149886 3123184 2960557 2878753 2833140 2732296 2791732 2792432 2707141
6215 2707141 2733149 2725437 2759343 2891202 3049564 3122803 3155057 3317656 3536828 3694475 3804429
6204 3804429 3953481 4170247 4243625 4482396 4739833 4763067 4785722 4814829 5060329 5251205
6194E251205J26030J80832L47489J57172J37066K14677K06966J04877J42152M8353
6184F916819m1160m892n3199L1011L6082P0562J62592q0506R608j58216P8785
6173F967486L566L5133J94602m2399k8643m0779P9228K896L5033J01527J3325
6162G320975M253K734O3002q5512J6581J1645K086M3215R1049J06824N6886N6311
6150G690049R6664N7509K0184j4035j34884j40011j90217j78613k31697k73387
6140F701562j82808j54238k69249j61278j46707o0209j17325p8782l6171K3807
6130E518602p6385j11552J8573M1030N2655P0219K2625J02795K23432L18052K69769
6119F449815K99632L26101L78645M37227L04612K43784J88071k7404n7241j96388
$$ plain form
6194 5251205 5377235 5558067 5905556 6062728 6199794 6414471 6621437 6726314 6868466 6916819
6184 6916819 6875659 6870767 6817568 6848579 6884661 6955223 7117815 7037309 7046917 6888701 6967486
6173 6967486 6971052 7006185 7200787 7158388 7129745 7088966 7168194 7171090 7206123 7307650 7320975
6162 7320975 7325228 7327962 7390964 7305452 7322033 7333678 7335764 7378979 7470028 7576852 7633738 7690049
6150 7690049 7786713 7844222 7864406 7850371 7715487 7575476 7385259 7206646 6974949 6701562
6140 6701562 6518754 6364516 6095267 5933989 5787282 5727073 5609748 5530966 5494795 5518602
6130 5518602 5442217 5330665 5349238 5390268 5442923 5513142 5535767 5638562 5861994 6180046 6449815
6119 6449815 6749447 7075548 7454193 7891420 8196032 8439816 8627887 8600483 8543242 8346854
6109H346854j77226j91580o4240k1022m999K1754J798J67922K29854K77935K07833
6098H794883J96073L61507M47628M34762M72589O18680P48896P68014Q89238R63288
6088A4695558Q28294Q24572O31334L87350J87755j81131l23159m31704k04632
6079A6414237k8722l5694J49502K84190L98977N35586N18838O25457Q64281R13033
6069B0639685J100215J175938J371379J630896J994264K263331K479617K630131
6061C5285456K691552K615165K397522J786957J165981M67243m63776j105104
6053D4840996j595251j778512j614795j392184j205974j037716o70667n93338
6045C4952559l66565m8682P274K49071N59119P22410R49681J102390J335181J665215
$$ plain form
6109 8346854 8169628 7978048 7913808 7892786 7887787 7909541 7911339 8079261 8309115 8587050 8794883
6098 8794883 8990956 9352463 9800091 10234853 10707442 11326122 12075018 12843032 13732270 14695558
6088 14695558 15523852 16348424 16979758 17367108 17554863 17373732 17050573 16618869 16414237
6079 16414237 16385515 16349821 16499323 16783513 17182490 17718076 18236914 18862371 19726652 20639685
6069 20639685 21739900 22915838 24287217 25918113 27912377 30175708 32655325 35285456
6061 35285456 37977008 40592173 42989695 44776652 45942633 46409876 45946100 44840996
6053 44840996 43245745 41467233 39852438 38460254 37254280 36216564 35545897 34952559
6045 34952559 34585994 34537312 34544586 34793657 35352776 36075186 37024867 38127257 39462438 41127653
6035D1127653J822982K407952K814329L307811L769753M318144M327616M181411
6027F8077651L842097L027591J883100L33950j179334k461127l411955l787945
6019F6324028m006490l750542l325964k966742k651595k204800j879496j612665
6011D3925734j277047j237172j051547q30271n65064m45857k46604j15329J61141
6002C8317984N89278R33898J128004J403813J728442J838467J735062J638007
5994D9312955J211865N68147k9890j106351j874924k336775k508829k538763k372345
5985C8325090k166325j889874j642970j491700j356429j202847q71889p40532
5977B6962524o84328o05317k19546k22843q0508J12020J35591L12805L28414K27222
$$ plain form
6035 41127653 42950635 45358587 48172916 51480727 55250480 59568624 63896240 68077651
6027 68077651 71919748 74947339 76830439 77164389 75985055 73523928 70111973 66324028
6019 66324028 62317538 58566996 55241032 52274290 49622695 47417895 45538399 43925734
6011 43925734 42648687 41411515 40359968 39529697 38964633 38518776 38272172 38156843 38317984
6002 38317984 38907262 39841160 40969164 42372977 44101419 45939886 47674948 49312955
5994 49312955 50524820 51092967 51063077 49956726 48081802 45745027 43236198 40697435 38325090
5985 38325090 36158765 34268891 32625921 31134221 29777792 28574945 27703056 26962524
5977 26962524 26278196 25672879 25453333 25230490 25149982 25262002 25397593 25710398 26038812 26266034
5967B6266034Q4066n6733k62404n59516p44717q77537j182749j299881j028964
5958B0337599r50485j030164q09533o40446o44637m25795n35124l90448k28646
5949A4682321k93817j20067k83070n5517k2410q0442K2243K06921J80205L01193
5939A4537560K80667J42187K48604K15975L1633l69837n44453p31881p83729n09281
5929A2517445m86684l06794l26291m45350k32903k31316j47076j35988n6196K5449
5919A0174296k8249P1343Q8368L4394K89928K08712K26529K76420L70303K95299
5909A2007343J67555N8275P630k38181l36343l81221n15569m74182l53825k07869
5899I733613l39539k91626k00361r3790k04995j64418j97773j49389q9592j66652
$$ plain form
5967 26266034 26350100 26293367 26030963 25471447 24726730 23849193 22666444 21366563 20337599
5958 20337599 19387114 18356950 17547417 16906971 16262334 15836539 15301415 14910967 14682321
5949 14682321 14388504 14268437 13985367 13929850 13907440 13826998 13849241 14056162 14236367 14537560
5939 14537560 14818227 14960414 15209018 15424993 15456626 15086789 14542336 13810455 13026726 12517445
5929 12517445 12030761 11723967 11397676 10952326 10719423 10488107 10341031 10205043 10148847 10174296
5919 10174296 10146047 10217390 10305758 10340152 10630080 10838792 11065321 11341741 11712044 12007343
5909 12007343 12174898 12233173 12240803 12002622 11666279 11285058 10769489 10295307 9941482 9733613
5899 9733613 9394074 9102448 8902087 8808297 8603302 8438884 8241111 8091722 8002130 7835478
5889G835478J1326J58671p6168J8051R8248O3963J02304R6949O8298K1595n6244
5878H342471k24604j36794l607j27802q5714q1003j10116j06699K6211k6973j01558
5867G363812j88424j47854j77058k80485j28259j70238j91056o4318o6144r2149
5857E857827l0256p0473j32241j33787m9882L443j34594j17366q2259j62443j16177
5846D831792j02267k21319j79434m3795p3776j00323p8651Q137k1382n2210j42301
5835C824471o1612L376M22j16372q9097j9387n7840q524p684j21984k7503q8891
5823C229375N3937M3286k7514n4798R1672j5097n4536l4353j02227j6039K5901
5812C139607L0338L8603j02716j06878k3599J4215r7077j253M5059l2368o5159
$$ plain form
5889 7835478 7846804 8005475 7929307 7947358 8045606 8109569 8211873 8308822 8377120 8398715 8342471
5878 8342471 8117867 7981073 7977466 7849664 7763950 7682947 7572831 7466132 7492343 7465370 7363812
5867 7363812 7175388 7027534 6850476 6569991 6441732 6271494 6080438 6016120 5949976 5857827
5857 5857827 5827571 5757098 5624857 5491070 5441188 5444631 5310037 5192671 5110412 4947969 4831792
5846 4831792 4729525 4508206 4328772 4284977 4211201 4110878 4032227 4040364 4018982 3966772 3824471
5835 3824471 3762859 3766235 3766657 3650285 3561188 3541801 3483961 3475437 3467753 3345769 3318266 3229375
5823 3229375 3283312 3326598 3299084 3244286 3335958 3320861 3266325 3231972 3129745 3113706 3139607
5812 3139607 3169945 3208548 3105832 2998954 2975355 2989570 2892493 2891240 2936299 2903931 2838772
5801B838772m3019q4623l0848K9993r6408p2898J71k6046J9692k6427k271m0155
5789B465933m9274Q8690q1694J5563K2971L713n0332k637o721m6435j9126J9087
5777B359738n7997N311P8892J6000k4608R1291O1737o705j36256q015J71903o3781
5765B487510m3480j9544O448n485l4600R4977M3705q9540r370j2377o7150P1203
5753B422297R2745M29j5683Q1804o0482J13112N7952M7853L518l9331P2681o7944
5741B708951j20687P6599M6883j7207n7019J3097j3143J29320J8172L3870J3558
5730B832394M28n822R5416L5906R2982J70707O9724J44497o6112P8791L1553P8031
5718C558495J43788Q5417Q3950P3696J66613R4061Q5371J28974J96564J53663
$$ plain form
5801 2838772 2795753 2711130 2680282 2710275 2613867 2540969 2541140 2515094 2534786 2508359 2506088 2465933
5789 2465933 2416659 2505349 2423655 2439218 2462189 2465902 2415570 2412933 2406212 2359777 2340651 2359738
5777 2359738 2301741 2307052 2385944 2401944 2377336 2468627 2530364 2523659 2387403 2379388 2551291 2487510
5765 2487510 2444030 2424486 2430934 2425449 2390849 2485826 2529531 2439991 2430621 2418244 2351094 2422297
5753 2422297 2515042 2515471 2499788 2581592 2521110 2634222 2692174 2740027 2743545 2704214 2776895 2708951
5741 2708951 2588264 2664863 2711746 2694539 2637520 2650617 2637474 2766794 2784966 2818836 2832394
5730 2832394 2832822 2827000 2922416 2958322 3051304 3222011 3291735 3436232 3370120 3448911 3480464 3558495
5718 3558495 3702283 3787700 3871650 3945346 4111959 4206020 4291391 4420365 4616929 4770592
5708D770592J38821J50706J14352n669k9118j6010p4149r97n3994m2010J08634
5697E061158J68489J8694M7862O7285P9715N9457J08627J21332J71736K30986
5687F135341K08718K60073K38190J99413L00033K90959L38000J63223K06490J10496
5677H450936J76600L26784J58951J36936j11105k51834o7919j32913o6103L2773
5667H653106r328j0956L5266R3067J67487J86802J77717K04684J55135K75919
5657I928899N68653N73219O29580P36064O70892N78764O66284N65822M63390K44797
5647A5626364R0321J70500J40588L66404M49635M31545L73144N63265O67032P36819
5637A9615617P80356J144002J244614J336159J533193J509183J739422J905442
$$ plain form
5708 4770592 4909413 5060119 5174471 5168802 5139684 5123674 5049525 5048528 4994534 4952524 5061158
5697 5061158 5229647 5248341 5296203 5363488 5443203 5502660 5611287 5732619 5904355 6135341
5687 6135341 6344059 6604132 6842322 7041735 7341768 7632727 7970727 8133950 8340440 8450936
5677 8450936 8627536 8954320 9113271 9250207 9139102 8887268 8819349 8686436 8620333 8653106
5667 8653106 8643778 8632822 8668088 8761155 8928642 9115444 9293161 9497845 9652980 9928899
5657 9928899 10497552 11070771 11700351 12436415 13107307 13686071 14352355 14918177 15381567 15626364
5647 15626364 15716685 15887185 16027773 16394177 16843812 17275357 17648501 18211766 18878798 19615617
5637 19615617 20395973 21539975 22784589 24120748 25653941 27163124 28902546 30807988
5629C0807988J942864K141644K267239K397611K724614L115860L745606M194210
5621E3337636M807437N224772N919349O358695O668181O962364P417646P845810
5613A04541890P907906P895576P687220P023743O303927N143158L748809K136050
5605A52388279K05754j774773l238093m000037n005684n824293o296463o713059
5597A19741631o918229o683648o552650o086711n461713n234796m780371m212545
5589G3810968l762866l548337l246629k966923k970392k850211k603937k584562
5581D9277111k373251k096855j812364j700449j557694j431711j412498j382245
5573C5510044j447254j500970j537849j418324j402918j220403j240562j007905
$$ plain form
5629 30807988 32750852 34892496 37159735 39557346 42281960 45397820 49143426 53337636
5621 53337636 58145073 63369845 69289194 75647889 82316070 89278434 96696080 104541890
5613 104541890 112449796 120345372 128032592 135056335 141360262 146503420 150252229 152388279
5605 152388279 152594033 150819260 147581167 143581130 138575446 132751153 126454690 119741631
5597 119741631 112823402 106139754 99587104 93500393 88038680 82803884 78023513 73810968
5589 73810968 70048102 66499765 63253136 60286213 57315821 54465610 51861673 49277111
5581 49277111 46903860 44807005 42994641 41294192 39736498 38304787 36892289 35510044
5573 35510044 34062790 32561820 31023971 29605647 28202729 26982326 25741764 24733859
5565B4733859j119851q81625r30864q00377p39156o71549p75833p03955n64384
5556A7546265n47697m30604m90055m79613m72739m07228l28204m66881m87554
5547A3435690l91163l73370k84435k99868k30678l22196k99328k64348k15647
5538A0754657k32120j65653k63229k22862l20548l23555j12056j31407j65993
5529H817234k26121j37634j67567k13528j08369j70312k85227j86812r5717p4847
5519G151100r6106j11012j68197j00234j61799q7504k2680j10774j87820o4947
5509F040027K9189o4684l1967N885j3704K5567n9835j3948m4972j03786J4884
5498E782656j43057k01523j22691j05911j74702k5638k4948j5500o9507j50495
$$ plain form
5565 24733859 23614008 22732383 21801519 21001142 20261986 19590437 18814604 18110649 17546265
5556 17546265 16998568 16567964 16077909 15598296 15125557 14718329 14390125 13923244 13435690
5547 13435690 13044527 12671157 12386722 12086854 11856176 11533980 11234652 10970304 10754657
5538 10754657 10522537 10356884 10093655 9870793 9550245 9226690 9114634 8983227 8817234
5529 8817234 8591113 8453479 8285912 8072384 7964015 7793703 7508476 7321664 7225947 7151100
5519 7151100 7054994 6943982 6775785 6675551 6513752 6426248 6403568 6292794 6104974 6040027
5509 6040027 6069216 6004532 5972565 5978450 5964746 5990313 5930478 5916530 5871558 5767772 5782656
5498 5782656 5639599 5438076 5315385 5209474 5034772 5009134 4984186 4968686 4899179 4748684
5488D748684n2578L2210L9821J4415j7331n9378K5732J61772L6377J28988K23999
5477E282711K08772N7290J3310J22307K0757j11564k68815k19209k20329k40912
5467D644318n7587p7472j18411j89642q7578J5509j765o3823J84871K9759k9035
5456D249144q5843l0405Q2943J44014K12088J77575K51254K63121K02724K20394
5446E687009J60043k00600k87561k20128j94766l22108k18670j28104j16488j13574
5436D045053j03300j0423k7572q0670K187j07146K1943J3023L6333N8764J04378
5425C952570J37030R2268J02836K39938J63180N3390O9768L6982j43628k60216
5415D444118j86113k68138j56673r1944j36726j92783o3962j43225n3451m2698
$$ plain form
5488 4748684 4696106 4728316 4768137 4782552 4765221 4705843 4731575 4893347 4929724 5058712 5282711
5477 5282711 5491483 5548773 5562083 5684390 5705147 5593583 5324768 5105559 4885230 4644318
5467 4644318 4586731 4509259 4390848 4201206 4113628 4129137 4127372 4063549 4248420 4278179 4249144
5456 4249144 4163301 4132896 4215839 4359853 4571941 4749516 5000770 5263891 5466615 5687009
5446 5687009 5847052 5646452 5358891 5138763 4943997 4621889 4403219 4275115 4158627 4045053
5436 4045053 3941753 3931330 3903758 3823088 3825275 3718129 3740072 3753095 3789428 3848192 3952570
5425 3952570 4089600 4181868 4284704 4524642 4687822 4741212 4810980 4847962 4704334 4444118
5415 4444118 4258005 3989867 3833194 3741250 3604524 3411741 3347779 3204554 3151103 3108405
5405C108405n449q3746n0668r595N4101o3727l9143M8787O2724Q3904j22620P067
5393B990040P897O8805O196m9415o1788o6885j08853k22227j52616q553p1151
5382B331450j40296P7997l8801j28538m9344m5729K6774j0581l201N2425j35493
5371A936663p4059n9996K7881M8356p8639O7942j42522l7336P547O3665M2194
5360A801696q4673p7671p6999r625n6908j8836o8743q0896k7187K5997Q1484q5941
5348A321698p3565l2436K6539j5145R2206o3253r8762J48494M6220j21761O9705
5337A299940r9906K8452P0127q0094N947Q262n5620N3984J1456o51q38j6800j7194
5324A207065M0186M0413p4028o9904Q0943L6035K3560K3420L0092O9574o4348
$$ plain form
5405 3108405 3102956 3019210 2968542 2958947 3013048 2949321 2910178 2958965 3021689 3105593 2982973 2990040
5393 2990040 2997937 3066742 3072938 3023523 2961735 2894850 2785997 2563770 2411154 2402601 2331450
5382 2331450 2191154 2269151 2230350 2101812 2052468 2006739 2033513 2022932 2019731 2072156 1936663
5371 1936663 1862604 1802608 1830489 1878845 1800206 1868148 1725626 1688290 1695837 1759502 1801696
5360 1801696 1717023 1639352 1562353 1552728 1495820 1476984 1408241 1327345 1300158 1326155 1407639 1321698
5348 1321698 1248133 1215697 1242236 1227091 1319297 1256044 1157282 1305776 1351996 1230235 1299940
5337 1299940 1200034 1228486 1298613 1218519 1224466 1232728 1177108 1231092 1242548 1241897 1241059 1224259 1207065
5324 1207065 1247251 1287664 1213636 1143732 1224675 1260710 1284270 1307690 1337782 1407356 1343008
5313A343008M6204R394L500k5581l2472J7395P4352J01113J20857q5612J16087
5302A688245n6943j0063m905J46663p1973j0538n0906j21346K838j52800O0153
5291A418425J29776o1467r3421J2807Q752k1287j9738l1421l9252P7186m0391
5280A339969m4289L0765N5467J663p7354J9523k1097l2342m7115P8322J13836
5269A417348K5532l9420j30209K5623J40469o5346k2928N1973m3093M2704O792
5258A409445M2795j1894r6985o526j8326O8716Q1875K8411O340Q2252K06074j33476
5246A658701K4922o4145L0445J4584k7633Q2936O4263M941J26092Q0074J42468
5235B137648J84705n3739J715J14305K376o4220q7961k2978M6470j79092j27782
$$ plain form
5313 1343008 1389212 1398606 1402106 1376525 1344053 1361448 1435800 1536913 1657770 1572158 1688245
5302 1688245 1631302 1621239 1616334 1762997 1691024 1680486 1629580 1508234 1511072 1358272 1418425
5291 1418425 1548201 1486734 1393313 1406120 1414872 1393585 1373847 1342426 1303174 1380360 1339969
5280 1339969 1295680 1326445 1381912 1383575 1306221 1325744 1304647 1272305 1225190 1303512 1417348
5269 1417348 1442880 1403460 1273251 1298874 1439343 1373997 1351069 1403042 1359949 1402653 1409445
5258 1409445 1452240 1440346 1343361 1336835 1318509 1387225 1469100 1497511 1503851 1586103 1792177 1658701
5246 1658701 1683623 1619478 1649923 1664507 1636874 1719810 1784073 1789014 1915106 1995180 2137648
5235 2137648 2322353 2268614 2270329 2384634 2387010 2322790 2234829 2211851 2258321 2079229 1951447
5224A951447m4392p8260j540J9039N522k9511K1841L2555q1144Q3911r157K5658
5212A895969R893q1932j1755k9407n5303Q8625Q2093M6453k1682q1450R751k4523
5200A826732P0373n6269m0674o9442j2186k270M3936k0862m0161L9831M2839N5995
5188A837842n8320N5286J30850K0815p6280O1748O7559L6147q0654p4843K3496
5177A943646M8327k8524M5878K3640n1391O8971P4486O8061Q127m2415R6626j5713
5165B239719K9774O326p690m8190L0050J2994J6552o9987k9457r4691Q5304O8653
5153B239357k2346Q0838l1750J7094P4234K3668J7540L4017J50773J88946J04321
5142B876692O1461Q8707J18287Q3824J69614J97076J02552L3435l0914j35521
$$ plain form
5224 1951447 1907055 1828795 1827255 1846294 1851816 1822305 1844146 1876701 1795557 1879468 1870311 1895969
5212 1895969 1905862 1823930 1812175 1782768 1727465 1816090 1898183 1944636 1922954 1841504 1851255 1826732
5200 1826732 1897105 1840836 1800162 1730720 1718534 1716264 1760200 1739338 1699177 1739008 1781847 1837842
5188 1837842 1779522 1834808 1965658 1986473 1910193 1971941 2039500 2075647 1994993 1920150 1943646
5177 1943646 1991973 1963449 2009327 2032967 1981576 2050547 2125033 2193094 2201221 2158806 2255432 2239719
5165 2239719 2269493 2275819 2268129 2219939 2249989 2262983 2279535 2209548 2180091 2085400 2170704 2239357
5153 2239357 2217011 2297849 2266099 2283193 2357427 2381095 2398635 2432652 2583425 2772371 2876692
5142 2876692 2938153 3026860 3145147 3228971 3398585 3595661 3698213 3731648 3700734 3565213
5132C565213J09724J75549J23068J07819J35759J23159J84163K51986K49136K25524
5122E251100K90260J75637J02663J42632Q3159J52604P9763n1497J45679k2832
5112F349168n2493M7205M6488K5690l2977J16083J11241J1861J61513J53907l473
5101F934213j1679K02789o427R0403m6659K681k726J08195k9619k5148J7177j6312
5089G216888J32766R503L8687K0673J29216r5719q4126n5884j4207P6442R3438
5078G467677J16954J24843J67811J190J00376O6061l8039N184j23089j18948q0169
5067G689851j45809j68633j84337j66899k62015j64131p9804k40319j55270k11164
5057E911470n7126k5223n4513j06725k9314k7729M361m205L4463q259m826o9632
$$ plain form
5132 3565213 3674937 3850486 3973554 4081373 4217132 4340291 4524454 4776440 5025576 5251100
5122 5251100 5541360 5716997 5819660 5962292 6045451 6198055 6277818 6226321 6372000 6349168
5112 6349168 6296675 6343880 6390368 6416058 6383081 6499164 6610405 6622266 6783779 6937686 6934213
5101 6934213 6922534 7125323 7118896 7209299 7162640 7165321 7162595 7270790 7241171 7216023 7233200 7216888
5089 7216888 7349654 7359157 7397844 7418517 7547733 7452014 7367888 7312004 7297797 7374239 7467677
5078 7467677 7584631 7709474 7877285 7878475 7978851 8044912 8006873 8012057 7888968 7770020 7689851
5067 7689851 7544042 7375409 7191072 7024173 6762158 6598027 6518223 6277904 6122634 5911470
5057 5911470 5854344 5829121 5774608 5667883 5638569 5610840 5615201 5610996 5645459 5637200 5632374 5562742
5045E562742L9661l4451k5314k5289J37157K3488J87738J24958k2525J18218J01594
5034F187977J41494L5839R8051J13020R4696J55812K44171J64225J82384K45135
5024G662804K05101J98494K82792J77207K78784K16962J45054K50816M17036L60161
5014A0195211L13888L10172L92172M35403M12660M63729M06460N20723N78061
5005A4028479N40666O57740P71162Q34675R14992R44593R30410J075587J035694
4996B1733998J044162J042738J253719J400113J594986J669170J774036J935557
4988C3448479K030755K217170K479632K662468K692326K771751K825297K802687
4980E3930565K693487K394434K007502J579875J216015R28677M18886K79258K38404
$$ plain form
5045 5562742 5602403 5567952 5542638 5517349 5654506 5677994 5865732 5990690 5968165 6086383 6187977
5034 6187977 6329471 6365310 6463361 6576381 6671077 6826889 7071060 7235285 7417669 7662804
5024 7662804 7867905 8066399 8349191 8526398 8805182 9022144 9167198 9418014 9835050 10195211
5014 10195211 10509099 10819271 11211443 11646846 12059506 12523235 12929695 13450418 14028479
5005 14028479 14569145 15226885 15998047 16832722 17747714 18692307 19622717 20698304 21733998
4996 21733998 22778160 23820898 25074617 26474730 28069716 29738886 31512922 33448479
4988 33448479 35479234 37696404 40176036 42838504 45530830 48302581 51127878 53930565
4980 53930565 56624052 59018486 61025988 62605863 63821878 64750555 65169441 65448699 65687103
4971F5687103J73645K73050L45387M69468O12437Q71007J115238J357702J622825
4962G2527862J899958K446251K659631L072762L464040L789610M214686M524348
4954I8599148M962410N228103N428528N607110N764106N584328N139347M682302
4946A40995382L848963K772254J656506P96581j29991m41001m09051l83179j43780
4937A48562684N7649L53813O08563Q09398R80741J179924J126080J198248J278662
4928A56155762J073801R99704J076297J009811J089029J503215J809465K154077
4920A66871161K538372K858342K910445K701810K130982J389284P1347j379751
4912A80091992k829817m122762n102000n634028n803340n692929n040237m444609
$$ plain form
4971 65687103 65860748 66133798 66479185 66948653 67561090 68432097 69547335 70905037 72527862
4962 72527862 74427820 76874071 79533702 82606464 86070504 89860114 94074800 98599148
4954 98599148 103561558 108789661 114218189 119825299 125589405 131173733 136313080 140995382
4946 140995382 144844345 147616599 149273105 150069686 149939695 149498694 149089643 148706464 148562684
4937 148562684 148620333 148974146 149582709 150392107 151372848 152552772 153678852 154877100 156155762
4928 156155762 157229563 158229267 159305564 160315375 161404404 162907619 164717084 166871161
4920 166871161 169409533 172267875 175178320 177880130 180011112 181400396 181471743 180091992
4912 180091992 177262175 173139413 168037413 162403385 156600045 150907116 145866879 141422270
4904A41422270l471573k508120j733820j168095q34713p10984q19233j315488
4896A28860244k184926l201381m403334m933800n086102n183497m832652m508450
4888I4526102m195064l774211l323391k969033k668165k295188j994658j831415
4880G1474977j594244j354487j165345j141409r18113j099578j082966j266156
4872F1852679j405649j583562j572909j414680j484251j375326j258215j079125
4864E0678962j042458p49595p61042p28278p43728p93308q90259r08121j022333
4855D3039840j010235r06358r90735r83074r42746q95037r34578q65254p98855
4846C4712968p04641o95468o47837n84655o55937o78520n47626o55095m61281
$$ plain form
4904 141422270 137950697 135442577 133708757 132540662 131705949 130994965 130175732 128860244
4896 128860244 126675318 123473937 119070603 114136803 109050701 103867204 99034552 94526102
4888 94526102 90331038 86556827 83233436 80264403 77596238 75301050 73306392 71474977
4880 71474977 69880733 68526246 67360901 66219492 65301379 64201801 63118835 61852679
4872 61852679 60447030 58863468 57290559 55875879 54391628 53016302 51758087 50678962
4864 50678962 49636504 48886909 48125867 47397589 46653861 45860553 44970294 44062173 43039840
4855 43039840 42029605 41123247 40132512 39149438 38206692 37311655 36377077 35511823 34712968
4846 34712968 34008327 33312859 32665022 32080367 31424430 30745910 30198284 29543189 29081908
4837B9081908n00689n25574m62609n76003n56568m85242n84172n76034m11320
4828B4403697l99371m52056n26355m67596l15075l26723l34282l27492l37153
4819B0917594k20855k30264l08248j91759q4174k36419k72077r0408l6532j48026
4809A9098832j62685k04893j35123M2034j3943j87599k7326r3891n3988Q3391
4799A8344809r133O2579Q7042J6118J29733R7586J10626Q7798L7540N0688K15647
4788A9231033Q0238P2103K54278J6671q490J12599K17500J72020N3341L9534J04655
4777B0345482J18864P2547J08595J4746J31379J07418O1667R1473P3962K814P2960
4766B1201907J5175J04935P566J9131Q5001L3001o4357n4580j17844O3299M6563
$$ plain form
4837 29081908 28581219 28055645 27593036 27017033 26460465 25975223 25391051 24815017 24403697
4828 24403697 24004326 23552270 23025915 22558319 22243244 21916521 21582239 21254747 20917594
4819 20917594 20696739 20466475 20158227 19966468 19882294 19645875 19373798 19283390 19246858 19098832
4809 19098832 18936147 18731254 18596131 18638165 18624222 18436623 18409297 18315406 18261418 18344809
4799 18344809 18335676 18398255 18485297 18501415 18631148 18728734 18839360 18927158 18964698 19015386 19231033
4788 19231033 19311271 19383374 19637652 19654323 19645833 19758432 19975932 20147952 20201293 20240827 20345482
4777 20345482 20464346 20536893 20645488 20660234 20791613 20899031 20960698 21052171 21126133 21128947 21201907
4766 21201907 21217082 21322017 21329583 21348714 21433715 21466716 21402359 21347779 21229935 21293234 21339797
4755B1339797J4681L9987J0513L7112n0635k9117L2990P5914r765j13177o1587
4744B1286713J01196L7038o8255k28476j04456j35438j17063q8562q3464j23526
4734B0475707q1716j54136j18956l2747j71757j1828N3766k01788L6130j5316
4724A9777359o2597q8900p5840p0801J23296q3574n383M3929j7121M0548j1053
4713A9569863L8828Q4658J89499P8042K46874K16331J39379J41742K68393K52727
4703B1226336J88265K70877J33512K86556J15022K00205K12288J57639J96778
4694B2987478K50299L54547L56917L76072L98057M78742M07139M31178N53715
4685B6594144N68711N87964O14871N49942P58658P35506P96826R20983R83424
$$ plain form
4755 21339797 21354478 21394465 21404978 21442090 21391455 21362338 21395328 21471242 21461477 21348300 21286713
4744 21286713 21387909 21424947 21356692 21128216 21023760 20888322 20771259 20682697 20599233 20475707
4734 20475707 20393991 20239855 20120899 20088152 19916395 19904567 19958333 19756545 19792675 19777359
4724 19777359 19714762 19625862 19550022 19479221 19602517 19518943 19513560 19557489 19540368 19580916 19569863
4713 19569863 19608691 19693349 19882848 19960890 20207764 20424095 20563474 20705216 20973609 21226336
4703 21226336 21414601 21685478 21818990 22105546 22220568 22420773 22633061 22790700 22987478
4694 22987478 23237777 23592324 23949241 24325313 24723370 25202112 25609251 26040429 26594144
4685 26594144 27162855 27750819 28365690 28915632 29674290 30409796 31206622 32127605 33111029
4676C3111029J040166J129260J174124J278854J484660J747082J912876K188955
4668D5067006K584952K854631L237380L695356M194595M595841N261788N885929
4660G7377478O433811P261128Q153867R664729J1077503J3259415J5822281J8323552
4652A67373764K0379204K1342256K0584561J8829025J5825976J0491740K272507
4645B77099033o577734j2543492j5084123j5252813j4771562j4196313j3472036
4638A85200960j2329168j1166937j0313957r411737q683210p969548p120899o374061
4630A11831443n517618m617938m059145l636003l218825l168030k942225l223507
4622H1448152l801215l947518l805671l641377l258310k968772k697990k483498
$$ plain form
4676 33111029 34151195 35280455 36454579 37733433 39218093 40965175 42878051 45067006
4668 45067006 47651958 50506589 53743969 57439325 61633920 66229761 71491549 77377478
4660 77377478 83811289 91072417 99226284 108891013 119968516 133227931 149050212 167373764
4652 167373764 187752968 209095224 229679785 248508810 264334786 274826526 277099033
4645 277099033 270521299 257977807 242893684 227640871 212869309 198672996 185200960
4638 185200960 172871792 161704855 151390898 141979161 133295951 125326403 118205504 111831443
4630 111831443 106313825 101695887 97636742 94000739 90781914 87613884 84671659 81448152
4622 81448152 77646937 73699419 69893748 66252371 62994061 60025289 57327299 54843801
4614E4843801k168399k127606k009006j857029j831015j793859j712049j679986
4606C9664852j459599j334007j327372j216070j004640r42919r57965q22899p60767
4597B9838614p09009o80693n21581m92492n94724n60218n53174o12527n79466
4588B4534730n21994m02552m65412m49470l50640l51422l50109k94056m17351
4579B0931724m90344m60461l74039m30334k74169k71639k12089k86044k57487
4570A7875118j84417j81202r2206p2509j22435j09864M768M1579K0285Q9311L3087
4559A7301515O6541J87614O8567O5219M6124K57735L09862J45697J46441L31484
4549A8926799M57330O72575P43405Q02054Q64840Q35134Q66722P67235M98025
$$ plain form
4614 54843801 52675402 50547796 48538790 46681761 44850746 43056887 41344838 39664852
4606 39664852 38205253 36871246 35543874 34327804 33323164 32380245 31422280 30599381 29838614
4597 29838614 29129605 28448912 27927331 27434839 26840115 26279897 25726723 25114196 24534730
4588 24534730 24012736 23610184 23144772 22695302 22344662 21993240 21643131 21349075 20931724
4579 20931724 20441380 19980919 19606880 19176546 18902377 18630738 18418649 18132605 17875118
4570 17875118 17690701 17509499 17417293 17344784 17222349 17112485 17117253 17158832 17179117 17268428 17301515
4559 17301515 17368056 17555670 17624237 17689456 17735580 17993315 18303177 18448874 18595315 18926799
4549 18926799 19384129 20056704 20800109 21602163 22467003 23302137 24168859 24936094 25434119
4540B5434119N7931l8834j26829o7024N5496J28599J06006j00921j3198m1122
4530B5394223j85085q568Q5956J44338L98875N76013O85886O34464R34693P16540
4520B9377335M88285K47069k06958p75339j089042j101206j059342j109553r95214
4511B3776035q05547q01981o24843n26564n35315n77806n48311m01852l58200
4502A8595616j87078j34529k26175k25743j00961J23027P1355k4957n3240P9602
4492A7916917J21737J36950J816j52221k44034k62199l73543l31799k31872l21074
4482A6260678l59607l67006m11511k89643l67390k09881k76488l15109k33054
4473A3430989k71155k74239l53550k37009k65010j99475j53672j43473j46867
$$ plain form
4540 25434119 25492050 25453216 25326387 25259363 25314859 25443458 25549464 25448543 25435345 25394223
4530 25394223 25209138 25200570 25286526 25430864 25829739 26405752 27091638 27726102 28660795 29377335
4520 29377335 29865620 30112689 29905731 29130392 28041350 26940144 25880802 24771249 23776035
4511 23776035 22970488 22168507 21543664 21017100 20481785 19903979 19355668 18953816 18595616
4502 18595616 18408538 18274009 18047834 17822091 17721130 17844157 17915512 17890555 17837315 17916917
4492 17916917 18038654 18175604 18177420 18025199 17781165 17518966 17145423 16813624 16581752 16260678
4482 16260678 15901071 15534065 15122554 14832911 14465521 14255640 13979152 13664043 13430989
4473 13430989 13159834 12885595 12532045 12295036 12030026 11830551 11676879 11533406 11386539
4464A1386539r3185j58479j98818j57231j99603j1249j72510j06545j34138n5463
4454A0099318m6780j28210J9899k5285j3671p0583P1988J6189N272J76162N7895
4443A0162194J28085O0102j47644j19467r9702j35482j56359j43526j51262k44861
4433I152078k09594j00665q0612j09818j46278o0074m8453j16673j29116j12095
4423H038700j04213n9324j68206L5587o3188k26394r6972J0518q4958j86919j02542
4412F992089j06634j2509j02078p7458j1516m8590j5617j65416n8420l4258p3530
4401F286063m9018m8298l5385k5176j15899j12320L4905m3645l0008P0118l5212
4390E896125j2570R3484k8077k3012P5904J03499M5604J1698j1875K4457N8013
$$ plain form
4464 11386539 11293354 11134875 10936057 10778826 10579223 10567974 10395464 10288919 10154781 10099318
4454 10099318 10052538 9924328 9944227 9918942 9905271 9834688 9906676 9922865 9928137 10104299 10162194
4443 10162194 10290279 10350381 10202737 10083270 9983568 9848086 9691727 9548201 9396939 9152078
4433 9152078 8942484 8841819 8761207 8651389 8505111 8445037 8396584 8279911 8150795 8038700
4423 8038700 7934487 7875163 7706957 7742544 7679356 7452962 7355990 7366508 7281550 7094631 6992089
4412 6992089 6885455 6872946 6770868 6693410 6681894 6633304 6617687 6452271 6393851 6359593 6286063
4401 6286063 6237045 6188747 6153362 6128186 6012287 5899967 5934872 5891227 5861219 5931337 5896125
4390 5896125 5883555 5977039 5948962 5925950 6001854 6105353 6150957 6162655 6150780 6175237 6233250
4379F233250M3992k2638P8245j20512l9662M8580j73929l1251j0107P0410m7341
4368F029037p4557j48304r3868k4725j1368M4878l0921q673k8044q6831L0520
4357E597144P080M9589N9491l5756M0449J8518L762j0859P0227J77595N9825J23628
4345F160693l9840m2827J11700K2658m7659o2615k5862k488q5128j60518j80422
4334E647692j30254k5809N5859M3637n5632r7709J5918o6128r9359j9107O1635
4323E330743K3963j00823N1696O3961Q64o5855o1028L0637K3518n8934M8036P6233
4311E363011O8012n4874j31946q3677p0812J3211J3148M0677N066j0536J00827
4300E252107j93211O9595J38772N5481J05669n9235Q3110J22535l3856M1096j1107
$$ plain form
4379 6233250 6277242 6254604 6332849 6212337 6172675 6221255 6047326 6016075 6005968 6076378 6029037
4368 6029037 5954480 5806176 5712308 5687583 5676215 5721093 5690172 5681499 5653455 5566624 5597144
4357 5597144 5604224 5653813 5713304 5677548 5717997 5736515 5740277 5729418 5799645 5977240 6037065 6160693
4345 6160693 6120853 6078026 6189726 6212384 6164725 6102110 6076248 6073760 5988632 5828114 5647692
4334 5647692 5517438 5491629 5547488 5591125 5535493 5437784 5453702 5387574 5288215 5269108 5330743
4323 5330743 5354706 5253883 5305579 5369540 5370404 5304549 5243521 5274158 5297676 5238742 5286778 5363011
4311 5363011 5431023 5376149 5244203 5160526 5089714 5102925 5116073 5156750 5161816 5151280 5252107
4300 5252107 5058896 5128491 5267263 5322744 5428413 5369178 5452288 5574823 5540967 5582063 5570956
4289E570956J4284j57751r7173Q5103J54986j06431j43435J5481J12641R977P153
4278E465791L3839K8347p102m918M4617j6665J34637J44903M0545J892J02399
4267E968285Q8810k7092K3084J38265L5502M6287q00R4795L5893O861P386J57328
4255F574604J64628Q6650L4126R3487P7242J15950J75809L0437p234J79967J21052
4244G646718R9728J48398L7425J09288J81852K06598j3040J04707K53319K79911
4234I054904K53448J00453J13775J52134K22487K88664M35885L29357K17581L45226
4224A1513914K90191L60134N80264M91995O48445O17313N72845P08055P75243
4215A6558399Q22439P90737R47561R94093J112533J168382J309444J320748J439286
$$ plain form
4289 5570956 5585240 5427489 5330316 5415419 5570405 5463974 5320539 5336020 5448661 5458638 5465791
4278 5465791 5499630 5527977 5520875 5515957 5560574 5543909 5678546 5823449 5863994 5865886 5968285
4267 5968285 6057095 6030003 6053087 6191352 6226854 6273141 6272341 6367136 6403029 6409890 6417276 6574604
4255 6574604 6739232 6825882 6860008 6953495 7030737 7146687 7322496 7352933 7345699 7525666 7646718
4244 7646718 7746446 7894844 7932269 8041557 8223409 8430007 8416967 8521674 8774993 9054904
4234 9054904 9308352 9408805 9522580 9674714 9897201 10185865 10621750 10951107 11168688 11513914
4224 11513914 11804105 12164239 12744503 13236498 13884943 14502256 15075101 15783156 16558399
4215 16558399 17380838 18171575 19119136 20113229 21225762 22394144 23703588 25024336 26463622
4206B6463622J631851J607625J681460J755620J942535J953732K032971K120135
4198D1189551K174941K277363K362428K373774K555864K646702K608762K616956
4190F0806341K796954K734286K607471K706654K822966K541302K440649K517138
4182H1973761K395248K181312K109988J991396J917543K004579J809921J629530
4174I8013278J507134J243694J069496P86315N63650L75762O0963j49929l65945
4165A03104418n45095o00651q02637r29634r66211j242988j475386j559697j708422
4156I3273697j815005k072370k234530k364083k386926k300835k470500k460578
4148G5168870k433686k470343k426951k371834k503889k351592k458159k380860
$$ plain form
4206 26463622 28095473 29703098 31384558 33140178 35082713 37036445 39069416 41189551
4198 41189551 43364492 45641855 48004283 50378057 52933921 55580623 58189385 60806341
4190 60806341 63603295 66337581 68945052 71651706 74474672 77015974 79456623 81973761
4182 81973761 84369009 86550321 88660309 90651705 92569248 94573827 96383748 98013278
4174 98013278 99520412 100764106 101833602 102619917 103183567 103559329 103620292 103470363 103104418
4165 103104418 102559323 101958672 101156035 100226401 99260190 98017202 96541816 94982119 93273697
4156 93273697 91458692 89386322 87151792 84787709 82400783 80099948 77629448 75168870
4148 75168870 72735184 70264841 67837890 65466056 62962167 60610575 58152416 55771556
4140E5771556k372821k229239k234217k219370k077800j968634j997324j785455
4132C8886696j768060j645404j618769j623009j522197j404167j340779j415142
4124B6549169j294894j111380j047196j011472q48637r51037p85227p65998q01135
4115A7932193o67072n65121n95984m54169m46790o46752n47860k81201k55621
4106A3471623m19290m04070m60973l68753k36078j51791k22348k47966k66038
4097A0694316k39048j60574j88387j14920j04639p1120k06486k11829j41760o5884
4087I189669j00307p6192j27900j58238o8042q0366j39383j24186j40741r3116
4077H081198n6014j63886j9682k6083r1942j94547q4616o2757j35221m1822j88910
$$ plain form
4140 55771556 53398735 51169496 48935279 46715909 44638109 42669475 40672151 38886696
4132 38886696 37118636 35473232 33854463 32231454 30709257 29305090 27964311 26549169
4124 26549169 25254275 24142895 23095699 22084227 21235590 20284553 19499326 18733328 17932193
4115 17932193 17265121 16700000 16104016 15649847 15203057 14556305 14008445 13727244 13471623
4106 13471623 13052333 12648263 12187290 11818537 11582459 11430668 11208320 10960354 10694316
4097 10694316 10455268 10294694 10106307 9991387 9886748 9815628 9609142 9397313 9255553 9189669
4087 9189669 9089362 9013170 8885270 8727032 8658990 8578624 8439241 8315055 8174314 8081198
4077 8081198 8025184 7861298 7841616 7815533 7723591 7529044 7444428 7381671 7246450 7204628 7015718
4066G015718o3761P731j56360o9144j1635m8679j14963j45859N1222m0440m5113
4055F378717K2181J7012j10352o5475k5076k0277j942K5808j50867K6025j1594
4044F084160q5563m8703o4316J0191N454n1249m5736P9914P2052m6639p7725P1811
4032E903651j530M8931n51O5339J32888K6835m567O9693J23912O9514M4062J74185
4020F652362N1908j8932J13679J8415O486n770M1628O8299l408J7557p6227o37
4008F865360k7931N1109o4028p3545n9514r744l6639o9463j19089j24395L9559
3997F371680j58925r157N0582j80244j53618O3496j7425r2724j05645j14439J1588
3986E665169k6038L839n281k5985O6103j659m5506Q271J11828m677r6039J16960
$$ plain form
4066 7015718 6951957 6959688 6803328 6734184 6722549 6673870 6558907 6413048 6464270 6423830 6378717
4055 6378717 6400898 6417910 6307558 6242083 6217007 6196730 6194788 6220596 6069729 6095754 6084160
4044 6084160 5998597 5949894 5885578 5895769 5901223 5849974 5804238 5884152 5956204 5909565 5831840 5903651
4032 5903651 5902121 5951052 5950501 6015840 6148728 6175563 6170996 6240689 6364601 6434115 6478177 6652362
4020 6652362 6704270 6685338 6799017 6817432 6823918 6818148 6859776 6928075 6924667 6942224 6865997 6865360
4008 6865360 6837429 6888538 6824510 6750965 6691451 6681707 6645068 6575605 6456516 6332121 6371680
3997 6371680 6212755 6203598 6254180 6073936 5920318 5983814 5966389 5873665 5768020 5653581 5665169
3986 5665169 5639131 5642970 5637689 5611704 5677807 5676148 5630642 5638913 5750741 5746064 5650025 5766985
3974E766985J104p5870j7848J1311o2652P5947J41709k3035l9700j0775O5261
3963E832437R3950k97n7720J07330p631q7566k4020K4828Q7586R0398K5228J25839
3951F210362m2170R0280J53630K8502Q8066J37660M4888R8958K36335R1052J93602
3940G331165J72198J47193J80118J82015L6873J15808R5705O3399P6235O8869
3930H469578Q5547P3456J43815J14081J02171Q2504J02400N3486L7594Q3870N2026
3919I400528M0439m9028M0408l1220m9807K37K2351R353K0168j10461J0088J11312
3907I414368L0313L5320R924J1814Q0059J13455N8371R9921M3144N863J08370
3896A0010922K10428J01749J6257J66511J70794J27040K71251J95373K95345L22993
$$ plain form
3974 5766985 5768089 5692219 5674371 5685682 5623030 5698977 5840686 5817651 5777951 5767176 5832437
3963 5832437 5926387 5926090 5868370 5975700 5968069 5880503 5856483 5881311 5968897 6059295 6084523 6210362
3951 6210362 6168192 6258472 6412102 6440604 6528670 6666330 6711218 6810176 7046511 7137563 7331165
3940 7331165 7503363 7650556 7830674 8012689 8049562 8165370 8261075 8324474 8400709 8469578
3930 8469578 8555125 8628581 8772396 8886477 8988648 9071152 9173552 9227038 9264632 9348502 9400528
3919 9400528 9440967 9391939 9432347 9401127 9351320 9351557 9373908 9383261 9403429 9292968 9303056 9414368
3907 9414368 9444681 9480001 9489925 9501739 9581798 9695253 9753624 9853545 9896689 9902552 10010922
3896 10010922 10221350 10323099 10339356 10505867 10676661 10803701 11074952 11270325 11565670 11888663
3886A1888663L27854K42337L31499L74774L72627L31361M65836N07693O33572
3877A5476216N68914P36712O73844P92847P95236Q73807J010064J039153J222986
3868B3189779J237165J075236J173178J256083J130198J183462J085151J084813
3860C2415065J032291J072458R52753R71435R94011Q62546P22681Q11975O45015
3851D0480230O19732M33108K36456K36893J39247J7230k28391k58685l51132l52373
3841D0972315k48628k26051k72947m59181k98835l15962l39003k47829k22291
3832C8341588k19274j99549l8221K6103J34401L85056L82267N74018P74951J014019
3822D1175359J208026J442277J706259J924056K030923K337714K529196K926338
$$ plain form
3886 11888663 12216517 12458854 12790353 13165127 13537754 13869115 14334951 14842644 15476216
3877 15476216 16045130 16781842 17455686 18248533 19043769 19917576 20927640 21966793 23189779
3868 23189779 24426944 25502180 26675358 27931441 29061639 30245101 31330252 32415065
3860 32415065 33447356 34519814 35472567 36444002 37438013 38300559 39023240 39835215 40480230
3851 40480230 41099962 41533070 41769526 42006419 42145666 42162896 41934505 41675820 41324688 40972315
3841 40972315 40723687 40497636 40224689 39765508 39466673 39150711 38811708 38563879 38341588
3832 38341588 38122314 37922765 37884544 37910647 38045048 38430104 38812371 39386389 40161340 41175359
3822 41175359 42383385 43825662 45531921 47455977 49486900 51824614 54353810 57280148
3814E7280148L126036L296409L433963L543604L589565L648476L362239L493551
3806H4773991L608598L451703L404421L243494L357066L388438L315465K975089
3798A11518265K836607K601241K359202J914401J599432J207284P52147O06734
3790A25395313M45545L22229J00825J21094N457j6913K807p3501K50047K01073
3780A26753976J65761K29705N11448O81810Q03934R34781R94899J144138J316172
3771A33536624J412276J402866J591851J602763J659500J860751J942573K081650
3763A47090854K151426K268480K470385K382572K474419K561926K354683K312167
3755A66066912K227072K323914K273865K373135K494975K898168L246589L648004
$$ plain form
3814 57280148 60406184 63702593 67136556 70680160 74269725 77918201 81280440 84773991
3806 84773991 88382589 91834292 95238713 98482207 101839273 105227711 108543176 111518265
3798 111518265 114354872 116956113 119315315 121229716 122829148 124036432 124788579 125395313
3790 125395313 125840858 126163087 126263912 126385006 126390463 126373550 126376357 126302856 126552903 126753976
3780 126753976 126919737 127149442 127660890 128342700 129146634 130081415 131076314 132220452 133536624
3771 133536624 134948900 136351766 137943617 139546380 141205880 143066631 145009204 147090854
3763 147090854 149242280 151510760 153981145 156363717 158838136 161400062 163754745 166066912
3755 166066912 168293984 170617898 172891763 175264898 177759873 180658041 183904630 187552634
3747A87552634M298203N126423N898093P021320Q099650R061838J0242003J1157271
3739B48457435J1570899J1683375J1317467J0592251R274134P590189N851992
3732C16337742L919074K447487J161195P4292l19133m81473n15664n37897o96055
3723C21389568j183523j978464l169205m785840o652345q462504j0235474j1547704
3715B73374509j2662172j3369259j3367121j2909995j2273936j1479446j0360607
3708A86951973r544801q838189q086833p364166o676794o223513n798470n399067
3700A29020140n186838m995054m799912m342203m096559m046585l886608l672833
3692I3993548l570239l308933l105741k938467k860925k735980k699186k712557
$$ plain form
3747 187552634 191850837 196977260 202875353 209896673 217996323 227058161 237300164 248457435
3739 248457435 260028334 271711709 283029176 293621427 302895561 310485750 316337742
3732 316337742 320256816 322704303 323865498 323939790 323620657 323139184 322623520 322085623 321389568
3723 321389568 320206045 318227581 315058376 310272536 303620191 295157687 284922213 273374509
3715 273374509 260712337 247343078 233975957 221065962 208792026 197312580 186951973
3708 186951973 177407172 168568983 160482150 153117984 146441190 140217677 134419207 129020140
3700 129020140 123833302 118838248 114038336 109696133 105599574 101552989 97666381 93993548
3692 93993548 90423309 87114376 84008635 81070168 78209243 75473263 72774077 70061520
3684G0061520k579105k355629k429523k341586k243074k246764k033237j937611
3676E1894991j887939j713778j717021j490839j507734j362772j313251j217051
3668C9684606j221630j099713r52506j005744r64499q25226r52655q07692o89319
3659C1165622q37078p28820o04927p00709o42313n56555n65996o15989n73459
3650B5339776n99383n34852m11671m62609l75129n27121m45451l97969n20153
3641B1065438m64164k65193l03457l15136l78977k53216m18350k62600l62601
3632A8041744j59555l10205l77676j29297k12524k05855k53513j70801l16874
3623A5905444k85284j58787r1820j55991k32978k28458k09831k34194r9521j73813
$$ plain form
3684 70061520 67482415 65126786 62697263 60355677 58112603 55865839 53832602 51894991
3676 51894991 50007052 48293274 46576253 45085414 43577680 42214908 40901657 39684606
3668 39684606 38462976 37363263 36410757 35405013 34440514 33615288 32662633 31854941 31165622
3659 31165622 30328544 29599724 28994797 28294088 27651775 27095220 26529224 25913235 25339776
3650 25339776 24740393 24205541 23793870 23331261 22956132 22429011 21983560 21585591 21065438
3641 21065438 20601274 20336081 20032624 19717488 19338511 19085295 18666945 18404345 18041744
3632 18041744 17882189 17571984 17194308 17065011 16852487 16646632 16393119 16222318 15905444
3623 15905444 15620160 15461373 15369553 15213562 14980584 14752126 14542295 14308101 14208580 14034767
3613A4034767k30694j63557j26773q0697k54956j26780j26643j77678j17550j84177
3603A2445262j92684l7380p4213j65713j60941k74272q0040o7653o9276r3302
3593A1229788j07815q4182l08502k02771J0483k1018k8767m0367k18957r0952
3583A0136940P8815p0266k07176k30011j7063j64919j14639o8342m7287q3429
3573I212623r4972m9370L417q6901l5290q8523p4911l3111m800R228j21863n3073
3561H582454O9655N9077j29518n9227j39573l1693l8176m8482n5623n9060o9305
3550H080529o0138r6016P8403L6895k5722N2117p6087J5257J31878o9960m9737
3539H017419m079L1007j7390R2342L5172o9569O5661p3392n0756m7181j59661
$$ plain form
3613 14034767 13804073 13640516 13513743 13433046 13178090 13051310 12924667 12746989 12629439 12445262
3603 12445262 12252578 12215198 12140985 11975272 11814331 11540059 11460019 11392366 11323090 11229788
3593 11229788 11121973 11037791 10729289 10526518 10537001 10515983 10487216 10446849 10227892 10136940
3583 10136940 10215755 10145489 9938313 9708302 9691239 9526320 9411681 9343339 9296052 9212623
3573 9212623 9117651 9068281 9071698 8984797 8949507 8860984 8786073 8752962 8748162 8757390 8635527 8582454
3561 8582454 8652109 8711186 8581668 8522441 8382868 8351175 8312999 8264517 8208894 8149834 8080529
3550 8080529 8020391 7924375 8002778 8039673 8013951 8066068 7989981 8005238 8137116 8067156 8017419
3539 8017419 8013340 8044347 8026957 8119299 8154471 8084902 8150563 8077171 8026415 7979234 7819573
3528G819573k1463M1578n6640p0864J5603j21032j4837m6929M4871J26406L3589
3517G749855M4268L7533P659J1561P3139R9188L5681L0654R5137J39974J87102
3506H511751K17641K26103J00251J53702K6609J12222N1315j26083j07827r8879
3496I066805N0291Q9643o9868P1401j8165l5557P0531Q3652N6283R3947K08256
3485I667219J33573M0079K25541K94094K22536K45461K26786K05200L47815K57486
3475A1865790L05355K96111P9103K44287L21811K24419M9959K15618K27065J56222
3465A3985740L56520L68668M60000M47566L50028N65820M76143L76578M25389
3456A7812452K24429M51321N04412O65120O37061Q07777Q00028P17205O79410
$$ plain form
3528 7819573 7798110 7839688 7783048 7712184 7727787 7606755 7591918 7544989 7589860 7716266 7749855
3517 7749855 7794123 7831656 7839315 7850876 7924015 8023203 8058884 8089538 8184675 8324649 8511751
3506 8511751 8729392 8955495 9055746 9209448 9236057 9348279 9399594 9273511 9165684 9066805
3496 9066805 9117096 9206739 9136871 9208272 9190107 9154550 9225081 9308733 9365016 9458963 9667219
3485 9667219 9800792 9840871 10066412 10360506 10583042 10828503 11055289 11260489 11608304 11865790
3475 11865790 12171145 12467256 12546359 12790646 13112457 13336876 13386835 13602453 13829518 13985740
3465 13985740 14342260 14710928 15170928 15618494 15968522 16534342 17010485 17387063 17812452
3456 17812452 18036881 18488202 18992614 19657734 20294795 21102572 21902600 22619805 23299215
3447B3299215M30407K55968J0466j25540o4507p0241k11503l70172n85569n11363
3437B2057161k94063r2171k7852R1699K59316K02248L67860N51285L36815N00522
3427B3952820N04313O68284Q98237J078042J080528J121957J248472J162581J025840
3418C2741074J054501J011513J454188K320699K885836L601291M489967N446294
3410E5005363N324781M081394L436766K816983J544891k055723n947334o271211
3402E7935910n504461m468390l456658k752240k359985j798370j507028j217963
3394C4870815q95975q65891m57734n2381Q7088M30400P99147J340803K116946
3385C7373218K877388M242995N048626M781282L918447M180784L451120J678919
$$ plain form
3447 23299215 23729622 23985590 23996056 23870516 23806009 23735768 23524265 23154093 22568524 22057161
3437 22057161 21763098 21670927 21643075 21734774 21994090 22196338 22564198 23115483 23452298 23952820
3427 23952820 24457133 25125417 26023654 27101696 28182224 29304181 30552653 31715234 32741074
3418 32741074 33795575 34807088 36261276 38581975 41467811 45069102 49559069 55005363
3410 55005363 60330144 64411538 67848304 70665287 72210178 70154455 64207121 57935910
3402 57935910 52431449 47963059 44506401 41754161 39394176 37595806 36088778 34870815
3394 34870815 33974840 33108949 32651215 32598834 32685922 33116322 33915469 35256272 37373218
3385 37373218 40250606 44493601 49542227 54323509 58241956 62422740 65873860 67552779
3377F7552779k538022o138793o240931n657846m592730l630069k970605k714954
3369C3068829k254962k036329j963271j896545j555140j372205j278186j101699
3361A9610492r80735q50919q40967o33117n45002n96762n77235m66084m55724
3352A3663947n06142l19397l69180k69074j95333k38268k74186k94373j87988
3343A1010006j29631k27928j86487j29287k88553j44035K8315q0413j19206j24980
3333I607801p8559J8775R490J5567j02534j9244J97M5799Q7254Q1865J79826J08624
3321I954861K1384J78562K57761K51041L81826L87595N47558M67211N38805P63409
3311A3750013P79182P24196R69638J250571J436442J889809K434743K966895L038171
$$ plain form
3377 67552779 65014757 58875964 52635033 46977187 42384457 38754388 35783783 33068829
3369 33068829 30813867 28777538 26814267 24917722 23362582 21990377 20712191 19610492
3361 19610492 18629757 17778838 16937871 16304754 15759752 15162990 14585755 14119671 13663947
3352 13663947 13157805 12838408 12469228 12200154 12004821 11766553 11492367 11197994 11010006
3343 11010006 10880375 10652447 10465960 10336673 10048120 9904085 9932400 9851987 9732781 9607801
3333 9607801 9529242 9548017 9557507 9573074 9470540 9451296 9451493 9497292 9584546 9666411 9846237 9954861
3321 9954861 9976245 10154807 10412568 10663609 11045435 11433030 11980588 12447799 12986604 13750013
3311 13750013 14529195 15253391 16223029 17473600 18910042 20799851 23234594 26201489 29239660
3302B9239660K974783K738063K419940J647564J1380j992828l048783k883252
3294C1106527k503216j909659j606192j173361r46145q86111m99125n00950l22946
3285B0758822j50954j95245N8174K45262M60088Q05176J215232J753906K236514
3276B7186975K659025K477268K389846K365630J918007R90895r54755k729251
3268C6303640l315700l021701k399421k143703j858185j573715j391651j156474
3260A9443090j087992j147759r91622q79756p07866p25356o90475m67265n12954
3251A2232045l89161l95445k24984l58871k74482j71968l24353k38451k8800j35154
3241I690376j73283j67011q3429j45688k38060j58328j53497j34932k00532k18362
$$ plain form
3302 29239660 32214443 34952506 37372446 39020010 39031390 37038562 33989779 31106527
3294 31106527 28603311 26693652 25087460 23914099 22967954 22081843 21582718 21081768 20758822
3285 20758822 20607868 20412623 20470797 20716059 21176147 21981323 23196555 24950461 27186975
3276 27186975 29846000 32323268 34713114 37078744 38996751 39987646 39032891 36303640
3268 36303640 32987940 29966239 27566818 25423115 23564930 21991215 20599564 19443090
3260 19443090 18355098 17207339 16215717 15335961 14628095 13902739 13212264 12744999 12232045
3251 12232045 11842884 11447439 11222455 10863584 10589102 10417134 10092781 9854330 9825530 9690376
3241 9690376 9517093 9350082 9266653 9120965 8882905 8724577 8571080 8436148 8235616 8017254
3231H017254j73089j64451K3776j06772j27965j20235n0775r4366q2738q9003
3221G031636n1156O7338k06408p542l8424k2988o6141l8052k1628p2072L803l5095
3209F543271j53517j26041j5357J297J0700n0749j23846l6518o2833o909m2557
3198E936941J7641M9193O5529p0881m6238P3541m2400j21198J0079j04763O935
3187E774379P8813O1490j0488M4636L8486r8800r0473O7989q9749L0553m5160
3176E761676j2135L9722k641k5178o10n6394j19331O3848r8061O2088J1504J14150
3164E738638m447O6243K3075M7323O9334m2276l5782k1809j04514N8808L0889
3153E825482P0837n7546R1155N543n010K5938Q650j8345l9805R378k5468M1110
$$ plain form
3231 8017254 7844165 7679714 7703490 7596718 7468753 7348518 7297743 7203377 7120639 7031636
3221 7031636 6980480 7047818 6841410 6833868 6795444 6772456 6706315 6668263 6646635 6574563 6578366 6543271
3209 6543271 6389754 6263713 6248356 6249653 6260353 6209604 6085758 6049240 5986407 5979498 5936941
3198 5936941 5954582 6003775 6069304 5998423 5952185 6025726 5983326 5862128 5872207 5767444 5774379
3187 5774379 5853192 5914682 5904194 5948830 5987316 5888516 5798043 5866032 5776283 5806836 5761676
3176 5761676 5749541 5789263 5786622 5761444 5760834 5704440 5585109 5648957 5550896 5612984 5624488 5738638
3164 5738638 5734191 5800434 5823509 5870832 5940166 5897890 5862108 5840299 5735785 5794593 5825482
3153 5825482 5896319 5838773 5929928 5935471 5930461 5956399 5965049 5946704 5906899 5916277 5890809 5931919
3141E931919Q6967J45155L1498k7887K5887J9602N2494N642m832L4962P2916m974
3129F369349j4436P380J77809J0003n6790L6417K18566P6732j16478k1794o9948
3118F616810N2801m2678J1505j1156n3252m1528J15989O7211K8184q1141O0101
3107F722846m9721K3149k0487J37699j2778k8083K9941j0664L8968k6443r3530
3096F710897j4349J05939r631K7860O8604n2923L6136l5038j00898J13700M100
3085F854397o5079q2266L0048M0937o5294m6763Q402M7768Q2407n503m6117m7410
3073F705527l1116r8784N5045L3473r8386j9228O6663N4161j29103l41J7231j119
3061F554023P8653M6526k5165l9635J09110L1437j30232m5117O1498K3180j13886
$$ plain form
3141 5931919 6018886 6164041 6195539 6167652 6193539 6213141 6265635 6271277 6266445 6301407 6374323 6369349
3129 6369349 6354913 6362293 6540102 6550105 6493315 6529732 6748298 6825030 6708552 6686758 6616810
3118 6616810 6669611 6626933 6638438 6627282 6574030 6532502 6648491 6715702 6743886 6662745 6722846
3107 6722846 6673125 6696274 6675787 6813486 6800708 6772625 6802566 6791902 6830870 6804427 6710897
3096 6710897 6696548 6802487 6792856 6820716 6889320 6836397 6872533 6837495 6736597 6850297 6854397
3085 6854397 6789318 6707052 6737100 6778037 6712743 6665980 6674382 6722150 6804557 6799054 6752937 6705527
3073 6705527 6674411 6575627 6630672 6664145 6565759 6546531 6613194 6667355 6538252 6537911 6555142 6554023
3061 6554023 6632676 6679202 6654037 6614402 6723512 6754949 6624717 6579600 6641098 6664278 6550392
3050F550392Q9958n5437O5798J34941j1163J968O0503m1605q6904M6908Q484N4609
3038F818452l3294k8964j0238J02681J8953o5793l3831J08771r1598l3271k2397
3027F729471O3750j8389n11N6835J7960j1645r679K4132L4585N8469k2832P2883
3015F995029r8490k8700R4882L7418N1240o0908L3947m2981K2786n1392q9696
3004F863135N199m1929J665N0692L6130o8680j10400K7682k9412l6710J51574
2993F848946j3889k2667J2206l1360J6785n3766j0015O6592j4140k2130r340K3502
2981F790724q9886q2282M4837k1439n9328o1541l1628m3361J01028N0691m4097
2970F553718j02453q5850l3526q1686P8401K668k893j09821L7371r0550j4497
$$ plain form
3050 6550392 6640350 6584913 6650711 6785652 6774489 6776457 6836960 6795355 6708451 6755359 6763843 6818452
3038 6818452 6785158 6756194 6745956 6848637 6867590 6801797 6767966 6876737 6785139 6751868 6729471
3027 6729471 6793221 6774832 6774321 6831156 6849116 6837471 6827792 6851924 6886509 6944978 6922146 6995029
3015 6995029 6896539 6867839 6962721 7000139 7051379 6990471 7024418 6981437 7004223 6952831 6863135
3004 6863135 6868334 6826405 6828070 6878762 6914892 6846212 6735812 6763494 6734082 6697372 6848946
2993 6848946 6835057 6812390 6824596 6793236 6810021 6756255 6746240 6812832 6798692 6776562 6767222 6790724
2981 6790724 6700838 6618556 6663393 6641954 6582626 6521085 6489457 6446096 6547124 6597815 6553718
2970 6553718 6451265 6365415 6331889 6250203 6328604 6331272 6328379 6218558 6255929 6165379 6150882
2959F150882L1004j1347l473n0793M1709n2953j23981j4054l529K478K978l9568
2947E929353k0047p3613r8084r9500Q7598L6739j08970M3523o4005j23860q629
2936E500505m581n6732L9671R2590k7885o1056j20408k0081L9324j34025K6013
2925E273335j4674K8270K406l2792j0466o156r0571q2554j8425k738M1445j38043
2913D949037j58961l8119J7951N1218M7916n160J8391j72735r1895j0769n541
2902D601333L116n4441M2214n7460o0025o7645J7383j4205j46570k7326k0812
2891D215562q1589O2383J12253o4565J7990l330k3976j22947j2819p3185K4425
2880D050202m5047j3868J4574j19153J0067L9530l7888m1901m4973K7712J3701
$$ plain form
2959 6150882 6181886 6170539 6167066 6116273 6157982 6105029 5981048 5966994 5963465 5965943 5968921 5929353
2947 5929353 5909306 5835693 5737609 5638109 5725707 5762446 5653476 5696999 5632994 5509134 5500505
2936 5500505 5495924 5439192 5478863 5571453 5543568 5482512 5362104 5342023 5381347 5247322 5273335
2925 5273335 5258661 5286931 5289337 5256545 5246079 5239923 5149352 5066798 5048373 5045635 5087080 4949037
2913 4949037 4790076 4751957 4769908 4821126 4869042 4863882 4882273 4709538 4617643 4606874 4601333
2902 4601333 4604449 4550008 4592222 4534762 4474737 4407092 4424475 4410270 4263700 4236374 4215562
2891 4215562 4133973 4196356 4308609 4244044 4262034 4258704 4234728 4111781 4098962 4025777 4050202
2880 4050202 4005155 3991287 4005861 3886708 3896775 3936305 3898417 3856516 3811543 3839255 3852956
2869C852956K645p8667j36642r6595O6736M3274r0750n5538R857M2340K256r0877
2857C470995k058N0030k6890j05404j2110M0313l4131l2788l9246R4435j5303
2846C387843p6292q2710m0158L1888Q910j6479o8667l3894k7974M1918l1j22694
2834C001660K4599k323R287p3615j27140J17107k4184L2386M7157j33860P4363
2823B945437J0223J0512j4509o4191j14487j1464L2189l703r5634K6276r805j07603
2811B603241K562O304J62582q8583j5374J5533j08950j03828J0397L791k6788
2800B460887p2694L4414K6952n4753P1786o3938k2950M65q158j2098N5550p8563
2788B336900O3305p0540l9413j47950p016P6722l3655K7717n0953m899k6209L5075
$$ plain form
2869 3852956 3855601 3776934 3640292 3543697 3610433 3653707 3562957 3507419 3517276 3559616 3561872 3470995
2857 3470995 3468937 3518967 3492077 3386673 3374563 3414876 3380745 3347957 3308711 3403146 3387843
2846 3387843 3311551 3228841 3188683 3220571 3229481 3213002 3144335 3110441 3082467 3124385 3124354 3001660
2834 3001660 3026259 3023936 3033223 2959608 2832468 2949575 2925391 2957777 3004934 2871074 2945437
2823 2945437 2955660 2966172 2951663 2887472 2772985 2761521 2793710 2790007 2694373 2720649 2710844 2603241
2811 2603241 2605803 2612107 2774689 2686106 2670732 2686265 2577315 2473487 2483884 2487675 2460887
2800 2460887 2388193 2422607 2449559 2394806 2466592 2402654 2379704 2380169 2372011 2359913 2415463 2336900
2788 2336900 2400205 2329665 2290252 2142302 2135286 2212008 2178353 2206070 2155117 2150218 2124009 2159084
2776B159084j7057K6540j48675j119R4889J12038j0642j15360n841M2576L3151
2765B169584j94025Q8205K7065n697Q2211m8836M85k7784R1373J8965p0073k06311
2753A925162l8895P8140l3331P6733l4204J4383r4418n7657L421P5584K6395k1699
2741A919614l2876n7024K7832j23561k0962L0008m9689P8862q198n1765o7779
2730A644462K2087j6965k1444j04342R1119j839J03957M7637j87293L4330p2741
2719A538968P6562P8899m374k1769j0181q0798L3522O7303J1271o6054l0691p4116
2707A518542J4220P5403n6218k4367R331J0362K3541P8390J4859l426J3294p4145
2695A599786q4288m0087M5286p4354n9232L8450M3723n3125J6643j63867J69592
$$ plain form
2776 2159084 2142027 2168567 2019892 2018773 2113662 2225700 2215058 2099698 2093857 2136433 2169584
2765 2169584 1975559 2063764 2090829 2085132 2167343 2118507 2118992 2091208 2182581 2201546 2131473 1925162
2753 1925162 1886267 1964407 1931076 2007809 1973605 1987988 1893570 1835913 1839334 1914918 1941313 1919614
2741 1919614 1886738 1829714 1857546 1733985 1713023 1743031 1693342 1772204 1764006 1712241 1644462
2730 1644462 1666549 1649584 1628140 1523798 1614917 1613078 1717035 1764672 1577379 1611709 1538968
2719 1538968 1615530 1694429 1690055 1668286 1658105 1577307 1610829 1678132 1689403 1623349 1592658 1518542
2707 1518542 1532762 1608165 1551947 1527580 1536911 1547273 1570814 1649204 1664063 1660637 1673931 1599786
2695 1599786 1515498 1475411 1520697 1446343 1387111 1425561 1469284 1416159 1432802 1268935 1438527
2684A438527N4750k0724M7091j1370m8572L9665n4463j3539J428L857n116j31090
2672A300444k1751J102Q4231j347l5207q6633j3067M1359p9280j3055j9031K0605
2660A178370N8404K9581J9891p1582J2643j51J8439M9229p7251j20642J20879
2649A217810L5418j16148O2128M3036M4390O3467M6359p8574m6835R050o5453
2638A214648j43986J8753N2995M1176P6242j4466m9140j08257P4436N1130L9882
2627A253413m5495O0950r0263l5081J6642p633k0674j3488j44215P0137N6209
2616A100502m286j2139o9605m87J19630L2324N8930j2706j56539K4239N1967M3679
2604A175509P7562j08120K5982j173R9975j8229q4290L9268O409k7513l8710o3955
$$ plain form
2684 1438527 1493277 1472553 1519644 1508274 1459702 1499367 1444904 1431365 1432793 1436650 1431534 1300444
2672 1300444 1278693 1279795 1364026 1362679 1327472 1240839 1227772 1269131 1189851 1176796 1157765 1178370
2660 1178370 1236774 1266355 1286246 1214664 1227307 1227156 1245595 1294824 1217573 1096931 1217810
2649 1217810 1253228 1137080 1199208 1242244 1286634 1350101 1396460 1317886 1271051 1280101 1214648
2638 1214648 1070662 1089415 1142410 1183586 1259828 1245362 1196222 1087965 1162401 1213531 1253413
2627 1253413 1207918 1268868 1178605 1143524 1160166 1152533 1131859 1118371 974156 1044293 1100502
2616 1100502 1096216 1084077 1014472 1013985 1133615 1165939 1224869 1212163 1055624 1079863 1131830 1175509
2604 1175509 1253071 1144951 1170933 1169760 1269735 1251506 1167216 1206484 1212893 1185380 1146670 1082715
2592A082715P0678K6152j31996P4226l8185J9857q4611L4670K4154o3903o3051
2581I50706R7582R8072o7127j6680Q0674o8733O9455n0865k2331o0934J8462N5780
2569A084061p752j71791n4815O516R471N3458j5428J50164n8471q9474l8913N3659
2557I20685j377Q0942m2612m3352K4133K0365j7120l3602j5070L0048L5405O5140
2545A023585M8828r8268j29027P2634j04056m7394J67499M505q9691P279Q0195
2534I36089M5946J2732j52773m743N0027O5498n9054j56903P3017k4106K8614
2523H14344L988j1190R4319m937n2683n8659n6206O0486M0364M0703O784n8869
2511H18444n0805k476O142K7178J21799n4505k9496k3313K1481l9119J13860K1444
$$ plain form
2592 1082715 1153393 1179545 1047549 1121775 1083590 1103447 1018836 1053506 1077660 1013757 950706
2581 950706 1048288 1146360 1079233 1062553 1143227 1074494 1143949 1093084 1070753 1009819 1028281 1084061
2569 1084061 1076309 904518 849703 856219 865690 919148 903720 1053884 995413 905939 867026 920685
2557 920685 919308 1000250 957638 914286 938419 958784 941664 908062 892992 923040 958445 1023585
2545 1023585 1072413 974145 845118 917752 813696 766302 933801 938306 848615 855894 936089
2534 936089 982035 994767 841994 837251 887278 952776 893722 736819 809836 785730 814344
2523 814344 818332 807142 901461 896524 843841 785182 728976 789462 829826 870529 877313 818444
2511 818444 767639 765163 771305 798483 920282 865777 836281 812968 834449 795330 909190 930634
2499I30634q0506O2353m9361K8293N0221o4598n6291m6342J22990m29l458q0183
2487H13323Q5865k4426j3011K4013K5888M0466n0676N1064k2269l3863m5238m0277
2475H10859J3914L835n5464L7794P697O76J6640r2149p6545R0041M1500j00162
2463F98636k110O6242P3706Q188l5354m9333m5404J23017O0869p7107l6248J62014
2451I47116L8499q7569O180n9255m112n1105L385Q4456o5509j58421M9435L2687
2439G35787L4024o424n5594K9569N4238L8838j73772O8447K8052o277J2983Q4463
2427H44334m9936o7631K2408J4546l1756j5728O5601N2550j4085j2658L8711L3741
2415H80097L1908J2847N697J4046p08K0708j7376k8407P7292j01618n8035P0187
$$ plain form
2499 930634 850128 912481 863120 891413 941634 877036 820745 774403 897393 896964 893506 813323
2487 813323 899188 874762 861751 885764 911652 952118 901442 952506 930237 896374 851136 810859
2475 810859 824773 828608 773144 810938 818635 819311 835951 743802 667257 757298 798798 698636
2463 698636 696526 762768 836474 844662 809308 759975 714571 837588 898457 821350 785102 947116
2451 947116 985615 898046 904226 844971 840859 789754 793139 877595 812086 653665 703100 735787
2439 735787 769811 763387 707793 737362 791600 830438 656666 725113 753165 746888 759871 844334
2427 844334 794398 726767 749175 763721 731965 716237 781838 834388 820303 807645 846356 880097
2415 880097 912005 924852 930549 944595 943887 964595 947219 918812 996104 894486 836451 906638
2403I06638l5608p7096L0951M3447M2370O0491o5381j0207k7528R9431J82368
2392A149876m6194m7254m4732O3300Q0971N038n0040l8240R4752n652J14149L2653
2380A308627J6240j5682K2141L2460K1362M1589R7544P8051L0705J6600K7775
2369A677412P7948J42828O0933J26683J37352k9178J68045N9996J38325J68787
2359B729131K01015J79315K55609J82707J34449M30763L93435N25265M66226N62896
2349F060811O65858O34839O82579O51628Q07578Q79557J178266J443065J748930
2340A4753111K308458L136853L827006L898105L632287L368371L031567K192806
2332D0148564j74139l775691m608270m022384l387797k534739k131862j804760
$$ plain form
2403 906638 871030 793934 824885 868332 910702 971193 905812 895605 868077 967508 1149876
2392 1149876 1103682 1056428 1011696 1074996 1155967 1161005 1110965 1072725 1167477 1161825 1275974 1308627
2380 1308627 1324867 1309185 1331326 1363786 1385148 1426737 1524281 1602332 1633037 1649637 1677412
2369 1677412 1755360 1898188 1959121 2085804 2223156 2193978 2362023 2422019 2560344 2729131
2359 2729131 2930146 3109461 3365070 3547777 3682226 4112989 4506424 5031689 5497915 6060811
2349 6060811 6726669 7361508 8044087 8695715 9503293 10382850 11561116 13004181 14753111
2340 14753111 17061569 20198422 24025428 27923533 31555820 34924191 37955758 40148564
2332 40148564 39974425 36198734 31590464 27568080 24180283 21645544 19513682 17708922
2324A7708922j580916j222053j162311j055050q09718q35785q23577n97248p30221
2315H892043p04657m23946m76978l79327m26523l36289k61600m32175k97025l40338
2305D813185k13473j91414k05929k11002j44591k98290r1508l7677r6704j99510
2295C123087K2061j00215j49454j07948j38496j27923k5717m4507n8839M160K3500
2284B419709j46361j54406o2288O1002n4714j12067L2114K6857J15926q4612j39941
2273A901219n4169n8947n0500n1227j41110J2195P63l3883k6953J8843m5652o2194
2261A408385n8440M3124R5488K177j45915n3221L6976j6919L814J3446l8520n093
2249A285302j963j9561q28o0948p5365P5624J8923m8430j1805m3756k8217N220
$$ plain form
2324 17708922 16128006 14905953 13743642 12688592 11878874 11043089 10219512 9622264 8892043
2315 8892043 8187386 7763440 7286462 6907135 6480612 6144323 5882723 5450548 5153523 4813185
2305 4813185 4599712 4408298 4202369 3991367 3846776 3548486 3456978 3419301 3322597 3123087
2295 3123087 3145148 3044933 2895479 2787531 2649035 2521112 2495395 2450888 2392049 2396209 2419709
2284 2419709 2273348 2118942 2056654 2117656 2062942 1950875 1982989 2009846 2125772 2041160 1901219
2273 1901219 1847050 1788103 1737603 1686376 1545266 1557461 1558224 1524341 1497388 1516231 1470579 1408385
2261 1408385 1349945 1393069 1488557 1490734 1344819 1291598 1328574 1311655 1315469 1328915 1290395 1285302
2249 1285302 1283339 1263778 1262950 1202002 1126637 1202261 1221184 1172754 1160949 1117193 1088976 1094196
2237A094196l7914j9796p054N7263J12997l4489o2497p6143K3448M0104o0064
2226A030051m2032n4777K5471J7663K921k3363L7340m5186j8300p906Q5838q2400
2214I25320q2953O6477L3366J5666p2982n3597J7015Q1430o0259l2150L6371r3017
2202G80687J14331o1065j4316M8377K317q6958L1980m6588K3115J16376n8932
2191H49324j34614q3146J44966L1601k2462j32152Q765j4165r7356l0866J29491
2180F49386R9790j25425Q6395R2960j16503M27k0188l5548L8139j22913m4418
2169E02102J69428J4859J02315k922l5700n8297j22161N0618L2733N1442J4586
2158G19003J2445k9274K7034O1063j14055m6772J8694k9036o1511Q4828K2695
$$ plain form
2237 1094196 1056282 1036486 1029432 1086695 1199692 1165203 1102706 1026563 1050011 1090115 1030051
2226 1030051 988019 933242 958713 976376 979297 955934 993274 948088 929788 921882 1007720 925320
2214 925320 842367 908844 942210 957876 884894 831297 848312 929742 869483 837333 873704 780687
2202 780687 895018 833953 819637 868014 870331 783373 815353 768765 791880 908256 849324
2191 849324 714710 631564 776530 808131 785669 653517 662282 648117 550761 519895 649386
2180 649386 749176 623751 710146 803106 686603 687030 666842 631294 669433 546520 502102
2169 502102 671530 686389 788704 785782 750082 691785 569624 620242 652975 704417 719003
2158 719003 731448 702174 729208 790271 676216 629444 648138 619102 557591 642419 665114
2147F65114R0008l6493L3505p6207n3158r9823n5329p729Q8026K5705o6748P3179
2135E80050K661M6266N9735m1680j1936K6299r2547J08945L5299r336q9402O1412
2123F75766J6902r9322L987l6494j9432o4725L3323O2796R7182j4075p4925L0548
2111F11531o8013r265K1616J07493N4748r1586q629m5294l107L7474l4874m8909
2099E23185J6949j6222m6099O2081o0043J04624M3201j10957l4024M8506K0818
2088E52019l8824L9206K4167L4938j3525j1057j06265K7622J28879m2207J4557
2077F09510o2597J2497N014q361O2675j4551j813o659l8188o9696O2670J54351
2065G04852j8349p0819p4782K460m599N6314J5277n5561k1959q0583N3782k8888
$$ plain form
2147 665114 755122 718629 752134 675927 622769 522946 467617 459888 547914 573619 506871 580050
2135 580050 582711 628977 688712 647032 635096 661395 568848 677793 713092 703756 614354 675766
2123 675766 692668 593346 597333 560839 541407 476682 510005 572801 669983 655908 580983 611531
2111 611531 543518 534253 555869 663362 718110 626524 617895 572601 569494 606968 572094 523185
2099 523185 540134 523912 477813 539894 479851 584475 627676 516719 482695 531201 552019
2088 552019 513195 552401 576568 611506 597981 586924 480659 508281 637160 594953 609510
2077 609510 546913 559410 564424 556063 618738 604187 602374 595715 557527 487831 550501 704852
2065 704852 686503 615684 540902 543362 538763 595077 610354 554793 532834 452251 506033 477145
2053D77145m2114N6852J9821K7312M1657j15527P3075J18848p7913j10044L104
2042D72216P2709K5726j39254J6947J00178J4062k4555n8485r874L5768M8942
2031E54380k7241k4921j1575p8617J3584J42568m0376m1180K3901M3290M444J3128
2019E71385K8163j61597m7281P2051Q255k6719n6082P233Q5031M9247j51987L5654
2007D13353J4663p6498L8415Q555j293Q9424O8833J74584r0651r4359o2236q554
1995D74236j1950N257j3812j03406J3771j0355J7774k5912L1964J1492l1080M9285
1983D07264o5167O0897J7584k4155J9321j842J9396r9127M7243j8486N2193l0920
1971C84201P5425l3105k0835L9266O2953j4263k1595l8717k1539k8623L4763L2864
$$ plain form
2053 477145 435031 491883 511704 539016 580673 465146 538221 657069 579156 469112 472216
2042 472216 544925 570651 431397 448344 548522 562584 538029 479544 469670 505438 554380
2031 554380 527139 502218 490643 412026 425610 568178 527802 486622 510523 553813 558257 571385
2019 571385 599548 437951 390670 462721 470976 444257 388175 395408 480439 529686 377699 413353
2007 413353 428016 351518 389933 398488 397195 486619 555452 730036 639385 545026 482790 474236
1995 474236 462286 467543 453731 350325 364096 353741 371515 345603 377567 389059 357979 407264
1983 407264 342097 402994 420578 396423 415744 413902 433298 334171 381414 362928 415121 384201
1971 384201 459626 426521 405686 444952 507905 493642 472047 433330 411791 383168 417931 450795
1959D50795L4094N6786j1489r0451j4503M8472n7298O894J0249M8293n2735L8152
1947D67259p8436q645J8560L9703n7895M4513q646o2938O6724j5325l5720n3511
1935C15643O6092j9064J7493k2870L739k8034j2319p284K0540P2418m0968o1978
1923C03408k1405N8577J0774j5417k0780m4369R1073R6203m4961n0551K834o0609
1911C04777L845J06409m3591J38555P5313k18769n3633K5487M3861j7950n3014
1900C11290m7695l2895N704m8265N8049O4521M0914K4225L5431q768o5994M9164
1888C85681K5755J9738p2373O9338N1004j44224J0922n6808M2038k1659J2896
1877C22308O8942r4731K934P5140k276L7777j26667p0522R4269k6265K456n578
$$ plain form
1959 450795 484889 541675 530186 439735 425232 473704 416406 423300 433549 481842 429107 467259
1947 467259 388823 380178 398738 438441 380546 425059 416413 353475 420199 404874 369154 315643
1935 315643 381735 362671 380164 357294 361033 332999 320680 313396 333936 406354 365386 303408
1923 303408 282003 340580 351354 335937 315157 270788 361861 458064 413103 362552 365386 304777
1911 304777 308622 415031 371440 509995 585308 366539 312906 338393 382254 364304 311290
1900 311290 263595 230700 236404 188139 246188 310709 351623 375848 411279 402511 336517 385681
1888 385681 411436 431174 358801 428139 479143 334919 345841 289033 331071 309412 322308
1877 322308 391250 296519 299453 374593 372317 410094 283427 212905 307174 280909 283365 277787
1865B77787O8829R2211q9536J22086L8903j23503j01518J03328P0225l4681q7041
1854C37090p5221m4027j9049Q5633j3256n172K171K0579O0508j2054l8661l4417
1842B64124j11283P4323K5273R093J20011l0649p7671L4458K286M6454n6033K4358
1830C24744j4248J1005o5344o2754J3607J24935L1555J6302J0634m9176n886M387
1818C39761K3465J9109l7435r521j4292q1847K3432P4601J1288m3293J8277M2423
1806C65968J1226j0944j11326Q4367P9884l5422j17225P137Q7329q3035N3274
1795C31233L5553M1532j01019O5415o9629j92995R5660K0213P5888L9146J4460
1784C55457L5210o7680l5810r854Q0344M8554P441m8775J1366j8891J1301n8579
$$ plain form
1865 277787 346616 438827 349291 471377 510280 386777 285259 388587 458812 424131 337090
1854 337090 261869 217842 198793 284426 271170 265998 268169 288748 349256 337202 298541 264124
1842 264124 152841 227164 252437 261530 381541 350892 273221 307679 309965 356419 300386 324744
1830 324744 310496 321501 256157 193403 207010 331945 363500 379802 390436 341260 335374 339761
1818 339761 363226 382335 344900 335379 321087 239240 262672 337273 348561 305268 323545 365968
1806 365968 377194 366250 254924 339291 419175 383753 266528 273665 360994 277959 331233
1795 331233 366786 408318 307299 372714 303085 110090 205750 225963 301851 340997 355457
1784 355457 390667 322987 287177 277323 357667 406221 413662 364887 376253 357362 368663 310084
1772C10084k2160n4040K8081n626j8923K6447M2601o323j7105L4950q3205l7694
1760A97087o4732J53175O9885j44841L7314M2965m1598n1788M5263J8127N783
1749B66640P115r029m419k8152K234R329l674N6270j1098K2582M7714n4341K1436
1736C22607R2798j9751k4443J19045n0635j21021O8507o8882q1573P3619O872
1725C17143j2159J19978q4488j9806R312j28543O4261q0859k0352P618k5848n2521
1713I3736R3435Q2895m3029L9803o34r6063N41O7023J16614k4855m4850r929r1092
1700A83595L474p178N5887p918K0214j3508l3621L3736l4195L8560j2814M6650
1688B72882J1025n713n9278L1166M4991m816p6007n2025N1703K420L2014J0614
$$ plain form
1772 310084 287924 233884 261965 256339 237416 263863 306464 300141 283036 317986 234781 197087
1760 197087 132355 285530 355415 210574 247888 290853 249255 197467 242730 260857 266640
1749 266640 273755 264726 260307 232155 234389 243718 240044 296314 285216 307798 355512 301171 322607
1736 322607 415405 395654 371211 490256 439621 318600 387107 318225 236652 310271 317143
1725 317143 304984 424962 340474 320668 329980 201437 265698 184839 164487 172105 146257 93736
1713 93736 187171 270066 227037 266840 266206 170143 170684 237707 354321 329466 284616 274687 183595
1700 183595 187069 179891 235778 227860 248074 234566 200945 234681 200486 239046 226232 272882
1688 272882 283907 278194 218916 250082 295073 290257 214250 162225 213928 216348 248362 258976
1676B58976n3092l0513N613L7143J33472k6649l7433l5271o1852Q3155J6782q3588
1664B06743j0805L5637k9185k6254J03260K7258r1577O648o3328K2134j391J13714
1652B92854R6833m0831L8169j61817n2631O5735r6510k2043J13287p9606n0326
1641A03114M3302R7484p8622o4968J14014K4765k734Q8789l2448q5547L8179m6601
1629A98727K2762l5017p7431M2487P2797p7186R8526j1379k3437L2379J401P3859
1617C18488p6774j23134N9989K5464P2228P1621j50665J8941j02931M9461R6693
1606B59381l614l4195J06867o003j21203j6949k0383K1568r3230N532J7788L1176
1594A46735J9573l7921l6606M7914J18707J9777j269j0211k3544n9312P6266j2800
$$ plain form
1676 258976 205884 175371 180984 218127 351599 324950 287517 252246 190394 273549 290331 206743
1664 206743 195938 231575 202390 176136 279396 306654 215077 221725 158397 180531 179140 292854
1652 292854 389687 348856 387025 225208 172577 238312 141802 119759 233046 153440 103114
1641 103114 146416 243900 165278 100310 214324 239089 236355 325144 292696 207149 245328 198727
1629 198727 221489 186472 109041 151528 224325 147139 245665 234286 210849 243228 244629 318488
1617 318488 241714 118580 178569 204033 276261 347882 197217 216158 113227 162688 259381
1606 259381 255767 221572 328439 322436 201233 184284 163901 185469 92239 97771 115559 146735
1594 146735 166308 128387 91781 139695 258402 278179 276910 266699 243155 183843 260109 247309
1582B47309J4799j3502J5090M5085j39870p4142J51625N0452p0708j36594J3302
1571A02846J40168N0331j00938n0428L5851k5490p461j2760Q732L3261l7294o630
1559A30188n144r925K1033P3660J3313l359k9664k8903O4243l2741K7151p8339
1547A41513J0516j0506M8524M5360J2387p8700K6128m0036o0592Q3665J13363
1536B91622k5087N917P1306m7347m4953J2672J2140n1874m2709k0368Q980Q1724
1524B52023k5601r458l880m1826R590o0829O8428l5482m5260q0386J13951R9334
1512B40604l6505k4290m6228L1392M0859K8545P1568q4857q0538k8138M0010J14656
1500B67078o7677k6690l1958M8837k1877L174j7310J4878Q9554L1296l6173r216
$$ plain form
1582 247309 262108 248606 263696 308781 168911 94769 246394 296846 226138 89544 102846
1571 102846 243014 293345 192407 141979 177830 152340 144879 132119 140851 174112 136818 130188
1559 130188 125044 115119 136152 209812 223125 219766 190102 161199 225442 192701 219852 141513
1547 141513 152029 141523 190047 235407 247794 169094 195222 155186 94594 178259 291622
1536 291622 266535 272452 343758 296411 251458 264130 276270 224396 181687 161319 170299 252023
1524 252023 226422 216964 213084 171258 180848 120019 188447 152965 107705 27319 141270 240604
1512 240604 204099 179809 133581 164973 205832 234377 305945 221088 140550 112412 152422 267078
1500 267078 199401 172711 140753 189590 167713 170887 153577 168455 258009 289305 253132 243916
1488B43916n3578m1578Q5206n2774M659l9423L3915N3889o2309l9725P947k7091
1476A13054K845p5439L2185J25800Q35p2917q157Q863r7656O5594Q6655K4723
1464B06385O5886M0504j6177j32106j5027Q3746j6245l9669o3222j2978l7243
1453F3854P3245j00365P883Q0658J35727n2650k0971M8667p4491M7401m504j7275
1441A87179Q529q2881j7074K8101j15869N1950n252O1999M8045j879n245J5182
1429A72785q054J1251k0897o4321L1232o4432P3003O0301m5189k1269J44466l4204
1417B34672k8515J728k8174L1740L4474p8075j04145R0662O2019o588J6887o1454
1405A65231O139Q1692n5046m7889O232N244M9168K776p1555N45L2843J5534j70219
$$ plain form
1488 243916 190338 148760 233966 181192 185851 146428 180343 234232 171923 132198 140145 113054
1476 113054 115899 40460 72645 198445 199280 126363 118206 127069 29413 95007 181662 206385
1464 206385 272271 312775 296598 164492 149465 233211 216966 177297 114075 101097 63854
1453 63854 137099 36734 44617 125275 261002 208352 187381 236048 161557 208958 204454 187179
1441 187179 195708 112827 95753 123854 7985 59935 54683 116682 164727 162848 157603 172785
1429 172785 164731 175982 155085 90764 121996 57564 130567 190868 145679 124410 268876 234672
1417 234672 206157 207885 179711 211451 245925 167850 63705 154367 216386 209798 226685 165231
1405 165231 171370 253062 198016 150127 156359 161603 210771 213547 141992 142537 175380 190914 20695
1392B0695M8758M7055P5282m3330o5434N8806R8458j14494l0353K9964m9338p6651
1380e82L3842L5874J1280Q2818m1938j8307P4193N0330m444j34505j1243R7484
1368A74802J9963j7341j1437k5053M3505M1967o4866k1844K7609n669n6389k1972
1356H3275M1348N8290J3877J7891o5087K0552l2829O2909l4269j5908p478J9740
1344A62311J3678p3930M7037Q895N0815r5727n337P0418r871O4908j25462l5061
1332G2674R8792K8704k8268q6811n15P1032o7988o7604J3237j1137L1485M9727
1320A03328P9190l5376J6498J7481r9302L2573J1818O2226L854p1321l8654o1747
1308B0568m1145o558J01700K0532o5484O4891n9014L8399J24467m5748j0202p9189
$$ plain form
1392 20695 69453 116508 191790 148460 83026 141832 240290 125796 95443 125407 76069 -582
1380 -582 33260 69134 80414 163232 121294 102987 177180 227510 223066 88561 77318 174802
1368 174802 194765 177424 165987 140934 184439 226406 161540 139696 167305 161636 105247 83275
1356 83275 124623 182913 196790 214681 149594 170146 137317 200226 165957 150049 142571 162311
1344 162311 175989 102059 149096 157991 208806 113079 107742 178160 168289 233197 107735 72674
1332 72674 171466 200170 171902 85091 84576 155608 87620 20016 33253 22116 53601 103328
1320 103328 182518 147142 163640 181121 81819 114392 126210 188436 192290 120969 82315 20568
1308 20568 -20577 -27135 74565 95097 29613 94504 35490 73889 198356 152608 142406 63217
1296F3217j08399J02319k8781J7411L523M0665R4340J8601k7833j15423o0849
1285a209L0209j3343N6026K7988r3725R6250l9335J9463P2506M8500q3605j11660
1273H065J03207q352m6025P0123q465J9365n3970r7809J49528j22220J6074J36593
1261A66114r473q3376k4635O0289N3990p876k8041J9395j7068O813M091N0087
1249A90310n3831J2829r5528n7425L1450L6147o839K5258M6542j8812o182p078
1237I6841q1875K9607M4962N697P0408p7000P2527o2144r6429P5775J10276o5376
1225A23269m2056M844k3442O6502n504K9074j4803l8751m7498L9676j794q8307
1213A210N3081L9599N3657j31630k839J59311j6084J2820q2024o8102J80214K8791
$$ plain form
1296 63217 -45182 57137 28356 45767 49290 89955 184295 202896 175063 59640 -1209
1285 -1209 29000 15657 71683 99671 5946 102196 62861 82324 154830 203330 119725 8065
1273 8065 111272 102920 56895 127018 118553 137918 83948 -13861 135667 13447 29521 166114
1261 166114 156641 73265 48630 108919 162909 155033 126992 146387 129319 136132 140223 190310
1249 190310 136479 149308 53780 -3645 27805 63952 57113 82371 128913 110101 103919 96841
1237 96841 14966 44573 89535 95232 165640 88640 161167 99023 2594 78369 188645 123269
1225 123269 81213 86057 62615 129117 123613 152687 137884 99133 51635 91311 89517 1210
1213 1210 54291 93890 147547 15917 13078 172389 156305 169125 87101 18999 199213 228004
1201B28004L4852l3569n0888k736o1160l5265l3838j1805j2934L7580p1220N6059
1189D3080J2198j5694K8517K6797o2786P3864o8194m5388l1695J5541M9995J0980
1177C7215P3277M2479k6199J5521k2744j591O039m4830k3769n2559L5671m1592
1165c082k1768J19901M9855j1019N8556N3190j64195l2839J1178o1647P5027J17293
1153A90450p9441p2206K0889n0160M6728n143O9034j14207N947K5064j38874j3968
1141a15887N4154J44184j6545N271N2443k6615O7083J15244m6966n5390j13867
1130F3109L0664M2333m4625j5257m2412M7726N91L1166K7677o4585o7325m702
1118D360N13L2449K1509k5385K9639o0823o0725R4490l5929O2785J6863J7952
$$ plain form
1201 228004 262856 229287 178399 175663 114503 79238 45400 33595 20661 58241 -12979 43080
1189 43080 55278 39584 68101 94898 32112 105976 37782 -7606 -39301 -23760 26235 37215
1177 37215 110492 152971 126772 142293 119549 117958 123997 79167 55398 2839 38510 -3082
1165 -3082 -24850 95051 144906 133887 192443 245633 81438 48599 59777 -1870 73157 190450
1153 190450 111009 38803 59692 9532 56260 51117 120151 5944 11891 36955 -101919 -115887
1141 -115887 -61733 82451 65906 71177 123620 97005 164088 279332 232366 176976 63109
1130 63109 93773 136106 91481 76224 33812 81538 82129 113295 140972 76387 9062 4360
1118 4360 4873 37322 58831 33446 63085 2262 -58463 36027 98 62883 79746 97698
1106I7698n433q0893L902k3810Q057P3050J8710M1849m9964L5735l6584q0892
1094A425R2594m5543j3807o2547m3208L551k2064J25895J3417k0322m931J8788
1082D3248k5892L235P7127L6410k8966k7197l8709Q3786J30910N2120j19283L2417
1070B19206p6992j11564L8384K1254M35M169J0863P000m7869q9789L0842j11939
1058a06000J29499Q6220r345k6852L2282P406K7454K1367p8682j44815m269P3586
1046G851L6149j6631j9243L6799p3095J16461l7523O2439j7609k7788m5380Q2807
1034A05237L9467r2663J2802K3005k6751o8116l2551K1190j17586j5027J43914
1023g079j6242J29153N602p6362K262P5042K3570l1793o6174O0157r803o1179
$$ plain form
1106 97698 92265 11372 15274 -8536 -479 72571 91281 133130 83166 118901 82317 1425
1094 1425 94019 48476 34669 -27878 -71086 -67535 -89599 36296 49713 29391 24460 43248
1082 43248 17356 20591 97718 134128 105162 77965 39256 123042 253952 306072 186789 219206
1070 219206 142214 30650 69034 90288 90723 94892 105755 112755 64886 -24903 5939 -106000
1058 -106000 23499 109719 100374 73522 105804 113210 140664 162031 83349 -61466 -65735 7851
1046 7851 44000 27369 8126 44925 -28170 88291 50768 113207 95598 67810 22430 105237
1034 105237 144704 52041 64843 87848 61097 -7019 -39570 -18380 -135966 -150993 -7079
1023 -7079 -23321 105832 111434 35072 37334 112376 135946 104153 37979 98136 88333 27154
1011B7154o4198j8184L0101m362M4250L237q5454k6285J7572R3775j4581J08307
999A11332m6886j14882L4220J91592q5086j0894Q504j30257K9845j6652P5648
988D6484m7666m5202J03938l9661j05725J6749J18424O7291o6931k2087P95j4173
976A2236l7151r8243l2713J13505Q0986J3553J9340P544j69927L3230J20538l9443
964B3455N9376N257r0155n7530K1155j5221J4899O0811n9946J31533q9235m6153
952d1754j6423L5235J78220l7380l9112J5162n801j34547p4474J11631J52753
941A43510m3233n9418J34016k1092j26171k3523o805O2665Q1342p9030L1107j5982
929G7386p8310r4611M9425O5885L7327K5519o7154J4472L7143j5700o3467N4836
$$ plain form
1011 27154 -37044 -55228 -25127 -29489 14761 17998 -67456 -93741 -76169 17606 3025 111332
999 111332 64446 -50436 -16216 175376 90290 79396 87900 -42357 -12512 -29164 46484
988 46484 -1182 -46384 57554 17893 -87832 -71083 47341 114632 47701 25614 26409 12236
976 12236 -24915 -123158 -155871 -42366 38620 52173 71513 79057 -90870 -57640 62898 23455
964 23455 82831 88088 -2067 -59597 -38442 -53663 -38764 22047 -37899 93634 4399 -41754
952 -41754 -58177 -22942 155278 117898 78786 93948 88147 -46400 -120874 -9243 143510
941 143510 100277 40859 174875 153783 27612 4089 -2716 59949 141291 62261 93368 77386
929 77386 -924 -95535 -46110 19775 57102 82621 15467 29939 67082 51382 -12085 42751
917D2751k173J2333j23041P421P6406l295p529L0190Q2565L4623M2280p2279p1388
904D8864N923k6857L0553P318k889p2071q901J8371L7314n3017q7493P6953p889
891c3821M2004J6584j07830o5282J03064P8350r2039R9410l7905j4268R3671J5621
879I7559n3437K0337j14168L8557l180q9493k471O0522L987o6884q231p888K9396
866i5394K0172P5721R6177M2471k0415o0867n5953K6867j34322J35764m7171l0003
854d6953l6565M8700O3277m0188o1515l000K5358j9660N4685N2956J3485K2486
842G3066o8507m379j3541N8063l0629J2616j8538j9946J052j08530Q282N9899
830e1092k4122K4495J6531M8353r0070J6234J00172k2921r452O994n8012n6086
$$ plain form
917 42751 40578 52911 -70130 -62709 13697 10402 2873 33063 115628 150251 192531 120252 48864
904 48864 54787 27930 58483 65801 62912 -9159 -18060 311 37625 -15392 -102885 -25932 -33821
891 -33821 8183 24767 -83063 -148345 -45281 33069 -58970 40440 2535 -11733 81938 97559
879 97559 44122 64459 -49709 -11152 -14332 -103825 -106296 -45774 -41787 -108671 -116902 -124790 -95394
866 -95394 -75222 499 96676 139147 118732 57865 1912 28779 -105543 30221 -16950 -46953
854 -46953 -83518 -34818 28459 -11729 -73244 -76244 -50886 -70546 -15861 37095 50580 73066
842 73066 4559 180 -13361 44702 14073 26689 8151 -11795 -10743 -119273 -110991 -51092
830 -51092 -75214 -50719 -34188 14165 -75905 -59671 40501 17580 8128 15122 -42890 -98976
818i8976P6776m8181J0191l7332R9655P9963J1549o0744j64048P9588Q2956n3758
806b2361R128k7982J00020o1394n2398M3420J940K646p6945N4548L5442m0069
794c4005k7164P359M2010L0504l2359j2642n459k0027m5939l2580l3459Q2397
782h1364P8691j1613L7486o3828P770K1165P7322k06475J5722N2509q7780L3317
770a27078l9846K8977J67291l1810l5626o5996k2166K3940O5439P3612m5315o5444
758g4022r055N90L1671M1561m4105J30077l1355r9374L4959P899o9881k1835L5715
745f7155l3430l5304J12717n3150K6082j900j3947L329m0905n7403M9787o746
733a18025j12394R4040J52654R008j18185J7491l1621K2070M5394m165j32172
$$ plain form
818 -98976 -22200 -70381 -60190 -97522 2133 82096 93645 32901 -131147 -51559 31397 -22361
806 -22361 -13233 -41215 58805 -2589 -54987 -11567 -9627 -6981 -83926 -29378 6064 -34005
794 -34005 -61169 -53810 -11800 18704 -13655 -26297 -31756 -51783 -97722 -130302 -163761 -81364
782 -81364 -2673 -14286 23200 -40628 -32858 -11693 65629 -140846 -125124 -72615 -160395 -127078
770 -127078 -166924 -137947 29344 -2466 -38092 -104088 -126254 -102314 -36875 36737 -8578 -74022
758 -74022 -83077 -82487 -50816 -9255 -53360 76717 45362 -54012 -19053 -11154 -81035 -102870 -67155
745 -67155 -100585 -135889 -23172 -76322 -50240 -52140 -66087 -62758 -103663 -161066 -111279 -118025
733 -118025 -230419 -136379 16275 25283 -92902 -75411 -107032 -84962 -39568 -43733 -175905
722a75905J24406r571o1189J0668o6756O7448r900j13053Q5651R9183m572o5236
710a18826P460R2381o5301o1594J5989L8642R9713n7530K1609r617j78528J09746
698a05856M4001o5706J5318m8403k3416L8935O8013K3812j2105O3559j45468O3870
686h3446J4821M0259j9533j19985L4306k3207Q8681k5758m4034Q8228Q6554M0126
674G7012q8378J7894m3315J2156k0771r6021o5519n6343m264R5277K3371O4310
662h4591R6657k3604O1875l7819o7918k9950l4591J574Q9186q626k5106p7165
650a40078m7526P595m5816J24811J3259n0558O0034l6087P8799O2716p4042k3319
638g0212O4459O3465p3117o5636R2036j15687n8058L7653P1666l7282k8820J21495
$$ plain form
722 -175905 -51499 -61070 -122259 -111591 -178347 -110899 -120799 -233852 -148201 -49018 -53590 -118826
710 -118826 -111366 -18985 -84286 -145880 -129891 -91249 8464 -49066 -27457 -37074 -215602 -105856
698 -105856 -61855 -127561 -112243 -160646 -184062 -145127 -77114 -53302 -65407 -1848 -147316 -83446
686 -83446 -68625 -28366 -47899 -167884 -133578 -156785 -68104 -93862 -137896 -49668 36886 77012
674 77012 -11366 6528 -36787 -24631 -45402 -141423 -206942 -263285 -267549 -172272 -148901 -84591
662 -84591 12066 -11538 50337 12518 -55400 -85350 -119941 -118367 -29181 -37807 -62913 -140078
650 -140078 -187604 -180009 -225825 -101014 -87755 -138313 -78279 -114366 -35567 27149 -46893 -70212
638 -70212 -5753 57712 -15405 -81041 10995 -104692 -162750 -125097 -53431 -90713 -119533 1962
626A962r0391j0925K7234N4948P375j29713N0032O3673n8321O2562M7753J6801
614D2990j45031m6988J17131N6294m2160k5063J3685K5669p3903K6993j9805l0442
602a00630k7471J65749q3910n5711n266N0869l1511j0490K815L8503R280M6467
590a306l5610j18892K5854O4052J8902R578o0067J883N0984r2854J18619q1610
578a00467R715j5853P5456N5924q0383j03191P3418P147K3055k3345L3385j3832
566e8971L4059l57j3803n32m1632P2209J0522k0377q6247k9787N5941m7786R852
553a16909m336Q358n3208l4247M6339l9799M38N7188q1730M4251j9883M3651J18107
$$ plain form
626 1962 -88429 -99354 -72120 -17172 -9797 -139510 -89478 -25805 -84126 -21564 26189 42990
614 42990 -102041 -149029 -31898 24396 -17764 -42827 -29142 -3473 -77376 -50383 -70188 -100630
602 -100630 -128101 37648 -46262 -101973 -107239 -56370 -87881 -98371 -95556 -57053 -47773 -1306
590 -1306 -36916 -155808 -129954 -65902 -47000 -37422 -97489 -95606 -44622 -137476 -18857 -100467
578 -100467 -90752 -106605 -31149 24775 -55608 -158799 -85381 -78234 -55179 -78524 -45139 -58971
566 -58971 -24912 -25269 -39072 -39604 -81236 -9027 1495 -18882 -105129 -134916 -78975 -126761 -116909
553 -116909 -121245 -112887 -166095 -200342 -154003 -193802 -193364 -136176 -217906 -173655 -193538 -149887 -31780
$$ [...]
##END NTUPLES=NMR SPECTRUM
##END=
