##TITLE=1H_DE-80H_X3
 200.13MHz, d2o
 8 sc
 
 19ns.26.2.2025
##JCAMPDX= 6.0         $$ Bruker NMR JCAMP-DX V2.0
##DATA TYPE= NMR SPECTRUM
##DATA CLASS= NTUPLES
##ORIGIN= UXNMR, Bruker Analytische Messtechnik GmbH
##OWNER= pz
$$ XWIN-NMR		Version 3.5
$$ Mon Oct 20 10:26:25 2025 Russian Standard Time (UT+4h)  Yarkov@DPX200
##.OBSERVE FREQUENCY= 200.1313
##.OBSERVE NUCLEUS= ^1H
##.ACQUISITION MODE= SIMULTANEOUS
##.ACQUISITION SCHEME= undefined
##.AVERAGES= 8
##.DIGITISER RES= 18
##SPECTROMETER/DATA SYSTEM= spect
##.PULSE SEQUENCE= zg30
##.SOLVENT NAME= CDCl3
##.SHIFT REFERENCE= (INTERNAL, CDCl3, 0, 15.4858)
##AUDIT TRAIL= $$ (NUMBER, WHEN, WHO, WHERE, WHAT)
$$ ##TITLE= Audit trail, XWIN-NMR		Version 3.5
$$ ##JCAMPDX= 5.01
$$ ##ORIGIN= Bruker BioSpin GmbH
$$ ##OWNER= Yarkov
$$ C:/Bruker/XWIN-NMR/data/yarkov2/nmr/H-C/1/pdata/1/auditp.txt
$$ ##AUDIT TRAIL=  $$ (NUMBER, WHEN, WHO, WHERE, WHAT)
(   1,<2025-10-20 10:25:32.06 +0400>,<Yarkov>,<DPX200>,
      <created by zg, POWCHK disabled, PULCHK disabled
       configuration hash MD5:
       00 E9 B6 7A A2 85 ED C7 34 08 36 98 17 FE 4E 26
       data hash MD5: 16K
       62 CC A3 74 59 6F 5E F2 58 DC 0D 04 AB 77 D0 14>)
(   2,<2025-10-20 10:25:37.90 +0400>,<Yarkov>,<DPX200>,
      <Start of raw data processing
       efp BC_mod = 2 LB = 0.25 FT_mod = 6 PKNL = 1 PHC0 = -4076.016 PHC1 = 14.22191 SI = 16K 
       data hash MD5: 16K
       FD BA 6E 42 16 F3 E3 5D 05 9A 27 90 2E 55 50 52>)
(   3,<2025-10-20 10:25:48.25 +0400>,<Yarkov>,<DPX200>,
      <abs ABSG = 5 
       data hash MD5: 16K
       4F E5 63 B3 58 2A F3 FF 23 49 B7 8E 43 CB 7F 63>)
$$ ##END=
$$ 
$$ hash MD5
$$ 02 20 26 23 73 EC 78 A7 34 6B 96 53 A3 DF A9 C1
##$RELAX= 
##$RELAX= 
##$RELAX= 
##$RELAX= 
##$RELAX= 
##$RELAX= 
$$ Bruker specific parameters
$$ --------------------------
##$DU= <C:/Bruker/XWIN-NMR>
##$EXPNO= 1
##$NAME= <H-C>
##$PROCNO= 1
##$TYPE= <nmr>
##$USER= <yarkov2>
##$AMP= (0..31)
100 100 100 100 100 100 100 100 100 100 100 100 100 100 100 100 100 100 
100 100 100 100 100 100 100 100 100 100 100 100 100 100 
##$AQSEQ= 0
##$AQ_mod= 1
##$AUNM= <au_zg>
##$AUTOPOS= <>
##$BF1= 200.13
##$BF2= 200.13
##$BF3= 200.13
##$BF4= 200.13
##$BF5= 200.13
##$BF6= 200.13
##$BF7= 200.13
##$BF8= 200.13
##$BYTORDA= 1
##$CFDGTYP= 0
##$CFRGTYP= 5
##$CHEMSTR= <none>
##$CNST= (0..31)
1 1 145 1 1 1 1 1 1 1 1 1 1 1 1 1 1 1 1 1 1 1 1 1 1 1 1 1 1 1 1 1 
##$CPDPRG= <>
##$CPDPRG1= <>
##$CPDPRG2= <>
##$CPDPRG3= <>
##$CPDPRG4= <mlev>
##$CPDPRG5= <mlev>
##$CPDPRG6= <mlev>
##$CPDPRG7= <mlev>
##$CPDPRG8= <mlev>
##$CPDPRGB= <>
##$CPDPRGT= <>
##$D= (0..31)
0 0.7 0 0 0 0 0 0 0 0 0 0.03 0 0 0 0 0 0 0 0 0 0 0 0 0 0 0 0 0 0 0 0 
##$DATE= 1760941531
##$DBL= (0..7)
120 120 120 120 120 120 120 120 
##$DBP= (0..7)
150 150 150 150 150 150 150 150 
##$DBP07= 0
##$DBPNAM0= <>
##$DBPNAM1= <>
##$DBPNAM2= <>
##$DBPNAM3= <>
##$DBPNAM4= <>
##$DBPNAM5= <>
##$DBPNAM6= <>
##$DBPNAM7= <>
##$DBPOAL= (0..7)
0.5 0.5 0.5 0.5 0.5 0.5 0.5 0.5 
##$DBPOFFS= (0..7)
0 0 0 0 0 0 0 0 
##$DE= 6
$$ [...]
##$SUBNAM3= <"">
##$SUBNAM4= <"">
##$SUBNAM5= <"">
##$SUBNAM6= <"">
##$SUBNAM7= <"">
##$SUBNAM8= <"">
##$SUBNAM9= <"">
##$SW= 18.0517328524113
##$SWIBOX= (0..15)
0 0 2 0 0 0 0 0 0 0 0 0 0 0 0 0 
##$SW_h= 3612.71676300578
##$TD= 16384
##$TD0= 1
##$TE= 0
##$TE2= 300
##$TE3= 300
##$TEG= 300
##$TL= (0..7)
0 120 120 120 120 120 120 120 
##$TP= (0..7)
150 150 150 150 150 150 150 150 
##$TP07= 0
##$TPNAME0= <>
##$TPNAME1= <>
##$TPNAME2= <>
##$TPNAME3= <>
##$TPNAME4= <>
##$TPNAME5= <>
##$TPNAME6= <>
##$TPNAME7= <>
##$TPOAL= (0..7)
0.5 0.5 0.5 0.5 0.5 0.5 0.5 0.5 
##$TPOFFS= (0..7)
0 0 0 0 0 0 0 0 
##$TUNHIN= 0
##$TUNHOUT= 0
##$TUNXOUT= 0
##$USERA1= <user>
##$USERA2= <user>
##$USERA3= <user>
##$USERA4= <user>
##$USERA5= <user>
##$V9= 5
##$VALIST= <valist>
##$VCLIST= <CCCCCCCCCCCCCCC>
##$VD= 0
##$VDLIST= <DDDDDDDDDDDDDDD>
##$VPLIST= <PPPPPPPPPPPPPPP>
##$VTLIST= <TTTTTTTTTTTTTTT>
##$WBST= 1024
##$WBSW= 4
##$XGAIN= (0..3)
0 0 0 0 
##$XL= 0
##$YL= 0
##$YMAX_a= 227768
##$YMIN_a= -338928
##$ZGOPTNS= <>
##$ZL1= 120
##$ZL2= 120
##$ZL3= 120
##$ZL4= 120
##$ABSF1= 15.48577
##$ABSF2= -2.566079
##$ABSG= 5
##$ABSL= 3
##$ALPHA= 0
##$AQORDER= 0
##$ASSFAC= 0
##$ASSFACI= 0
##$ASSFACX= 0
##$ASSWID= 0
##$AUNMP= <proc_1d>
##$AZFE= 0.1
##$AZFW= 0.1
##$BCFW= 0
##$BC_mod= 2
##$BYTORDP= 0
##$COROFFS= 0
##$CY= -3
##$DATMOD= 1
##$DC= 0
##$DFILT= <>
##$DTYPP= 0
##$F1P= 0
##$F2P= 0
##$FCOR= 1
##$FTSIZE= 16384
##$FT_mod= 6
##$GAMMA= 0
##$GB= 0
##$INTBC= 1
##$INTSCL= 3.241238e-09
##$ISEN= 128
##$LB= 0.25
##$LEV0= 0
##$LPBIN= 0
##$MAXI= 10000
##$MC2= 0
##$MEAN= 0
##$ME_mod= 0
##$MI= 1.114404
##$NCOEF= 0
##$NC_proc= -8
##$NLEV= 6
##$NOISF1= 3.799351
##$NOISF2= 2.8
##$NSP= 0
##$NTH_PI= 0
##$NZP= 0
##$OFFSET= 15.48577
##$PC= 1
##$PHC0= -4076.016
##$PHC1= 14.22191
##$PH_mod= 1
##$PKNL= yes
##$PPARMOD= 0
##$PSCAL= 0
##$PSIGN= 0
##$REVERSE= no
##$SF= 200.130007191634
##$SI= 16384
##$SIGF1= 3
##$SIGF2= 2
##$SINO= 0.751879
##$SIOLD= 32768
##$SREGLST= <19F.Aceton>
##$SSB= 0
##$STSI= 16384
##$STSR= 0
##$SW_p= 3612.71676300578
##$SYMM= 0
##$S_DEV= 0
##$TDeff= 16384
##$TDoff= 0
##$TI= <>
##$TILT= no
##$TM1= 0
##$TM2= 0
##$TOPLEV= 0
##$USERP1= <user>
##$USERP2= <user>
##$USERP3= <user>
##$USERP4= <user>
##$USERP5= <user>
##$WDW= 1
##$XDIM= 16384
##$YMAX_p= 379022250
##$YMIN_p= -1305677
$$ End of Bruker specific parameters
$$ ---------------------------------
##NTUPLES= NMR SPECTRUM
##VAR_NAME=  FREQUENCY,     SPECTRUM/REAL,   SPECTRUM/IMAG
##SYMBOL=    X,             R,               I
##VAR_TYPE=  INDEPENDENT,   DEPENDENT,       DEPENDENT
##VAR_FORM=  AFFN,          ASDF,            ASDF
##VAR_DIM=   16384,         16384,           16384
##UNITS=     HZ,            ARBITRARY UNITS, ARBITRARY UNITS
##FACTOR=    0.220516191357247, 1,           1
##FIRST=     3099.16730660229, 0,            0
##LAST=      -513.54945640349, 0,            0
##MIN=       -513.54945640349, -1305677,     0
##MAX=       3099.16730660229, 379022250,    0
$$ Real data points
##PAGE= N=1
##DATA TABLE= (X++(R..R)), XYDATA
$$ [...]
$$ plain form
7397 7614591 8151143 7994512 7771503 7747931 7251438 7480259 8017534 8149441 8045275 8161803
7387 8161803 8343642 9027900 9456420 9618428 9939871 10206247 10450140 10452813 10725224 10437756
7377 10437756 10507585 10643542 9862038 9933402 10441206 10511583 10088332 9865940 9749619 9225433
7367 9225433 8747635 8555011 8526717 8105909 7705252 7745741 7439537 7071903 7207941 7370591
7357 7370591 7077639 6981992 6513831 6361659 6379144 6271512 6295453 6147665 6237661 5996769
7347 5996769 5811688 5492076 5868103 5905292 5988667 6332952 6480735 6222833 6297059 6630789
7337 6630789 6779314 6797165 6320323 6033801 6360906 6077301 6059116 5415849 5509322 5865198
7327 5865198 5819117 5413421 5723332 6070516 5923860 5763246 5707696 5368707 5838113 6174275
$$ packed form
7397G614591N36552j56631k23009k3572m96493K28821N37275J31907j04166J16528
7387H161803J81839O84258M28520J62008L21443K66376K43893K673K72411k87468
7377A0437756O9829J35957p81504P1364N07804P0377m23251k22392j16321n24186
7367I225433m77798j92624k8294m20808m00657M0489l06204l67634J36038J62650
7357G370591k92952r5647m68161j52172J7485j07632K3941j47788Q9996k40892
7347E996769j85081l19612L76027L7189Q3375L44285J47783k57902P4226L33730
7337F630789J48525J7851m76842k86522L27105k83605j8185o43267R3473L55876
7327E865198m6081m05696L09911L47184j46656j60614n5550l38989M69406L36162
$$ plain form
7317 6174275 6066694 6152945 5933921 6375053 6598238 6286036 6073544 5815914 5742324 5940071
7307 5940071 5445274 5434609 5595612 5343710 5205254 5121745 4895895 4635527 4805986 4466988
7297 4466988 4160413 4235258 4003936 4011918 3928347 4053935 3918391 4080712 4049741 4317251
7287 4317251 4165349 4571326 4606921 4072620 3829664 3349616 3219468 3336232 3819256 3797368
7277 3797368 3661810 3751564 3215654 3069119 3300061 3416453 2849662 2534638 2286293 2068602
7267 2068602 2208135 2147435 2251714 2278921 2462723 1993235 2118788 1931982 1758346 1733457
7257 1733457 1447833 2089206 1728854 1602262 1653084 1887381 2079023 2271524 1957285 1758152
7247 1758152 1865908 1867547 1707732 1900321 2061783 1993544 2436358 2235155 2040707 2295602
$$ packed form
7317F174275j07581Q6251k19024M41132K23185l12202k12492k57630p3590J97747
7307E940071m94797j0665J61003k51902j38456q3509k25850k60368J70459l38998
7297D466988l06575P4845k31322P982q3571J25588j35544J62321l0971K67510
7287D317251j51902M05977L5595n34301k42956m80048j30148J16764M83024k1888
7277C797368j35558Q9754n35910j46535K30942J16392n66791l15024k48345k17691
7267B068602J39533o0700J04279K7207J83802m69488J25553j86806j73636k4889
7257A733457k85624O41373l60352j26592N0822K34297J91642J92501l14239j99133
7247A758152J07756J639j59815J92589J61462o8239M42814k01203j94448K54895
$$ plain form
7237 2295602 2478731 2560373 2842613 2691086 2409851 2404086 2520702 2552650 2835633 3140396
7227 3140396 3519747 3974581 3962918 3897418 3928055 4161914 3884699 3609716 3393692 3525365
7217 3525365 3869859 4011240 3693580 3305700 3109121 3017467 2863628 2694050 3121587 2970633
7207 2970633 2455036 2273098 2497160 2483516 1903944 1908913 2079658 2196015 2350144 2334128
7197 2334128 2336405 2239894 2191682 1824760 1459593 2000384 2219618 2113144 2042897 2333630
7187 2333630 2754346 2755001 2730919 2398539 2168718 2633212 2485795 2202562 2272641 2785762
7177 2785762 3185085 3062924 3179341 3444155 3825083 3618440 3526729 3786726 3874462 3496165
7167 3496165 3349007 3373843 3575039 3247804 3254576 3151789 3089486 3009268 2604211 2884238
$$ packed form
7237B295602J83129Q1642K82240j51527k81235n765J16616L1948K82983L04763
7227C140396L79351M54834j1663o5500L0637K33859k77215k74983k16024J31673
7217C525365L44494J41381l17660l87880j96579r1654j53839j69578M27537j50954
7207B970633n15597j81938K24062j3644n79572M969J70745J16357J54129j6016
7197B334128K277r6511m8212l66922l65167N40791K19234j06474p0247K90733
7187B333630M20716O55k4082l32380k29821M64494j47417k83233P0079N13121
7177B785762L99323j22161J16417K64814L80928k06643r1711K59997Q7736l78297
7167C496165j47158K4836K01196l27235O772j02787o2303q0218m05057K80027
$$ plain form
7157 2884238 2909578 2602100 2328247 2350797 2090154 2035102 2115234 2003160 2488837 2064863
7147 2064863 2223776 2585515 2552748 1826706 1667113 2158283 2329828 2446697 2422479 2271614
7137 2271614 2692955 2291056 2294211 2369316 2695249 2466008 2300075 2215588 2018934 2151201
7127 2151201 2385747 2663221 2447447 2400751 2461600 3067567 3054682 2828664 2942402 3365577
7117 3365577 3040606 3106310 3752714 4012179 3649969 3839555 4005247 4277469 4705071 4884271
7107 4884271 5067594 5820576 6104665 6214581 6194998 5877794 6048058 6184053 6276105 6164895
7097 6164895 5772236 5772665 5229335 4872509 4754547 4815628 4759505 4734217 4889108 4808119 4920824
7086 4920824 4941330 4994892 4894113 4648157 4979066 4947769 4575279 4753845 4787224 4889600
$$ packed form
7157B884238K5340l07478k73853K2550k60643n5052Q0132j12074M85677m23974
7147B064863J58913L61739l2767p26042j59593M91170J71545J16869k4218j50865
7137B271614M21341m01899L155P5105L25933k29241j65933q4487j96654J32267
7127B151201K34546K77474k15774m6696O0849O05967j2885k26018J13738M23175
7117C365577l24971O5704O46404K59465l62210J89586J65692K72222M27602J79200
7107D884271J83323P52982K84089J09916j9583l17204J70264J35995R2052j11210
7097F164895l92659M29n43330l56826j17962O1081n6123k5288J54891q0989J12705
7086D920824K0506N3562j00779k45956L30909l1297l72490J78566L3379J02376
$$ plain form
7076 4889600 4482342 4448468 4607345 4404050 4316742 4307595 4276145 3974708 3983891 4152000 3720273
7065 3720273 3768068 3787857 3705481 3612320 3653104 3228515 2893690 3426235 3387678 3640630 3347062
7054 3347062 3108510 2956920 2974459 2613796 2639488 2831346 2614605 3047722 3652832 3232897
7044 3232897 3430344 3424613 3373268 3760221 3933287 3565700 3646136 4182824 4107605 4417243
7034 4417243 4313449 4632344 4810690 4531727 4653231 4931421 4172395 4571009 4742889 4291045
7024 4291045 3831293 3083788 2922481 3203387 2686458 2242238 2383891 2280185 2255215 1965299
7014 1965299 1959230 1800997 1637069 1715164 1794071 2080279 1551843 1632625 1121559 1398274
7004 1398274 1549412 1236614 1391366 1110998 1515696 1490213 1917496 1620164 1531601 1754386
$$ packed form
7076D889600m07258l3874J58877k03295q7308r147l1450l01437R183J68109m31727
7065C720273M7795J9789q2376r3161M0784m24589l34825N32545l8557K52952k93568
7054C347062k38552j51590J7539l60663K5692J91858k16741M33117O05110m19935
7044C232897J97447n731n1345L86953J73066l67587Q0436N36688p5219L09638
7034D417243j03794L18895J78346k78963J21504K78190p59026L98614J71880m51844
7024D291045m59752p47505j61307K80906n16929m44220J41653j03706k4970k89916
7014A965299o069j58233j63928P8095P8907K86208n28436Q0782n11066K76715
7004A398274J51138l12798J54752k80368M04698k5483M27283k97332q8563K22785
$$ plain form
6994 1754386 2086364 2138290 2121742 1649526 1730108 1573442 1252316 982210 1101899 1223238
6984 1223238 1685540 1374241 1107077 1151381 957235 1408009 1134586 862410 1123971 1314861
6974 1314861 1208526 1201045 670908 724263 1106433 443285 44121 647961 857983 573940
6964 573940 583084 729275 597597 487224 501592 322882 189784 207620 844117 635321
6954 635321 221092 431847 66748 398090 348701 807102 752385 786884 716525 376019
6944 376019 -146893 -49814 -7331 -23016 7003 -83488 57199 223070 323309 394640 251843
6933 251843 335840 350071 217652 237130 347698 372005 368976 180932 9722 239203 336121
6922 336121 142532 -160186 298767 473135 342153 243143 282673 648612 634447 376699
$$ packed form
6994A754386L31978N1926j6548m72216Q0582j56666l21126k70106J19689J21339
6984A223238M62302l11299k67164M4304j94146M50774k73423k72176K61561J90890
6974A314861j06335p481n30137N3355L82170o63148l99164O03840K10022k84043
6964E73940R144J46191j31678j10373J4368j78710j33098J7836O36497k08796
6954F35321m14229K10755l65099L31342m9389M58401n4717L4499p0359l40506
6944C76019n22912R7079M2483j5685L0019r0491J40687J65871J00239P1331j42797
6933B51843Q3997J4231j32419J9478J10568K4307l029j88044j71210K29481R6918
6922C36121j93589l02718M58953J74368j30982r9010L9530L65939j4165k57748
$$ plain form
6912 376699 255889 7830 -9768 344141 335248 551549 218616 -170144 -630638 -526415
6902 -526415 -152778 358550 638572 548981 753629 526407 130271 203729 511478 69776
6892 69776 270182 295649 -168689 -543776 -243719 163980 -51498 -64043 -98540 26252
6882 26252 307714 85876 134372 338836 124602 -46398 101230 286802 220912 250758
6872 250758 291620 -320294 -232026 -135694 -136690 -145587 -184386 -121141 -103485 -313366 -209661 -296380
6860 -296380 -119049 -56522 -330968 -256415 -268145 -4302 -104035 -233978 -207144 -36829 62666
6849 62666 90399 216274 -173970 -110108 -133876 -225589 -455014 -54386 -66046 28786 -120629
6838 -120629 -250544 -443624 -389231 70660 -32777 -173320 -100541 284734 216376 -46893
$$ packed form
6912C76699j20810k48059j7598L53909q893K16301l32933l88760m60494J04223
6902e26415L73637N11328K80022q9591K04648k27222l96136P3458L07749m41702
6892F9776K00406K5467m64338l75087L00057M07699k15478j2545l4497J24792
6882B6252K81462k21838M8496K04464k14234j71000J47628J85572o5890K9846
6872B50758M0862o11914Q8268R6332r96q897l8799O3245J7656k09881J03705q6719
6860b96380J77331O2527k74446P4553j1730K63843r9733j29943K6834J70315R9495
6849F2666K7733J25875l90244O3862k3768r1713k29425M00628j1660R4832j49415
6838a20629j29915j93080N4393M59891j03437j40543P2779L85275o8358k63269
$$ plain form
6828 -46893 -38567 -155198 169596 163488 517004 210807 -94798 157555 432987 563605 -44193
6817 -44193 77797 200372 499949 470809 -2117 -210300 42903 97422 173627 -63518
6807 -63518 473896 587014 891175 1112488 986218 763636 507844 613987 1122349 1322096
6797 1322096 1323794 1711343 1992363 2041798 2598667 2726785 2781367 2925274 2715236 2712510 2317102
6786 2317102 2226414 2218311 1931788 1818556 1343410 1091078 1165670 1055775 679637 607945
6776 607945 382311 641821 770595 735817 555655 761850 1007508 631446 363162 424876
6766 424876 768284 944065 1174885 993050 852955 1018512 1289275 1068494 858246 971522
6756 971522 794383 1440447 2223063 2266454 2326821 2653045 2466551 2369122 2797499 2583398
$$ packed form
6828d6893Q326j16631L24794o108L53516l06197l05605K52353K75432J30618o07798
6817d4193J21990J22575K99577k9140m72926k08183K53203N4519P6205k37145
6807f3518N37414J13118L04161K21313j26270k22582k55792J06143N08362J99747
6797A322096J698L87549K81020M9435N56869J28118N4582J43907k10038k726l95408
6786B317102r0688q103k86523j13232m75146k52332P4592j09895l76138p1692
6776F07945k25634K59510J28774l4778j80162K06195K45658l76062k68284O1714
6766D24876L43408J75781K30820j81835j40095J65557K70763k20781k10248J13276
6756I71522j77139O46064P82616M3391O0367L26224j86494r7429M28377k14101
$$ plain form
6746 2583398 2448025 2487617 2444990 2225420 1939641 1477015 1366530 1404435 1272364 1265347
6736 1265347 1174054 1438997 1334951 601514 644014 565143 475228 416459 520859 663581
6726 663581 935894 769509 596951 624792 432685 488872 306472 340547 97719 89655 602044
6715 602044 565341 180645 331847 456429 510028 587523 340889 168831 214569 445521
6705 445521 374871 545314 344087 245310 391190 540251 451595 731862 574425 236311
6695 236311 408610 40186 180336 430406 150212 347824 35717 173546 351052 82856
6685 82856 34364 -111945 -177646 -87471 87802 89232 205172 267878 533190 933232 606793
6674 606793 427881 462421 215728 61466 327920 351671 601768 724506 666396 980448
$$ packed form
6746B583398j35373L9592m2627k19570k85779m62626j10485L7905j32071p017
6736A265347r1293K64943j04046p33437M2500p8871q9915n8769J04400J42722
6726F63581K72313j66385j72558K7841j92107N6187j82400L4075k42828q064N12389
6715F02044l6703l84696J51202J24582N3599P7495k46634j72058M5738K30952
6705D45521p0650J70443k01227r8777J45880J49061q8656K80267j57437l38114
6695B36311J72299l68424J40150K50070k80194J97612l12107J37829J77506k68196
6685H2856m8492j46309o5701R0175J75273J430J15940O2706K65312M00042l26439
6674F06793j78912L4540k46693j54262K66454K3751K50097J22738n8110L14052
$$ plain form
6664 980448 912427 859023 540178 280580 -42757 80504 46809 460365 761373 589574
6654 589574 445851 673451 993486 807215 487896 613767 798878 519903 642190 380299
6644 380299 423465 893035 734361 836373 637857 105153 -53083 492505 385570 222387
6634 222387 276903 580740 -25189 -96823 207722 134819 172680 328595 440657 526279 848833
6623 848833 704015 158120 21448 -98731 145991 120017 178957 459489 559850 271727
6613 271727 80432 77414 246817 489431 326461 643179 973592 1266688 843432 1144622
6603 1144622 1148070 1209266 1775981 1789576 1762302 2018360 2225197 2168784 2267405 2126752 2179736
6592 2179736 2258921 2167161 2518742 2441589 2600300 2763707 2898739 3250328 3606454 3870305
$$ packed form
6664I80448o8021n3404l18845k59598l23337J23261l3695M13556L01008j71799
6654E89574j43723K27600L20035j86271l19319J25871J85111k78975J22287k61891
6644C80299M3166M69570j58674J02012j98516n32704j58236N45588j06935j63183
6634B22387N4516L03837o05929p1634L04545p2903L7861J55915J12062Q5622L22554
6623H48833j44818n45895j36672j20179K44722k5974N8940K80532J00361k88123
6613B71727j91295l018J69403K42614j62970L16718L30413K93096m23256L01190
6603A144622L448O1196N66715J3595k7274K56058K06837n6413R8621j40653N2984
6592B179736P9185r1760L51581p7153J58711J63407J35032L51589L56126K63851
$$ plain form
6582 3870305 3964004 3644579 4056999 4245176 4172181 4384104 4926040 5166044 5706648 5948997
6572 5948997 6255600 6456675 7085554 7836672 8344110 8646751 8865767 9957416 10863391
6563 10863391 11531863 12355564 13128916 13790169 14758961 15271670 15404463 15209885 15031034
6554 15031034 14820557 14171840 13893149 13556685 13489685 13646439 13948885 13542831 13478778 14102524
6544 14102524 14504217 15048363 15715774 17157333 18079492 18643955 19563898 20333383 20852608
6535 20852608 21326621 21232224 21349066 21175043 20647587 20162017 20016768 19625871 18867095 18455913
6525 18455913 18043809 17949156 18455177 18130218 18359114 18411042 18700221 19428167 20160491 21197516
6515 21197516 22615933 24084643 26264132 28124211 30501510 33072622 35584461 38306197
$$ packed form
6582C870305R3699l19425M12420J88177p2995K11923N41936K40004N40604K42349
6572E948997L06603K01075O28879P51118N07438L02641K19016J091649R05975
6563A0863391O68472Q23701P73352O61253R68792N12709J32793j94578j78851
6554A5031034k10477o48717k78691l36464o7000J56754L02446m06054o4053O23746
6544A4102524M01693N44146O67411J441559R22159N64463R19943P69485N19225
6535B0852608M74013r4397J16842j74023n27456m85570j45249l90897p58776m11182
6525A8455913m12104r4653N06021l24959K28896N1928K89179P27946P32324J037025
6515B1197516J418417J468710K179489J860079K377299K571112K511839K721736
$$ plain form
6507 38306197 40352538 41802674 41761927 40955500 39102585 36524961 33455029 30639594 28131276
6498 28131276 26075241 24116664 22755995 21292217 19862083 18892766 17759645 16802938
6490 16802938 15799861 15081453 14502499 13912677 13263445 12628626 12452930 12232680 12442845
6481 12442845 12388850 12111862 11508590 11178627 11382823 11570960 11355015 10894261 10233298 9912534
6471 9912534 9488534 9177836 9480142 8853496 8295135 8018595 7642479 6819765 6730863 7107437
6461 7107437 6621873 6567097 6782401 6794619 6567629 6233082 6146429 6236068 5767978 5810088
6451 5810088 5843685 5886781 5946879 5647819 5727274 5484690 5625869 5401996 5419018 5308479
6441 5308479 4988723 4930626 4500132 4296397 4201312 4226096 4360099 4106869 3992447 4130184
$$ packed form
6507C8306197K046341J450136m0747q06427j852915k577624l069932k815435k508318
6498B8131276k056035j958577j360669j463778j430134r69317j133121r56707
6490A6802938j003077p18408n78954n89822o49232o34819j75696k20250K10165
6481A2442845n3995k76988o03272l29963K04196J88137k15945m60754o60963l20764
6471I912534m24000l10698L02306o26646n58361k76540l76116q22714q8902L76574
6461G107437m85564n4776K15304J2218k26990l34547q6653Q9639m68090M2110
6451E810088L3597M3096O0098k99060P9455k42584J41179k23873J7022j10539
6441E308479l19756n8097m30494k03735r5085K4784J34003k53230j14422J37737
$$ plain form
6431 4130184 4077114 3850357 4014408 4072346 3769751 3521393 3485712 3982609 3686916 3387824
6421 3387824 3259756 3072363 3205157 3206679 2996702 2985316 3040797 2864264 3190311 2839475
6411 2839475 2728886 3129162 3107160 3159237 2917654 2913011 2932221 2934519 2976454 2566577 2433354
6400 2433354 2386129 2718833 2530279 2389934 2751903 2519088 2144650 2185631 2241052 2253246
6390 2253246 2228179 2384223 2369220 1983447 2223219 2097912 1804495 1867898 2127588 2114104
6380 2114104 1960432 2075048 1506646 1389752 2002965 2301999 2261499 2412700 1961115 1586830
6370 1586830 1987943 2240425 2441146 2365245 2202312 2403319 2418027 2239200 2297663 2264634
6360 2264634 2221921 2206800 2196155 1818407 2039198 2043973 2059858 2339931 2332736 1651087 1535169
$$ packed form
6431D130184n3070k26757J64051N7938l02595k48358l5681M96897k95693k99092
6421C387824j28068j87393J32794J522k09977j1386N5481j76533L26047l50836
6411B839475j10589M00276k2002N2077k41583m643J9210K298M1935m09877j33223
6400B433354m7225L32704j88554j40345L61969k32815l74438M0981N5421J2194
6390B253246k5067J56044j5003l85773K39772j25307k93417O3403K59690j3484
6380B114104j53672J14616n68402j16894O13213K99034m0500J51201m51585l74285
6370A586830M01113K52482K00721p5901j62933K01007J4708j78827N8463l3029
6360B264634m2713j5121j0645l77748K20791M775J5885K80073p195o81649j15918
$$ plain form
6349 1535169 1625002 1887478 2269928 2286365 2263416 2211213 2223208 2387604 2690480 2661422 2634168
6338 2634168 2341993 2422129 2678906 2604965 2333596 2467102 2661534 3178889 2963368 2900804
6328 2900804 2697915 2949625 3137300 2695074 2627239 2920996 2977873 3017044 2998357 3056576
6318 3056576 3533212 2938318 3565685 3462743 3359409 3550680 3223235 3360372 3883243 4260923
6308 4260923 4223546 4165788 3989279 4291641 4128917 4037480 4078568 4259528 3950149 3930777
6298 3930777 4009909 3843829 4295406 4561602 4854229 4866749 4618878 4707177 5108594 5501039
6288 5501039 5791610 5656338 5642490 5823924 6523675 7223468 7388612 7312527 7823736 8152532
6278 8152532 8075402 8383635 8309260 8494079 8745681 8649224 8838370 9337489 9389820 9226985
$$ packed form
6349A535169Q9833K62476L82450J6437k2949n2203J1995J64396L02876k9058k7254
6338B634168k92175Q0136K56777p3941k71369J33506J94432N17355k15521o2564
6328B900804k02889K51710J87675m42226o7835K93757N6877L9171j8687N8219
6318C056576M76636n94894O27367j02942j03334J91271l27445J37137N22871L77680
6308D260923l7377n7758j76509L02362j62724r1437M1088J80960l09379j9372
6298C930777P9132j66080M51577K66196K92627J2520k47871Q8299M01417L92445
6288E501039K90571j35272j3848J81434O99751O99793J65144p6085N11209L28796
6278H152532p7130L08233p4375J84819K51602r6457J89146M99119N2331j62835
$$ plain form
6268 9226985 9562914 9624818 9744748 9608254 9446416 9430518 9680520 9475846 9794189 9504516
6258 9504516 9476564 9664977 9554290 9804230 10076957 10466129 10916765 11713398 12216598 12893221
6248 12893221 13436796 13328715 13478958 13298543 12517049 11772566 10824848 10345722 10195797
6239 10195797 9805367 9327660 9565473 9572305 9557765 9373679 9275943 8714771 8880354 8877907
6229 8877907 8478773 8674671 9129897 8895294 9443404 9806799 9749573 9984561 10332033 10745979
6219 10745979 11402855 11821269 11767573 12159624 12366513 12294968 12441728 12739502 12419571 12292943
6209 12292943 12075137 11674498 11344380 11518629 11915388 12203891 12175702 12370779 12919965 12823733
6199 12823733 13035899 13123575 12894301 12658852 12921798 13287538 13317316 13393301 13469436 13944279
$$ packed form
6268I226985L35929O1904J19930j36494j61838j5898K50002k04674L18343k89673
6258I504516k7952J88413j10687K49940K72727L89172M50636P96633N03200O76623
6248A2893221N43575j08081J50243j80415p81494p44483r47718m79126j49925
6239A0195797l90430m77707K37813O832j4540j84086r7736n61172J65583k447
6229H877907l99134J95898M55226k34603N48110L63395n7226K34988L47472M13946
6219A0745979O56876M18414n3696L92051K06889p1545J46760K97774l19931j26628
6209A2292943k17806m00639l30118J74249L96759K88503k8189J95077N49186r6232
6199A2823733K12166Q7676k29274k35449K62946L65740K9778P5985P6135M74843
$$ plain form
6189 13944279 14320604 14509727 14266711 14211201 14217444 14458552 15116318 14979188 14971939 15097498
6179 15097498 15244856 15458710 15184495 15387993 15636495 15460480 15176388 15592665 16576075
6170 16576075 16419648 16479999 16778501 16685312 16809472 16941915 17786716 18282125 17872196 17883278
6160 17883278 18649351 19131585 19069772 19266857 19556121 19984717 20064771 19859486 19740795 19704052
6150 19704052 19407980 19123455 19148647 19170734 19132154 19273471 19350628 19379473 19153224 19464486
6140 19464486 19658481 20224040 20813609 20967870 21578474 22005929 23253961 24267202 25720681
6131 25720681 27081096 28713678 30381941 32314290 34532676 37180691 40471263 43767887
6123 43767887 46588765 49328863 51947921 54000180 54762547 54460244 52789300 51304932
$$ packed form
6189A3944279L76325J89123k43016n5510O243K41108O57766j37130p249J25559
6179A5097498J47358K13854k74215K03498K48502j76015k84092M16277R83410
6170A6576075j56427O0351K98502r3189J24160J32443Q44801M95409m09929J1082
6160A7883278P66073M82234o1813J97085K89264M28596Q0054k05285j18691l6743
6150A9704052k96072k84525K5192K2087l8580J41317P7157K8845k26249L11262
6140A9464486J93995N65559N89569J54261O10604M27455J248032J013241J453479
6131B5720681J360415J632582J668263J932349K218386K648015L290572L296624
6123D3767887K820878K740098K619058K052259P62367l02303j670944j484368
$$ plain form
6115 51304932 50075715 48199846 46417196 45096069 44609356 44414679 44637988 45167694 45935053
6106 45935053 46845158 48075127 50097305 52758404 54720030 57310821 61210205 65864911
6098 65864911 71214241 76604528 82691541 88140236 92867004 97606484 100833023 101583409
6090 101583409 100246811 96240417 90887656 85695930 80412443 75478271 71546800 68395804
6082 68395804 65711874 63842793 61916220 60366443 59588174 59070186 58629895 58421940 59129794
6073 59129794 60049175 61166261 62836869 64852930 66644550 68769065 70588204 71848897
6065 71848897 72663171 72948420 71778013 69256159 66605578 62919211 59504179 56476039
6057 56476039 53220727 50677184 48619506 46527230 44539787 42828253 41422323 39930567
$$ packed form
6115E1304932j229217j875869j782650j321127m86713j94677K23309N29706P67359
6106D5935053R10105J229969K022178K661099J961626K590791L899384M654706
6098F5864911N349330N390287O087013N448695M726768M739480L226539P50386
6090A01583409j336598m006394n352761n191726n283487m934172l931471l150996
6082F8395804k683930j869081j926573j549777p78269n17988m40291k07955P07854
6073E9129794R19381J117086J670608K016061J791620K124515J819139J260693
6065G1848897Q14274K85249j170407k521854k650581l686367l415032l028140
6057E6476039l255312k543543k057678k092276j987443j711534j405930j491756
$$ plain form
6049 39930567 38555843 36825690 35569223 34936304 34128889 32616600 32106159 31316331 30642626
6040 30642626 30008088 29723208 29207572 28883903 28305711 27681216 27057552 26450386 25999262
6031 25999262 25619666 25179865 24538703 24354983 24389377 24371622 24122084 23978414 23697417 23890607
6021 23890607 23795189 23703036 24135566 24249536 23784370 24033446 24189210 24130532 24502110 24992369
6011 24992369 25371163 25603075 25869694 26124673 26708397 26773734 27034316 26890449 26692460 27328561
6001 27328561 27108553 26701975 26587218 26775289 26185617 26192659 26371118 26304098 26039423 25774380
5991 25774380 25534800 25164207 25125603 25198098 25191753 25159585 25431143 25446168 26037597 26779186
5981 26779186 27081619 27986253 28764435 29076369 29995222 30528563 31042431 31783144 32176281
$$ packed form
6049C9930567j374724j730153j256467o32919q07415j512289n10441p89828o73705
6040C0642626o34538k84880n15636l23669n78192o24495o23664o07166m51124
6031B5999262l79596m39801o41162j83720L4394j7755k49538j43670k80997J93190
6021B3890607r5418r2153M32530J13970m65166K49076J55764n8678L71578M90259
6011B4992369L78794K31912K66619K54979N83724O5337K60582j43867j97989O36101
6001B7328561k20008m06578j14757J88071n89672P042J78459o7020k64675k65043
5991B5774380k39580l70593l8604P2495o345l2168K71558J5025N91429P41589
5981B6779186L02433R04634P78182L11934R18853N33341N13868P40713L93137
$$ plain form
5972 32176281 32903299 33443118 33961705 34198462 34192867 33981215 34091456 34363695 33842926 33259980
5962 33259980 32466106 31836873 32023241 31781678 31284793 31286237 31525023 31227224 31067434 31301234
5952 31301234 31503879 31657218 31826661 32095465 32861573 33256054 33538611 33939227 34054027
5943 34054027 34208219 34073123 33845112 33708067 33740571 33517083 33417278 32849124 32646915 32027641
5933 32027641 31350178 30829956 29983551 29546291 29060809 28458990 28076913 28013855 28277356 28740729
5923 28740729 28849305 29362517 29575608 29963375 30608752 30962647 31355662 31892555 32519106
5914 32519106 33232565 33715972 34212565 34073707 33921446 33451350 32885772 32692619 32013991
5905 32013991 31218464 30305489 29525110 28698328 27701955 27429651 27214922 26620027 26142459
$$ packed form
5972C2176281P27018N39819N18587K36757n595k11652J10241K72239n20769n82946
5962C3259980p93874o29233J86368k41563m96885J444K38786k97799j59790K33800
5952C1301234K02645J53339J69443K68804P66108L94481K82557M00616J14800
5943C4054027J54192j35096k28011j37045L2504k23488r9805n68154k02209o19274
5933C2027641o77463n20222q46405m37260m85482o01819l82077o3058K63501M63373
5923B8740729J08576N13212K13091L87767O45377L53895L93015N36893O26551
5914C2519106P13459M83407M96593j38858j52261m70096n65578j93153o78628
5905C2013991p95527r12975p80379q26782r96373k72304k14729n94895m77568
$$ plain form
5896 26142459 25498197 25347051 25168795 24797356 24584992 24212416 23740901 23848906 23700308
5887 23700308 23354471 23353105 23460742 23787490 23847264 23808576 24040871 24249091 24203060 23806780
5877 23806780 23314549 23110477 22708317 21939656 21647750 21132854 20814426 20287898 20202023 19886838
5867 19886838 19400295 19016544 18855835 18780560 18575809 18263860 18013875 17759159 17595091 17376131
5857 17376131 16923147 16321904 15923019 15619512 15395062 15661932 15016094 14347782 13875133
5848 13875133 13745453 13497768 13341941 13145151 13130262 13062574 13034876 12972447 13059782 13220819
5838 13220819 12888369 12597210 12418134 12290875 12094458 12201502 11827547 11780079 11900361 11896176
5828 11896176 11633674 11508771 11556026 11299149 11283229 10485210 10406881 10358046 9713996 9645790
$$ packed form
5896B6142459o44262j51146j78256l71439k12364l72576m71515J08005j48598
5887B3700308l45837j366J07637L26748N9774l8688K32295K08220m6031l96280
5877B3806780m92231k04072m02160p68661k91906n14896l18428n26528q5875l15185
5867A9886838m86543l83751j60709p5275k04751l11949k49985k54716j64068k18960
5857A7376131m52984o01243l98885l03507k24450K66870o45838o68312m72649
5848A3875133j29680k47685j55827j96790j4889o7688k7698o2429Q7335J61037
5838A3220819l32450k91159j79076j27259j96417J07044l73955m7468J20282m185
5828A1896176k62502j24903M7255k56877j5920p98019p8329m8835o44050o8206
$$ plain form
5818 9645790 10154366 10035011 9546867 9638682 9582604 9329965 9208130 9128462 9157571 8745812
5808 8745812 8582752 8642757 8840775 8312086 8308237 8589297 8354902 7967115 7877323 8090521
5798 8090521 8219778 8134980 7720006 7835826 7637706 7866351 8049061 8095669 8103974 8187029
5788 8187029 8387350 8324129 8323027 9036463 9036509 9028969 9417877 9358112 9390800 9609947 10127299
5777 10127299 9663611 9591302 9719838 9668685 9389890 9272990 9680907 9967404 9895532 10117578
5767 10117578 10109633 9835631 10003789 9968669 10273458 10328006 10318689 10273516 10814487 10752748 10688408
5756 10688408 11151092 11736425 11756538 11649898 12421619 13145692 13334020 13586474 13609293 13737614
5746 13737614 13292667 13024573 13071523 12931468 13049077 13165872 13255177 12974493 12943310 12688666
$$ packed form
5818I645790N08576j19355m88144R1815n6078k52639j21835p9668K9109m11759
5808H745812j63060O0005J98018n28689l849K81060k34395l87787q9792K13198
5798H090521J29257q4798m14974J15820j98120K28645J82710M6608Q305Q3055
5788H187029K00321o3221j102P13436M6p540L88908n9765L2688K19147N17352
5777A0127299m63688p2309J28536n1153k78795j16900M07917K86497p1872K22046
5767A0117578p945k74002J68158l5120L04789N4548r317m5173N40971o1739o4340
5756A0688408M62684N85333K0113j06640P71721P24073J88328K52454K2819J28321
5746A3737614m44947k68094M6950j40055J17609J16795Q9305k80684l1183k54644
$$ plain form
5736 12688666 12769871 13080022 13425097 13487668 14051756 14877672 14793932 14774152 15729840 16381661
5726 16381661 17308176 17522436 18295068 19424270 20124972 20886599 20942004 21442005 20587518
5717 20587518 19811731 19917266 19619180 18825552 18462612 17972657 17771612 17599074 17383492
5708 17383492 17236234 17254759 17686103 17880292 17731621 18116759 18260100 18561125 19292022 19892473
5698 19892473 20937331 21565510 22155146 23521325 24702495 25864021 26447782 27332434 28341238
5689 28341238 28734243 29123780 28801386 27899892 27278257 26731984 25728758 25160246 24326827
5680 24326827 23504647 23270988 22719773 22523023 23188244 22982560 22987883 22956673 22953772 23675668
5670 23675668 23669700 23882735 24437166 24858900 25396354 26060679 26820578 28119926 28938954 29738077
$$ packed form
5736A2688666Q1205L10151L45075O2571N64088Q25916q3740j9780R55688O51821
5726A6381661R26515K14260P72632J129202P00702P61627N5405N00001q54487
5717B0587518p75787J05535k98086p93628l62940m89955k01045j72538k15582
5708A7383492j47258J8525M31344J94189j48671L85138J43341L01025P30897O00451
5698A9892473J044858O28179N89636J366179J181170J161526N83761Q84652J008804
5689B8341238L93005L89537l22394r01494o21635n46273j003226n68512q33419
5680B4326827q22180k33659n51215j96750O65221k05684N323l1210k901P21896
5670B3675668n968K13035N54431M21734N37454O64325P59899J299348Q19028P99123
$$ plain form
5660 29738077 31129800 32076417 33250316 34047138 34579179 34953128 35451941 35585636 36016168
5651 36016168 36489684 37435309 38553056 39650922 41190105 43104963 45443987 48115437
5643 48115437 50805347 53993541 57612100 61579437 65930027 70736508 76032063 80853519
5635 80853519 85023430 88654323 91226371 92965488 93201716 94050766 94765175 95781414 97882429
5626 97882429 100633370 104508750 109366920 115247821 122452557 130399908 138563756 147921462
5618 147921462 158239089 169133820 180958591 192798286 204335827 216618093 228458218
5611 228458218 239597692 248719000 255298108 259911004 261986129 260620786 254996637 246330542
5603 246330542 235696677 224296689 213495485 203823723 194721985 186358718 179598289 172696305
$$ packed form
5660B9738077J391723R46617J173899P96822N32041L73949M98813J33695M30532
5651C6016168M73516R45625J117747J097866J539183J914858K339024K671450
5643D8115437K689910L188194L618559L967337M350590M806481N295555M821456
5635H0853519M169911L630893K572048J739117K36228Q49050P14409J016239K101015
5626I7882429K750941L875380M858170N880901P204736P947351Q163848R357706
5618A47921462J0317627J0894731J1824771J1839695J1537541J2282266J1840125
5611B28458218J1139474R121308O579108M612896K075125j365343n624149q666095
5603B46330542j0633865j1399988j0801204r671762r101738q363267o760429o901984
$$ plain form
5595 172696305 166845686 161844549 157465795 153278953 149342299 146008622 142869712 139534256
5587 139534256 136440712 133375680 130198334 127613168 125194038 122665672 120363090 118074270
5579 118074270 115155479 111671675 107337157 102209675 96384798 90715270 85532469 80505919
5571 80505919 76395717 72765937 69969216 66795077 63886323 61845707 60292985 58194851
5563 58194851 56406697 55285940 54268033 53257535 51871850 50940935 49988210 49119869 48359500
5554 48359500 47448211 46754364 45936985 44716432 43860709 43212295 42225946 41375529 40231034
5545 40231034 39500626 38510644 37401964 36768230 36082035 34943178 34206161 33232595 32378636
5536 32378636 31826582 30892987 30593530 29547133 28152666 27508949 27127811 26146860 25578831
$$ packed form
5595A72696305n850619n001137m378754m186842l936654l333677l138910l335456
5587A39534256l093544l065032l177346k585166k419130k528366k302582k288820
5579A18074270k918791l483804m334518n127482n824877n669528n182801n026550
5571H0505919m110202l629780k796721l174139k908754k040616j552722k098134
5563E8194851j788154j120757j017907j010498j385685r30915r52725q68341p60369
5554D8359500r11289o93847q17379j220553q55723o48414r86349q50417j144495
5545D0231034p30408r89982j108680o33734o86195j138857p37017r73566q53959
5536C2378636n52054r33595k99457j046397j394467o43717l81138r80951n68029
$$ plain form
5527 25578831 25086691 24171903 23414669 23220252 23044480 22622674 22402210 21834803 21450611
5518 21450611 21340075 21255884 21111372 20843803 20812972 21139920 21731085 21791709 22170119 22653038
5508 22653038 23142687 23684761 23934686 23530449 23389695 22764464 22060350 21627241 21034194
5499 21034194 20516018 20511679 20166618 19320880 19396078 19601314 19823880 19313218 19426256 19802508
5489 19802508 20186035 20935197 21386756 22240564 23509957 25141104 26402553 27645936 29219503
5480 29219503 30626075 31553606 32003687 31788327 30681933 28883105 27094576 25884984 25282381
5471 25282381 24198335 23453734 22632797 22069423 22084463 21890634 21850415 21759077 21904753 22242080
5461 22242080 23165788 23488117 24515558 25788264 27271699 29399808 31791720 33904351
$$ packed form
5527B5578831m92140r14788p57234j94417j75772m21806k20464n67407l84192
5518B1450611j10536q4191j44512k67569l0831L26948N91165O0624L78410M82919
5508B2653038M89649N42074K49925m04237j40754o25231p04114m33109n93047
5499B1034194n18176m339l45061q45738P5198K05236K22566n10662J13038L76252
5489A9802508L83527P49162M51559Q53808J269393J631147J261449J243383J573567
5480B9219503J406572R27531M50081k15360j106394j798828j788529j209592o02603
5471B5282381j084046p44601q20937n63374J5040j93829m0219r1338J45676L37327
5461B2242080R23708L22329J027441J272706J483435K128109K391912K112631
$$ plain form
5453 33904351 34940225 36227720 37505312 38023266 37136332 35467439 33013762 30826667
5445 30826667 28976078 27119629 26218148 25167331 24014614 23022843 22565566 22115163 21307472
5436 21307472 21150081 20941874 21098779 21464382 21932889 22330592 23157383 24447687 25865097
5427 25865097 27152409 28528768 29595711 30152008 31022850 31053065 29698631 28095622 26110121
5418 26110121 24390919 23127241 21817850 20900948 19746813 18774874 18370702 17716652 17624676
5409 17624676 17257167 16575685 16051900 15691539 15698456 15818608 16175367 16358819 16633497 16876120
5399 16876120 17018104 17334195 17882509 17920066 17755435 17464709 16735321 15826145 14944386 14460201
5389 14460201 13552806 12876003 12454561 12134552 11833117 10895896 10106566 10081519 9857076 9613971
$$ packed form
5453C3904351J035874J287495J277592N17954q86934j668893k453677k187095
5445C0826667j850589j856449r01481j050817j152717r91771m57277m50403q07691
5436B1307472j57391k08207J56905L65603M68507L97703Q26791J290304J417410
5427B5865097J287312J376359J066943N56297Q70842L0215j354434j603009j985501
5418B6110121j719202j263678j309391r16902j154135r71939m04172o54050r1976
5409A7624676l67509o81482n23785l60361O917J20152L56759J83452K74678K42623
5399A6876120J41984L16091N48314L7557j64631k90726p29388r09176q81759m84185
5389A4460201r07395o76803m21442l20009l01435r37221p89330k5047k24443k43105
$$ plain form
5379 9613971 9448037 9405024 9387173 9111042 9044585 9112882 9188255 8438981 8244380 8680326
5369 8680326 9030504 8754606 7927611 8046743 8253009 7998376 7855273 7679921 7739799 7838512
5359 7838512 7730217 7404082 7130447 6844273 7277655 7523736 7311562 7137034 6842432 6643505
5349 6643505 6668452 6292774 6304632 6474488 6526233 6374279 6550413 6555362 6520698 6012917 5801971
5338 5801971 5743149 5723374 5520902 5608364 5721731 5651411 6262329 6145964 5486790 5580872
5328 5580872 5579057 5473444 5384022 5930531 6692187 6420846 5849448 5748207 6017271 5985216
5318 5985216 6288029 6450322 6735929 6414020 6246877 6646020 6737702 6695598 6535393 6586455
5308 6586455 6160096 5917509 6066923 6333406 6468696 6253529 6219092 6753479 6855134 6666447
$$ packed form
5379I613971j65934m3013j7851k76131o6457O8297P5373p49274j94601M35946
5369H680326L50178k75898q26995J19132K06266k54633j43103j75352N9878R8713
5359G838512j08295l26135k73635k86174M33382K46081k12174j74528k94602j98927
5349F643505K4947l75678J1858J69856N1745j51954J76134M949l4664n07781k10946
5338E801971n8822j9775k02472Q7462J13367p0320O10918j16365o59174R4082
5328E580872j815j05613q9422N46509P61656k71341n71398j01241K69064l2055
5318E985216L02813J62293K85607l21909j67143L99143R1682m2104j60205N1062
5308F586455m26359k42587J49414K66483J35290k15167l4437N34387J01655j88687
$$ plain form
5298 6666447 6650046 6418550 6704304 6526957 6584678 6540315 6680379 6663091 6406079 6378578
5288 6378578 6289101 6651876 6763746 6477908 6308493 6045648 6404682 6287787 6140466 6041298
5278 6041298 6138059 6422880 6825411 6762199 6915532 7439951 6642156 6141714 6608364 6258916
5268 6258916 6393216 6587850 7199529 7683583 7018814 6707881 7201385 7337471 7366289 7339366
5258 7339366 7394216 7462363 8188770 8494895 8737791 8764159 8830387 9140789 9061551 9272655
5248 9272655 9514978 9921062 10298929 10870657 11224506 11540902 12263404 12797580 12912067 13095248
5238 13095248 13060268 12844921 11990442 11803185 11188332 10701515 10111391 9623951 9369645 9541207
5228 9541207 9577896 9413065 9467110 9404527 9032334 9033288 9021660 8937558 9032682 9280200 9646045
$$ packed form
5298F666447j6401k31496K85754j77347N7721m4363J40064j7288k57012k7501
5288F378578q9477L62775J11870k85838j69415k62845L59034j16895j47321r9168
5278F041298R6761K84821M02531o3212J53333N24419p97795n00442M66650l49448
5268F258916J34300J94634O11679M84054o64769l10933M93504J36086K8818k6923
5258G339366N4850O8147P26407L06125K42896K6368O6228L10402p9238K11104
5248I272655K42323M06084L77867N71728L53849L16396P22502N34176J14487J83181
5238A3095248l4980k15347q54479j87257o14853m86817n90124m87440k54306J71562
5228I541207L6689j64831N4045o2583l72193R54j1628q4102R5124K47518L65845
$$ plain form
5217 9646045 10073723 10533393 10661560 11262867 11792609 12664047 13475068 13595454 14075790 15120010
5207 15120010 15566551 15790112 15963741 16003853 15366853 14664033 13881136 12993541 12093917 11736440
5197 11736440 11950920 11168423 10841837 10422060 10590284 10546841 10060620 9371447 9460978 9638972
5187 9638972 9190457 9386357 10070783 10246759 10070597 10285017 10609126 10735238 10903123 11245546
5177 11245546 11246787 11138646 11412588 11643468 11707591 11671953 11672548 11769065 12122879 12303775 12369802
5166 12369802 12178382 12410173 12812435 12700594 12967082 13147216 13480578 13399133 14055289 14044094
5156 14044094 14420938 15311473 15982247 16375867 16732640 17601439 18651949 19217791 20101427
5147 20101427 20907205 21821334 23018740 23103375 23533235 24078100 24569407 24418048 23972908
$$ packed form
5217I646045M27678M59670J28167O01307N29742Q71438Q11021J20386M80336J044220
5207A5120010M46541K23561J73629M0112o37000p02820p82897q87595q99624l57477
5197A1736440K14480p82497l26586m19777J68224m3443m86221o89173Q9531J77994
5187I638972m48515J95900O84426J75976j76162K14420L24109J26112J67885L42423
5177A1245546J241j08141K73942K30880O4123l5638N95R6517L53814J80896O6027
5166A2369802j91420K31791M02262j11841K66488J80134L33362q1445O56156j1195
5156A4044094L76844Q90535O70774L93620L56773Q68799J050510N65842Q83636
5147B0101427Q05778R14129J197406Q4635M29860N44865M91307j51359m45140
$$ plain form
5138 23972908 23333574 23107932 22789807 22393339 22109289 21763636 22069226 21530344 21335156
5129 21335156 21497274 21193431 21073139 21232597 22259542 22103344 21701392 22055895 21715371
5120 21715371 21736446 21462745 21425595 21157648 20585738 20358465 19897488 19482604 19190174 19113962
5110 19113962 18784697 18429746 18208018 18397305 18225890 18080959 18065410 17997216 17794922 17621797
5100 17621797 17405295 16970801 16819727 16652915 16871317 16527131 16135795 16258596 16411090
5091 16411090 15968552 15895751 15957799 16140085 16450701 16268285 16413026 16819881 17082090 16689692
5081 16689692 16575136 16592187 16258537 16040844 16044344 15883130 15749970 15557422 15266431 15532402
5071 15532402 15251449 15238572 15063077 15293108 15135122 14921986 15040389 14834010 14827241 14841649
$$ packed form
5138B3972908o39334k25642l18125l96468k84050l45653L05590n38882j95188
5129B1335156J62118l03843j20292J59458J026945j56198m01952L54503l40524
5120B1715371K1075k73701l7150k67947n71910k27273m60977m14884k92430p6212
5110A9113962l29265l54951k21728J89287j71415j44931j5549o8194k02294j73125
5100A7621797k16502m34494j51074j66812K18402l44186l91336J22801J52494
5091A6411090m42538p2801O2048J82286L10616j82416J44741M06855K62209l92398
5081A6689692j14556J7051l33650k17693L500j61214j33160j92548k90991K65971
5071A5532402k80953j2877j75495K30031j57986k13136J18403k06379o769J4408
$$ plain form
5061 14841649 14351834 14304444 14256334 14255129 14527921 14573454 14764085 14761492 14751398 14694394 14648518
5050 14648518 14773892 15112963 15270161 15544924 15465223 15615415 16215050 16439550 16277763 17274518
5040 17274518 17703082 17517090 17745849 18115035 18288286 18674607 19134718 19744537 20054859
5031 20054859 20165643 20254642 20739083 21170022 22165343 23033987 23385031 23721437 24282476 25061240
5021 25061240 25365602 26005063 27410539 28028400 29236344 30827501 32715139 34643828 36634363
5012 36634363 38159008 39859923 41389668 42432221 43555502 43291601 43043790 43072380 42771464
5003 42771464 42424745 42743606 43091970 43304457 43922571 44708056 45082180 45894582 46465451
4994 46465451 47053875 48053677 48359928 48606177 49275270 50146875 51709297 52674211 53840174
$$ packed form
5061A4841649m89815m7390m8110j205K72792M5533J90631k593j0094n7004m5876
5050A4648518J25374L39071J57198K74763p9701J50192N99635K24500j61787R96755
5040A7274518M28564j85992K28759L69186J73251L86321M60111O09819L10322
5031B0054859J10784Q8999M84441M30939R95321Q68644L51044L36406N61039P78764
5021B5061240L04362O39461J405476O17861J207944J591157J887638J928689J990535
5012C6634363J524645J700915J529745J042553J123281k63901k47811K8590l00916
5003D2771464l46719L18861L48364K12487O18114P85485L74124Q12402N70869
4994D6465451N88424R99802L06251K46249O69093Q71605J562422R64914J165963
$$ plain form
4985 53840174 54737664 56085209 57212328 58119064 59623569 61281717 62169005 63283144 64144068
4976 64144068 65037454 66672940 67860981 69399281 71108651 72906967 74442619 75704290
4968 75704290 77537979 79457468 81326204 83061718 85294600 87369550 89513564 91343897
4960 91343897 93343513 95528092 97157563 99431436 101038582 102429963 103815168 105502284
4952 105502284 106860794 108417777 110088195 112034743 115032890 117800754 120405481 123166983
4944 123166983 126036643 128905199 131230402 133845906 136049031 137839329 139543157 140985099
4936 140985099 141995660 142117600 142566821 142856081 142978815 142843319 143263104 143768392 144646245
4927 144646245 145930422 147682932 149801262 152148653 154940533 156740759 157997775 158810130
$$ packed form
4985E3840174Q97490J347545J127119R06736J504505J658148Q87288J114139Q60924
4976F4144068Q93386J635486J188041J538300J709370J798316J535652J261671
4968G5704290J833689J919489J868736J735514K232882K074950K144014J830333
4960I1343897J999616K184579J629471K273873J607146J391381J385205J687116
4952A05502284J358510J556983J670418J946548K998147K767864K604727K761502
4944A23166983K869660K868556K325203K615504K203125J790298J703828J441942
4936A40985099J010561J21940M49221K89260J22734j35496M19785N05288Q77853
4927A44646245J284177J752510K118330K347391K791880J800226J257016Q12355
$$ plain form
4919 158810130 159152185 158251975 155575882 153072325 149598517 145309863 141021978 137358404
4911 137358404 134037612 131021515 129437261 128307925 127817959 128351327 129930238 131085042
4903 131085042 132128008 133481091 134050948 133812452 131835439 128495836 124507936 120464364
4895 120464364 117229765 113546271 110509918 108230400 105679653 103696618 102238530 101168389
4887 101168389 99807981 98701484 98607018 98660233 98383868 98645568 99420105 99807485 100668364
4878 100668364 101131063 101553323 101273764 101160306 101229895 100879886 100920494 101324871 101025294 100963111
4868 100963111 101673640 102028704 102281379 102126970 101815220 101232986 100185997 98943805 97989824
4859 97989824 96526840 95290616 94086324 92606896 90618710 89015344 87978497 86691442
$$ packed form
4919A58810130L42055r00210k676093k503557l473808m288654m287885l663574
4911A37358404l320792l016097j584254j129336m89966N33368J578911J154804
4903A31085042J042966J353083N69857k38496j977013l339603l987900m043572
4895A20464364l234599l683494l036353k279518k550747j983035j458088j070141
4887A01168389j360408j106497r4466N3215k76365K61700P74537L87380Q60879
4878A00668364M62699M22260k79559j13458O9589l50009M0608M04377k99577o2183
4868A00963111P10529L55064K52675j54409l11750n82234j046989j242192r53981
4859I7989824j462984j236224j204292j479428j988186j603366j036847j287055
$$ plain form
4851 86691442 85882340 84476748 82867109 81247551 80151232 78874680 77522181 75984159
4843 75984159 74908360 73748277 72528719 71140010 69736838 69344979 68327870 67111170
4835 67111170 66178517 65405337 64544671 63179688 62011225 61050952 60387559 59283638 58303809
4826 58303809 57740541 56880785 56233042 56124568 55637588 54748812 54429342 54000704 53733340
4817 53733340 53716471 53446913 53167382 53127970 53086318 52378906 52248514 51483850 50794129 50983035
4807 50983035 51011512 51276419 50884518 50596481 50318393 49729810 49531002 50013086 50182249 50016138
4797 50016138 50166634 50121558 49975430 50220559 49719566 49477337 49687521 50042920 50381865 50128409
4787 50128409 50195978 49935966 49984655 50579444 51027002 51295813 51435431 51457213 51673351 52276400
$$ packed form
4851H6691442q09102j405592j609639j619558j096319j276552j352499j538022
4843G5984159j075799j160083j219558j388709j403172l91859j017109j216700
4835F7111170r32653p73180q60666j364983j168463r60273o63393j103921r79829
4826E8303809n63268q59756o47743j08474m86980q88776l19470m28638k67364
4817E3733340j6869k69558k79531l9412m1652p07412j30392p64664o89721J88906
4807E0983035K8477K64907l91901k88037k78088n88583j98808M82084J69163j66111
4797E0016138J50496m5076j46128K45129n00993k42229K10184L55399L38945k53456
4787E0128409O7569k60012M8689N94789M47558K68811J39618K1782K16138O03049
$$ plain form
4777 52276400 52747319 52824476 53080095 53628758 53476299 53486886 54004911 54874027 55081862 55197259
4767 55197259 55449450 56198100 56177823 56684056 57186920 57806170 58342106 58375279 58628901 59062738
4757 59062738 59280403 59436109 59778670 60347656 61108278 61731856 62529023 63254645 63497700
4748 63497700 63716620 63943559 64300649 64473042 64026779 64033102 63924661 63642555 63894787 63350347
4738 63350347 63193790 63298464 63346498 64029986 64328180 64489288 64915986 65365632 65779129 66147095
4728 66147095 65819446 65996465 66619072 67011527 67451241 68040206 68269569 68885107 69885267
4719 69885267 70446712 71115991 71314516 71597839 71245020 71363536 71463642 70989795 70312479
4710 70312479 69471980 68763232 67469021 66580840 66154759 65679084 65176104 64754040 64444838
$$ packed form
4777E2276400M70919P7157K55619N48663j52459J0587N18025Q69116K07835J15397
4767E5197259K52191P48650k0277N06233N02864O19250N35936L3173K53622M33837
4757E9062738K17665J55706L42561N68986P60622O23578P97167P25622K43055
4748F3497700K18920K26939L57090J72393m46263O323j08441k82106K52232n44440
4738F3350347j56557J04674M8034O83488K98194J61108M26698M49646M13497L67966
4728F6147095l27649J77019O22607L92455M39714N88965K29363O15538J000160
4719F9885267N61445O69279J98525K83323l52819J18516J00106m73847o77316
4710G0312479q40499p08748j294211q88181m26081m75675n02980m22064l09202
$$ plain form
4701 64444838 64020054 64015929 63969551 63560988 64154715 64232063 64495344 64865419 64818596 64807972
4691 64807972 65311399 65343583 66102737 66707959 67424570 68135210 68995688 69546800 69971746 70703482
4681 70703482 71560349 71844921 72504259 73523317 74264063 74877779 75898814 77125519 79012558
4672 79012558 81275444 83987038 86735465 90504554 94400954 98641249 103472105 108735440
4664 108735440 114930712 121798684 129959609 138987728 149537671 161440085 174945182 190383656
4656 190383656 207564587 226682400 247816037 270769621 294789944 318032237 337931947
4649 337931947 354411258 367608878 376648887 379022250 371080683 355830866 337626323
4642 337626323 320157300 304345736 289444100 274824749 260939695 246814605 232566024
$$ packed form
4701F4444838m24784m125m6378m08563N93727P7348K63281L70075m6823j0624
4691F4807972N03427L2184P59154O05222P16611P10640Q60478N51112M24946P31736
4681G0703482Q56867K84572O59338J019058P40746O13716J021035J226705J887039
4672G9012558K262886K711594K748427L769089L896400M240295M830856N263335
4664A08735440O195272O867972Q160925R028119J0549943J1902414J3505097J5438474
4656A90383656J7180931J9117813K1133637K2953584K4020323K3242293J9899710
4649C37931947J6479311J3197620R040009K373363p941567j5249817j8204543
4642C37626323j7469023j5811564j4901636j4619351j3885054j4125090j4248581
$$ plain form
4635 232566024 218979722 206032332 194176889 183592988 173861708 164966349 156641946
4628 156641946 149315656 142697006 136984080 131744244 127320043 123651328 120406023 117772093
4620 117772093 115454505 113233188 111158502 108737879 106303586 103602440 100060949 96359872
4612 96359872 92863771 90161618 87632828 85104121 82572876 80663846 79442549 78004402
4604 78004402 76799403 75183649 73677774 72167372 70745529 68795144 66300594 64061627
4596 64061627 61414997 59213780 56967272 54516244 52734946 51210515 49816590 48354706
4588 48354706 47586883 46297624 45110666 44051601 43285058 42676496 42011929 41553079 40996786
4579 40996786 40132564 39796172 39162396 38574473 38155558 37840016 37744461 37903378 37845872 37929377
$$ packed form
4635B32566024j3586302j2947390j1855443j0583901r731280q895359q324403
4628A56641946p326290o618650n712926n239836m424201l668715l245305k633930
4620A17772093k317588k221317k074686k420623k434293k701146l541491l701077
4612I6359872l496101k702153k528790k528707k531245j909030j221297j438147
4604G8004402j204999j615754j505875j510402j421843j950385k494550k238967
4596F4061627k646630k201217k246508k451028j781298j524431j393925j461884
4588D8354706p67823j289259j186958j059065p66543o08562o64567m58850n56293
4579D0996786q64222l36392o33776n87923m18915l15542r5555J58917n7506Q3505
$$ plain form
4569 37929377 37990017 38044526 38411209 38460277 38620937 39218279 39967645 40016482 40422478 41169569
4559 41169569 41748111 43092680 44941293 46470673 48079826 50266440 52532682 54299568
4551 54299568 56247375 57723614 58728463 58728799 58320657 56949489 55166992 53560717 52615104
4542 52615104 51425332 50316460 49485349 48896149 48376085 47671217 47439622 46981194 46375590
4533 46375590 45882521 45206860 44358244 43643954 43034808 42406293 42205296 42123691 41916745 41886489
4523 41886489 41980790 41783438 41994544 41940827 42185825 43110667 43417795 44006138 44772082 45300617
4513 45300617 46043867 46570758 47840522 48876609 49764639 51610987 53663662 55686920 58486981
4504 58486981 61198627 64897296 68488921 72281571 76499106 80584591 83712658 86308859
$$ packed form
4569C7929377O0640N4509L66683M9068J60660N97342P49366M8837M05996P47091
4559D1169569N78542J344569J848613J529380J609153K186614K266242J766886
4551E4299568J947807J476239J004849L36m08142j371168j782497j606275r45613
4542E2615104j189772j108872q31111n89200n20064p04868k31595m58428o05604
4533D6375590m93069o75661q48616p14290o09146o28515k00997q1605k06946l0256
4523D1886489R4301j97352K11106n3717K44998R24842L07128N88343P65944N28535
4513D5300617P43250N26891J269764J036087Q88030J846348K052675K023258K800061
4504E8486981K711646L698669L591625L792650M217535M085485L128067K596201
$$ plain form
4496 86308859 87666312 87077222 85782347 83678001 81496506 79794307 77917841 75631728
4488 75631728 73488341 71271590 68359760 65855960 64207572 61884818 59598774 57329743
4480 57329743 55011341 52535248 50366576 48264720 46407704 44791066 43482544 42255541
4472 42255541 41229088 40295951 39820682 39197596 38470839 38360186 37925691 37139003 37324419
4463 37324419 37223585 37152001 37366367 37575714 37613438 37918114 38268097 38435899 38213225 38068093
4453 38068093 38375419 38571572 39107485 39937629 40682453 42117995 42713899 43700764 44926492
4444 44926492 45679342 46599582 46985358 47035092 46814510 46754160 46191961 45862527 45455715 44419972
4434 44419972 43076330 42211007 41154332 39888419 38396482 37042498 35634245 34297389
$$ packed form
4496H6308859J357453n89090j294875k104346k181495j702199j876466k286113
4488G5631728k143387k216751k911830k503800j648388k322754k286044k269031
4480E7329743k318402k476093k168672k101856j857016j616638j308522j227003
4472D2255541j026453r33137m75269o23086p26757j10653m34495p86688J85416
4463C7324419j00834p1584K14366K09347L7724L04676L49983J67802k22674j45132
4453C8068093L07326J96153N35913Q30144P44824J435542N95904R86865J225728
4444D4926492P52850R20240L85776M9734k20582o0350n62199l29434m06812j035743
4434D4419972j343642q65323j056675j265913j491937j353984j408253j336856
$$ plain form
4426 34297389 33416030 32475185 32007163 31358157 30726219 30310086 30167072 30067106 29574906 28611808
4416 28611808 28321265 28119799 28013908 27470182 27399325 27464815 27339784 26844498 26431971 26591145
4406 26591145 26293338 26247207 25909092 25979931 25843384 25303499 25209057 25381877 25330925 25089274
4396 25089274 24890117 24951655 24604287 25045607 25068147 25029832 24932028 24769839 24838379 25236555
4386 25236555 25448788 25308879 25465803 25363792 25197786 25481110 25089305 25002227 25002748 24496220
4376 24496220 24403973 24257759 24462773 24637631 24606730 24701212 24595327 24521443 24920321 25079244
4366 25079244 25286694 25441546 25600035 25576318 25823510 26018175 26311431 26730755 27239194 27353263
4356 27353263 27358517 28141240 28806327 29296857 29665016 29978211 30414975 30968235 31503418 31963097
$$ packed form
4426C4297389q81359r40845m68022o49006o31938m16133j43014r9966m92200r63098
4416B8611808k90543k01466j05891n43726p0857O5490j25031m95286m12527J59174
4406B6591145k97807m6131l38115P0839j36547n39885r4442J72820n0952k41651
4396B5089274j99157O1538l47368M41320K2540l8315r7804j62189O8540L98176
4386B5236555K12233j39909J56924j02011j66006K83324l91805q7078N21n06528
4376B4496220r2247j46214K05014J74858l0901R4482j05885p3884L98878J58923
4366B5079244K07450J54852J58489k3717K47192J94665K93256M19324N08439J14069
4356B7353263N254P82723O65087M90530L68159L13195M36764N53260N35183M59679
$$ plain form
4346 31963097 32360798 32506093 32589936 32986391 32915006 32916295 33147174 32725522 32687131 32589256
4336 32589256 32401551 31973200 31947722 32311138 32407648 31953443 31563452 31448969 31273745 31023750
4326 31023750 31350314 31521048 31088168 31248290 31468526 31597346 31657157 31690559 31944035 32119550
4316 32119550 31914588 32386825 32224439 32534392 33155903 33336374 34038529 34354810 34560008
4307 34560008 35104461 36153107 36426449 36597322 37326080 37628836 37515826 37619873 36923810
4298 36923810 37065390 37302606 37282360 38033333 37619427 37622543 37965864 38095752 38224668 37991199
4288 37991199 38040498 38462458 38855895 38858195 39403260 40355108 40745004 40862763 40832548 41320958
4278 41320958 42086196 42285726 42624433 43047077 43587249 44351920 45007644 45195316 45062700
$$ packed form
4346C1963097L97701J45295Q3843L96455p1385J289K30879m21652l8391r7875
4336C2589256j87705m28351k5478L63416R6510m54205l89991j14483j75224k49995
4326C1023750L26564J70734m32880J60122K20236J28820N9811L3402K53476J75515
4316C2119550k04962M72237j62386L09953O21511J80471P02155L16281K05198
4307C4560008N44453J048646K73342J70873P28758L02756j13010J04047o96063
4298C6923810J41580K37216k0246P50973m13906L116L43321J29888J28916k33469
4288C7991199M9299M21960L93437K300N45065R51848L89896J17759l0215M88410
4278D1320958P65238J99530L38707M22644N40172P64671O55724J87672j32616
$$ plain form
4269 45062700 45239333 45734228 46430563 46683301 47249515 47265987 47465133 47438902 47618157 48047019
4259 48047019 48290859 48175676 48180820 48745784 48626670 48489584 49190653 49601299 49773507 49753374
4249 49753374 49683807 50003119 50525622 50480197 50647984 50753996 50223281 50268329 50653412 51048054
4239 51048054 50751740 50790819 51168562 51473413 51616783 51622433 51715096 51726490 51618421 51792571
4229 51792571 52099607 52311990 52584157 53204593 53698903 54014751 54835760 54956283 54990740 54934704
4219 54934704 55518085 56174487 56583182 57098680 57543427 57957933 58908977 60164858 61005157
4210 61005157 61868299 62644232 63079914 63031045 63474444 64525340 65754438 66692165 67091728
4201 67091728 67762011 68650189 69373284 70997383 71665191 72523495 73546679 74122130 74814404
$$ packed form
4269D5062700J76633M94895O96335K52738N66214J6472J99146k6231J79255M28862
4259D8047019K43840j15183N144N64964j19114j37086P01069M10646J72208k0133
4249D9753374o9567L19312N22503m5425J67787J06012n30715M5048L85083L94642
4239E1048054k96314L9079L77743L04851J43370N650R2663J1394j08069J74150
4229E1792571L07036K12383K72167O20436M94310L15848Q21009J20523L4457n6036
4219E4934704N83381O56402M08695N15498M44747M14506R51044J255881Q40299
4210F1005157Q63142P75933M35682m8869M43399J050896J229098R37727L99563
4201F7091728O70283Q88178P23095J624099O67808Q58304J023184N75451O92274
$$ plain form
4192 74814404 75746156 76554921 77498156 78432961 79583892 80662781 81560517 82605195 83324527
4183 83324527 84502193 85932755 86620240 87081224 87670574 88642824 88741178 89260429 89486126
4174 89486126 89159022 89615205 90004234 90190587 90404549 90534439 90935362 91126922 91018274
4165 91018274 91101029 91427210 91372113 90760275 89784280 88278250 87067326 85396512 83403551
4156 83403551 81821504 80284669 78804369 77375758 75919553 74352336 72541617 71011684
4148 71011684 70129077 68551099 66881301 65325116 63752354 62041441 60626492 59394488
4140 59394488 58054754 56767199 55513355 54111815 52695921 51430857 50622904 49889532
4132 49889532 48843385 48465283 47712101 46934655 46335883 45824472 45105215 45000529 44381840
$$ packed form
4192G4814404R31752Q08765R43235R34805J150931J078889Q97736J044678P19332
4183H3324527J177666J430562O87485M60984N89350R72250R8354N19251K25697
4174H9486126l27104M56183L89029J86353K13962J29890M00923J91560j08648
4165I1018274Q2755L26181n5097o11838r75995j506030j210924j670814j992961
4156H3403551j582047j536835j480300j428611j456205j567217j810719j529933
4148G1011684q82607j577978j669798j556185j572762j710913j414949j232004
4140E9394488j339734j287555j253844j401540j415894j265064q07953p33372
4132D9889532j046147l78102p53182p77446n98772n11411p19257j04686o18689
$$ plain form
4123 44381840 44042600 43424128 42370015 41807329 41744722 41508387 41082640 40304418 40178174
4114 40178174 40198936 40220420 39593577 39660048 39134548 38522666 38577844 38567092 38486692 38318079
4104 38318079 38634618 38719399 38882306 39286284 39588619 39327792 39732277 40619709 40732003 40501314
4094 40501314 40611543 40155592 39828191 39608122 39125254 38886570 38970773 38737924 38362048 38211284
4084 38211284 38028549 37673140 37612693 37152143 36594321 35879909 35793809 35121721 34676281 34298369
4074 34298369 33718066 33886686 33393814 32666888 32320586 31994554 31590292 31126040 31232041
4065 31232041 31462680 31045306 31241694 31036328 30788335 30950999 30996716 30847920 31187130 31167738
4055 31167738 31150589 30936345 31113665 31040476 31025013 31205402 31047192 31139106 31092855 30950485
$$ packed form
4123D4381840l39240o18472j054113n62686o2607k36335m25747p78222j26244
4114D0178174K0762K1484o26843O6471n25500o11882N5178j0752q0400j68613
4104C8318079L16539Q4781J62907M03978L02335k60827M04485Q87432J12294k30689
4094D0501314J10229m55951l27401k20069m82868k38684Q4203k32849l75876j50764
4084C8211284j82735l55409o0447m60550n57822p14412q6100o72088m45440l77912
4074C4298369n80303J68620m92872p26926l46302l26032m04262m64252J06001
4065C1232041K30639m17374J96388k05366k47993J62664M5717j48796L39210j9392
4055C1167738j7149k14244J77320p3189j5463J80389j58210R1914m6251j42370
$$ plain form
4045 30950485 31131340 31364672 31123787 30696622 30620775 30694882 30532025 30649443 30705520 30715095
4035 30715095 30905353 31008780 30585828 30932875 31348584 31067475 31306850 31491121 31174572
4026 31174572 31288219 31508763 31865743 31491531 31701987 31873302 32332106 32728854 32908163
4017 32908163 33462565 33882464 34464513 35101380 35583760 36102097 36618520 37429540 38130271
4008 38130271 38356651 39006028 40517546 42016636 43223939 44793021 45841439 47131869
4000 47131869 49013841 51074707 53073634 54543681 56065526 57357004 58359052 59597774
3992 59597774 60242857 60494343 60401750 61017427 61703659 61735449 61462034 61564952 62314109 62521418
3982 62521418 62259894 61617576 61680637 61168672 60671473 59623592 58268481 57493372 56844703
$$ packed form
4045C0950485J80855K33332k40885m27165p5847P4107j62857J17418N6077R575
4035C0715095J90258J03427m22952L47047M15709k81109K39375J84271l16549
4026C1174572J13647K20544L56980l74212K10456J71315M58804L96748J79309
4017C2908163N54402M19899N82049O36867M82380N18337N16423Q11020P00731
4008C8130271K26380O49377J511518J499090J207303J569082J048418J290430
4000D7131869J881972K060866J998927J470047J521845J291478J002048J238722
3992E9597774O45083K51486r2593O15677O86232L1790k73415J02918P49157K07309
3982F2521418k61524o42318O3061n11965m97199j047881j355111p75109o48669
$$ plain form
3973 56844703 56007695 54973034 53828785 52642612 51747289 51302216 50876786 50014189 49402171
3964 49402171 48708108 48602877 48358873 47938535 47925444 47704408 47657623 47221744 47468744 47518902
3954 47518902 47937248 47855550 47716171 47800168 47688223 47877183 48293651 48422171 48190665 48185161
3944 48185161 48427025 48837722 49545215 50105707 50015633 50059051 50418047 51375283 51897028 52844267
3934 52844267 53613261 54630468 55056629 55687493 56263295 57178128 58244834 59197292 59595581
3925 59595581 60425967 61071327 61922217 63021621 63931602 64646770 65674250 66340276 67117955
3916 67117955 67514879 67357095 67854318 68543637 69290173 70002993 70801512 71795453 72547102
3907 72547102 73068788 73616770 74038817 74744639 75401385 76238126 76859857 77797078 78558913
$$ packed form
3973E6844703q37008j034661j144249j186173q95323m45073m25430q62597o12018
3964D9402171o94063j05231k44004m20338j3091k21036m6785m35879K47000N0158
3954D7518902M18346q1698j39379Q3997j11945J88960M16468J28520k31506n504
3944D8185161K41864M10697P07493N60492r0074M3418L58996R57236N21745R47239
3934E2844267P68994J017207M26161O30864N75802R14833J066706R52458L98289
3925E9595581Q30386O45360Q50890J099404R09981P15168J027480O66026P77679
3916F7117955L96924j57784M97223O89319P46536P12820P98519R93941P51649
3907G2547102N21686N47982M22047P05822O56746Q36741O21731R37221P61835
$$ plain form
3898 78558913 79038000 79859093 81029466 81717015 82437696 83352534 84195348 85248749 86299451
3889 86299451 87320407 88519659 89692511 91088100 92944506 94417218 95715110 97303493
3881 97303493 98554728 99972769 101872636 103260433 104437269 105891721 107840830 108992592
3873 108992592 109961764 111400656 112722929 114196899 115420603 116431119 117135710 118225554
3865 118225554 118737894 119530473 120274673 121016265 121734996 122057185 122127229 121980215 122102769
3856 122102769 122128468 121629207 121670067 121425164 121065631 120783485 119558574 118642606 118401046
3847 118401046 117945018 117490669 116834032 116278526 115533195 114845379 115332321 114780867 113946523
3838 113946523 113406249 112888932 112482278 112377195 112305594 111541915 111174195 111444312 111855221
$$ packed form
3898G8558913M79087Q21093J170373O87549P20681R14838Q42814J053401J050702
3889H6299451J020956J199252J172852J395589J856406J472712J297892J588383
3881I7303493J251235J418041J899867J387797J176836J454452J949109J151762
3873A08992592R69172J438892J322273J473970J223704J010516P04591J089844
3865A18225554N12340P92579P44200P41592P18731L22189P0044j47014J22554
3856A22102769K5699m99261M0860k44903l59533k82146j224911r15968k41560
3847A18401046m56028m54349o56637n55506p45331o87816M86942n51454q34344
3838A13946523n40274n17317m06654j05083p1601p63679l67720K70117M10909
$$ plain form
3829 111855221 112249187 112564450 113023389 112888715 113024982 113033976 113242122 112992287 112309667 112057171
3819 112057171 111488562 111347324 112073101 112433891 112882734 113092729 113723032 114870551 115444204
3810 115444204 116104643 117008560 118122670 118964993 120558730 121557006 122365713 123387234 124443687
3801 124443687 125033678 126216836 127537252 128249308 128495839 128672918 128839866 128421777 128043403
3792 128043403 127283904 127273769 127631733 127090769 127216512 127340936 127176870 127109858 127262017 127286251
3782 127286251 127597708 128575313 129274847 129823703 130472661 131016171 132039786 133575581 135499758
3773 135499758 136787402 137632620 138782102 139527623 139577483 139496815 139046635 138730463 138235300
3764 138235300 137337657 136730561 136268357 135586629 135123890 134764532 134327198 133498369 132170494
$$ packed form
3829A11855221L93966L15263M58939j34674J36267Q994K08146k49835o82620k52496
3819A12057171n68609j41238P25777L60790M48843K09995O30303J147519N73653
3810A15444204O60439R03917J114110Q42323J593737R98276Q08707J021521J056453
3801A24443687N89991J183158J320416P12056K46531J77079J66948m18089l78374
3792A28043403p59499j0135L57964n40964J25743J24424j64066o7012J52159K4234
3782A27286251L11457R77605O99534N48856O48958N43510J023615J535795J924177
3773A35499758J287644Q45218J149482P45521M9860q0668m50180l16172m95163
3764A38235300q97643o07096m62204o81728m62739l59358m37334q28829j327875
$$ plain form
3755 132170494 131053686 129221282 127396240 125201453 122860140 120953635 118661376 116988608
3747 116988608 115802163 114181193 112228933 110706773 109426058 108120258 106930937 105634906
3739 105634906 104731860 103750113 103081733 102408136 101189898 100444230 99843716 98723481 97362993
3730 97362993 96700277 95997177 94559133 93693720 92495740 90925594 89487687 88325402 86881895
3721 86881895 85378755 84118291 82259660 80293370 79562261 78072279 76942834 75944847
3713 75944847 74590545 73140920 71591581 70075876 68476449 66947778 65725133 64460359
3705 64460359 63324235 62339383 61471527 60364881 59481699 59276889 58771408 58555185 58520895
3696 58520895 58786444 59006163 59190779 59675951 59930808 60026101 60135783 60484981 60380878 60555897
$$ packed form
3755A32170494j116808j832404j825042k194787k341313j906505k292259j672768
3747A16988608j186445j620970j952260j522160j280715j305800j189321j296031
3739A05634906r03046r81747o68380o73597j218238p45668o00514j120235j360488
3730I7362993o62716p03100j438044q65413j197980j570146j437907j162285j443507
3721H6881895j503140j260464j858631j966290p31109j489982j129445r97987
3713G5944847j354302j449625j549339j515705j599427j528671j222645j264774
3705F4460359j136124r84852q67856j106646q83182k04810n05481k16223l4290
3696E8520895K65549K19719J84616M85172K54857R5293J09682L49198j04103J75019
$$ plain form
3686 60555897 60267935 59862317 59626072 59473381 59089270 58329675 57516636 56622743 56175635
3677 56175635 55518291 54836737 53827601 52736987 52061356 51098169 49584003 47883585 46513291
3668 46513291 45424179 43656507 41927905 40419453 39577770 38674142 37590394 36853771 35894329
3659 35894329 34778067 33897221 33337071 32827750 31870676 31330885 30588230 29967889 29639759
3650 29639759 29416643 29010225 28374942 27885390 27573184 26812539 26460790 26341460 26328746 25639795
3640 25639795 25594743 25660220 25426847 25375855 25492534 25216694 24638621 25030564 25151201 25039980
3630 25039980 25166923 25387899 25143313 25102970 24945256 25003446 24941071 25398853 25240234 25712474
3620 25712474 26075105 26253525 26801293 27130682 27631057 28007578 28160277 28512391 28622387
$$ packed form
3686F0555897k87962m05618k36245j52691l84111p59595q13039q93893m47108
3677E6175635o57344o81554j009136j090614o75631r63187j514166j700418j370294
3668D6513291j089112j767672j728602j508452q41683r03628j083748p36623r59442
3659C5894329j116262q80846n60150n09321r57074n39791p42655o20341l28130
3650B9639759k23116m06418o35283m89552l12206p60645l51749j19330j2714o88951
3640B5639795m5052O5477k33373n0992J16679k75840n78073L91943J20637j11221
3630B5039980J26943K20976k44586m0343j57714N8190o2375M57782j58619M72240
3620B5712474L62631J78420N47768L29389N00375L76521J52699L52114J09996
$$ plain form
3611 28622387 28480566 27860664 27974038 28148312 27905949 27399850 27165619 27616593 27389713
3602 27389713 27278921 27189828 27364842 26990528 26899121 26954179 26666480 26671930 26918077 26850359
3592 26850359 27467171 27619204 27891934 28454157 29121221 29261256 29364767 30316855 30988052
3583 30988052 30874625 30820153 30870734 30961639 30985537 30865016 30674128 30567637 30518614 30376645
3573 30376645 30050001 29757813 28621504 27943023 27266302 27007967 26393184 26310290 26378825 26057512
3563 26057512 25964463 25191731 24959966 25302168 25063240 25173882 25314381 25229438 25709537 25330298
3553 25330298 25258832 25496549 25761144 25787605 26012951 26242407 27046490 27321644 27209255 26720744
3543 26720744 26254345 26076121 26032950 25698383 25515141 25223928 24918817 24960606 24555107 24654478
$$ packed form
3611B8622387j41821o19902J13374J74274k42363n06099k34231M50974k26880
3602B7389713j10792q9093J75014l74314r1407N5058k87699N450K46147o7718
3592B6850359O16812J52033K72730N62223O67064J40035J03511R52088O71197
3583C0988052j13427n4472N0581R0905K3898j20521j90888j06491m9023j41969
3573C0376645l26644k92188j136309o78481o76721k58335o14783q2894O8535l21313
3563B6057512r3049p72732k31765L42202k38928J10642J40499q4943M80099l79239
3553B5330298p1466K37717K64595K6461K25346K29456Q04083K75154j12389m88511
3543B6720744m66399j78224m3171l34567j83242k91213l05111M1789m05499R9371
$$ plain form
3533 24654478 25045806 25445272 25529487 25567562 25873620 25653917 25960753 26030067 26018135 26209403
3523 26209403 26627313 26786586 27156861 27222632 27556302 27986572 28064358 28629040 29009994 29325386
3513 29325386 30118959 30529147 31141225 31973504 32424017 32692986 32849649 33785599 34848068
3504 34848068 35184317 35766735 36283408 36980214 37948742 38466158 39515078 40710588 41640460
3495 41640460 43111545 44702318 45775822 47124495 49219399 51836236 53617200 55737714
3487 55737714 58548222 61249675 64538120 68970388 72928155 76619341 80668122 85185348
3479 85185348 89143848 92802074 96078045 98952327 102275513 105246081 108072354 110794049
3471 110794049 113586378 115863312 118532262 121410452 123993124 126616666 129659583 132010457
$$ packed form
3533B4654478L91328L99466Q4215L8075L06058k19703L06836O9314j1932J91268
3523B6209403M17910J59273L70275O5771L33670M30270P7786N64682L80954L15392
3513B9325386P93573M10188O12078Q32279M50513K68969J56663R35950J062469
3504C4848068L36249N82418N16673O96806R68528N17416J048920J195510R29872
3495D1640460J471085J590773J073504J348673K094904K616837J780964K120514
3487E5737714K810508K701453L288445M432268L957767L691186M048781M517226
3479H5185348L958500L658226L275971K874282L323186K970568K826273K721695
3471A10794049K792329K276934K668950K878190K582672K623542L042917K350874
$$ plain form
3463 132010457 134243104 137154785 139462192 140650975 139508392 136001992 132859524 130162374
3455 130162374 127353039 125497143 124416209 122838128 120847651 118319742 115936288 113591904
3447 113591904 112266922 111545134 110798646 110535589 111167889 112060315 113279294 115910703 119604061
3438 119604061 124117791 129429138 134956082 140427683 146030973 151388456 154678774 153473377
3430 153473377 151156901 149344024 146996081 144094289 139204591 132088420 124896672 117297175
3422 117297175 110818330 105415330 100241495 96245620 92430352 89525036 87011386 84035533
3414 84035533 82009075 79923693 78332696 77060854 76462361 76569126 77481063 79286713 81386952
3405 81386952 84543296 88069333 90232148 91795143 93321856 93995491 93160091 89102132
$$ packed form
3463A32010457K232647K911681K307407J188783j142583l506400l142468k697150
3455A30162374k809335j855896j080934j578081j990477k527909k383454k344384
3447A13591904j324982p21788p46488k63057O32300Q92426J218979K631409L693358
3438A19604061M513730N311347N526944N471601N603290N357483L290318j205397
3430A53473377k316476j812877k347943k901792m889698p116171p191748p599497
3422A17297175o478845n403000n173835l995875l815268k905316k513650k975853
3414H4035533k026458k085382j590997j271842n98493J06765R11937J805650K100239
3405H1386952L156344L526037K162815J562995J526713O73635q35400m057959
$$ plain form
3397 89102132 82624608 76747617 71577721 67255985 63967584 60941297 57992896 56060804
3389 56060804 53984223 52165053 50378665 48603082 47324135 46542563 45768698 44939131 44348161
3380 44348161 44082871 43265081 42564100 41895120 41107856 41272777 40844494 39668891 38953252
3371 38953252 37948306 37123841 36234029 35207274 34440367 33667904 32853728 32341457 31956759
3362 31956759 31638086 31340579 30982883 31000644 30579748 30558611 30527478 30155359 30194387 30250141
3352 30250141 30076666 30244563 30516273 30507381 30307896 30116533 30314733 30388967 30303736 30691298
3342 30691298 30689379 30948330 31330219 31330221 31739987 32242876 32482544 33070726 33562964 33940001 34394749
3331 34394749 35506934 36660103 37781123 39230078 41046516 42561149 44656357 46653213
$$ packed form
3397H9102132o477524n876991n169896m321736l288401l026287k948401j932092
3389E6060804k076581j819170j786388j775583j278947p81572p73865q29567n90970
3380D4348161k65290q17790p00981o68980p87264J64921m28283j175603p15639
3371C8953252j004946q24465q89812j026755p66907p72463q14176n12271l84698
3362C1956759l18673k97507l57696J7761m20896k1137l1133l72119L9028N5754
3352C0250141j73475J67897K71710q892j99485j91363J98200P4234q5231L87562
3342C0691298j919K58951L81889KM09766N02889K39668N88182M92238L77037M54748
3331C4394749J112185J153169J121020J448955J816438J514633K095208J996856
$$ plain form
3323 46653213 49097698 51427638 54283693 58383819 61853571 65696322 70358134 75218825
3315 75218825 81449991 88024206 94954022 103416483 113965670 126356824 141431178 159903510
3307 159903510 183288054 208069550 229904207 250438008 270099601 286397252 294389658
3300 294389658 287055649 265244672 240417235 218536738 200176142 185993454 174557753
3293 174557753 165939166 160116447 155337715 151293960 148503132 146554379 144874545 144896762
3285 144896762 146916609 151024049 157886032 166717586 179072583 195562985 216393786 237031587
3277 237031587 254441619 271074395 287353858 298208875 298234714 281717786 255103580
3270 255103580 228572783 205184013 185478714 169218519 155980699 144772951 135329038
$$ packed form
3323D6653213K444485K329940K856055M100126L469752L842751M661812M860691
3315G5218825O231166O574215O929816Q462461J0549187J2391154J5074354J8472332
3307A59903510K3384544K4781496K1834657K0533801J9661593J6297651P992406
3300B94389658p334009k1810977k4827437k1880497j8360596j4182688j1435701
3293A74557753q618587n822719m778732m043755k790828j948753j679834K2217
3285A44896762K019847M107440O861983Q831554J2354997J6490402K0830801K0637801
3277B37031587J7410032J6632776J6279463J0855017K5839j6516928k6614206
3270B55103580k6530797k3388770j9705299j6260195j3237820j1207748r443913
$$ plain form
3263 135329038 126565752 118644012 110678867 103387512 96213104 90040531 84882700 80486035
3255 80486035 76457486 72911291 69543024 66831823 64901854 62749858 60762975 59161955
3247 59161955 57859030 56987148 55082598 53831566 52683256 51071074 49345259 47725389
3239 47725389 45782759 44588169 43519472 41868309 40825152 39770331 38389040 37589872
3231 37589872 37082543 36135143 35112037 34396555 34126978 33557677 33109758 33051939 32559932
3222 32559932 32671716 32607860 32558863 32676968 32977999 32624479 32416708 31877848 31256765 30901980
3212 30901980 30303110 29431165 29052635 28538930 27886728 27600083 26885847 26467535 26703615
3203 26703615 26544037 25623601 25005885 24632512 24190145 24355547 24376541 23733424 23524277 23302070
$$ packed form
3263A35329038q763286p921740p965145p291355p174408o172573n157831m396665
3255H0486035m028549l546195l368267k711201j929969k151996j986883j601020
3247E9161955j302925q71882j904550j251032j148310j612182j725815j619870
3239D7725389j942630j194590j068697j651163j043157j054821j381291p99168
3231C7589872n07329r47400j023106p15482k69577n69301m47919n7819m92007
3222C2559932J11784o3856m8997J18105L01031l53520k07771n38860o21083l54785
3212C0901980n98870q71945l78530n13705o52202k86645p14236m18312K36080
3203B6703615j59578r20436o17716l73373m42367J65402K0994o43117k09147k22207
$$ plain form
3193 23302070 23437220 23058887 22857619 22748571 22420249 22179929 21860587 21860783 21685975 21315685
3183 21315685 21099156 21195819 20987375 21070861 21662835 21519791 21437650 21563465 21492043 21677398
3173 21677398 21742504 21850546 21599933 21766196 22434467 22534352 22584196 22328335 22779869 22525298
3163 22525298 22479013 23085742 23089990 23000320 23171668 23136346 23352241 23318894 23398381 23577405 23539612
3152 23539612 23475414 23546679 23450867 23569632 23479921 23529167 23978128 24201309 24693975 25006990
3142 25006990 25509390 26042429 25986511 26277931 26891689 27190838 27936161 28435289 28748450 29074233
3132 29074233 29212646 29538242 29445293 29528459 29718513 28931689 28098983 27624041 27572561 27230130
3122 27230130 26812435 26547829 26783637 27207415 26808791 26690183 26711147 27061405 27006886 27332871
$$ packed form
3193B3302070J35150l78333k01268j09048l28322k40320l19342J96j74808l70290
3183B1315685k16529R6663k08444Q3486N91974j43044q2141J25815p1422J85355
3173B1677398O5106J08042k50613J66263O68271R9885M9844k55861M51534k54571
3163B2525298m6285O06729M248q9670J71348l5322K15895l3347P9487J79024l7793
3152B3539612o4198P1265r5812J18765q9711M9246M48961K23181M92666L13015
3142B5006990N02400N33039n5918K91420O13758K99149P45323M99128L13161L25783
3132B9074233J38413L25596r2949Q3166J90054p86824q32706m74942n1480l42431
3122B7230130m17695k64606K35808M23778l98624j18608K0964L50258n4519L25985
$$ plain form
3112 27332871 27544597 27994638 27966747 28115311 28425856 28655060 28533309 28637074 29120395 28925930
3102 28925930 28186248 27870887 27567761 26697542 26167163 25404053 24967324 24593815 23927911
3093 23927911 23494873 23538815 23016621 22649102 22317237 22202002 22194056 22030323 22119161 21962622
3083 21962622 21623273 21768811 21406144 20905235 20595446 20320917 19451572 19009189 18519358
3074 18519358 17911741 17777383 17592623 17202131 16593239 16534398 15647652 15240479 14894753 14451276
3064 14451276 14023121 13816892 13798039 12975391 12736036 12624872 12445926 12282606 12010388 12397641
3054 12397641 12077072 11593183 11713113 11479642 11007507 10929164 11041745 10712490 10422989 10111745
3044 10111745 10045039 9985541 9477971 9455854 9132993 8915049 9269088 8926978 8712116 8330711
$$ packed form
3112B7332871K11726M50041k7891J48564L10545K29204j21751J03765M83321j94465
3102B8925930p39682l15361l03126q70219n30379p63110m36729l73509o65904
3093B3927911m33038M3942n22194l67519l31865j15235p946j63733Q8838j56539
3083B1962622l39349J45538l62667n00909l09789k74529q69345m42383m89831
3074A8519358o07617j34358j84760l90492o08892n8841q86746m07173l45726m43477
3064A4451276m28155k06229j8853q22648k39355j11164j78946j63320k72218L87253
3054A2397641l20569m83889J19930k33471m72135p8343J12581l29255k89501l11244
3044A0111745o6706n9498n07570k2117l22861k17944L54039l42110k14862l81405
$$ plain form
3034 8330711 8184819 8376003 8317378 8225786 8024590 8066629 8222015 8358761 7955155 7624376
3024 7624376 7947829 7763806 7724086 7437674 7820351 8318211 8434591 8224609 8420397 8335934
3014 8335934 8124857 7818594 7452384 7131870 7052481 7240703 6825651 6735467 6833849 7025758
3004 7025758 7096036 6512481 6371614 6698478 6555214 6619436 6622581 6675350 6621975 6861259 7123537
2993 7123537 6895318 6560496 6716895 7213263 6836426 6852409 6623607 6278551 6273474 6190123
2983 6190123 6074830 5828547 5793810 5271834 5444246 5511246 5074505 4962214 5107753 5191842
2973 5191842 4601116 4762943 5036099 5067848 4677332 4133994 4035317 4358624 4073030 4662061
2963 4662061 4923678 4235146 4006110 4089890 4261491 4312416 4325707 4021339 4366913 4014467
$$ packed form
3034H330711j45892J91184n8625r1592k01196M2039J55386J36746m03606l30779
3024G624376L23453j84023l9720k86412L82677M97860J16380k09982J95788q4463
3014H335934k11077l06263l66210l20514p9389J88222m15052r0184R8382J91909
3004G025758P0278n83555j40867L26864j43264O4222L145N2769n3375K39284K62278
2993G123537k28219l34822J56399M96368l76837J5983k28802l45056n077q3351
2983F190123j15293k46283l4737n21976J72412O7000m36741j12291J45539Q4089
2973E191842n90726J61827K73156L1749l90516n43338r8677L23307k85594N89031
2963D662061K61617o88532k29036Q3780J71601N0925J3291l04368L45574l52446
$$ plain form
2953 4014467 3813893 4136290 4243269 4595918 4570747 4289407 4046678 3845809 3436572 3705506
2943 3705506 3437646 3512911 4093932 3993262 4231302 3933546 3674060 3563067 3832504 3651700
2933 3651700 3722789 3673058 3581329 3474210 3415691 3918149 3574579 3509003 3280896 3384414
2923 3384414 3742687 3366054 3120106 3310915 3702273 3469223 3522470 3467363 3599831 3135146
2913 3135146 3009941 3051706 3331344 2938956 2993258 2972151 2451582 2711610 2568363 2580556
2903 2580556 2945332 2625882 2573400 2666262 2898112 2767066 2628470 2745297 2917562 2608220
2893 2608220 2894711 3374732 2853531 2529603 2296149 2533200 2822087 2933083 2736496 2464516
2883 2464516 2412502 2597705 2902476 2690241 2379309 2391191 2891479 3219986 2625373 2375606
$$ packed form
2953D014467k00574L22397J06979L52649k5171k81340k42729k00869m09237K68934
2943C705506k67860P5265N81021j00670K38040k97756k59486j10993K69437j80804
2933C651700P1089m9731r1729j07119n8519N02458l43570o5576k28107J03518
2923C384414L58273l76633k45948J90809L91358k33050N3247n5107J32468m64685
2913C135146j25205M1765K79638l92388N4302k1107n20569K60028j43247J2193
2903B580556L64776l19450n2482R2862K31850j31046j38596J16827J72265l09342
2893B608220K86491M80021n21201l23928k33454K37051K88887J10996j96587k71980
2883B464516n2014J85203L04771k12235l10932J1882N00288L28507n94613k49767
$$ plain form
2873 2375606 2474201 2533774 2587470 2374357 2465308 2784126 2746374 2423657 2191661 2312906
2863 2312906 2153433 2412367 2691439 2430206 2591113 2382730 2436068 2467434 2535876 2451143
2853 2451143 2471770 2299393 2425917 2506125 2224044 2441604 2068411 1873200 1953601 2213189
2843 2213189 2275821 2420097 2194330 2063188 1834970 1465760 1628520 2110334 1861101 2176207
2833 2176207 2173356 2105874 2068923 2030363 1607037 1874130 2210595 2243651 2789591 2592783 1995897
2822 1995897 2166833 2597100 2330027 1983142 2246685 2303385 2196963 1699854 1995217 2213891
2812 2213891 2056093 1732018 1693768 1545563 1901725 1928080 1784100 2324252 2281996 1985399
2802 1985399 2184831 1843675 1757723 1895669 2142519 1898035 1822874 1801811 1815005 2199450
$$ packed form
2873B375606R8595N9573N3696k13113R0951L18818l7752l22717k31996J21245
2863B312906j59473K58934K79072k61233J60907k08383N3338L1366O8442q4733
2853B451143K0627j72377J26524Q0208k82081K17560l73193j95211Q0401K59588
2843B213189O2632J44276k25767j31142k28218l69210J62760M81814k49233L15106
2833B176207k851o7482l6951l8560m23326K67093L36465L3056N45940j96808n96886
2822A995897J70936M30267k67073l46885K63543N6700j06422m97109K95363K18674
2812B213891j57798l24075l8250j48205L56162K6355j43980N40152m2256k96597
2802A985399J99432l41156q5952J37946K46850k44484p5161k1063J3194L84445
$$ plain form
2792 2199450 2153476 2176225 1901838 1600873 1500524 1223426 908855 1179171 1183774 1707878
2782 1707878 1490020 1401455 1796362 1738062 1765028 1823055 1489143 1576098 1395730 1349387 1191391
2771 1191391 1406463 930997 1036838 1114478 1188949 1394477 1431131 1577635 1595774 1479041
2761 1479041 1534485 1809902 1364634 1181318 920530 1122888 1644897 1551185 1401364 1256472
2751 1256472 1632553 1540870 1879449 1762549 1536282 1323391 1305261 1679667 1428797 1180520
2741 1180520 1146001 1517042 1689838 1412149 904673 1131217 983521 1250826 1401997 1528372
2731 1528372 1568504 1727982 1679936 1327727 1331796 1582029 1729340 1476005 1187140 1058072
2721 1058072 1319571 1288649 1265042 1197757 1258922 1302406 1411425 1130304 908066 993841 1164498
$$ packed form
2792B199450m5974K2749k74387l00965j00349k77098l14571K70316M603N24104
2782A707878k17858q8565L94907n8300K6966N8027l33912Q6955j80368m6343j57996
2771A191391K15072m75466J05841P7640P4471K05528L6654J46504J8139j16733
2761A479041N5444K75417m45268j83316k60788K02358N22009r3712j49821j44892
2751A256472L76081r1683L38579j16900k26267k12891j8130L74406k50870k48277
2741A180520l4519L71041J72796k77689n07476K26544j47696K67305J51171J26375
2731A528372M0132J59478m8046l52209M069K50233J47311k53335k88865j29068
2721A058072K61499l0922k3607o7285O1165M3484J09019k81121k22238Q5775J70657
$$ plain form
2710 1164498 1135903 1071963 885973 1098770 892481 1046378 1084081 1026260 1007062 539583
2700 539583 563337 616134 1160185 1292993 1055677 1041016 1127311 1073274 1149982 1536075 1576084
2689 1576084 893390 791185 853422 973073 952445 1062585 742676 566917 654616 760933
2679 760933 853078 741035 860223 817552 821754 249993 285393 969718 1254892 1172595 1054160
2668 1054160 751100 1002209 1098914 1226044 1178291 748505 566287 678774 757718 1076338
2658 1076338 1251607 1095322 796396 608496 812733 579548 568817 402137 343660 467522
2648 467522 1086414 926362 579539 870198 1071648 727017 608560 822064 1160230 1038447
2638 1038447 820404 595877 1012107 1134143 721396 883531 994407 1094323 869646 929588
$$ packed form
2710A164498k8595o3940j85990K12797k06289J53897L7703n7821j9198m67479
2700E39583K3754N2797N44051J32808k37316j4661Q6295n4037P6708L86093M0009
2689A576084o82694j02205O2237J19651k0628J10140l19909j75759Q7699J06317
2679G60933R2145j12043J19188m2671M202n71761L5400O84325K85174q2297j18435
2668A054160l03060K51109R6705J27130m7753m29786j82218J12487P8944L18620
2658A076338J75269j56285k98926j87900K04237k33185j0731j66680n8477J23862
2648D67522O18892j60052l46823K90659K01450l44631j18457K13504L38166j21783
2638A038447k18043k24527M16230J22036m12747J62135J10876R9916k24677N9942
$$ plain form
2628 929588 911697 1159584 1038755 1024775 1047245 791818 693010 786253 812325 664217 741255
2617 741255 744591 638050 754082 965617 1069879 784831 644336 840211 926624 1084744
2607 1084744 1207279 1096529 1471215 1417711 1343049 1192110 1373289 1768283 1636712 1637739
2597 1637739 1803943 1714678 1309602 1224226 934543 358814 870670 901858 620670 800487
2587 800487 609012 1081787 860451 733988 1148424 1395704 1459310 1343248 1113725 890867
2577 890867 959708 780898 704308 654865 259680 161456 238391 725109 830636 797756 528836
2566 528836 396276 663077 728483 491028 616081 925920 823185 607925 1078846 812003
2556 812003 924894 727241 698973 406290 518514 633035 560594 357839 635983 668202
$$ packed form
2628I29588j7891K47887j20829j3980K2470k55427r8808R3243K6072j48108P7038
2617G41255L336j06541J16032K11535J04262k85048j40495J95875Q6413J58120
2607A084744J22535j10750L74686n3504p4662j50939J81179L94994j31571J027
2597A637739J66204q9265m05076q5376k89683n75729N11856L1188k81188J79817
2587H00487j91475M72775k21336j26463M14436K47280O3606j16062k29523k22858
2577H90867O8841j78810p6590m9443l95185r8224P6935M86718J05527l2880k68920
2566E28836j32560K66801O5406k37455J25053L09839j02735k15260M70921k66843
2556H12003J12891j97653k8268k92683J12224J14521p2441k02755K78144L2219
$$ plain form
2546 668202 628431 284659 111967 82165 211147 175649 250602 474325 146550 783465
2536 783465 947992 850422 583255 632164 386653 638310 805696 797985 401881 86431
2526 86431 419417 542937 632701 782035 717385 992413 511440 24492 109818 568764
2516 568764 412755 820138 855243 609432 267665 165550 111866 320017 203229 608687
2506 608687 817825 851136 285776 211293 530016 674993 595730 358050 611697 723905
2496 723905 759855 605899 857726 958173 879501 513181 379191 986764 1282997 1220138
2486 1220138 914098 615801 1098416 974152 807341 811389 444607 530297 691887 887141
2476 887141 917512 716529 638181 442697 341013 455153 596536 769605 549799 483554
$$ packed form
2546F68202l9771l43772j72692k9802J28982l5498P4953K23723l27775O36915
2536G83465J64527r7570k67167M8909k45511K51657J67386p711l96104l15450
2526H6431L32986J23520Q9764J49334o4650K75028m80973m86948Q5326M58946
2516E68764j56009M07383L5105k45811l41767j02115n3684K08151j16788M05458
2506F08687K09138L3311n65360p4483L18723J44977p9263k37680K53647J12208
2496G23905L5950j53956K51827J00447p8672l66320j33990O07573K96233o2859
2486A220138l06040k98297M82615j24264j66811M048l66782Q5690J61590J95254
2476H87141L0371k00983p8348j95484j01684J14140J41383J73069k19806o6245
$$ plain form
2466 483554 872807 669476 37455 459652 831723 687629 566148 582629 800217 396562
2456 396562 652192 655908 496282 631748 873722 425214 477806 502202 105371 -87726
2446 -87726 360563 367915 443528 352902 365629 752186 971230 1348058 1189029 1215459 1214324
2435 1214324 1233585 489917 288741 680512 667791 627747 311194 709927 937922 1004846
2425 1004846 1207341 847805 788834 687599 630923 718971 656487 803595 925908 673491
2415 673491 862588 1038674 950269 925724 1200955 1146561 1231304 1708879 1741378 1299081 1169467
2404 1169467 1167858 1419072 1368686 1589387 1582743 1141309 1179351 1357347 1494379 1609461 2084377
2393 2084377 1848554 1665095 1747571 2227823 2482018 2705934 2293295 1869733 1897576 2102791
$$ packed form
2466D83554L89253k03331o32021M22197L72071j44094j21481J6481K17588m03655
2456C96562K55630L716j59626J35466K41974m48508N2592K4396l96831j93097
2446h7726M48289P352P5613r0626J2727L86557K19044L76828j59029K6430j135
2435A214324J9261p43668k01176L91771j2721m0044l16553L98733K27995O6924
2425A004846K02495l59536n8971j01235n6676Q8048o2484J47108J22313k52417
2415F73491J89097J76086q8405k4545K75231n4394Q4743M77575L2499m42297j29614
2404A169467j609K51214n0386K20701o644m41434L8042J77996J37032J15082M74916
2393B084377k35823j83459Q2476M80252K54195K23916m12639m23562K7843K05215
$$ plain form
2383 2102791 2257366 2683308 3194788 3301314 3068896 3217634 3426238 3228986 3382417 3654146
2373 3654146 3883630 4130191 4756706 4982168 4857823 5793226 5673803 6309050 7200984 7376725
2363 7376725 7767914 8340672 9526791 10400622 10916048 11758763 12849427 13797780 15299000
2354 15299000 16948179 18532740 20527580 22642715 25247302 27678033 30110028 32945428
2346 32945428 35908104 39146898 42672492 47630968 53676932 60326510 69329829 81678261
2338 81678261 98187244 113507850 125156974 136907337 149444371 159209038 162150199
2331 162150199 151072053 131831758 114922347 100117227 88828211 79304248 71414838
2324 71414838 64739465 59715292 54677094 49990328 46086924 42528862 38970063 35917083
$$ packed form
2383B102791J54575M25942N11480J06526k32418J48738K08604j97252J53431K71729
2373C654146K29484K46561O26515K25462j24345R35403j19423O35247Q91934J75741
2363G376725L91189N72758J186119Q73831N15426Q42715J090664R48353J501220
2354A5299000J649179J584561J994840K115135K604587K430731K431995K835400
2346C2945428K962676L238794L525594M958476O045964O649578R003319J2348432
2338H1678261J6508983J5320606J1649124J1750363J2537034R764667K941161
2331A62150199j1078146j9240295j6909411j4805120j1289016r523963p889410
2324G1414838o675373n024173n038198m686766l903404l558062l558799l052980
$$ plain form
2316 35917083 32963518 30775550 28992214 27133885 25124846 23529192 22105868 20732993
2308 20732993 19637279 18174990 17200597 16470899 15736168 15373899 14494544 13771793 13158959
2299 13158959 12507729 12120043 11224378 10769258 10292987 9773189 10001793 9336827 8634299
2290 8634299 8051213 7769008 7652215 7551330 6956952 6593690 6612075 6606452 6375038 6556479
2280 6556479 6352656 5732858 6013239 5675044 5677237 5835922 5910151 5556141 5695906 5126429
2270 5126429 4775455 5026379 4927513 4804679 4541942 4289653 4151176 4121719 4358219 3974545
2260 3974545 3625145 3540614 3902151 3827967 3777946 3705517 3221425 3424120 3142736 3137089 3038887
2249 3038887 3135115 3146569 2526754 2703032 3066454 3052775 3079806 3166423 3190339 3326006 3499713
$$ packed form
2316C5917083k953565k187968j783336j858329k009039j595654j423324j372875
2308B0732993j095714j462289r74393p29698p34731l62269q79355p22751o12834
2299A3158959o51230l87686q95665m55120m76271n19798K28604o64966p02528
2290H634299n83086k82205j16793j00885n94378l63262J8385n623k31414J81441
2280F556479k03823o19798K80381l38195K193J58685P4229l54010J39765n69477
2270E126429l50974K50924r8866j22834k62737k52289j38477k9457K36500l83674
2260C974545l49400q4531L61537p4184n0021p2429m84092K02695k81384n647r8202
2249C038887R6228J1454o19815J76278L63422j3679K7031Q6617K3916J35667J73707
$$ plain form
2238 3499713 3463665 3221041 2976114 2825432 2616501 2633183 2917799 3046443 2469101 1936627
2228 1936627 1854621 1803794 2164903 2371822 2551335 2515338 2325094 2297651 1886936 2039556
2218 2039556 2401228 2242465 1870328 1960831 1743959 1636360 2121690 2244355 2159643 1939490
2208 1939490 1816932 1608009 1602499 1934977 1716252 1731474 1610642 1671269 1529643 1850251
2198 1850251 1948415 1462469 1226684 1509415 1502966 1250130 1908207 1919400 1401769 1037131
2188 1037131 1141665 1187200 1082907 763237 935326 1115356 1373206 1227486 1362444 1722230
2178 1722230 1503200 979555 1416680 1599364 1239310 988985 1131361 834944 1079390 1354404
2168 1354404 928961 971157 917821 954790 953930 799441 776453 926575 962807 872329 817421
$$ packed form
2238C499713l6048k42624k44927j50682k08931J6682K84616J28644n77342n32474
2228A936627q2006n0827L61109K06919J79513l5997j90244k7443m10715J52620
2218B039556L61672j58763l72137R0503k16872j07599M85330J22665q4712k20153
2208A939490j22558k08923n510L32478k18725J5222j20832O0627j41626L20608
2198A850251R8164m85946k35785K82731o449k52836O58077J1193n17631l64638
2188A037131J04534M5535j04293l19670J72089J80030K57850j45720J34958L59786
2178A722230k19030n23645M37125J82684l60054k50325J42376k96417K44446K75014
2168A354404m25443M2196n3336L6969q60j54489k2988J50122L6232r0478n4908
$$ plain form
2157 817421 721866 820736 1314904 1078763 982138 860915 699569 783060 1221995 1351966
2147 1351966 1338841 1137490 908563 712151 859588 1132731 1158095 871067 701192 1089405
2137 1089405 1127378 779894 488927 886133 638221 712670 1025040 1072895 954823 1121473
2127 1121473 958085 160358 269013 444700 320625 236767 262954 440706 644968 712108
2117 712108 681687 896068 960258 552564 509437 577355 1005404 770139 922469 837938 350082
2106 350082 705893 751755 379810 148000 374684 467598 847003 616242 272343 603797
2096 603797 437810 356591 562240 470943 290371 83804 335873 595801 922756 789424
2086 789424 482145 670316 805498 780134 565466 188312 311404 346984 655532 1143496
$$ packed form
2157H17421r5555R8870M94168k36141r6625j21223j61346Q3491M38935J29971
2147A351966j3125k01351k28927j96412J47437K73143K5364k87028j69875L88213
2137A089405L7973l47484k90967L97206k47912P4449L12370M7855j18072J66650
2127A121473j63388p97727J08655J75687j24075q3858K6187J77752K04262O7140
2117G12108l0421K14381O4190m07694m3127O7918M28049k35265J52330q4531m87856
2106C50082L55811M5862l71945k31810K26684R2914L79405k30761l43899L31454
2096F03797j65987q1219K05649r1297j80572k06567K52069K59928L26955j33332
2086G89424l07279J88171J35182k5364k14668l77154J23092L5580L08548M87964
$$ plain form
2076 1143496 999381 1049635 1089659 837503 631764 498541 1045391 1526231 965813 984288
2066 984288 989641 1330760 1458130 1386274 1167055 841257 1028403 1221869 1265269 849933
2056 849933 924645 866725 350022 356004 598817 515751 573295 779137 694040 480818 833556
2045 833556 494243 99279 318170 259304 116429 353564 561039 98820 -110063 20614
2035 20614 307145 471240 873534 1053021 802414 652939 723335 911575 850339 565755
2025 565755 285768 255536 240152 123754 30168 591827 762197 335206 266111 138528
2015 138528 178172 146671 -48043 -39688 319695 442336 387594 45930 114126 523808 475122
2004 475122 424231 621942 672652 872088 560541 318540 512312 607786 643333 717234 1060331
$$ packed form
2076A143496j44115N0254M0024k52156k05739j33223N46850M80840n60418J8475
2066I84288N353L41119J27370p1856k19219l25798J87146J93466M3400m15336
2056H49933P4712n7920n16703N982K42813q3066N7544K05842q5097k13222L52738
2045H33556l39313l94964K18891n8866j42875K37135K07475m62219k08883J30677
2035B0614K86531J64095M02294J79487k50607j49475P0396J88240o1236k84584
2025E65755k79987l0232j5384j16398r3586N61659J70370m26991o9095j27583
2015A38528L9644l1501j94714Q355L59383J22641n4742l41664O8196M09682m8686
2004D75122n0891J97711N0710J99436l11547k42001J93772R5474L5547P3901L43097
$$ plain form
1993 1060331 771151 657389 944704 681919 787335 211891 647641 924603 643107 417030
1983 417030 778152 683266 798259 717419 527641 253940 339132 360328 508393 556935 243351
1972 243351 189307 3379 487833 478617 -112964 -188412 -10488 350654 258380 342389 551338
1961 551338 322568 333929 -33474 225063 -132409 220860 365386 733144 544828 397090
1951 397090 384004 556125 644627 324595 -135176 70841 189877 462323 131866 234458
$$ packed form
1993A060331k89180j13762K87315k62785J05416n75444M35750K76962k81496k26077
1983D17030L61122r4886J14993q0840j89778k73701Q5192K1196J48065M8542l13584
1972B43351n4044j85928M84454r216n91581p5448J77924L61142r2274Q4009K08949
1961E51338k28770J1361l67403K58537l57472L53269J44526L67758j88316j47738
1951C97090j3086J72121Q8502l20032m59771K06017J19036K72446l30457J02592
$$ [...]
##END NTUPLES=NMR SPECTRUM
##END=
