##TITLE=1H_DE-80H_X3
 200.13MHz, d2o
 8 sc
 
 19ns.26.2.2025
##JCAMPDX= 6.0         $$ Bruker NMR JCAMP-DX V2.0
##DATA TYPE= NMR SPECTRUM
##DATA CLASS= NTUPLES
##ORIGIN= UXNMR, Bruker Analytische Messtechnik GmbH
##OWNER= pz
$$ XWIN-NMR		Version 3.5
$$ Tue Oct 14 14:51:04 2025 Russian Standard Time (UT+4h)  Yarkov@DPX200
##.OBSERVE FREQUENCY= 200.1313
##.OBSERVE NUCLEUS= ^1H
##.ACQUISITION MODE= SIMULTANEOUS
##.ACQUISITION SCHEME= undefined
##.AVERAGES= 8
##.DIGITISER RES= 18
##SPECTROMETER/DATA SYSTEM= spect
##.PULSE SEQUENCE= zg30
##.SOLVENT NAME= CDCl3
##.SHIFT REFERENCE= (INTERNAL, CDCl3, 0, 12.8227)
##AUDIT TRAIL= $$ (NUMBER, WHEN, WHO, WHERE, WHAT)
$$ ##TITLE= Audit trail, XWIN-NMR		Version 3.5
$$ ##JCAMPDX= 5.01
$$ ##ORIGIN= Bruker BioSpin GmbH
$$ ##OWNER= Yarkov
$$ C:/Bruker/XWIN-NMR/data/yarkov2/nmr/H-C/1/pdata/1/auditp.txt
$$ ##AUDIT TRAIL=  $$ (NUMBER, WHEN, WHO, WHERE, WHAT)
(   1,<2025-10-14 14:48:13.45 +0400>,<Yarkov>,<DPX200>,
      <created by zg, POWCHK disabled, PULCHK disabled
       configuration hash MD5:
       00 E9 B6 7A A2 85 ED C7 34 08 36 98 17 FE 4E 26
       data hash MD5: 16K
       86 BF 44 F1 21 D6 A3 09 3E 48 3B 03 B8 11 C5 E5>)
(   2,<2025-10-14 14:48:17.89 +0400>,<Yarkov>,<DPX200>,
      <Start of raw data processing
       efp BC_mod = 2 LB = 0.25 FT_mod = 6 PKNL = 1 PHC0 = -2644.588 PHC1 = 15.19097 SI = 16K 
       data hash MD5: 16K
       78 48 4A FA 68 CF CA AD E6 CF E5 CF B7 5B 1E A2>)
$$ ##END=
$$ 
$$ hash MD5
$$ 68 29 79 A6 2B F8 89 FB E9 CB BD 1E 7E 10 2D 33
##$RELAX= 
##$RELAX= 
##$RELAX= 
##$RELAX= 
##$RELAX= 
##$RELAX= 
$$ Bruker specific parameters
$$ --------------------------
##$DU= <C:/Bruker/XWIN-NMR>
##$EXPNO= 1
##$NAME= <H-C>
##$PROCNO= 1
##$TYPE= <nmr>
##$USER= <yarkov2>
##$AMP= (0..31)
100 100 100 100 100 100 100 100 100 100 100 100 100 100 100 100 100 100 
100 100 100 100 100 100 100 100 100 100 100 100 100 100 
##$AQSEQ= 0
##$AQ_mod= 1
##$AUNM= <au_zg>
##$AUTOPOS= <>
##$BF1= 200.13
##$BF2= 200.13
##$BF3= 200.13
##$BF4= 200.13
##$BF5= 200.13
##$BF6= 200.13
##$BF7= 200.13
##$BF8= 200.13
##$BYTORDA= 1
##$CFDGTYP= 0
##$CFRGTYP= 5
##$CHEMSTR= <none>
##$CNST= (0..31)
1 1 145 1 1 1 1 1 1 1 1 1 1 1 1 1 1 1 1 1 1 1 1 1 1 1 1 1 1 1 1 1 
##$CPDPRG= <>
##$CPDPRG1= <>
##$CPDPRG2= <>
##$CPDPRG3= <>
##$CPDPRG4= <mlev>
##$CPDPRG5= <mlev>
##$CPDPRG6= <mlev>
##$CPDPRG7= <mlev>
##$CPDPRG8= <mlev>
##$CPDPRGB= <>
##$CPDPRGT= <>
##$D= (0..31)
0 0.7 0 0 0 0 0 0 0 0 0 0.03 0 0 0 0 0 0 0 0 0 0 0 0 0 0 0 0 0 0 0 0 
##$DATE= 1760438893
##$DBL= (0..7)
120 120 120 120 120 120 120 120 
##$DBP= (0..7)
150 150 150 150 150 150 150 150 
##$DBP07= 0
##$DBPNAM0= <>
##$DBPNAM1= <>
##$DBPNAM2= <>
##$DBPNAM3= <>
##$DBPNAM4= <>
##$DBPNAM5= <>
##$DBPNAM6= <>
##$DBPNAM7= <>
##$DBPOAL= (0..7)
0.5 0.5 0.5 0.5 0.5 0.5 0.5 0.5 
##$DBPOFFS= (0..7)
0 0 0 0 0 0 0 0 
##$DE= 6
##$DECBNUC= <off>
##$DECIM= 32
##$DECNUC= <off>
##$DECSTAT= 4
##$DIGMOD= 1
##$DIGTYP= 9
##$DL= (0..7)
0 120 120 120 120 120 120 120 
##$DP= (0..7)
$$ [...]
##$SUBNAM2= <"">
##$SUBNAM3= <"">
##$SUBNAM4= <"">
##$SUBNAM5= <"">
##$SUBNAM6= <"">
##$SUBNAM7= <"">
##$SUBNAM8= <"">
##$SUBNAM9= <"">
##$SW= 18.0517328524113
##$SWIBOX= (0..15)
0 0 2 0 0 0 0 0 0 0 0 0 0 0 0 0 
##$SW_h= 3612.71676300578
##$TD= 16384
##$TD0= 1
##$TE= 0
##$TE2= 300
##$TE3= 300
##$TEG= 300
##$TL= (0..7)
0 120 120 120 120 120 120 120 
##$TP= (0..7)
150 150 150 150 150 150 150 150 
##$TP07= 0
##$TPNAME0= <>
##$TPNAME1= <>
##$TPNAME2= <>
##$TPNAME3= <>
##$TPNAME4= <>
##$TPNAME5= <>
##$TPNAME6= <>
##$TPNAME7= <>
##$TPOAL= (0..7)
0.5 0.5 0.5 0.5 0.5 0.5 0.5 0.5 
##$TPOFFS= (0..7)
0 0 0 0 0 0 0 0 
##$TUNHIN= 0
##$TUNHOUT= 0
##$TUNXOUT= 0
##$USERA1= <user>
##$USERA2= <user>
##$USERA3= <user>
##$USERA4= <user>
##$USERA5= <user>
##$V9= 5
##$VALIST= <valist>
##$VCLIST= <CCCCCCCCCCCCCCC>
##$VD= 0
##$VDLIST= <DDDDDDDDDDDDDDD>
##$VPLIST= <PPPPPPPPPPPPPPP>
##$VTLIST= <TTTTTTTTTTTTTTT>
##$WBST= 1024
##$WBSW= 4
##$XGAIN= (0..3)
0 0 0 0 
##$XL= 0
##$YL= 0
##$YMAX_a= 357123
##$YMIN_a= -565855
##$ZGOPTNS= <>
##$ZL1= 120
##$ZL2= 120
##$ZL3= 120
##$ZL4= 120
##$ABSF1= 0
##$ABSF2= 0
##$ABSG= 0
##$ABSL= 0
##$ALPHA= 0
##$AQORDER= 0
##$ASSFAC= 0
##$ASSFACI= 0
##$ASSFACX= 0
##$ASSWID= 0
##$AUNMP= <proc_1d>
##$AZFE= 0.1
##$AZFW= 0.1
##$BCFW= 0
##$BC_mod= 2
##$BYTORDP= 0
##$COROFFS= 0
##$CY= -3
##$DATMOD= 1
##$DC= 0
##$DFILT= <>
##$DTYPP= 0
##$F1P= 0
##$F2P= 0
##$FCOR= 1
##$FTSIZE= 16384
##$FT_mod= 6
##$GAMMA= 0
##$GB= 0
##$INTBC= 1
##$INTSCL= 3.241238e-09
##$ISEN= 128
##$LB= 0.25
##$LEV0= 0
##$LPBIN= 0
##$MAXI= 10000
##$MC2= 0
##$MEAN= 0
##$ME_mod= 0
##$MI= 1.114404
##$NCOEF= 0
##$NC_proc= -6
##$NLEV= 6
##$NOISF1= 3.799351
##$NOISF2= 2.8
##$NSP= 0
##$NTH_PI= 0
##$NZP= 0
##$OFFSET= 12.82268
##$PC= 1
##$PHC0= -2644.588
##$PHC1= 15.19097
##$PH_mod= 1
##$PKNL= yes
##$PPARMOD= 0
##$PSCAL= 0
##$PSIGN= 0
##$REVERSE= no
##$SF= 200.130540148363
##$SI= 16384
##$SIGF1= 3
##$SIGF2= 2
##$SINO= 0.751879
##$SIOLD= 32768
##$SREGLST= <19F.Aceton>
##$SSB= 0
##$STSI= 16384
##$STSR= 0
##$SW_p= 3612.71676300578
##$SYMM= 0
##$S_DEV= 0
##$TDeff= 16384
##$TDoff= 0
##$TI= <>
##$TILT= no
##$TM1= 0
##$TM2= 0
##$TOPLEV= 0
##$USERP1= <user>
##$USERP2= <user>
##$USERP3= <user>
##$USERP4= <user>
##$USERP5= <user>
##$WDW= 1
##$XDIM= 16384
##$YMAX_p= 291701236
##$YMIN_p= -1537437
$$ End of Bruker specific parameters
$$ ---------------------------------
##NTUPLES= NMR SPECTRUM
##VAR_NAME=  FREQUENCY,     SPECTRUM/REAL,   SPECTRUM/IMAG
##SYMBOL=    X,             R,               I
##VAR_TYPE=  INDEPENDENT,   DEPENDENT,       DEPENDENT
##VAR_FORM=  AFFN,          ASDF,            ASDF
##VAR_DIM=   16384,         16384,           16384
##UNITS=     HZ,            ARBITRARY UNITS, ARBITRARY UNITS
##FACTOR=    0.220516191357247, 1,           1
##FIRST=     2566.20996927693, 0,            0
##LAST=      -1046.50679372885, 0,           0
##MIN=       -1046.50679372885, -1537437,    0
##MAX=       2566.20996927693, 291701236,    0
$$ Real data points
##PAGE= N=1
##DATA TABLE= (X++(R..R)), XYDATA
$$ [...]
8879C492893N1022j73362j52306j05386m4087j05300J746j32475o4526j3344k8365
$$ 3492893 3543915 3370553 3218247 3112861 3068774 2963474 2965220 2832745 2768219 2754875 2726510
8868B726510M3429J5911O944L8321q5947N3658J3815O387j3558k3038j27998r6848
$$ 2726510 2769939 2785850 2792794 2831115 2745168 2798826 2812641 2819028 2805470 2782432 2654434 2557586
8856B557586M3945p4719P3202R9290m4247n6592N6208P8203m5371K7918P4633
$$ 2557586 2601531 2526812 2600014 2699304 2655057 2598465 2654673 2732876 2687505 2715423 2790056
8845B790056n84k0787n1368j06466r234J9226k9417Q0146J73143j87516m4975
$$ 2790056 2789472 2768685 2717317 2610851 2601617 2620843 2591426 2671572 2844715 2657199 2612224
8834B612224O7075J5325l9366N1817K3620j49003m0025J07846L5224n3229M7870
$$ 2612224 2679299 2694624 2655258 2707075 2730695 2581692 2541667 2649513 2684737 2631508 2679378
8823B679378K0257l1724m6842R985q7145p16m0341O653q2177o3203L0981J2218
$$ 2679378 2699635 2667911 2621069 2631054 2543909 2543193 2502852 2509505 2427328 2364125 2395106 2407324
8811B407324Q0470l6509m1080J7423o1609J33692J61649J07477l5543r4966l5178
$$ 2407324 2487794 2451285 2410205 2427628 2366019 2499711 2661360 2768837 2733294 2638328 2603150
8800B603150l3232P879k5099O8475n7237j9647N9452L3504K6424l3761J15460
$$ 2603150 2569918 2577797 2552698 2621173 2563936 2544289 2603741 2637245 2663669 2629908 2745368
8789B745368M9586k9100k8394m0099l8282Q2884L2417m5732O3611m2813K7093
$$ 2745368 2794954 2765854 2737460 2697361 2659079 2741963 2774380 2728648 2792259 2749446 2776539
8778B776539M187O023J8994r1438r7910P9777N4121j70209o024J14725J60339
$$ 2776539 2780726 2786749 2805743 2714305 2616395 2696172 2750293 2580084 2574060 2688785 2849124
8767B849124j7980Q819r9639N2175L3954L9216j1378o5618r7161p986J07827K5061
$$ 2849124 2831144 2839963 2740324 2792499 2826453 2865669 2854291 2788673 2691512 2683526 2791353 2816414
8755B816414M0436L3650Q1395N4078O5784N2660m0100k9499n9016k15495j610
$$ 2816414 2856850 2890500 2971895 3025973 3091757 3144417 3104317 3074818 3015802 2800307 2798697
8744B798697K29403k5585m2282m4800m6051j2478J1040J51103M1079l1546Q9158
$$ 2798697 3028100 3002515 2960233 2915433 2869382 2856904 2867944 3019047 3060126 3028580 3117738
8733C117738o0618j05324j3275Q8543J2956j13774J54492j3300K2646J4075Q5545
$$ 3117738 3057120 2951796 2938521 3027064 3040020 2926246 3080738 3067438 3090084 3104159 3189704
8722C189704o0220o4084J5819k7639Q1183M1098K2593J9333M6298K0944r0937
$$ 3189704 3129484 3065400 3081219 3053580 3134763 3175861 3198454 3217787 3264085 3285029 3194092
8711C194092j07058P0595O3500K056R7022M395J3488J6695P0772O6355J11141
$$ 3194092 3087034 3157629 3221129 3223185 3320207 3324602 3338090 3354785 3425557 3491912 3603053
8700C603053j71719n7809N2469L8912R1398k9365Q8724P542N5589J62623M2335
$$ 3603053 3431334 3373525 3425994 3464906 3556304 3526939 3615663 3623205 3678794 3841417 3883752
8689C883752J9010P4738Q7020k5595J42421L0957J768K732J5532J47969O7862
$$ 3883752 3902762 3977500 4064520 4038925 4181346 4212303 4214071 4216803 4232335 4380304 4448166
8678D448166J53345o3592n5869K172q014j39134j35902j07033j0475O5339K1398
$$ 4448166 4601511 4537919 4482050 4484222 4476208 4337074 4201172 4094139 4083664 4149003 4170401
8667D170401l2800k2065k9143M3173R460K693k5365Q5840J04180K2677J12349
$$ 4170401 4137601 4115536 4086393 4129566 4139026 4141719 4116354 4202194 4306374 4329051 4441400
8656D441400J14592j3947k19150n7445m6093J16290j3963o9908N4761m5853j93623
$$ 4441400 4555992 4542045 4322895 4265450 4219357 4335647 4321684 4251776 4306537 4260684 4067061
8645D067061p6491J1580R5297K5090p1313k1822P4895L8003R8426J03020p9559
$$ 4067061 3990570 4002150 4097447 4122537 4051224 4029402 4104297 4142300 4240726 4343746 4264187
8634D264187l034L4493K6148L5486K22774m001l9589J347J63709K7376O2183n493
$$ 4264187 4261153 4295646 4321794 4357280 4580054 4576053 4536464 4537811 4701520 4728896 4791079 4785586
8622D785586o7134n324P8093J45617L8002J8837N1224K7852J17138J10860O9568
$$ 4785586 4718452 4713128 4791221 4936838 4974840 4993677 5044901 5072753 5189891 5300751 5370319
8611E370319p5885J80241J57579M2639n2324J9699Q7200r7047O0439J7230q786
$$ 5370319 5294434 5474675 5632254 5674893 5622569 5642268 5729468 5632421 5692860 5710090 5701304
8600E701304k287O3220N4829O6974P3402J1438J24517O9908j37835J13830j331
$$ 5701304 5699017 5762237 5817066 5884040 5957442 5968880 6093397 6163305 6025470 6139300 6137969
8589F137969n0763N3022J12697P4636o2484m7725j6404J70787J51434j03830K9298
$$ 6137969 6087206 6140228 6252925 6327561 6265077 6217352 6200948 6371735 6523169 6419339 6448637
8578F448637L7067m5789N0061L7873k4760L1493N0374O7986l7655J79952N999
$$ 6448637 6485704 6439915 6489976 6527849 6503089 6534582 6584956 6652942 6615287 6795239 6801238
8567F801238l6771R8914p950J8544q484m6999j99540J07411r182o3220M5924r8752
$$ 6801238 6764467 6863381 6855431 6873975 6865491 6818492 6618952 6726363 6717181 6653961 6699885 6601133
8555F601133K3225j7941m6690k0238l6806L8960L0257Q937M4243O489J90233J9048
$$ 6601133 6624358 6606417 6559727 6539489 6502683 6541643 6571900 6580837 6625080 6631569 6821802 6840850
8543F840850Q7141J21605N5370J24860P9348J17021J52415J18758q6585J08985
$$ 6840850 6927991 7049596 7104966 7229826 7309174 7426195 7578610 7697368 7610783 7719768
8533G719768K08679M0763J36497K26402O391P098O469M2820J20408q0548J2725
$$ 7719768 7928447 7969210 8105707 8332109 8338500 8345598 8352067 8394887 8515295 8434747 8447472
8522H447472p3289Q6426J82975J60326L27632K60974K12934Q8275Q6883J26284
$$ 8447472 8374183 8460609 8643584 8803910 9131542 9392516 9605450 9693725 9780608 9906892
8512I906892K76685L41841M39612K07596L49630M48443M01055M59587K64738L24131
$$ 9906892 10183577 10525418 10965030 11172626 11522256 11970699 12371754 12831341 13096079 13420210
8502A3420210K29515R0390J32363J62302M7840K82962M45359L14022K45902M76471
$$ 13420210 13649725 13740115 13872478 14034780 14082620 14365582 14810941 15124963 15370865 15847336
8492A5847336N30024O23798O91894O80886Q49696J007026R43123R09094J090873
$$ 15847336 16377360 17001158 17693052 18373938 19223634 20230660 21173783 22082877 23173750
8483B3173750J329087J414801J680211J787917J951341K057720J970921K076420
$$ 23173750 24502837 25917638 27597849 29385766 31337107 33394827 35365748 37442168
8475C7442168J609132J159039O15095O2694m05005r96525j227782j383233j238107
$$ 37442168 39051300 40210339 40825434 40888128 40483123 39486598 38258816 36875583 35637476
8466C5637476j027316r16464p37262n26556k49271P728K07031K99966N53638P14228
$$ 35637476 34610160 33693696 32956434 32429878 32180607 32188335 32395366 32695332 33248970 33963198
8456C3963198R28221R54969J161300J358245J441515J698981K087085K504899
$$ 33963198 34891419 35846388 37007688 38365933 39807448 41506429 43593514 46098413
8448D6098413K800550L269604L482593L428493L248858K609441J900542P67334
$$ 46098413 48898963 52168567 55651160 59079653 62328511 64937952 66838494 67605828
8440F7605828o58923j790314k882940l477745l906808l752172l400340l059626
$$ 67605828 66946905 65156591 62273651 58795906 54889098 51136926 47736586 44676960
8432D4676960k739383k181442j822623j735732j438231j118357q77570o53151
$$ 44676960 41937577 39756135 37933512 36197780 34759549 33641192 32763622 32110471
8424C2110471l45086m61846l6682j4105m0413J54412M66571P91086J026646J178559
$$ 32110471 31765385 31303539 31266857 31252752 31212339 31366751 31833322 32624408 33651054 34829613
8414C4829613J376447J414937J342099Q29867N20387n3678o37902j246868j792239
$$ 34829613 36206060 37620997 38963096 39792963 40313350 40259672 39621770 38374902 36582663
8405C6582663k226521k546621k327301k142155k001570j758020j514398j427916
$$ 36582663 34356142 31809521 29482220 27340065 25338495 23580475 22066077 20638161
8397B0638161j346388r50633r63828q36629o20782n25730n32814m61453m76281
$$ 20638161 19291773 18341140 17377312 16540683 15919901 15394171 14861357 14399904 13923623
8388A3923623m30110k26911m57992l19341m10439l78968k81104k32222l33841
$$ 13923623 13493513 13266602 12808610 12489269 12078830 11699862 11418758 11186536 10852695
8379A0852695j75509l66752m60022k77928j45034j85387j91766k95419j35235
$$ 10852695 10677186 10310434 9850412 9572484 9427450 9242063 9050297 8754878 8619643
8370H619643k01153j33187r1075k7332l3594o0072P6724j66681j88172R8090L6373
$$ 8619643 8418490 8285303 8194228 8166896 8133302 8073230 8149954 7983273 7795101 7893191 7929564
8359G929564k15422j2559R6176l3913j03455l5994n6536J00131j20959j53366
$$ 7929564 7714142 7701583 7797759 7763846 7660391 7624397 7567861 7667992 7547033 7393667
8349G393667l9829j64031l8192m4734j22438j04292j5482n9631r9253j6929J0915
$$ 7393667 7353838 7189807 7151615 7106881 6984443 6880151 6864669 6805038 6705785 6688856 6699771
8338F699771j74746O3685J24583o1945o9847j09240O5023n4652J08655K21657
$$ 6699771 6525025 6588710 6713293 6651348 6581501 6472261 6537284 6482632 6591287 6812944
8328F812944j80918J72712J23331j5911n0893r2737j61114m9166l2515q2670k5003
$$ 6812944 6632026 6804738 6928069 6912158 6861265 6768528 6607414 6558248 6525733 6443063 6418060
8317F418060J21868K1556o6266k342n8744L2306p3229l515K4698l0399Q6981j91513
$$ 6418060 6539928 6561484 6495218 6492876 6434132 6466438 6393209 6389694 6414392 6383993 6470974 6279461
8305F279461l7777L7953K2771O9416j74072p5166K6961m8949j35426M2066n276
$$ 6279461 6241684 6279637 6302408 6371824 6197752 6122586 6149547 6100598 5965172 6007238 6001962
8294F001962L1253j9597O9292q553m1521j39269j02451M4087j575j19025r2641
$$ 6001962 6033215 6013618 6082910 6074357 6032836 5893567 5791116 5835203 5833628 5714603 5621962
8283E621962o853L3717j53706r5652j6965p6076l0175j08475L3200k502j1926
$$ 5621962 5615109 5648826 5495120 5399468 5382503 5306427 5276252 5167777 5200977 5198475 5186549
8272E186549K179j6770J1650j17618n376K9665L1036j21428l7080p7606J3388
$$ 5186549 5188728 5171958 5183608 5065990 5060614 5090279 5121315 4999887 4962807 4885201 4898589
8261D898589K5627N3661r2810k7662p4974J01610j8439j56535J5731p0254K9849
$$ 4898589 4924216 4977877 4885067 4857405 4782431 4884041 4865602 4709067 4724798 4654544 4684393
8250D684393k8185K29593l8738j83509n5137l2823J23916o174K8643k969m8395
$$ 4684393 4656208 4885801 4847063 4663554 4608417 4575594 4699510 4693336 4721979 4719010 4670615
8239D670615P9443p7054j13704n2084J01629J5965j2668j06249O0785J01363j08099
$$ 4670615 4750058 4673004 4559300 4507216 4608845 4624810 4612142 4505893 4566678 4668041 4559942
8228D559942R8781J5589j22775j1409j0405J8291J5342J7981q6774P0137j64429
$$ 4559942 4658723 4674312 4551537 4540128 4529723 4548014 4563356 4581337 4494563 4564700 4400271
8217D400271J04131J02315q752K0510N8101j1310q9816N7127O4316R069n6718
$$ 4400271 4504402 4606717 4597965 4618475 4676576 4665266 4575450 4632577 4696893 4705962 4649244
8206D649244l7896Q5885j38762l1264m75J8434J6360P7524l3094j08802N4187
$$ 4649244 4611348 4697233 4558471 4527207 4526732 4545166 4561526 4639050 4605956 4497154 4551341
8195D551341J86512J30829N60469Q44770j406922l65809J63759p5796m243J36171
$$ 4551341 4737853 4868682 5429151 6273921 4866999 4501190 4664949 4589153 4584910 4721081
8185D721081m1231N1728J44430j775J96440J2308J60114q4769K7874K0311J7373
$$ 4721081 4679850 4731578 4876008 4874233 5070673 5082981 5243095 5158326 5186200 5206511 5223884
8174E223884k6827Q6144l0500o613q0601M7137K6223O638K1893J9207J04946N9157
$$ 5223884 5197057 5283201 5252701 5246088 5165487 5212624 5238847 5245485 5267378 5286585 5391531 5450688
8162E450688L0027r232R641O6708K3193Q3692p0317L6783O2043M3866Q4886J31794
$$ 5450688 5480715 5471483 5481124 5547832 5571025 5654717 5584400 5621183 5683226 5727092 5811978 5943772
8150E943772J89023R188j34707N3139J32669k058R2071K5517M9025P3971m5906
$$ 5943772 6132795 6141983 6007276 6060415 6193084 6191026 6283097 6308614 6357639 6431610 6385704
8139F385704k8645o149R2758K0779J25913Q4955P1897J37809R1393k9990O9075
$$ 6385704 6357059 6350910 6443668 6464447 6590360 6675315 6747212 6885021 6976414 6946424 7015499
8128G015499L3294O7545R695J85581O035p7650J63729Q8732Q2397j91368J41608
$$ 7015499 7048793 7116338 7126033 7311614 7317649 7239999 7403728 7492460 7574857 7383489 7525097
8117G525097J64937O8183P2292j55814q4781J4883N5176K2372R3044N3237Q4572
$$ 7525097 7690034 7758217 7830509 7674695 7589914 7604797 7659973 7682345 7775389 7828626 7913198
8106G913198J8733r160K12636J70082R5540Q0536K5081K36397K72008J67740K04550
$$ 7913198 7931931 7922771 8135407 8305489 8401029 8481565 8506646 8743043 9015051 9182791 9387341
8095I387341K61778J31932N5984J48145K62244K67550L32336K39143J6622N0906
$$ 9387341 9649119 9781051 9837035 9985180 10247424 10514974 10847310 11086453 11103075 11153981
8085A1153981K62371R3267j16793o7865K5643m547k2888L9122J30902J41724M800
$$ 11153981 11416352 11509619 11392826 11324961 11350604 11346057 11323169 11362291 11493193 11634917 11639717
8074A1639717K85861K50488K47983L11549K34236L45568M56628L84243N13627
$$ 11639717 11925578 12176066 12424049 12735598 12969834 13315402 13772030 14156273 14669900
8065A4669900M94082M10851O00972O80637P14023N67925O83492Q57544J051787
$$ 14669900 15163982 15574833 16175805 16856442 17570465 18138390 18821882 19679426 20731213
8056B0731213J041482R14158J058818R24783J124511R70691J113738J324298J508466
$$ 20731213 21772695 22686853 23745671 24670454 25794965 26765656 27879394 29203692 30712158
8047C0712158J564422J889601J972441K020564K261219K572375K828305L155091
$$ 30712158 32276580 34166181 36138622 38159186 40420405 42992780 45821085 48976176
8039D8976176L484322L789925L989265M468651N002327N231089N380414N629943
$$ 48976176 52460498 56250423 60239688 64708339 69710666 74941755 80322169 85952112
8031H5952112N775839N555312N244182M529000L832726K875908J493744J73056
$$ 85952112 91727951 97283263 102527445 107056445 110889171 113765079 115258823 115431879
8023A15431879j149118k379797l442792m139066m894659n125439n187593n283755
$$ 115431879 114282761 111902964 108460172 104321106 99426447 94301008 89113415 83829660
8015H3829660n335516n138360m994199m531660m068893l904845l301142k811913
$$ 83829660 78494144 73355784 68361585 63829925 59761032 55856187 52555045 49743132
8007D9743132k382012k215997j937959j822571j580849j586507j501708j392559
$$ 49743132 47361120 45145123 43207164 41384593 39803744 38217237 36715529 35322970
7999C5322970j357884j407374j333364j350573j299474j176165j013814j063167
$$ 35322970 33965086 32557712 31224348 29873775 28574301 27398136 26384322 25321155
7991B5321155j055888j050176j102817r97425q63241j085886r46596q22063r21987
$$ 25321155 24265267 23215091 22112274 21114849 20251608 19165722 18219126 17397063 16475076
7982A6475076o93480n57268n87390o37938o53546m77635m70091m41383l59480
$$ 16475076 15781596 15224328 14636938 13999000 13345454 12867819 12397728 11956345 11596865
7973A1596865l88858l74454k86729l00974l62021l45764j84286o1739k87957k28324
$$ 11596865 11208007 10833553 10546824 10245850 9883829 9538065 9353779 9292040 9004083 8775759
7963H775759j06155m20411K8275l1943k44269p5254j39921j11702k09959k06974
$$ 8775759 8669604 8249193 8277468 8245525 8001256 7926002 7786081 7674379 7464420 7257446
7953G257446j24638k18092j88130q8329j71855o2339j73301j12295O3757m1670
$$ 7257446 7132808 6914716 6726586 6638257 6466402 6404063 6230762 6118467 6182224 6140554
7943F140554j64283j61687j97739j14993j6097J7207j00209j78356o4006k9311
$$ 6140554 5976271 5814584 5616845 5501852 5485755 5502962 5402753 5224397 5160391 5131080
7933E131080K0169n3919k2368j25609j81773r7768M6487o1227j07318J21230j3052
$$ 5131080 5151249 5097330 5074962 4949353 4767580 4669812 4716299 4655072 4547754 4668984 4655932
7922D655932o3060p5118J59411L4635o1040k4735L984j36229M3181q7030j19883
$$ 4655932 4592872 4517754 4677165 4711800 4650760 4626025 4630009 4493780 4536961 4449931 4330048
7911D330048K3562o7184L5814j07337k2906J0303m4192m1898M8916j25973M9587
$$ 4330048 4353610 4286426 4322240 4214903 4191997 4202300 4158108 4116210 4165126 4039153 4088740
7900D088740M2064L1615k8695j7692P7318J00907J37742k8728j5403m0522Q8958
$$ 4088740 4130804 4162419 4133724 4116032 4193350 4294257 4431999 4403271 4387868 4347346 4436304
7889D436304K5146n1685j2273K0072j72533j03538J8978L9480l8592l3150j3365
$$ 4436304 4461450 4409765 4397492 4417564 4245031 4141493 4160471 4199951 4161359 4128209 4114844
7878D114844j3496l211j16168J19571R0281o9403k8461J3303L0881M0653J30205
$$ 4114844 4101348 4098137 3981969 4101540 4191821 4122418 4093957 4107260 4138141 4178794 4308999
7867D308999q4807R1640K10154o2516l1278J57581J54805J1820l8845q0656j86936
$$ 4308999 4224192 4315832 4525986 4463470 4432192 4589773 4744578 4756398 4717553 4636897 4449961
7856D449961M0937P8378O355P6372N3745l0258M7824m181Q5201J45288J83030
$$ 4449961 4490898 4569276 4575631 4652003 4705748 4675490 4723314 4719133 4804334 4949622 5132652
7845E132652Q9225L16308J44852K20539K71871M37303M24954J89131Q8492O3895
$$ 5132652 5221877 5538185 5683037 5903576 6175447 6612750 7037704 7226835 7315327 7379222
7835G379222J49070k07576m91933m34462m23139m51741l45624l04040j24063j67017
$$ 7379222 7528292 7320716 6828783 6394321 5971182 5519441 5173817 4869777 4745714 4578697
7825D578697p2474q9807k8701k35019j67153J31118J13900j23823J3227m326j45285
$$ 4578697 4506223 4416416 4387715 4152696 3985543 4116661 4230561 4106738 4119965 4115639 3970354
7814C970354j14603K102j8786J06554o4858l5261m8102J70328n4222J00092J23654
$$ 3970354 3855751 3857853 3839067 3945621 3880763 3845502 3797400 3967728 3913506 4013598 4137252
7803D137252M3587m74220l66601K9841L6755J15651P2230K515j37868o3668K7463
$$ 4137252 4180839 3706619 3340018 3369859 3406614 3522265 3594495 3597010 3459142 3395474 3422937
7792C422937R3180K404k0812j02929k7401M5913p2472M8347j359j01404R4090
$$ 3422937 3516117 3518521 3497709 3394780 3367379 3413292 3340820 3389167 3387808 3286404 3380494
7781C380494O8598j04627j18577R1708K9128N0034p0389N8197J12752n0256J6945
$$ 3380494 3449092 3344465 3225888 3317596 3346724 3396758 3326369 3384566 3497318 3447062 3464007
7770C464007k8263j7044P3369j25903L1269j52424J04724K4572q3140o7481r4588
$$ 3464007 3435744 3418700 3492069 3366166 3397435 3245011 3349735 3374307 3291167 3223686 3129098
7759C129098O7144R7427o1740P0165J06199k8477L3480j0379J834q607k9697R7674
$$ 3129098 3196242 3293669 3231929 3302094 3408293 3379816 3413296 3402917 3404751 3396144 3366447 3464121
7747C464121O0699j6260J33539p5705j25094N6963L3614J47263k04384O581J5915
$$ 3464121 3524820 3508560 3642099 3566394 3441300 3498263 3531877 3679140 3474756 3481337 3497252
7736C497252l8699O827O8961J44714k16R0559P2645N6447j21109J19915O6124
$$ 3497252 3458553 3465380 3534341 3679055 3678839 3769398 3842043 3898490 3777381 3897296 3963420
7725C963420n1232J13911L2558p7309K26098r4460j8654M1137p9722K1691M9272
$$ 3963420 3912188 4026099 4058657 3981348 4207446 4112986 4094332 4135469 4055747 4077438 4126710
7714D126710Q0625j38345r9120R2001L4565L1788o7493j22093J61809M6253q0356
$$ 4126710 4207335 4068990 3969870 4061871 4096436 4128224 4060731 3938638 4100447 4146700 4066344
7703D066344r2539p1946J01874n7118J94J51716k8618j4506k4397O5591R0566
$$ 4066344 3973805 3901859 4003733 3946615 3946809 4098525 4069907 4055401 4031004 4096595 4187161
7692D187161J0685N7597k6564p8874J5952K9569l5788m7425L0429N1421J78999
$$ 4187161 4197846 4255443 4228879 4150005 4165957 4195526 4159738 4112313 4142742 4194163 4373162
7681D373162M7282P3112R547J4056O1555J24433J38912j24896j5172L9746n7580
$$ 4373162 4420444 4493556 4503103 4517159 4578714 4703147 4842059 4717163 4701991 4741737 4684157
7670D684157O9911J89640J12404P0301O7272J21350J11837O1768J71210J77715
$$ 4684157 4754068 4943708 5056112 5126413 5193685 5315035 5426872 5488640 5659850 5837565
7660E837565L7079J55563R0425J22699N0011n3475r5001l2647K5916q6394j37603
$$ 5837565 5874644 6030207 6120632 6243331 6293342 6239867 6144866 6112219 6138135 6051741 5914138
7649E914138j13203j09032j8765l7541O581j08996j94819j97707N658k4855J07595
$$ 5914138 5800935 5691903 5673138 5635597 5642178 5533182 5338363 5140656 5146314 5121459 5229054
7638E229054J49574j64414p7365n143L8337K0528P5527q1749R2768O2947l9766
$$ 5229054 5378628 5214214 5136849 5131706 5170043 5190571 5266098 5184349 5277117 5340064 5300298
7627E300298p4236J45917N7866m7640J53865J04494r5912J02739N4254p0782J18230
$$ 5300298 5226062 5371979 5429845 5382205 5536070 5640564 5544652 5647391 5701645 5630863 5749093
7616E749093L2834j01301N7130P0688j31318Q1391j5441N0107K7151Q4721j1537
$$ 5749093 5781927 5680626 5737756 5808444 5677126 5758517 5743076 5793183 5820334 5905055 5893518
7605E893518J8621M7905k0594k3719P8156p2284j29047q59M1815K6164m2553K10616
$$ 5893518 5912139 5960044 5939450 5915731 5993887 5921603 5792556 5791697 5833512 5859676 5817123 6027739
7593F027739Q7432l8128r2171k1342M1842K3232L7711K6368N5180P0909J12866
$$ 6027739 6115171 6077043 5984872 5963530 6005372 6028604 6066315 6092683 6147863 6218772 6331638
7582F331638j0910l6237L5426m9076J3133O0337j3150J35157J56867j2299P5272
$$ 6331638 6320728 6284491 6319917 6270841 6283974 6344311 6331161 6466318 6623185 6610886 6686158
7571F686158J21720J35294J00614M8046J16826K6607j12590J3843J30495L4082
$$ 6686158 6807878 6943172 7043786 7091832 7208658 7235265 7122675 7136518 7267013 7301095
7561G301095j03477J11612L1351k6566M4239O1311L7733L952J12339N2419m9398
$$ 7301095 7197618 7309230 7340581 7314015 7358254 7419565 7457298 7461250 7573589 7626008 7576610
7550G576610R863K68137L9130k2459p9234J69731P6277J00266R4318n8521J36486
$$ 7576610 7586473 7854610 7893740 7871281 7792047 7961778 8038055 8138321 8232639 8174118 8310604
7539H310604o3073J31595O1122O2008M4453Q5306L7064K8756P9945K7612n5716
$$ 8310604 8247531 8379126 8440248 8502256 8546709 8632015 8669079 8697835 8777780 8805392 8749676
7528H749676r0384K00301j805N0600Q7377p6095N7647J76170J1358m3399q4589
$$ 8749676 8659292 8859593 8857788 8908388 8995765 8919670 8977317 9153487 9164845 9121446 9036857
7517I036857J0312J57720J38625M9827L589O2460P9758m0682M8808O346l8687
$$ 9036857 9047169 9204889 9343514 9393341 9396930 9459390 9539148 9498466 9547274 9553620 9514933
7506I514933J25558K6818j3306j13801O8676J00060K0417K5490n8363p3616N5004
$$ 9514933 9640491 9667309 9654003 9540202 9608878 9708938 9729355 9754845 9696482 9622866 9677870
7495I677870K6089J89960L936M3914L8707P0641l531M6082L8184J9342q38l5901
$$ 9677870 9703959 9893919 9897855 9941769 9980476 10051117 10047586 10093668 10131852 10151194 10150356 10114455
7483A0114455p0215J55610j4136l0460M4319K00844l5036j49367Q0135j01349
$$ 10114455 10044240 10199850 10185714 10155254 10199573 10400417 10365381 10216014 10296149 10194800
7473A0194800J62624K68064P6815q0697L1500O4192K1599M859J72039Q6505j3197
$$ 10194800 10357424 10625488 10702303 10621606 10653106 10717298 10738897 10743756 10915795 11002300 10989103
7462A0989103R9599K15319J42855N4426k0045K08904K59280J18175J06862J14953
$$ 10989103 11088702 11304021 11446876 11501302 11481257 11690161 11949441 12067616 12174478 12289431
7452A2289431N1708J81538K31236R6254L0102K01952O8057J54656K08345K70151
$$ 12289431 12341139 12522677 12753913 12850167 12880269 13082221 13150278 13304934 13513279 13783430
7442A3783430J59262J30751L39892L38230J63596K65505K56509K70514J79657
$$ 13783430 13942692 14073443 14413335 14751565 14915161 15180666 15437175 15707689 15887346
7433A5887346K86584K36443K79681L94449L41257L16772L55262N40514M74300
$$ 15887346 16173930 16410373 16690054 17084503 17425760 17742532 18097794 18638308 19112608
7424A9112608M08675L95709M11216O38671P16735O26135O04862P09123P56982
$$ 19112608 19521283 19916992 20328208 20966879 21683614 22309749 22914611 23623734 24380716
7415B4380716P73775P67851Q92778R85683J098487J217870J201393J394112J450884
$$ 24380716 25154491 25922342 26815120 27800803 28899290 30117160 31318553 32712665 34163549
7406C4163549J480790J603141J804823J779527J904862K159952K191538K479057
$$ 34163549 35644339 37247480 39052303 40831830 42736692 44896644 47088182 49567239
7398D9567239K756681K777265K536817K403119K124252J671084J274490Q20764
$$ 49567239 52323920 55101185 57638002 60041121 62165373 63836457 65110947 65931711
7390F5931711K45107l18073k91665l90756l27745j61602o7114L10235M57798N74725
$$ 65931711 66176818 65858745 65567080 65176324 64848579 64686977 64619863 64930098 65387896 65962621
7380F5962621Q03021J100818J407325J789119K044163K249061K642117K895419
$$ 65962621 66765642 67866460 69273785 71062904 73107067 75356128 77998245 80893664
7372H0893664L194214L457140M012246M403992M726421N051872N362225N237942
$$ 80893664 84087878 87545018 91557264 95961256 100687677 105739549 111101774 116339716
7364A16339716N123082M773285M139677L167949K120836R79197j54616j063550
$$ 116339716 121462798 126236083 130375760 133543709 135664545 136643742 136489126 135425576
7356A35425576j549485j580363j541650j014113n28102k14238K38566K93114O27550
$$ 135425576 133876091 132295728 130754078 129739965 129211863 128997625 129236191 129529305 130156855
7347A30156855R85070J052044Q73911Q36703J007556O22921N98166R36519R69628
$$ 130156855 131141925 132193969 133067880 133904583 134912139 135535060 136133226 137069745 138039373
7338A38039373J199801J503138J417544J356185J292427P50356J48898p40346
$$ 138039373 139239174 140742312 142159856 143516041 144808468 145558824 145707722 144967376
7330A44967376j861079k772218l874415m665932n059665n321834n158349m763538
$$ 144967376 143106297 140334079 136459664 131793732 126734067 121412233 116253884 111490346
7322A11490346m050879l044976k238104j523830j052573j219942j263740j663628
$$ 111490346 107439467 104394491 102156387 100632557 99579984 98360042 97096302 95432674
7314I5432674k505209l232482l872165m304314m458447m185994m026273l503120
$$ 95432674 92927465 89694983 85822818 81518504 77060057 72874063 68847790 65344670
7306F5344670l089991k615738k295770j986973j865692j464351j042893q93625
$$ 65344670 62254679 59638941 57343171 55356198 53490506 52026155 50983262 50089637
7298E0089637p48179o95461n08842m58810m38182l94334n85835o28815p22288
$$ 50089637 49341458 48645997 48137155 47678345 47240163 46845829 46259994 45631179 44908891
7289D4908891p34267o26889p77639r35531p12015m93306n15844j99125k11641
$$ 44908891 44174624 43547735 42770096 41834565 41122550 40629244 40113400 39914275 39702634
7280C9702634p9620L5608N2988l227J00581L4133K01517J91640K09396J62164
$$ 39702634 39623014 39658622 39711610 39708383 39808964 39843097 40044614 40236254 40445650 40607814
7270D0607814J793O0502p6958l75131n07258o60832q07835q75191j038691j164383
$$ 40607814 40609607 40670109 40593151 40218020 39710762 39049930 38242095 37366904 36328213 35163830
7260C5163830j275424j195821j206979j155545j070310j090633r88138r41013
$$ 35163830 33888406 32692585 31485606 30330061 29259751 28169118 27180980 26239967
7252B6239967q88314p50206p99340o15975p92081p66575n53865o33523n02494
$$ 26239967 25351653 24601447 23802107 23186132 22394051 21627476 21073611 20440088 19937594
7243A9937594m91116n77238k93109l53364l06255k84051l93391l24642k44740
$$ 19937594 19446478 18869240 18576131 18222767 17916512 17632461 17239070 16914428 16669688
7234A6669688q7354k97226k81160j45831k87524j76622l3856j67810k61821j9677
$$ 16669688 16582334 16285108 16003948 15858117 15570593 15393971 15360115 15192305 14930484 14910807
7224A4910807j78274k15589l791j26679q2895O2936k61697r3463o0808j7398P306
$$ 14910807 14732533 14516944 14513153 14386474 14303579 14366515 14104818 14011355 13950547 13933149 13940455
7213A3940455j34837j60163J57166J51537k11536j08164O3448R2406n4932l2073
$$ 13940455 13805618 13645455 13802621 13954158 13742622 13634458 13697906 13790312 13735380 13703307
7203A3703307n143M5084O8120K4656K5074n5349j4651J89415K50779M3515Q2816
$$ 13703307 13698164 13743248 13811368 13836024 13861098 13805749 13791098 13980513 14231292 14274807 14357623
7192A4357623P2738J1556o9197r0240l0499m5264k13257l7171k0254o8770o6963
$$ 14357623 14430361 14441917 14372720 14282480 14251981 14206717 13993460 13956289 13936035 13867265 13800302
7181A3800302r2322j6914k2306L0431j14606J00011N4564Q9889m028J45515j3124
$$ 13800302 13707980 13691066 13668760 13699191 13584585 13684596 13739160 13829049 13825021 13970536 13957412
7170A3957412j3514J85m4316j8205M4262n0496j30J61670J42259l5556k11672
$$ 13957412 13943898 13944083 13899767 13881562 13925824 13875328 13875198 14036868 14179127 14143571 13931899
7159A3931899o5999N8867J74814N5995j62057j6116Q0682O0078J4512J2049R0461
$$ 13931899 13865900 13924767 14099581 14155576 13993519 13977403 14058085 14118163 14132675 14144724 14235185
7148A4235185L8300r6461R2623J56138K8813J08207R697P5662M9209Q6346J94902
$$ 14235185 14273485 14177024 14269647 14425785 14454598 14562805 14572502 14648164 14697373 14783719 14978621
7137A4978621R2739J9650Q0122K87988J77384J30661J43490J38422R0333J81448
$$ 14978621 15071360 15091010 15171132 15459120 15636504 15767165 15910655 16049077 16139410 16320858
7127A6320858L07906M4603J96959K51332J22565K98209N1067K48970J40469J19856
$$ 16320858 16628764 16673367 16870326 17121658 17244223 17542432 17593499 17842469 17982938 18102794
7117A8102794L34085L62367M28322L88773L82925M54420N30490N69122L75481
$$ 18102794 18436879 18799246 19227568 19616341 19999266 20453686 20984176 21553298 21928779
7108B1928779N11891N41117M30556O75209P54445P86888O09888P66453P92560
$$ 21928779 22440670 22981787 23412343 24087552 24841997 25628885 26238773 27005226 27797786
7099B7797786Q96732Q56142R63330R85106J030045J205577J232856J473162J484650
$$ 27797786 28694518 29550660 30513990 31499096 32529141 33734718 34967574 36440736 37925386
7090C7925386J752885J914560J997944K350741K529080K818853L158771L674679
$$ 37925386 39678271 41592831 43590775 45941516 48470596 51289449 54448220 58122899
7082E8122899L963893M469919M660691N038889N360618N664916O266569O759758
$$ 58122899 62086792 66556711 71217402 76256291 81616909 87281825 93548394 100308152
7074A00308152P853837R223013J0905539J3039160J4988447J5951596J4936303
$$ 100308152 108161989 117385002 128290541 141329701 156318148 172269744 187206047
7067A87206047J2438534Q858739M872179K1697n993227j1982613j5260533j5514550
$$ 187206047 199644581 208503320 213375499 213397196 207403969 195421356 180160823 164646273
7059A64646273j4322298j2761938j0916927r453626q291888p020354n865662m855050
$$ 164646273 150323975 137562037 126645110 117191484 108899596 101879242 96013580 91158530
7051I1158530m226795l561396l345550l233775l130251l348358l642090l909709
$$ 91158530 86931735 83370339 80024789 76791014 73660763 70312405 66670315 62760606
7043F2760606l660727l264463l034623k803046k646385k348647k048063j767406
$$ 62760606 59099879 55835416 52800793 49997747 47351362 45002715 42954652 41187246
7035D1187246j930260j698765j564577j401190j366548j338321j127772j122519
$$ 41187246 39256986 37558221 35993644 34592454 33225906 31887585 30759813 29637294
7027B9637294r91769r46122q68197p33582p80839n68593n45080o80963o27872
$$ 29637294 28645525 27699403 26831206 26097624 25316785 24748192 24203112 23522149 22894277
7018B2894277m38986m69840l88180l10159n55646n44638l97390m11737m23997
$$ 22894277 22455291 21985451 21597271 21287112 20731466 20186828 19789438 19377701 18953704
7009A8953704m21614l12653l19866k60374r0242k18182k65640j44866r0899r1503
$$ 18953704 18532090 18219437 17899571 17639197 17548955 17330773 17065133 16920267 16829368 16737865
6999A6737865j69158l41940k16065j63507l59957l49869l60698k38972j90590
$$ 16737865 16568707 16226767 16010702 15847195 15487238 15137369 14776671 14537699 14347109
6990A4347109q7532k08939k53884j68236p7357k51808j14525k1839J2649o4225
$$ 14347109 14259577 14050638 13796754 13628518 13551161 13299353 13184828 13162989 13175638 13111413
6980A3111413q966Q5965j39647r5797j00513K1846p4807k08780o3161N1228n8140
$$ 13111413 13102447 13188412 13048765 12952968 12852455 12874301 12799494 12590714 12527553 12578781 12520641
6969A2520641L5076j8111M1411J26832K29098K70028J80512M2287K02681q4197
$$ 12520641 12555717 12537606 12579017 12705849 12934947 13204975 13385487 13427774 13630455 13546258
6959A3546258q0163k5879p2184N9871P8734N3625J02341K10304L08794K35379
$$ 13546258 13466095 13440216 13368032 13427903 13506637 13560262 13662603 13872907 14181701 14417080
6949A4417080K29024K16088L61687J44219N3137J58073J89953J95226M1289J09849
$$ 14417080 14646104 14862192 15223879 15368098 15421235 15579308 15769261 15964487 16005776 16115625
6939A6115625J3374O1333O8171l30028j93230p7398p4233l9775j16599j56918
$$ 16115625 16128999 16190332 16258503 15928475 15735245 15657847 15583614 15543839 15427240 15270322
6929A5270322n9876J04802r9500R285J22413J83242J65836K24610K03377O4154
$$ 15270322 15210446 15315248 15215748 15225033 15347446 15530688 15696524 15921134 16124511 16188665
6919A6188665J5229j62715k81648k91492l36304m32704o27915m86405l90904l51261
$$ 16188665 16203894 16041179 15759531 15468039 15131735 14699031 14071116 13584711 13193807 12842546
6909A2842546m15958k95202k92370l04112j55441j78955m07827k20379j05800
$$ 12842546 12426588 12131386 11839016 11534904 11379463 11200508 10792681 10572302 10466502
6900A0466502j71255k12506j37197l6030j22975k30091j42792q8552j44161l59925
$$ 10466502 10295247 10082741 9945544 9909514 9786539 9556448 9413656 9325104 9180943 8821018
6890H821018o8268k6643k07987j71731r2j1109o7670l8297j94413j62588r4716
$$ 8821018 8752750 8726107 8518120 8346389 8346297 8335188 8267518 8229221 8034808 7872220 7777504
6879G777504P5868j92731j12276r2350j06741J43448j04871o8908r8358m9440
$$ 7777504 7853372 7660641 7548365 7456015 7349274 7492722 7387851 7318943 7220585 7171145
6869G171145J15297m7552o9964K0356m4845M928k5966K9107M5656k4688O1239
$$ 7171145 7286442 7238890 7168926 7189282 7144437 7149365 7123399 7152506 7198162 7173474 7234713
6858G234713j69086r5961o5821O4657O2477j10552n0361J9255n5646J41822L2627
$$ 7234713 7065627 6969666 6903845 6968502 7030979 6920427 6870066 6889321 6833675 6975497 7008124
6847G008124Q6J00041P0819n3142K0393J25888J3557Q3236J53407Q978O6300r1497
$$ 7008124 7008210 7108251 7179070 7125928 7146321 7272209 7285766 7369002 7522409 7531387 7597687 7506190
6835G506190L9786j27762l34374j28425J83505j2008k47060j93707k8272J6648
$$ 7506190 7545976 7418214 7083840 6955415 7138920 7126912 6879852 6686145 6657873 6674521
6825F674521j58883Q5804j08079l2529j06633r6358K3612j82988k7308P2547O735
$$ 6674521 6515638 6601442 6493363 6460834 6354201 6257843 6281455 6098467 6071159 6143706 6150441
6814F150441j62929q1416P0205P2814M5374L45R443m9694p1577O279P0541P8806
$$ 6150441 5987512 5906096 5976301 6049115 6094489 6094834 6104277 6054583 5983006 5989285 6059826 6138632
6802F138632J78342R5687J27072J6112O8998O230j0942q5011P9563K4656m9046
$$ 6138632 6316974 6412661 6539733 6555845 6624843 6631073 6620131 6535120 6614683 6639339 6590293
6791F590293N3309k1493p6152J04393J67013O5508R7204R9849K3738R1941J36739
$$ 6590293 6643602 6622109 6545957 6650350 6817363 6882871 6980075 7079924 7103662 7195603 7332342
6780G332342k3582J51349R9402K18612K21135j92935K3390J7251k31199j02615
$$ 7332342 7308760 7460109 7559511 7778123 7999258 7806323 7829713 7846964 7615765 7513150
6770G513150n5099n1635j65835j74192j10334L3399J04893Q8088p8530K7103r082
$$ 7513150 7458051 7406416 7240581 7066389 6956055 6989454 7094347 7182435 7103905 7131008 7121926
6759G121926l2465j13619n2181p3214j84680p1214k1424n0293j02080j2014L9010
$$ 7121926 7089461 6975842 6923661 6850447 6665767 6594553 6573129 6522836 6420756 6408742 6447752
6748F447752j20886j01629P5603P881J26731M7750K7467j63109O2146L8326j28258
$$ 6447752 6326866 6225237 6300840 6308721 6435452 6483202 6510669 6347560 6409706 6448032 6319774
6737F319774J36902j3205O8890r042m4390J14029j82717L4844J48579k4044N7036
$$ 6319774 6456676 6443471 6512361 6503319 6458929 6572958 6390241 6425085 6573664 6549620 6606656
6726F606656J03159R5864k23m5272N8860K26265J89310K6184p2721J52212N1592
$$ 6606656 6709815 6805679 6805456 6760184 6819044 7045309 7234619 7260803 7188082 7340294 7391886
6715G391886N5067O9717J1777R2847K1633L134j5510q2882L2132q631R0884P7827
$$ 7391886 7446953 7516670 7528447 7621294 7642927 7646061 7630551 7547669 7579801 7571170 7662054 7739881
6703G739881m7569R332j0608M3679J09136j06029J12422J99001O2469J37025r2911
$$ 7739881 7692312 7701644 7691036 7734715 7843851 7737822 7850244 8049245 8111714 8248739 8155828
6692H155828Q1932j369r327J09937N8910J2986N6060P7316L0006L2911J02831
$$ 8155828 8237760 8236391 8227064 8337001 8395911 8408897 8464957 8542273 8572279 8605190 8708021
6681H708021P5647J12325N0698J14425J18155R3577J60543J18309J7499J6077
$$ 8708021 8783668 8895993 8946691 9061116 9179271 9272848 9433391 9551700 9569199 9585276
6671I585276J07369J49988K32446J60311R5022P4890P5071K49772L08624K38715
$$ 9585276 9692645 9842633 10075079 10235390 10330412 10405302 10480373 10730145 11038769 11277484
6661A1277484M9277R9200J44896J50651K06049L46044J94897K52482L17902K76395
$$ 11277484 11326761 11425961 11570857 11721508 11927557 12273601 12468498 12720980 13038882 13315277
6651A3315277N07186K45156L25917M12948N06550K99869M57193M73726N77372
$$ 13315277 13822463 14067619 14393536 14806484 15313034 15612903 16070096 16543822 17121194
6642A7121194N82408O81088P03049O78372Q02448R08018Q78137R61701R62337
$$ 17121194 17703602 18384690 19087739 19766111 20568559 21476577 22354714 23316415 24278752
6633B4278752R41820J217562R64373J322375J384351J285618J305955J572673
$$ 24278752 25220572 26438134 27402507 28724882 30109233 31394851 32700806 34273479
6625C4273479J598139J519931J728989J741927J883055J941637K106727K071569
$$ 34273479 35871618 37391549 39120538 40862465 42745520 44687157 46793884 48865453
6617D8865453K161766K225216K205619K307669K162992K228692K251567K428726
$$ 48865453 51027219 53252435 55458054 57765723 59928715 62157407 64408974 66837700
6609F6837700K459971K298006K339644K372946K476983K400097K306353K194358
$$ 66837700 69297671 71595677 73935321 76308267 78785250 81185347 83491700 85686058
6601H5686058K200862K013349J857130J643913J601986J569396J182282J180707
$$ 85686058 87886920 89900269 91757399 93401312 95003298 96572694 97754976 98935683
6593I8935683J221546J053931R26217P37985L96940M14655J95802j36128k58434
$$ 98935683 100157229 101211160 102137377 102875362 103272302 103686957 103882759 103746631 103488197
6584A03488197o13871r39221q87425j012183j246785j473348j395974j497578
$$ 103488197 102874326 101935105 101047680 100035497 98788712 97315364 95919390 94421812
6576I4421812j825895j730034j885373j972512k241658k214734k359295k612106
$$ 94421812 92595917 90865883 88980510 87007998 84766340 82551606 80192311 77580205
6568G7580205k420480k588500k633450k711001k484161k475420k442658k409410
$$ 77580205 75159725 72571225 69937775 67226774 64742613 62267193 59824535 57415125
6560E7415125k470103k459400k312337k248591k235328k095879j980844j969394
$$ 57415125 54945022 52485622 50173285 47924694 45689366 43593487 41612643 39643249
6552C9643249j989303j874279j614703j715094j668889j433498j399754j263139
$$ 39643249 37653946 35779667 34164964 32449870 30780981 29347483 27947729 26684590
6544B6684590j196417j167902j040625j105904r92848r29243q19933o48161q70209
$$ 26684590 25488173 24320271 23279646 22173742 21180894 20251651 19431718 18783557 17913348
6535A7913348o87824o37976m47259m12665o02153n35331m26340l55748k83363
$$ 17913348 17225524 16587548 16140289 15727624 15125471 14590140 14163800 13808052 13524689
6526A3524689l72709l04603k06946j87684k31066m01776l07597o0557k8953j14941
$$ 13524689 13151980 12847377 12640431 12452747 12221681 11819905 11512308 11451751 11422798 11307857
6516A1307857j71461j26021j18511j52985r6146j7540L2837n2029j89214k2648
$$ 11307857 11136396 11010375 10891864 10738879 10642733 10625193 10658030 10606001 10416787 10394139
6506A0394139r9011k3350j05586j01039J6934j20510r9123M9599k00469j40435
$$ 10394139 10295128 10271778 10166192 10065153 10082087 9961577 9862454 9912053 9711584 9571149
6496I571149L7161m5189q814R571j98423k51481n8225J5403j1918L8446o2660
$$ 9571149 9608310 9563121 9554307 9563878 9365455 9113974 9055749 9071152 9059234 9097680 9035020
6485I035020m9879l0465L9070j29790r7790J8290k7330j3601M9707r6970j77083
$$ 9035020 8985141 8954676 8993746 8863956 8766166 8784456 8757126 8743525 8793232 8696262 8519179
6474H519179J48159j6337J2726P5706l1308j03726k1192P965k8985r8546k6807
$$ 8519179 8667338 8651001 8663727 8739433 8708125 8604399 8583207 8591172 8562187 8463641 8436834
6463H436834J28691J09759j74534P9187k5104O583l6665P3401J43576q1998p4121
$$ 8436834 8565525 8675284 8500750 8579937 8554833 8561416 8524751 8598152 8741728 8659730 8585609
6452H585609M256M2072K5310q1671O9570J13626M1434P0119J14609m5107J1267
$$ 8585609 8589865 8631937 8657247 8575576 8645146 8758772 8800206 8870325 8984934 8939827 8951094
6441H951094J62588M749J00754j1393k2058J06631P2674R4162r1413j224m1286
$$ 8951094 9113682 9118431 9219185 9207792 9185734 9292365 9365039 9459201 9367788 9366564 9325278
6430I325278j113N3814P5294K12063m1613L0671M0756O6084J16243L6173M7924
$$ 9325278 9324165 9377979 9453273 9665336 9623723 9654394 9695150 9761234 9877477 9913650 9961574
6419I961574K5581o270J27661J6607R435J4052R648P6009Q3184l8017j7295Q6794
$$ 9961574 9987155 9980885 10108546 10125153 10134588 10148640 10158288 10234297 10317481 10279464 10262169 10348963
6407A0348963O2941P0358l5658J7977J4876m1779J34742M078m7896J3979L4112
$$ 10348963 10411904 10482262 10446604 10464581 10479457 10437678 10572420 10576498 10528602 10542581 10576693
6396A0576693m2146N21M8431O8580R2324J731L0392p524p5909Q8139J8521j2784
$$ 10576693 10534547 10535068 10583499 10652079 10744403 10746134 10776526 10769002 10693093 10781232 10799753 10786969
6384A0786969L1867m9838M8649M0604J5077j1583j7549l5294N3406J13657K2662
$$ 10786969 10818836 10768998 10817647 10858251 10873328 10861745 10844196 10808902 10862308 10975965 10998627
6373A0998627J38264J41687J27321N2211N3158N8531J56711N09l0523J05181J27947
$$ 10998627 11136891 11278578 11405899 11458110 11511268 11569799 11726510 11727019 11696496 11801677 11929624
6362A1929624Q7184Q5814J84005Q0032k3645J05580K45573O5933j8221K01715
$$ 11929624 12016808 12102622 12286627 12366659 12343014 12448594 12694167 12760100 12741879 12943594
6352A2943594K48453O0730O3146J36264J11014J32833J17718J13259J12331J47089
$$ 12943594 13192047 13252777 13315923 13452187 13563201 13696034 13813752 13927011 14039342 14186431
6342A4186431J9033K64370K64660M0516J71462J50159J28354P4685J43832J99513
$$ 14186431 14205464 14469834 14734494 14775010 14946472 15096631 15224985 15299670 15443502 15643015
6332A5643015K56965N3215O1824R9770K92828J45078K0437K10575J75929J53446
$$ 15643015 15899980 15953195 16015019 16114789 16407617 16552695 16573132 16783707 16959636 17113082
6322A7113082K13130L15284J39386J58385K17490J93341J14058J68268K33583
$$ 17113082 17326212 17641496 17780882 17939267 18156757 18350098 18464156 18632424 18866007
6313A8866007K09940K93298K35865K50102L33449L53340K40297L13092K98428
$$ 18866007 19075947 19369245 19605110 19855212 20188661 20542001 20782298 21095390 21393818
6304B1393818L51948M38473N63785N29274M44373M61694N25416N74709Q60407
$$ 21393818 21745766 22184239 22748024 23277298 23721671 24183365 24708781 25283490 26143897
6295B6143897O20710P29662Q02846Q70681Q21398Q03295Q80438R24934J090156
$$ 26143897 26764607 27494269 28297115 29167796 29989194 30792489 31672927 32597861 33688017
6286C3688017J137102J086993J186326J021454J217393J261816J033057J114633
$$ 33688017 34825119 35912112 37098438 38119892 39337285 40599101 41632158 42746791
6278D2746791R61997J023558R36884R70485P25516P56614P17116O58251O26832
$$ 42746791 43708788 44732346 45669230 46639715 47365231 48121845 48838961 49497212 50124044
6269E0124044P75152M92272L61678L80212L46056J59058J19901J79067r227j40694
$$ 50124044 50899196 51391468 51753146 52133358 52479414 52638472 52758373 52937440 52928213 52787519
6259E2787519r0105k19898j29796j49476j16944J215r0215J2743J56095L57835
$$ 52787519 52697414 52477516 52347720 52198244 52081300 52082515 51992300 52005043 52161138 52518973
6249E2518973K04580L38305M40633M98405P23944R27919J173411J267287J363032
$$ 52518973 52723553 53061858 53502491 54000896 54724840 55652759 56826170 58093457 59456489
6240E9456489J604065J808776K063073K259473K395029K525792K797381L112894
$$ 59456489 61060554 62869330 64932403 67191876 69586905 72112697 74910078 78022972
6232G8022972L166937L427619L566732L736181L784386L976595M041392L937859
$$ 78022972 81189909 84617528 88184260 91920441 95704827 99681422 103722814 107660673
6224A07660673M068770L942992L682373L576641L510023L450090L123249L151506
$$ 107660673 111729443 115672435 119354808 122931449 126441472 129891562 133014811 136166317
6216A36166317L075087K915112K697170K490770K098439J849980J608499J231930
$$ 136166317 139241404 142156516 144853686 147344456 149442895 151292875 152901374 154133304
6208A54133304R28377N76608J93447Q4247L640j02757k39301p8912N8740j8440
$$ 154133304 155061681 155638289 155831736 155915983 155919623 155816866 155577565 155498653 155557393 155538953
6198A55538953J42319L7311J88034K97976K75985O12103R15621R52556J214033
$$ 155538953 155681272 155718583 155906617 156204593 156480578 157092681 158008302 158960858 160174891
6189A60174891J418297J814105K158460K524784K584907K954781L350470L689126
$$ 160174891 161593188 163407293 165565753 168090537 170675444 173630225 176980695 180669821
6181A80669821L790142L896775L880854L697820L266584K929645K568933J911064
$$ 180669821 184459963 188356738 192237592 195935412 199201996 202131641 204700574 206611638
6173B06611638J601455J433021J183022R67575R98225J007978J066986J187386
$$ 206611638 208213093 209646114 210829136 211796711 212794936 213802914 214869900 216057286
6165B16057286J242699J316136J186549J353730J317460J448499J785206K198186
$$ 216057286 217299985 218616121 219802670 221156400 222473860 223922359 225707565 227905751
6157B27905751K873366L853525M664678N539616O246999O788734P234786P034795
$$ 227905751 230779117 234632642 239297320 244836936 251083935 257872669 265107455 272142250
6149B72142250O591693N399460M162081K497945R07807l23834j377409k126655
$$ 272142250 278733943 284133403 288295484 290793429 291701236 291377402 289999993 287873338
6141B87873338k514367k723221k828512k605726k714246l143638l941956m794190
$$ 287873338 285358971 282635750 279807238 277201512 274487266 271343628 267401672 262607482
6133B62607482o018055p467492q962146j0344082j1338247j1893408j2298098
$$ 262607482 256589427 249121935 240159789 229815707 218477460 206584052 194285954
6126A94285954j2233388j1703388j0982312j0089394r206294q327938p513219
$$ 194285954 182052566 170349178 159366866 149277472 140071178 131743240 124230021
6119A24230021o586073o058918n577348m873305m675756m386867l890510l689275
$$ 124230021 117643948 111585030 106007682 101134377 96458621 92071754 88181244 84491969
6111H4491969l530054l379012l177931l003758k816127k642695k513591k515799
$$ 84491969 80961915 77582903 74404972 71401214 68585087 65942392 63428801 60913002
6103F0913002k266362k278597k278128k089821k054592k055975k029788j960258
$$ 60913002 58646640 56368043 54089915 52000094 49945502 47889527 45859739 43899481
6095D3899481j824342j889465j704855j635659j551398j550278j408773j066461
$$ 43899481 42075139 40185674 38480819 36845160 35293762 33743484 32334711 31268250
6087C1268250j351803j190015j017584j070789r42734p98937p02150r15920o58669
$$ 31268250 29916447 28726432 27708848 26638059 25695325 24896388 24194238 23278318 22619649
6078B2619649p48247o14949n88792n22394m67486o45523m30506m99029m03333
$$ 22619649 21871402 21256453 20667661 20145267 19677781 19032258 18601752 18102723 17699390
6069A7699390k48252l13862m67952m04540k90956k59996k84744k82245k45658
$$ 17699390 17451138 17137276 16669324 16264784 15973828 15713832 15429088 15146843 14901185
6060A4901185j87960k77362k36123k92226r5868j90080j94447k78708k16274l0104
$$ 14901185 14713225 14435863 14199740 13907514 13811646 13621566 13427119 13148411 12932137 12902033
6050A2902033k13898j25190m5372q2572k31229j47399r6411l0028j91030j03328
$$ 12902033 12688135 12562945 12517573 12435001 12203772 12056373 11959962 11929934 11738904 11635576
6040A1635576j08472j02803p1053j73271q9513q5492k803m2280k01870j64989
$$ 11635576 11527104 11424301 11353248 11179977 11090464 11004972 11002169 10959889 10758019 10593030
6030A0593030J8277k5056m7151n9655J0596j4662j54540O1774m2162k33621q4801
$$ 10593030 10611307 10586251 10539100 10479445 10490041 10475379 10320839 10382613 10340451 10106830 10022029
6019A0022029j3508M7161k6204k8154q977P340L7303r9518j3535q8745j15255
$$ 10022029 10008521 10055682 10029478 10001324 9992347 9999687 10036990 9937472 9923937 9835192 9719937
6008I719937J86140O6906K1729l0588L4068J12711j2993j6588L6597J7524j57583
$$ 9719937 9906077 9972983 9994712 9964124 9998192 10110903 10097910 10081322 10117919 10135443 9977860
5997I977860J31014N6751p235J12253M4406p311k5500R8014M997Q1292O0771M804
$$ 9977860 10108874 10165625 10158390 10270643 10315049 10307738 10282238 10380252 10385249 10466541 10527312 10532116
5985A0532116L5977L7165L6358j9801R2475J83407R5377O7821P7189O2810J14309
$$ 10532116 10568093 10605258 10641616 10621815 10714290 10897697 10993074 11060895 11138084 11200894 11315203
5974A1315203L9928M1247K28500J8978j1835Q4545K11384J32660J00845J71232
$$ 11315203 11355131 11396378 11624878 11643856 11632021 11716566 11927950 12060610 12161455 12332687
5964A2332687J36709J10400J55986K78992J00199J06395J35435K58499K16113
$$ 12332687 12469396 12579796 12735782 13014774 13114973 13221368 13356803 13615302 13831415
5955A3831415L63967K02738K8746J28199K56600L76390R8231K54687L77482L47117
$$ 13831415 14195382 14398120 14426866 14555065 14811665 15188055 15286286 15540973 15918455 16265572
5945A6265572K70777J45459L37908K71198L27372L41522L26515L54513L16213
$$ 16265572 16536349 16681808 17019716 17290914 17618286 17959808 18286323 18640836 18957049
5936A8957049M11717L80554L38558M92073N11321L39734M67736L71494L43100
$$ 18957049 19368766 19749320 20087878 20579951 21091272 21431006 21898742 22270236 22613336
5927B2613336N10031M63533N41132M95652O34768N82387N78737N57206P08779
$$ 22613336 23123367 23586900 24128032 24623684 25258452 25840839 26419576 26976782 27685561
5918B7685561O78339O57776Q59452P29951Q49754P89910R81289R34040J084988
$$ 27685561 28363900 29021676 29881128 30611079 31460833 32250743 33232032 34166072 35251060
5909C5251060J218584J298780J264718J431580J533071J593121J633584J743265
$$ 35251060 36469644 37768424 39033142 40464722 41997793 43590914 45224498 46967763
5901D6967763J918634K105090K227440K020215K209603K605877K586938K507522
$$ 46967763 48886397 50991487 53218927 55239142 57448745 60054622 62641560 65149082
5893F5149082K485737K585062K367398K161429J642738J145624O41901k8200p09714
$$ 65149082 67634819 70219881 72587279 74748708 76391446 77537070 78178971 78150771 77441057
5884G7441057j314071j832038k086974k185390k358285k406982k100678j929929
$$ 77441057 76126986 74294948 72207974 70022584 67664299 65257317 63156639 61226710
5876F1226710j927805j526698j580363j513721j386013j190612j297487j319212
$$ 61226710 59298905 57772207 56191844 54678123 53292110 52101498 50804011 49484799
5868D9484799j283858j382015j031019r35088r65254p70863q61363p65235p72854
$$ 49484799 48200941 46818926 45787907 44852819 43887565 43116702 42255339 41490104 40717250
5859D0717250p39329o48994n76669p57351q16880n13457n72405n63330l76865
$$ 40717250 39977921 39328927 38752258 37994907 37178027 36664570 36092165 35528835 35151970
5850C5151970n71937m21877m33502m40186l59046m03351k94056q2258k15666l86423
$$ 35151970 34580033 34158156 33724654 33284468 32925422 32522071 32228015 32145757 31930091 31543668
5840C1543668l09952l45337l22782o26052r34748q83880r63925q27439p99351
$$ 31543668 31233716 30888379 30565597 29939545 29004797 28120917 27156992 26329553 25530202
5831B5530202o91657q06353o77700o92948o04166l80434m46999k73332m88260
$$ 25530202 24838545 24032192 23354492 22661544 22057378 21676944 21229945 20956613 20468353
5822B0468353l13100m46369m08265j83545j87402o535k76063k35384j20946p1439
$$ 20468353 20155253 19708884 19300619 19117074 18929672 18923137 18647074 18411690 18290744 18219305
5812A8219305J7627N9873k6078k3409j29720p9154k00257m60458n26895l59184
$$ 18219305 18236932 18296805 18270727 18247318 18117598 18038444 17838187 17377729 16850834 16491650
5802A6491650j67398m51874l25822k41885k52790l08338l26188k29233q3715j26376
$$ 16491650 16324252 15872378 15546556 15304671 15051881 14743543 14417355 14188122 14104407 13978031
5792A3978031l14744j10747j17734k60659k9191j76214J0489j61879k29103r3293
$$ 13978031 13663287 13552540 13434806 13174147 13144956 12968742 12979231 12817352 12588249 12494956
5782A2494956j48566q5057K5302r9249j51102j50739j88977j26607j32033m7083
$$ 12494956 12346390 12261333 12286635 12187386 12036284 11885545 11696568 11569961 11437928 11390845
5772A1390845q5745j83204j01291L5207m2434l0881p3515j71606k07217Q9772
$$ 11390845 11305100 11121896 11020605 11055812 11013378 10982497 10908982 10737376 10530159 10619931
5762A0619931q239o2049j9512m1859j15806n4969P2876r9536j68019J8433P6146
$$ 10619931 10611692 10549643 10530131 10488272 10372466 10317497 10390373 10290837 10122818 10141251 10217397
5751A0217397n1946l1240Q5285K304o2332K3001o4707J4436J30020j07936j06871
$$ 10217397 10165451 10134211 10219496 10221800 10159468 10182469 10117762 10132198 10262218 10154282 10047411
5740A0047411J19912M3244p0875r8272J14531P4110J29547N2546J38762J94127
$$ 10047411 10167323 10210567 10139692 10041420 10155951 10230061 10359608 10412154 10550916 10745043
5730A0745043o3628J46430L60664P7384J59707K62613J85518K04252J99526L53314
$$ 10745043 10681415 10827845 11188509 11265893 11425600 11688213 11873731 12077983 12277509 12630823
5720A2630823M36767P36411R13226N95580O10130N19298K38811J85700j84499
$$ 12630823 13067590 13804001 14717227 15312807 15922937 16442235 16681046 16866746 16682247
5711A6682247o04816r01040q82099n51670n66634n20877m91924k31864j18726
$$ 16682247 16077431 15176391 14294292 13742622 13175988 12655111 12163187 11931323 11812597
5702A1812597j62116j3758j3891j21660R0897J10827J2867J49023K75836L17146
$$ 11812597 11650481 11636723 11622832 11501172 11592069 11702896 11715763 11864786 12140622 12457768
5692A2457768L94627N48337O34876O73473N29285L16396N7638L505l66316r20658
$$ 12457768 12852395 13400732 14035608 14709081 15238366 15554762 15612400 15615905 15249589 14328931
5682A4328931r00762q48985p62472o60550m87254l83398l88374l90121l00787
$$ 14328931 13428169 12579184 11816712 11156162 10668908 10285510 9897136 9507015 9206228
5673I206228k06682k47576j84791k80486j98966j02705j04596j66903m4659m164
$$ 9206228 8999546 8751970 8567179 8286693 8087727 7985022 7880426 7713523 7668864 7664700
5663G664700p3952j18759r5401L6660J0272r6057J6776j1232J46623q1679o2050
$$ 7664700 7590748 7471989 7376588 7413248 7423520 7327463 7344239 7333007 7479630 7397951 7335901
5652G335901l9317n9231j07595k2529R9999n330k9027q0996n2310Q677o0126o6423
$$ 7335901 7296584 7237353 7129758 7107229 7207228 7201898 7172871 7091875 7039565 7048242 6988116 6921693
5640F921693K07167M9647j47015P0193m9245L2025O9519n500J30144L1469O6915
$$ 6921693 7128860 7178507 7031492 7101685 7052440 7084465 7153984 7148484 7278628 7310097 7377012
5629G377012l5921l0888J12035J15147K2538K9359N3418N8102J11495J61703Q4075
$$ 7377012 7341091 7310203 7422238 7537385 7559923 7589282 7642700 7700802 7812297 7974000 8058075
5618H058075j7641J03484j6759o2725Q1668J00841J07369O5470J10336O073L609
$$ 8058075 8040434 8143918 8127159 8064434 8146102 8246943 8354312 8419782 8530118 8536191 8539800
5607H539800J14914J64529J55439J10603o2940R3570J12484R0479J44463J78934
$$ 8539800 8654714 8819243 8974682 9085285 9022345 9115915 9228399 9318878 9463341 9642275
5597I642275J94524J93097J39559J60503J94580J51921L66083K97629K46639K46688
$$ 9642275 9836799 10029896 10169455 10329958 10524538 10676459 11042542 11340171 11586810 11833498
5587A1833498J92903J74304K18929L15619L17462L90363L29059M35276L78924
$$ 11833498 12026401 12200705 12419634 12735253 13052715 13443078 13772137 14207413 14586337
5578A4586337L29289L60859K18960L73845L79592M01729K93225J46199K11781
$$ 14586337 14915626 15276485 15495445 15869290 16248882 16650611 16943836 17090035 17301816
5569A7301816K24689K59603L04085K85790L48290J62696L10325M38095M44175
$$ 17301816 17526505 17786108 18090193 18375983 18724273 18886969 19197294 19635389 20079564
5560B0079564L86299N25067N11162O97402N92984N24998O95259R55542J040208
$$ 20079564 20465863 20990930 21502092 22199494 22792478 23317476 24012735 24968277 26008485
5551B6008485P04951Q41987Q59002P45572N62997M72234L51580J44777j80640
$$ 26008485 26713436 27555423 28414425 29159997 29722994 30195228 30546808 30691585 30510945
5542C0510945l36408m16469n91165n88722m61356l69884o3838j51746j35036P4892
$$ 30510945 30174537 29758068 29166903 28578181 28116825 27746941 27683103 27531357 27396321 27471213
5532B7471213Q5679K43196L37002M01038M25555L86998M58121O32774N04920L87920
$$ 27471213 27556892 27800088 28137090 28538128 28963683 29350681 29808802 30441576 30946496 31334416
5522C1334416L50446L88281L87360J08673L3448k40016k58287n73066p41764p93366
$$ 31334416 31684862 32073143 32460503 32569176 32602624 32362608 32104321 31531255 30789491 29996125
5512B9996125p99022r15284q92375q03758o93396o87762o95339m25816k47784
$$ 29996125 29197103 28281819 27389444 26585686 25892290 25204528 24509189 24083373 23835589
5503B3835589k22723r3368j89672k46169j55448j46634k92426k13996j76078k43948
$$ 23835589 23612866 23519498 23329826 23083657 22928209 22781575 22489149 22275153 22099075 21855127
5493B1855127n04802m70199m61830o66088o47086p15150p99380p56769p77555
$$ 21855127 21350325 20880126 20418296 19752208 19105122 18389972 17590592 16833823 16056268
5484A6056268p29676m87020m74899n78695o15851m83161n86956l78408m11989
$$ 16056268 15326592 14839572 14364673 13785978 13170127 12686966 12100010 11721602 11309613
5475A1309613m30421l41315k67064k56906k18752j77569l88445l84875j86065
$$ 11309613 10879192 10537877 10270813 10013907 9795155 9617586 9229141 8844266 8658201
5466H658201j84492j88565l27967k04241j34077j19340l05370k97983k91133j77285
$$ 8658201 8473709 8285144 7957177 7752936 7618859 7499519 7194149 6896166 6605033 6427748
5456F427748j96356n4855k97522k73574j08412j12695p8464j98953j47002o5782
$$ 6427748 6231392 6176537 5879015 5605441 5497029 5384334 5305870 5106917 4959915 4894133
5446D894133j45476k31422q5759j38764j29360j33284j10406j8260m1056q5958
$$ 4894133 4748657 4517235 4431476 4292712 4163352 4030068 3919662 3901402 3860346 3774388
5436C774388j54971j11940Q4429p7006r0971j77406J3244P3573J02978n128j65968
$$ 3774388 3619417 3507477 3591906 3514900 3423929 3246523 3259767 3333340 3436318 3431190 3265222
5425C265222l6894j15026p6986l8367k24077j07660J30761j40007k07097r2440
$$ 3265222 3228328 3113302 3036316 2997949 2773872 2666212 2796973 2656966 2449869 2357429
5415B357429j9202J37433q4528j30932k594j75415j41611o5234K0173J284J6525
$$ 2357429 2338227 2475660 2391132 2260200 2257606 2082191 1940580 1875346 1895519 1896803 1913328
5404A913328j0714j2076j16947M405M2128K6407p3912j97644J7214R8748n1906
$$ 1913328 1902614 1890538 1773591 1777996 1820124 1846531 1772619 1574975 1592189 1690937 1639031
5393A639031j75534m3116j00740p7244p8900n9432l7617M2271K0627o5709o9820
$$ 1639031 1463497 1420381 1319641 1242397 1163497 1104065 1066448 1108719 1129346 1063637 993817
5382I93817N1227k8700l6257p6359k3957O4956o6406j68620j87104O5898N5594
$$ 993817 1045044 1016344 980087 903728 879771 944727 878321 709701 522597 588495 644089
5371F44089q8528J7226K9965L8319L8927q9180j19630l4857J4323q0548L4550
$$ 644089 555561 572787 602752 641071 679998 590818 471188 436331 450654 370106 404656
5360D04656j7983o3113P5439j19558J2830n7767r7845J60862M7765K8357j68137
$$ 404656 386673 323560 398999 279441 292271 234504 136659 297521 345286 373643 205506
5349B05506o2605Q1637k958J1299m3598J0215j96059L9949P672J40367n9072l4767
$$ 205506 142901 224538 221580 232879 189281 199496 3437 43386 51058 191425 132353 97586
5337I7586P7733r5123p6239R3129J17719k6598p2671n9894l7807n5389m7035j869
$$ 97586 175319 80196 3957 97086 214805 188207 115536 55642 17835 -37554 -84589 -86458
5325h6458r3469Q702L6084j1612J57414j01687p666n2743J12774l4954m2027q4029
$$ -86458 -179927 -171225 -135141 -146753 10661 -91026 -98692 -151435 -38661 -73615 -115642 -199671
5313a99671j12165o5442J59948p948q894N0076j04899m2880R3134q3265L7333
$$ -199671 -311836 -377278 -217330 -225278 -234172 -184096 -288995 -331875 -238741 -322006 -284673
5302b84673L7540p5375K4217M5327P4511r6339O6629L7921n2257N7782J189m9233
$$ -284673 -247133 -322508 -298291 -252964 -178453 -274792 -208163 -170242 -222499 -164717 -163528 -212761
5290b12761o9645P1177r8262j34484J23313p4120l1099J31146l7484N2332l0719
$$ -212761 -282406 -211229 -309491 -443975 -320662 -394782 -425881 -294735 -332219 -279887 -310606
5279c10606j88298l3677L8898J8969J286P083p3474P7783M8598p0782M2200J78513
$$ -310606 -498904 -532581 -493683 -474714 -473428 -466345 -539819 -462036 -413438 -484220 -442020 -263507
5267b63507M2130j46954k06385J58112K9758o9470r2430J8677P9293j08577P009
$$ -263507 -221377 -368331 -574716 -416604 -386846 -456316 -548746 -530069 -450776 -559353 -552344
5256e52344l4121L1095n4023n889K33355K7889q2046j56252o1147r2142J32050
$$ -552344 -586465 -555370 -609393 -615282 -381927 -354038 -436084 -592336 -653483 -745625 -613575
5245f13575k1369l3151J14920l7534Q6408j7259M0319j33389o0068Q7704m7000
$$ -613575 -634944 -668095 -553175 -590709 -504301 -521560 -481241 -614630 -674698 -586994 -633994
5234f33994J01768M2109j21503j4345k8047P5894m5846j76967L6889P4790O3546
$$ -633994 -532226 -490117 -611620 -625965 -654012 -578118 -623964 -800931 -764042 -689252 -625706
5223f25706O9588l8740q9082N9327O2792j39414j6121r573j10665n658K4485J38067
$$ -625706 -556118 -594858 -683940 -624613 -561821 -701235 -717356 -726929 -837594 -843252 -818767 -680700
5211f80700J6678L6307K807j17148q6777k0412J6713K7645l816O6019j63729O1920
$$ -680700 -664022 -627715 -624908 -742056 -828833 -849245 -832532 -804887 -808703 -742684 -906413 -844493
5199h44493J6677j66556L0883J34956J5103o7634P0133K5467j31500j43407L3409
$$ -844493 -827816 -994372 -963489 -828533 -813430 -881064 -810931 -785464 -916964 -1060371 -1026962
5188a026962P2306M3667L7730q1258m2675L9477O649J67800l8152r6062n8985
$$ -1026962 -954656 -910989 -873259 -954517 -997192 -957715 -951066 -783266 -821418 -917480 -976465
5177i76465o5027o3708j5308J11803O2622q2932n8910p589P5829Q4302n9985j76825
$$ -976465 -1041492 -1105200 -1120508 -1008705 -946083 -1029015 -1087925 -1095514 -1019685 -935383 -995368 -1172193
5165a172193J7488o2146Q5032J22044k187O8550j165q15p326j04584R8001o7502
$$ -1172193 -1154705 -1216851 -1131819 -1009775 -1011962 -943412 -944577 -945392 -952718 -1057302 -959301 -1026803
5153a026803K9496n5407R6964j4269j82466J1129N194J1129q1016J14082m1588
$$ -1026803 -997307 -1052714 -955750 -970019 -1152485 -1141356 -1136162 -1125033 -1206049 -1091967 -1133555
5142a133555l7043j7837L246M3782P4054R2102k9110o7562o2678O582m4039R2229
$$ -1133555 -1170598 -1188435 -1185189 -1141407 -1067353 -975251 -1004361 -1071923 -1134601 -1128019 -1172058 -1079829
5130a079829Q1141j17697m9064J1116l8830J6023K5971l3507Q9156j5738p0352
$$ -1079829 -998688 -1116385 -1165449 -1154333 -1193163 -1177140 -1151169 -1184676 -1095520 -1111258 -1181610
5119a181610L2971K7791n7387k7689n8441R0987p1290k5627L2591P6770J41283
$$ -1181610 -1148639 -1120848 -1178235 -1205924 -1264365 -1173378 -1244668 -1270295 -1237704 -1160934 -1019651
5108a019651l8248j13957R4787j14333o3028K14353o2414R8164k0017l7374j78559
$$ -1019651 -1057899 -1171856 -1077069 -1191402 -1254430 -1040077 -1102491 -1004327 -1024344 -1061718 -1240277
5097a240277R6905Q8275L7678p7917r7874M2551p6379L6848N8256m1987K4786
$$ -1240277 -1143372 -1055097 -1017419 -1095336 -1193210 -1150659 -1227038 -1190190 -1131934 -1173921 -1149135
5086a149135l1212o1032N216m2049R4378j13200l7396k8956N6360n9645J21657
$$ -1149135 -1180347 -1241379 -1236163 -1278212 -1183834 -1297034 -1334430 -1363386 -1307026 -1366671 -1245014
5075a245014J14423N2523L4604j52876R386P046n9490K2286K3495M2841o3835
$$ -1245014 -1130591 -1078068 -1043464 -1196340 -1186954 -1179908 -1239398 -1217112 -1193617 -1150776 -1214611
5064a214611L9080J19951j68824J2415M5540m8300J1153j7500j07628J41395M8114
$$ -1214611 -1175531 -1055580 -1224404 -1211989 -1166449 -1214749 -1203596 -1221096 -1328724 -1187329 -1139215
5053a139215o7447n0908R2274k3173M302p117J9615J7309k4877L0052j08196p5059
$$ -1139215 -1206662 -1257570 -1165296 -1188469 -1184167 -1191284 -1171669 -1154360 -1179237 -1149185 -1257381 -1332440
5041a332440k6282Q3533K3114m7327n8413Q9288n4313J1545k474O88N5819P1019
$$ -1332440 -1358722 -1275189 -1252075 -1299402 -1357815 -1268527 -1322840 -1311295 -1313769 -1313081 -1257262 -1186243
5029a186243q493J0800j45881J3149J5737j5923o8366J4000O2593Q7002K1827
$$ -1186243 -1194736 -1183936 -1329817 -1316668 -1300931 -1316854 -1385220 -1371220 -1308627 -1221625 -1199798
5018a199798M0893n5369L7781Q5867p3997m0729J84376n0453m4270Q3008L9960
$$ -1199798 -1158905 -1214274 -1176493 -1090626 -1164623 -1205352 -1020976 -1071429 -1115699 -1032691 -992731
5007i92731J5450j23722n5670j14065j2697J8303k3475j6907L1707l2493O0691
$$ -992731 -977281 -1101003 -1156673 -1270738 -1283435 -1265132 -1288607 -1305514 -1273807 -1306300 -1245609
4996a245609O3685j7677M429M229j13602N1528R6752M2694K7076k0899j59146
$$ -1245609 -1181924 -1199601 -1195172 -1190943 -1304545 -1253017 -1156265 -1113571 -1086495 -1107394 -1266540
4985a266540Q4824N5960j63470M8417n4002o9497N8073Q912O9847j9544Q8213
$$ -1266540 -1181716 -1125756 -1289226 -1240809 -1294811 -1364308 -1306235 -1297323 -1227476 -1247020 -1158807
4974a158807M2699k3040J4160j54845p0880K0368o5519N4182P8494J14578r2647
$$ -1158807 -1116108 -1139148 -1124988 -1279833 -1350713 -1330345 -1395864 -1341682 -1263188 -1148610 -1241257
4963a241257M6142O9608q6142j2090R9872k7550q8376m8513n2202L0845J7943
$$ -1241257 -1195115 -1125507 -1211649 -1223739 -1123867 -1151417 -1239793 -1288306 -1340508 -1309663 -1291720
4952a291720M4701j9996k602K0127j293k6472J8562J40447M52R5937m8037N3017
$$ -1291720 -1247019 -1267015 -1269617 -1249490 -1250783 -1277255 -1258693 -1118246 -1117794 -1021857 -1069894 -1016877
4940a016877p8338j40457Q823R6103m2056n4412k9550l6675J61479j42899j33984
$$ -1016877 -1095215 -1235672 -1226849 -1130746 -1172802 -1227214 -1256764 -1293439 -1131960 -1274859 -1408843
4929a408843J89894J55876L6061j21106L123l2844o4930m5081p9624o2878Q2994
$$ -1408843 -1218949 -1063073 -1027012 -1148118 -1144995 -1177839 -1242769 -1287850 -1367474 -1430352 -1347358
4918a347358M649L2702O7649L8994J1361m6811K7368O5573M0292P0461o959n3013
$$ -1347358 -1342709 -1310007 -1242358 -1203364 -1192003 -1238814 -1211446 -1145873 -1105581 -1035120 -1042079 -1095092
4906a095092J53111l4262j19419o6872P3596o2535J05272K1259m5638j58756k3197
$$ -1095092 -941981 -976243 -1095662 -1162534 -1088938 -1151473 -1046201 -1024942 -1070580 -1229336 -1252533
4895a252533J39029m2531K150P3732J8394l1491l0435K8482n6753L728N0412P8038
$$ -1252533 -1113504 -1156035 -1153885 -1080153 -1061759 -1093250 -1123685 -1095203 -1151956 -1148228 -1097816 -1019778
4883a019778k505J9305l0997j1987n8631R381L8794J6765L3765N9752p6618R1784
$$ -1019778 -1022283 -1002978 -1033975 -1045962 -1104593 -1095212 -1056418 -1039653 -1005888 -946136 -1022754 -930970
4871i30970q9759j9364N5047l6506q9422L8315K3445p4388K3677L1125L270L3006
$$ -930970 -1020729 -1040093 -985046 -1021552 -1110974 -1072659 -1049214 -1123602 -1099925 -1068800 -1065530 -1032524
4859a032524O9742l4305n5752m2827O1006M3492J48834N345L3889j13729k9679
$$ -1032524 -962782 -997087 -1052839 -1095666 -1034660 -991168 -842334 -836989 -803100 -916829 -946508
4848i46508K3887n576j9839K1505M3863m0253J32947k2569p4742Q5835k9688O0043
$$ -946508 -922621 -928197 -948036 -926531 -882668 -922921 -789974 -812543 -887285 -801450 -831138 -771095
4836g71095m6896K2210m2527J8992N2676N8063l6242n9771N6628N0334M6805m9535
$$ -771095 -817991 -795781 -838308 -819316 -766640 -708577 -744819 -804590 -747962 -697628 -650823 -700358
4824g00358J43229k0419l2212j2402M766N6959J34408j6696l5577J01541K4474
$$ -700358 -557129 -577548 -609760 -622162 -617396 -560437 -426029 -442725 -478302 -376761 -352287
4813c52287k1623j5081L4535o414N8491r5367P7065J53352L8957q4771J38729
$$ -352287 -373910 -388991 -354456 -360870 -302379 -397746 -320681 -167329 -128372 -213143 -74414
4802g4414R7846J30913J8376n0461J23896m9713l1877P2704J13420P1347J00404
$$ -74414 23432 154345 172721 122260 246156 196443 164566 237270 350690 422037 522441
4791E22441P4517K4092L2864J99819J11339K06106L6109K06188J05256m4745J61872
$$ 522441 596958 621050 653914 853733 965072 1171178 1207287 1413475 1518731 1473986 1635858
4780A635858K03384L15708K58934J86409K40869K41672J71437K75574L66483L37447
$$ 1635858 1839242 2154950 2413884 2600293 2841162 3082834 3254271 3529845 3896328 4233775
4770D233775L26848N07862O67928O24414P21097P12601Q31044R66281J082287
$$ 4233775 4560623 5068485 5736413 6360827 7081924 7794525 8625569 9591850 10674137
4761A0674137R53931J050090J021395R89010J242912J376510J826588K201309
$$ 10674137 11628068 12678158 13699553 14688563 15931475 17307985 19134573 21335882
4753B1335882L112993M159468N511514N283610M155315K540420J509316R41727
$$ 21335882 24448875 28608343 34119857 39403467 43558782 46099202 47608518 48550245
4745D8550245j313917n085119o654522n510875m478224l554003k897383k369426
$$ 48550245 47236328 42151209 35496687 29985812 25507588 21953585 19056202 16686776
4737A6686776j897249j768218j483289j169214j003932p95047p74924p33259o73561
$$ 16686776 14789527 13021309 11538020 10368806 9364874 8569827 7794903 7061644 6388083
4728F388083o61714o29036m58695m60736m05576l58935l33664l02304l18113k43671
$$ 6388083 5726369 5097333 4638638 4177902 3772326 3413391 3079727 2777423 2459310 2215639
4718B215639j33915k97518n9243j86773j76887j76909l9735j61968k71059N4911
$$ 2215639 2081724 1784206 1724963 1538190 1361303 1184394 1144659 982691 711632 766543
4708G66543q0230j05658M2953k81296k34720P3440o5392j43677r3630K2711o4390
$$ 766543 686313 580655 623608 342312 107592 181032 115640 -28037 -121667 -98956 -163346
4697a63346n2201K2842j58946k0374P4981j27820n3967j19662k9740O4888K0290
$$ -163346 -215547 -192705 -351651 -372025 -297044 -424864 -478831 -598493 -628233 -563345 -543055
4686e43055k0950k8058r147k1538j41182k4881o2826M265k3955m8596M829L0723
$$ -543055 -564005 -592063 -601210 -622748 -763930 -788811 -851637 -847372 -871327 -919923 -915094 -884371
4674h84371R7924R7191p0786j18096Q4143k5757j34885K2037j33364r1996L406
$$ -884371 -786447 -689256 -760042 -878138 -793995 -819752 -954637 -932600 -1065964 -1157960 -1154554
4663a154554R880k861M3354J23552m1801q158J22402j21798j38148J75287m7770
$$ -1154554 -1144674 -1147535 -1104181 -980629 -1022430 -1030588 -908186 -1029984 -1168132 -992845 -1040615
4652a040615j4860j5526j0938m031o2022o0846m5951J6154R8646n3734q775m3792
$$ -1040615 -1055475 -1071001 -1081939 -1085970 -1147992 -1208838 -1254789 -1238635 -1139989 -1193723 -1202498 -1246290
4640a246290J23481J52544j51272n7619m5216q4011l217O1253o1191N5818M7458
$$ -1246290 -1122809 -970265 -1121537 -1179156 -1224372 -1308383 -1311600 -1250347 -1311538 -1255720 -1208262
4629a208262l0310M9523P6565j41859j07752J52324q0674q162m6900J00522n5656
$$ -1208262 -1238572 -1189049 -1112484 -1254343 -1362095 -1209771 -1290445 -1298607 -1345507 -1244985 -1300641
4618a300641j13175J45466L3060j49524R1647J3193n3680q079J2214n3029m321
$$ -1300641 -1413816 -1268350 -1235290 -1384814 -1293167 -1279974 -1333654 -1341733 -1329519 -1382548 -1386869
4607a386869R7817M9029p9920J03598L5730p0082J4583m2486J77724o1416r4285
$$ -1386869 -1289052 -1240023 -1319943 -1216345 -1180615 -1250697 -1236114 -1278600 -1100876 -1162292 -1256577
4596a256577k6634L0635l7525K4847n4804Q4373Q025Q6711q7780k8788M1496k08756
$$ -1256577 -1283211 -1252576 -1290101 -1265254 -1320058 -1235685 -1227660 -1140949 -1228729 -1257517 -1216021 -1424777
4584a424777M5538K0417l9629Q9674P6188J4822o6994n1908m1025K4892j3290
$$ -1424777 -1379239 -1358822 -1398451 -1308777 -1232589 -1217767 -1284761 -1336669 -1377694 -1352802 -1366092
4573a366092Q1486o8831P3563q402j05107q09p002l6737k5312n3741J26084O6043
$$ -1366092 -1284606 -1353437 -1279874 -1288276 -1393383 -1394192 -1401194 -1437931 -1463243 -1516984 -1390900 -1324857
4561a324857o0652q0742p1186K14479N7327j4045k1948l7938l9587m9543L4291
$$ -1324857 -1385509 -1466251 -1537437 -1322958 -1265631 -1279676 -1301624 -1339562 -1379149 -1428692 -1394401
4550a394401N7569r0015j05888Q0821J44163l0467r1699J802J05374j15482k8742
$$ -1394401 -1336832 -1426847 -1532735 -1451914 -1307751 -1338218 -1429917 -1428115 -1322741 -1438223 -1466965
4539a466965O8926L9209j1601M0713m24J34665p6668k9705q7941M7718K4096J6915
$$ -1466965 -1398039 -1358830 -1370431 -1329718 -1330142 -1195477 -1272145 -1301850 -1389791 -1342073 -1317977 -1301062
4527a301062N2933m8240L8261l0902Q0241o6186r2971k3770j5372N6467O3153
$$ -1301062 -1248129 -1296369 -1258108 -1289010 -1208769 -1274955 -1367926 -1391696 -1407068 -1350601 -1287448
4516a287448l5920J25000N3364p0562n0790j05368Q4973l0409p0533r4155Q3232
$$ -1287448 -1323368 -1198368 -1145004 -1215566 -1266356 -1371724 -1286751 -1317160 -1387693 -1481848 -1398616
4505a398616j7197J27027N4866j17156M9862j3441M0768o1569O7208n8006O3220
$$ -1398616 -1415813 -1288786 -1233920 -1351076 -1301214 -1314655 -1273887 -1335456 -1268248 -1326254 -1263034
4494a263034n3602N6838l4910M6224K8918K49m1106O6767j3045j58874L5844M3976
$$ -1263034 -1316636 -1259798 -1294708 -1248484 -1219566 -1219317 -1260423 -1193656 -1206701 -1365575 -1329731 -1285755
4482a285755J31821K6349M2292Q023j07792l562Q6892N5748L8761k1139n3370
$$ -1285755 -1153934 -1127585 -1085293 -1077270 -1185062 -1188624 -1101732 -1045984 -1007223 -1028362 -1081732
4471a081732j8065j5133n6672M0678q1852j49771l9738J1782J26349m191n2337
$$ -1081732 -1099797 -1114930 -1171602 -1130924 -1212776 -1362547 -1402285 -1390503 -1264154 -1268345 -1320682
4460a320682N3649R305j7823n2112k2657j6744O8324M5674M54K8948l5533J6999
$$ -1320682 -1267033 -1257728 -1275551 -1327663 -1350320 -1367064 -1298740 -1253066 -1252612 -1223664 -1259197 -1242198
4448a242198M8818o6631Q5416L5562j25452j4968l9506j18274N1579j5211O3853
$$ -1242198 -1193380 -1260011 -1174595 -1139033 -1264485 -1279453 -1318959 -1437233 -1385654 -1400865 -1337012
4437a337012m8665L339N8131J2943O0023o3122l8606r8235J11696p673Q862l7208
$$ -1337012 -1385677 -1382338 -1324207 -1311264 -1251241 -1314363 -1352969 -1451204 -1339508 -1347181 -1338319 -1375527
4425a375527L2240L455p5832J44112K9852q3262Q5661M6635j21002P1817J11824
$$ -1375527 -1343287 -1339832 -1415664 -1271552 -1241700 -1324962 -1239301 -1192666 -1313668 -1241851 -1130027
4414a130027q0877n3587p8514m0707J18802M7095J7384q252k0544o7731j4963
$$ -1130027 -1210904 -1264491 -1343005 -1383712 -1264910 -1217815 -1200431 -1208683 -1229227 -1296958 -1311921
4403a311921O7559M4171k8082l5298n037J5291q1554P0045k4799o5297N0735j1525
$$ -1311921 -1244362 -1200191 -1228273 -1263571 -1268608 -1253317 -1334871 -1264826 -1289625 -1354922 -1304187 -1315712
4391a315712R1936J45477m4138k0863N9469m7740o0426L2241o7160m2132L169
$$ -1315712 -1223776 -1078299 -1122437 -1143300 -1083831 -1131571 -1191997 -1159756 -1226916 -1269048 -1265879
4380a265879J2345J3306K5803j3860m5756J42799j16770J32925q7996J0448j01263
$$ -1265879 -1253534 -1240228 -1214425 -1228285 -1274041 -1131242 -1248012 -1115087 -1203083 -1192635 -1293898
4369a293898n2043J09216p6716K5865J02754L9431o3096n7540j284o3957n758
$$ -1293898 -1345941 -1236725 -1313441 -1287576 -1184822 -1145391 -1208487 -1266027 -1267311 -1331268 -1337026
4358a337026J21089K044O9834L922m9677q4079N6663m0708l3050L6531l0380J20715
$$ -1337026 -1215937 -1213893 -1144059 -1140137 -1189814 -1273893 -1217230 -1257938 -1290988 -1254457 -1284837 -1164122
4346a164122J31636j50291q6065J65126k6057j20121n5463L9549M6500j50828
$$ -1164122 -1032486 -1182777 -1268842 -1103716 -1129773 -1249894 -1305357 -1265808 -1219308 -1370136
4336a370136J4087J16687p830J6329l8714n4744Q3442R9264J9478o6838p2979
$$ -1370136 -1356049 -1239362 -1247192 -1230863 -1269577 -1324321 -1240879 -1141615 -1122137 -1188975 -1261954
4325a261954m323L8964j03064P5965m2819k0518L8988J9127r140k3172O2156P9179
$$ -1261954 -1266277 -1227313 -1330377 -1254412 -1297231 -1317749 -1278761 -1259634 -1268774 -1291946 -1229790 -1150611
4313a150611n4479P2085N60j1596q221K1123j22854O1301r3459R0768P6337j31872
$$ -1150611 -1205090 -1133005 -1132445 -1144041 -1152262 -1131139 -1253993 -1192692 -1286151 -1195383 -1119046 -1250918
4301a250918j9163l6120K27641J2326n5263n2095o8441J9000R4115m2702M6610
$$ -1250918 -1270081 -1306201 -1078560 -1066234 -1121497 -1173592 -1242033 -1223033 -1128918 -1171620 -1125010
4290a125010o9408J166J2048k8142Q821J04594j16832p5018q568Q7930r8285j68427
$$ -1125010 -1194418 -1193252 -1181204 -1209346 -1200525 -1095931 -1212763 -1287781 -1296349 -1208419 -1306704 -1475131
4278a475131J38398N2381N5028J2320K6632M9809J5015m9778l8028R786O1750
$$ -1475131 -1336733 -1284352 -1229324 -1217004 -1190372 -1140563 -1125548 -1175326 -1213354 -1203568 -1141818
4267a141818k9886q57k7751o3381M9940j56686Q5355n927J1847N0673J04576o7445
$$ -1141818 -1171704 -1172561 -1200312 -1263693 -1213753 -1370439 -1285084 -1291011 -1279164 -1228491 -1123915 -1191360
4255a191360j02770P7244l0504k8767K5517K0809m5338J6331N5946Q9638j5714
$$ -1191360 -1294130 -1216886 -1247390 -1276157 -1250640 -1229831 -1275169 -1258838 -1202892 -1113254 -1128968
4244a128968J47294L1003m8696K8641k55319k307M9245p9772O978J5544M7613
$$ -1128968 -981674 -950671 -999367 -970726 -1226045 -1228352 -1179107 -1258879 -1251901 -1236357 -1188744
4233a188744K8265J2974j28687J46951J60255n5432q2408j13044J8564j8448m2957
$$ -1188744 -1160479 -1147505 -1276192 -1129241 -968986 -1024418 -1106826 -1219870 -1201306 -1219754 -1262711
4222a262711k7673Q124l2346j1684N4767J32q7187m3834N0268N2394J11113N9538
$$ -1262711 -1290384 -1282260 -1314606 -1326290 -1271523 -1271391 -1358578 -1402412 -1352144 -1299750 -1188637 -1129099
4210a129099K1612M5323k6195j50572j4604P420Q6114l9394K2981j4320l5161
$$ -1129099 -1107487 -1062164 -1088359 -1238931 -1253535 -1246115 -1160001 -1199395 -1176414 -1190734 -1225895
4199a225895N8515J86n7082p4830N0118n349m5038J15633O5385j27226M8680p5161
$$ -1225895 -1167380 -1167194 -1224276 -1299106 -1248988 -1254337 -1299375 -1183742 -1118357 -1245583 -1196903 -1272064
4187a272064K439O505J702J07952K2174j17936k1377J20673M7890k7874j20309
$$ -1272064 -1269625 -1263120 -1261418 -1153466 -1131292 -1249228 -1270605 -1149932 -1102042 -1129916 -1250225
4176a250225J76792k4017q2219O7633J1172K9898p2465k5779J4031L7304k3479
$$ -1250225 -1073433 -1097450 -1179669 -1112036 -1100864 -1070966 -1143431 -1169210 -1155179 -1117875 -1141354
4165a141354J579N7824k8201n0274P1458J5329l4023j40296J1073J09215l0800
$$ -1141354 -1139775 -1081951 -1110152 -1160426 -1088968 -1073639 -1107662 -1247958 -1236885 -1127670 -1158470
4154a158470k1390K3036L9383n019K1231J8371o7554L3133J1910J17242L9593
$$ -1158470 -1179860 -1156824 -1117441 -1122460 -1101229 -1082858 -1150412 -1117279 -1105369 -988127 -948534
4143i48534r8941j14305M7219N8230m7045J8067L801J1030j14960J9715J1974
$$ -948534 -1047475 -1161780 -1114561 -1056331 -1103376 -1085309 -1081508 -1070478 -1185438 -1165723 -1153749
4132a153749l382K0240m9777j7545N5901m0634L8084P8565q3849P37L35O3077
$$ -1153749 -1157131 -1136891 -1186668 -1204213 -1148312 -1188946 -1150862 -1072297 -1156146 -1155409 -1155074 -1091997
4120a091997p8061M25N8065J02381k8466n7596j2481j75354N9841N4607L8814
$$ -1091997 -1170058 -1169633 -1111568 -1009187 -1037653 -1095249 -1107730 -1283084 -1223243 -1168636 -1129822
4109a129822j15465j02442P8346P4935j51597J5632Q3595J31129M4909J8255O4250
$$ -1129822 -1245287 -1347729 -1269383 -1194448 -1346045 -1330413 -1246818 -1115689 -1070780 -1052525 -988275
4098i88275L7840k3691j07828n2240p169J46764J23776J8363n4753j88358k1169
$$ -988275 -950435 -974126 -1081954 -1134194 -1141363 -994599 -870823 -852460 -907213 -1095571 -1116740
4087a116740m0560N1889J114J44495o1356j50955N3854k1230m8405J9896M7860
$$ -1116740 -1157300 -1105411 -1104297 -959802 -1021158 -1172113 -1118259 -1139489 -1187894 -1167998 -1120138
4076a120138Q4383j9311P3615o6863r9027o0646N5345k2715k4587J4247p8680
$$ -1120138 -1035755 -1055066 -981451 -1048314 -1147341 -1207987 -1152642 -1175357 -1199944 -1185697 -1264377
4065a264377r153N9528j3122K9390O4933N9369l0919K9439K4886l9123q2775j14012
$$ -1264377 -1273530 -1214002 -1227124 -1197734 -1132801 -1073432 -1104351 -1074912 -1050026 -1089149 -1171924 -1285936
4053a285936J00418r3875J0597P3425P3079j29282M3773j7872Q413K2031R9570
$$ -1285936 -1185518 -1279393 -1268796 -1195371 -1122292 -1251574 -1207801 -1225673 -1217260 -1195229 -1095659
4042a095659j08424l338j67861L3515K59242o5064P6438R1265q1153q4291J05400
$$ -1095659 -1204083 -1207421 -1375282 -1341767 -1082525 -1147589 -1071151 -979886 -1061039 -1145330 -1039930
4031a039930Q98j4191N7647j30623O6790j20746l8690J08847J00590n7792j03759
$$ -1039930 -1039032 -1053223 -995576 -1126199 -1059409 -1180155 -1218845 -1109998 -1009408 -1067200 -1170959
4020a170959j04650r879j03499J82069J35712Q2601L8786r5619L6439r203j3066
$$ -1170959 -1275609 -1285488 -1388987 -1206918 -1071206 -988605 -949819 -1045438 -1008999 -1018202 -1031268
4009a031268j07538M1677L4183R1069r3405r3992J15038l4435q6638m192M9448
$$ -1031268 -1138806 -1097129 -1062946 -971877 -1065282 -1159274 -1044236 -1078671 -1165309 -1169501 -1120053
3998a120053M4438J15777m9860o8712k2977R5785m3082P0058L4819r4828j0375
$$ -1120053 -1075615 -959838 -1009698 -1078410 -1101387 -1005602 -1048684 -978626 -943807 -1038635 -1049010
3987a049010M8343N1967j29494o9776R1161L1255l460o3664L3399N9208k01608
$$ -1049010 -1000667 -948700 -1078194 -1147970 -1056809 -1025554 -1029014 -1092678 -1059279 -1000071 -1201679
3976a201679K9297J01927Q5084L7734Q711j01270m3614L2271K7988p5057M4276
$$ -1201679 -1172382 -1070455 -985371 -947637 -938926 -1040196 -1083810 -1051539 -1023551 -1098608 -1054332
3965a054332m8211P094m4370J19083P3002r170l1829K9975r79K2790P2472q4794
$$ -1054332 -1102543 -1095449 -1139819 -1020736 -947734 -956904 -988733 -958758 -959737 -936947 -864475 -949269
3953i49269p8321O0305O1324l6801m030j02843l7614Q0136k4565j31496K2068
$$ -949269 -1027590 -967285 -905961 -942762 -946792 -1049635 -1087249 -1007113 -1031678 -1163174 -1141106
3942a141106J65282p1772J1606l534K0300l657N5198O826l616n2900L3776l7078
$$ -1141106 -975824 -1047596 -1035990 -1039524 -1019224 -1022881 -967683 -960857 -964473 -1017373 -983597 -1020675
3930a020675n4748j11199M0703L5139j718P5097L7400j1536l7833N7639j4888
$$ -1020675 -1075423 -1186622 -1145919 -1110780 -1112498 -1037401 -1000001 -1011537 -1049370 -991731 -1006619
3919a006619p9690j26556N6513M4188N6067Q877J2062k3387O054L7698O6845p7084
$$ -1006619 -1086309 -1212865 -1156352 -1112164 -1056097 -1047220 -1035158 -1058545 -1052491 -1014793 -947948 -1025032
3907a025032j25493q6358J46443J30330l4873r5731J26443M2591p1187n0284p3391
$$ -1025032 -1150525 -1236883 -1090440 -960110 -994983 -1090714 -964271 -921680 -992867 -1043151 -1116542
3896a116542J13599j07889J24206J56202m3378j74833o8236J46689m8451k4242
$$ -1116542 -1002943 -1110832 -986626 -830424 -873802 -1048635 -1116871 -970182 -1018633 -1042875
3886a042875M022k9484j21984O5257J93038j17121q3176l5133Q9086L1355M8105
$$ -1042875 -1038853 -1068337 -1190321 -1125064 -932026 -1049147 -1132323 -1167456 -1078370 -1047015 -998910
3875i98910j3233m5822j47377p4442J13333K8717p7012J76341K94069p9533J4093
$$ -998910 -1012143 -1057965 -1205342 -1279784 -1166451 -1137734 -1214746 -1038405 -744336 -823869 -809776
3864h09776j19419o8828N8970q9800k7431J30K6977Q837L0239J922m1583n3136
$$ -809776 -929195 -998023 -939053 -1028853 -1056284 -1056154 -1029177 -1020340 -990101 -988179 -1029762 -1082898
3852a082898n7479M9533l12J56814n3196J7163N9072p4705L4120P5902j4085j7000
$$ -1082898 -1140377 -1090844 -1091156 -934342 -987538 -970375 -911303 -986008 -951888 -875986 -890071 -907071
3840i07071l9745n3141n6312J12339m9847j15356O1589P335q18M8108k3939P679
$$ -907071 -946816 -999957 -1056269 -943930 -993777 -1109133 -1047544 -1040209 -1041027 -992919 -1016858 -1009179
3828a009179Q817M475q151R217P0552k0321O5190p7862j79267O7738Q0023q670
$$ -1009179 -1000362 -995887 -1004038 -994821 -924269 -944590 -879400 -957262 -1136529 -1068791 -988768 -997438
3816i97438r928r578N8974N7040l0276j11333J5763j9366K9750J03782o5578k8917
$$ -997438 -1007366 -1016944 -957970 -900930 -931206 -1042539 -1026776 -1046142 -1016392 -912610 -978188 -1007105
3804a007105n0818K0164j36083O2497P150j9827M847J15154P0381l7K8744l3850
$$ -1007105 -1057923 -1037759 -1173842 -1111345 -1104195 -1124022 -1119175 -1004021 -933640 -933677 -904933 -938783
3792i38783j26195l0529J41886J01037j10875q6800K03192L4122j45525m424p7084
$$ -938783 -1064978 -1095507 -953621 -852584 -963459 -1050259 -847067 -812945 -958470 -962894 -1039978
3781a039978l1330N8431Q9853N25N5736q2020k3650N0084l7025N2973k1935K6863
$$ -1039978 -1071308 -1012877 -923024 -922499 -866763 -948783 -972433 -922349 -959374 -906401 -928336 -901473
3769i01473j58869J12158O602n1724j0895M1489l3840m321Q3617M6271o1499l6899
$$ -901473 -1060342 -948184 -941582 -993306 -1004201 -962712 -996552 -1000873 -917256 -870985 -932484 -969383
3757i69383R3167L3997o1534l8190p0218M2447L2039o6801O0001J40021j04498
$$ -969383 -876216 -842219 -903753 -941943 -1012161 -969714 -937675 -1004476 -944475 -804454 -908952
3746i08952l6073m5143M6109N9049j2899j26537L696k350O4359j6273j04802L9237
$$ -908952 -945025 -990168 -944059 -885010 -897909 -1024446 -1020750 -1023100 -958741 -975014 -1079816 -1040579
3734a040579l4922J60059Q4125j93440m2292r190N982N3743K9742m0454O2296
$$ -1040579 -1075501 -915442 -831317 -1024757 -1067049 -1076239 -1070257 -1016514 -986772 -1027226 -964930
3723i64930q2517k7716J64688n5254q6104l3219J20459j0209j4472M3944j7768
$$ -964930 -1047447 -1075163 -910475 -965729 -1051833 -1085052 -964593 -974802 -989274 -945330 -963098
3712i63098j2779N3449J15322N9737n1138j60304p5142J7386J03668O8525l9147
$$ -963098 -975877 -922428 -807106 -747369 -798507 -958811 -1033953 -1016567 -912899 -844374 -883521
3701h83521K5978m8350j32236j00590J7201J57528J85844p0671q2691O5505o1596
$$ -883521 -857543 -905893 -1038129 -1138719 -1121518 -963990 -778146 -848817 -931508 -866003 -927599
3690i27599j47952O1470J6567j4315J26702N9657P6986j50966l0388M6711n9285
$$ -927599 -1075551 -1014081 -997514 -1011829 -885127 -825470 -748484 -899450 -929838 -883127 -942412
3679i42412l958j39395N618N5145K4951Q6249N8587L564o1957k3335R6706o4671
$$ -942412 -946370 -1085765 -1080147 -1025002 -1000051 -913802 -855215 -851651 -913608 -936943 -840237 -904908
3667i04908l9325N4975k7613K7784m3786O7614l8762k4798M7164o5411q0355l7153
$$ -904908 -944233 -889258 -916871 -889087 -932873 -865259 -904021 -928819 -881655 -947066 -1027421 -1064574
3655a064574R5620L9658k1719O3162p0667M3435J4434k7674j671j20820J01060
$$ -1064574 -968954 -929296 -951015 -887853 -958520 -915085 -900651 -928325 -929996 -1050816 -949756
3644i49756o131l9659J8426J52720J7046q0374q2957O5578K9497N1694J74442
$$ -949756 -955887 -995546 -977120 -824400 -807354 -887728 -970685 -905107 -875610 -823916 -649474
3633f49474k9410r2584m9593K8473l1477j31881L1397n8965N2125j3277N80J8773
$$ -649474 -678884 -771468 -821061 -792588 -824065 -955946 -924549 -983514 -931389 -944666 -944086 -925313
3621i25313L6045J03017K7858l5918k6270j35896o8869M5749J45587M5086J6216
$$ -925313 -889268 -786251 -758393 -794311 -820581 -956477 -1025346 -979597 -834010 -788924 -772708
3610g72708r7959l5726j14219o9974O8336J8377Q8603l5299m3927r4298P9875
$$ -772708 -870667 -906393 -1020612 -1090586 -1022250 -1003873 -915270 -950569 -994496 -1088794 -1008919
3599a008919P2998J0733l354K7749M3895K2458k6692N5858l4961k02986k1910
$$ -1008919 -935921 -925188 -928542 -900793 -856898 -834440 -861132 -805274 -840235 -1043221 -1065131
3588a065131J00233m36M4777N8693P0393q8129K011L6379o9782J1579J36701J08081
$$ -1065131 -964898 -965334 -920557 -861864 -791471 -879600 -877589 -841210 -910992 -899413 -762712 -654631
3576f54631j98609n2047Q1979M2406M8722j6327n6766K3184k47o9537j30495J740
$$ -654631 -853240 -905287 -823308 -780902 -732180 -748507 -805273 -782089 -782336 -851873 -982368 -980628
3564i80628N3196P0731j00259j81862J32492J43620r6540n5392J19281K2695Q6957
$$ -980628 -927432 -856701 -956960 -1138822 -1006330 -862710 -959250 -1014642 -895361 -872666 -785709
3553g85709k886j06337m837J13055o2244l114Q1192J9113j21125j05856j3648
$$ -785709 -788595 -894932 -899769 -786714 -848958 -852072 -770880 -751767 -872892 -978748 -992396
3542i92396R6894n455R082O9265o5632O1995p5101l4282j4465n8842P7904K6871
$$ -992396 -895502 -900957 -891875 -822610 -888242 -826247 -901348 -935630 -950095 -1008937 -931033 -904162
3530i04162J54189q3583j5049k5894P4927k6806n0613J04083o401p5930q6242
$$ -904162 -749973 -833556 -848605 -874499 -799572 -826378 -876991 -772908 -779309 -855239 -941481
3519i41481Q047p9727J4488J1555P4951L5083J42295j5905k3348O999o1842J44567
$$ -941481 -933434 -1013161 -998673 -987118 -912167 -877084 -734789 -750694 -774042 -767043 -828885 -684318
3507f84318j00709p8786R175j0473J4823M5262J4700n5413L0901p0884L2052p2031
$$ -684318 -785027 -863813 -854638 -865111 -850288 -805026 -790326 -845739 -814838 -885722 -853670 -925701
3495i25701p7021N865j4821J11822k2550P0256Q6957r785K7466r4615l4290L0517
$$ -925701 -1002722 -996857 -1011678 -899856 -922406 -852150 -765193 -774978 -747512 -842127 -876417 -845900
3483h45900m863k1576j6847q578J9987J01843j36056k2801Q590J67948n6512l8716
$$ -845900 -850763 -872339 -889186 -897764 -877777 -775934 -911990 -934791 -926201 -758253 -814765 -853481
3471h53481l4416j7434J02131m0385J584M4308K167r7991q4191J01383J7426L4245
$$ -853481 -887897 -905331 -803200 -843585 -842001 -797693 -795526 -893517 -977708 -876325 -858899 -824654
3459h24654J54232p9974j00733l3675j8443M4662r1347P272O5670L708n3133j3588
$$ -824654 -670422 -750396 -851129 -884804 -903247 -858585 -949932 -942660 -876990 -873282 -926415 -940003
3447i40003K1994j13609J21499K7080L9376n1945J25726o4625r6268J22422j47760
$$ -940003 -918009 -1031618 -910119 -883039 -843663 -895608 -769882 -834507 -930775 -808353 -956113
3436i56113p6046J08069J04515R4015r9840p9035J4494M9369j4178j16564k4445
$$ -956113 -1032159 -924090 -819575 -725560 -825400 -904435 -889941 -840572 -854750 -971314 -995759
3425i95759L5833j2048J37294r0553O9390n738j38050L9142O1308q7818R0329
$$ -995759 -959926 -971974 -834680 -925233 -855843 -861581 -999631 -960489 -899181 -986999 -896670
3414h96670P3541Q9283O159p6730n1769o5170k2192k484m9574J03170P1990j4138
$$ -896670 -823129 -733846 -727687 -804417 -856186 -921356 -943548 -946032 -995606 -892436 -820446 -834584
3402h34584j276k6929n7914P3891j0955M9209J43722j9731p4103j51539q502K9672
$$ -834584 -835860 -862789 -920703 -846812 -857767 -808558 -664836 -684567 -758670 -910209 -918711 -889039
3390h89039l4172K9976M8213O5715q3719l1548O832M1833J1881R887k9367o4980
$$ -889039 -923211 -893235 -845022 -779307 -863026 -894574 -887742 -845909 -834028 -824141 -853508 -918488
3378i18488P4974k1663o6045l9897Q7448M9405R1411R8623J4062p4037L7568o5198
$$ -918488 -843514 -865177 -931222 -971119 -883671 -834266 -742855 -644232 -630170 -704207 -666639 -731837
3366g31837K4941q4228o7309p228K1612q8002J61910K6507j2926j13385n2376
$$ -731837 -706896 -791124 -858433 -865661 -844049 -932051 -770141 -743634 -756560 -869945 -922321
3355i22321J4093K3735K9172P0211Q524K8260n8942j5981K7640O8785m8655p9576
$$ -922321 -908228 -884493 -855321 -785110 -776586 -748326 -807268 -823249 -795609 -726824 -775479 -855055
3343h55055J5317L1661L2905j3213l9315J07429m7526o1038j069k6584n1068l0836
$$ -855055 -839738 -808077 -775172 -788385 -827700 -720271 -767797 -828835 -829904 -856488 -907556 -938392
3331i38392J9317R9101K6364J07424j3568m6958o9444J5007J742p2682J32557
$$ -938392 -919075 -819974 -793610 -686186 -699754 -746712 -816156 -801149 -799407 -872089 -739532
3320g39532O1295n3698j20339Q3768j17574J31456r445J57252q118q5162k3155
$$ -739532 -678237 -731935 -852274 -768506 -886080 -754624 -764069 -606817 -614935 -700097 -723252
3309g23252j08130Q229j4068l6751N3089L3570J2103j390J6048Q3291J8916J9561
$$ -723252 -831382 -823153 -837221 -873972 -820883 -787313 -775210 -776600 -760552 -677261 -658345 -638784
3297f38784p5905j35882l434k5620J4834Q8877K784j01315O5995j05822O2941
$$ -638784 -714689 -850571 -854005 -879625 -864791 -775914 -773130 -874445 -808450 -914272 -851331
3286h51331J13237j52097l8041K04903p0679J147N2662j9802j18965j10J1438
$$ -851331 -738094 -890191 -928232 -723329 -794008 -792861 -740199 -760001 -878966 -879076 -867638
3275h67638n5498J59356J9028j15213m1686P8068o4434K1014K1143m018j9277
$$ -867638 -923136 -763780 -744752 -859965 -901651 -823583 -888017 -867003 -845860 -849878 -869155
3264h69155N8893J0302q4587K4138K5713N0798j564r2956r9879J79253k191q4225
$$ -869155 -810262 -799960 -884547 -860409 -834696 -783898 -785462 -878418 -978297 -799044 -801235 -885460
3252h85460L8411N6668N4082K7014j17757j8597O8125l8548k3489r9585j4112
$$ -885460 -847049 -790381 -736299 -709285 -827042 -845639 -777514 -816062 -839551 -939136 -953248
3241i53248Q0892M3066k3243J26821M3783j224r1830L9290o7871j39516K17601
$$ -953248 -872356 -829290 -852533 -725712 -681929 -683153 -774983 -735693 -803564 -943080 -725479
3230g25479l8505n6732J24459q5514n5466j2929n1722N986l4743J18721J34687
$$ -725479 -763984 -820716 -696257 -781771 -837237 -850166 -901888 -895902 -930645 -811924 -677237
3219f77237o0543r9789R9675M198n1918K538j66499M6934M5394K8093l3561J27264
$$ -677237 -737780 -837569 -737894 -733696 -785614 -783076 -949575 -902641 -857247 -829154 -862715 -735451
3207g35451n1170K1069n4448Q2304J32375l9959l5964j41683q6417O3815P805
$$ -735451 -786621 -765552 -820000 -737696 -605321 -645280 -681244 -822927 -909344 -845529 -837724
3196h37724O0244r177J12407o7264M7363k750j12018P3080j31605R1627J3393
$$ -837724 -777480 -786657 -674250 -741514 -694151 -696901 -808919 -735839 -867444 -775817 -762424
3185g62424j3840k3505p332O9025o2693l6403M250O903J18495N5504o4464m0822
$$ -762424 -776264 -799769 -807101 -738076 -800769 -837172 -832922 -826019 -707524 -652020 -716484 -757306
$$ [...]
##END NTUPLES=NMR SPECTRUM
##END=
