##TITLE=1H_DE-80H_X3
 200.13MHz, d2o
 8 sc
 
 19ns.26.2.2025
##JCAMPDX= 6.0         $$ Bruker NMR JCAMP-DX V2.0
##DATA TYPE= NMR SPECTRUM
##DATA CLASS= NTUPLES
##ORIGIN= UXNMR, Bruker Analytische Messtechnik GmbH
##OWNER= pz
$$ XWIN-NMR		Version 3.5
$$ Tue Oct 14 15:33:08 2025 Russian Standard Time (UT+4h)  Yarkov@DPX200
##.OBSERVE FREQUENCY= 200.1313
##.OBSERVE NUCLEUS= ^1H
##.ACQUISITION MODE= SIMULTANEOUS
##.ACQUISITION SCHEME= undefined
##.AVERAGES= 8
##.DIGITISER RES= 18
##SPECTROMETER/DATA SYSTEM= spect
##.PULSE SEQUENCE= zg30
##.SOLVENT NAME= CDCl3
##.SHIFT REFERENCE= (INTERNAL, CDCl3, 0, 17.9395)
##AUDIT TRAIL= $$ (NUMBER, WHEN, WHO, WHERE, WHAT)
$$ ##TITLE= Audit trail, XWIN-NMR		Version 3.5
$$ ##JCAMPDX= 5.01
$$ ##ORIGIN= Bruker BioSpin GmbH
$$ ##OWNER= Yarkov
$$ C:/Bruker/XWIN-NMR/data/yarkov2/nmr/H-C/1/pdata/1/auditp.txt
$$ ##AUDIT TRAIL=  $$ (NUMBER, WHEN, WHO, WHERE, WHAT)
(   1,<2025-10-14 15:31:34.12 +0400>,<Yarkov>,<DPX200>,
      <created by zg, POWCHK disabled, PULCHK disabled
       configuration hash MD5:
       00 E9 B6 7A A2 85 ED C7 34 08 36 98 17 FE 4E 26
       data hash MD5: 16K
       92 99 79 D1 CA D1 66 CF B0 D0 BA A7 07 43 2C E3>)
(   2,<2025-10-14 15:31:39.17 +0400>,<Yarkov>,<DPX200>,
      <Start of raw data processing
       efp BC_mod = 2 LB = 0.25 FT_mod = 6 PKNL = 1 PHC0 = -2487.609 PHC1 = -760.4607 SI = 16K 
       data hash MD5: 16K
       47 52 50 90 EE AE 2A 0D 72 A7 7E CB C2 F8 64 49>)
(   3,<2025-10-14 15:32:28.15 +0400>,<Yarkov>,<DPX200>,
      <pk PHC0 = -862.4451 PHC1 = 769.393 
       data hash MD5: 16K
       C7 7B 57 ED 57 0E CB A2 2C DE E0 60 41 56 A8 75>)
$$ ##END=
$$ 
$$ hash MD5
$$ 75 CA C5 2C CE 09 32 B4 C8 19 E6 18 10 44 0D 6F
##$RELAX= 
##$RELAX= 
##$RELAX= 
##$RELAX= 
##$RELAX= 
##$RELAX= 
$$ Bruker specific parameters
$$ --------------------------
##$DU= <C:/Bruker/XWIN-NMR>
##$EXPNO= 1
##$NAME= <H-C>
##$PROCNO= 1
##$TYPE= <nmr>
##$USER= <yarkov2>
##$AMP= (0..31)
100 100 100 100 100 100 100 100 100 100 100 100 100 100 100 100 100 100 
100 100 100 100 100 100 100 100 100 100 100 100 100 100 
##$AQSEQ= 0
##$AQ_mod= 1
##$AUNM= <au_zg>
##$AUTOPOS= <>
##$BF1= 200.13
##$BF2= 200.13
##$BF3= 200.13
##$BF4= 200.13
##$BF5= 200.13
##$BF6= 200.13
##$BF7= 200.13
##$BF8= 200.13
##$BYTORDA= 1
##$CFDGTYP= 0
##$CFRGTYP= 5
##$CHEMSTR= <none>
##$CNST= (0..31)
1 1 145 1 1 1 1 1 1 1 1 1 1 1 1 1 1 1 1 1 1 1 1 1 1 1 1 1 1 1 1 1 
##$CPDPRG= <>
##$CPDPRG1= <>
##$CPDPRG2= <>
##$CPDPRG3= <>
##$CPDPRG4= <mlev>
##$CPDPRG5= <mlev>
##$CPDPRG6= <mlev>
##$CPDPRG7= <mlev>
##$CPDPRG8= <mlev>
##$CPDPRGB= <>
##$CPDPRGT= <>
##$D= (0..31)
0 0.7 0 0 0 0 0 0 0 0 0 0.03 0 0 0 0 0 0 0 0 0 0 0 0 0 0 0 0 0 0 0 0 
##$DATE= 1760441493
##$DBL= (0..7)
120 120 120 120 120 120 120 120 
##$DBP= (0..7)
150 150 150 150 150 150 150 150 
##$DBP07= 0
##$DBPNAM0= <>
##$DBPNAM1= <>
##$DBPNAM2= <>
##$DBPNAM3= <>
##$DBPNAM4= <>
##$DBPNAM5= <>
##$DBPNAM6= <>
##$DBPNAM7= <>
##$DBPOAL= (0..7)
0.5 0.5 0.5 0.5 0.5 0.5 0.5 0.5 
##$DBPOFFS= (0..7)
$$ [...]
##$SUBNAM2= <"">
##$SUBNAM3= <"">
##$SUBNAM4= <"">
##$SUBNAM5= <"">
##$SUBNAM6= <"">
##$SUBNAM7= <"">
##$SUBNAM8= <"">
##$SUBNAM9= <"">
##$SW= 18.0517328524113
##$SWIBOX= (0..15)
0 0 2 0 0 0 0 0 0 0 0 0 0 0 0 0 
##$SW_h= 3612.71676300578
##$TD= 16384
##$TD0= 1
##$TE= 0
##$TE2= 300
##$TE3= 300
##$TEG= 300
##$TL= (0..7)
0 120 120 120 120 120 120 120 
##$TP= (0..7)
150 150 150 150 150 150 150 150 
##$TP07= 0
##$TPNAME0= <>
##$TPNAME1= <>
##$TPNAME2= <>
##$TPNAME3= <>
##$TPNAME4= <>
##$TPNAME5= <>
##$TPNAME6= <>
##$TPNAME7= <>
##$TPOAL= (0..7)
0.5 0.5 0.5 0.5 0.5 0.5 0.5 0.5 
##$TPOFFS= (0..7)
0 0 0 0 0 0 0 0 
##$TUNHIN= 0
##$TUNHOUT= 0
##$TUNXOUT= 0
##$USERA1= <user>
##$USERA2= <user>
##$USERA3= <user>
##$USERA4= <user>
##$USERA5= <user>
##$V9= 5
##$VALIST= <valist>
##$VCLIST= <CCCCCCCCCCCCCCC>
##$VD= 0
##$VDLIST= <DDDDDDDDDDDDDDD>
##$VPLIST= <PPPPPPPPPPPPPPP>
##$VTLIST= <TTTTTTTTTTTTTTT>
##$WBST= 1024
##$WBSW= 4
##$XGAIN= (0..3)
0 0 0 0 
##$XL= 0
##$YL= 0
##$YMAX_a= 144329
##$YMIN_a= -178030
##$ZGOPTNS= <>
##$ZL1= 120
##$ZL2= 120
##$ZL3= 120
##$ZL4= 120
##$ABSF1= 0
##$ABSF2= 0
##$ABSG= 0
##$ABSL= 0
##$ALPHA= 0
##$AQORDER= 0
##$ASSFAC= 0
##$ASSFACI= 0
##$ASSFACX= 0
##$ASSWID= 0
##$AUNMP= <proc_1d>
##$AZFE= 0.1
##$AZFW= 0.1
##$BCFW= 0
##$BC_mod= 2
##$BYTORDP= 0
##$COROFFS= 0
##$CY= -3
##$DATMOD= 1
##$DC= 0
##$DFILT= <>
##$DTYPP= 0
##$F1P= 0
##$F2P= 0
##$FCOR= 1
##$FTSIZE= 16384
##$FT_mod= 6
##$GAMMA= 0
##$GB= 0
##$INTBC= 1
##$INTSCL= 3.241238e-09
##$ISEN= 128
##$LB= 0.25
##$LEV0= 0
##$LPBIN= 0
##$MAXI= 10000
##$MC2= 0
##$MEAN= 0
##$ME_mod= 0
##$MI= 1.114404
##$NCOEF= 0
##$NC_proc= -9
##$NLEV= 6
##$NOISF1= 3.799351
##$NOISF2= 2.8
##$NSP= 0
##$NTH_PI= 0
##$NZP= 0
##$OFFSET= 17.93951
##$PC= 1
##$PHC0= -3350.054
##$PHC1= 8.932312
##$PH_mod= 1
##$PKNL= yes
##$PPARMOD= 0
##$PSCAL= 0
##$PSIGN= 0
##$REVERSE= no
##$SF= 200.129516132218
##$SI= 16384
##$SIGF1= 3
##$SIGF2= 2
##$SINO= 0.751879
##$SIOLD= 32768
##$SREGLST= <19F.Aceton>
##$SSB= 0
##$STSI= 16384
##$STSR= 0
##$SW_p= 3612.71676300578
##$SYMM= 0
##$S_DEV= 0
##$TDeff= 16384
##$TDoff= 0
##$TI= <>
##$TILT= no
##$TM1= 0
##$TM2= 0
##$TOPLEV= 0
##$USERP1= <user>
##$USERP2= <user>
##$USERP3= <user>
##$USERP4= <user>
##$USERP5= <user>
##$WDW= 1
##$XDIM= 16384
##$YMAX_p= 566459912
##$YMIN_p= -11592461
$$ End of Bruker specific parameters
$$ ---------------------------------
##NTUPLES= NMR SPECTRUM
##VAR_NAME=  FREQUENCY,     SPECTRUM/REAL,   SPECTRUM/IMAG
##SYMBOL=    X,             R,               I
##VAR_TYPE=  INDEPENDENT,   DEPENDENT,       DEPENDENT
##VAR_FORM=  AFFN,          ASDF,            ASDF
##VAR_DIM=   16384,         16384,           16384
##UNITS=     HZ,            ARBITRARY UNITS, ARBITRARY UNITS
##FACTOR=    0.220516191357247, 1,           1
##FIRST=     3590.22552508563, 0,            0
##LAST=      -22.4912379201551, 0,           0
##MIN=       -22.4912379201551, -11592461,   0
##MAX=       3590.22552508563, 566459912,    0
$$ Real data points
##PAGE= N=1
##DATA TABLE= (X++(R..R)), XYDATA
$$ [...]
$$ plain form
5078 7682106 7533977 6384998 6477507 7036425 6319845 5527655 6306686 5668403 5820333 5480721
5068 5480721 6109555 7154659 6241492 4664886 5223303 5879961 4609834 4886096 4522999
5059 4522999 4447906 5146272 5110364 4110158 3784302 3685178 3806615 4850984 4504162 3722832
5049 3722832 4149400 4272127 3433474 3235121 3089257 2983289 2845138 2799621 2869029 3374977
5039 3374977 3060918 2991460 3564264 3833684 3898824 3336524 3148028 3244556 2946515 2888770
5029 2888770 2424318 3459725 3270248 2612613 2439426 2708520 3542792 3195536 3438261
5020 3438261 2587186 3031394 4174880 3474904 3442504 4264719 4523146 4462255 3718552 2913370
5010 2913370 2915944 3202985 4095735 3963473 3990074 4119952 4148272 4854328 5256862 5124105
$$ packed form
5078G682106j48129j148979R2509N58918p16580p92190P79031o38283J51930l39612
5068E480721O28834J045104r13167j576606N58417O56658j270127K76262l63097
5059D522999p5093O98366l5908j000206l25856r9124J21437J044369l46822p81330
5049C722832M26568J22727q38653j98353j45864j05968j38151m5517O9408N05948
5039C374977l14059o9458N72804K69420O5140n62300j88496R6528k98041n7745
5029B888770m64452J035407j89477o57635j73187K69094Q34272l47256K42725
5020C438261q51075M44208J143486o99976l2400Q22215K58427o0891p43703q05182
5010B913370K574K87041Q92750j32262K6601J29878K8320P06056M02534j32757
$$ plain form
5000 5124105 4299300 4020034 4301704 4242405 4098588 4821487 6010198 5064985 5162818 5182919
4990 5182919 5491562 5293239 4719899 5427995 4309835 4098520 4253829 3496593 3187122
4981 3187122 2642674 2517331 2344498 2036824 2884878 2719941 2866186 2060601 1957665 2249499
4971 2249499 2519976 2903675 3745763 3755395 3276998 3265015 3169537 2976883 2323459 2636693
4961 2636693 2707442 2550464 3302880 3206003 3227620 3540998 3717000 3588777 4236298 4584229
4951 4584229 3949978 3140358 3266989 3358784 3991816 4424357 4960530 4537189 4190816 4927112
4941 4927112 4078185 3952954 4759778 4613108 4174800 3452840 3695116 3790208 3477796 3352720
4931 3352720 2818045 2658907 3440145 3376209 2657612 2196694 2390056 2865904 2913323 2998376
$$ packed form
5000E124105q24805k79266K81670n9299j43817P22899J188711r45213R7833K0101
4990E182919L08643j98323n73340P08096j118160k11315J55309p57236l09471
4981C187122n44448j25343j72833l07674Q48054j64937J46245q05585j02936K91834
4971B249499K70477L83699Q42088R632m78397j1983r5478j92654o53424L13234
4961B636693P0749j56978P52416r6877K1617L13378J76002j28223O47521L47931
4951D584229o34251q09620J26631R1795O33032M32541N36173m23341l46373P36296
4941D927112q48927j25231Q06824j46670m38308p21960K42276R5092l12412j25076
4931C352720n34675j59138P81238o3936p18597m60918J93362M75848M7419Q5053
$$ plain form
4921 2998376 3059318 2684011 2686659 3203123 2843350 3320783 3098537 2971747 2409142 2505744
4911 2505744 2481628 2306965 3131164 2643553 2833104 3269562 2560629 2968041 3144765 2251820
4901 2251820 1878488 1963106 2777960 2416387 2620022 3256600 3003487 3813054 4266624 3469437
4891 3469437 2306456 1978245 2510189 2202380 2117795 2385176 2352190 3394949 4077735 3844683
4881 3844683 2923415 3491591 3385489 3861132 4249579 4036116 4129673 4083216 3812771 4256118
4871 4256118 4624301 4558747 3795019 3855169 4520327 4238891 3622758 3452457 3601936 3608975
4861 3608975 3324871 4992200 5213926 5021464 4604856 4593579 5041176 5164930 5507358 5359500
4851 5359500 5140541 4531039 4921686 6076034 5046931 4319548 4497592 4591726 4808595
$$ packed form
4921B998376O0942l75307K648N16464l59773M77433k22246j26790n62605R6602
4911B505744k4116j74663Q24199m87611J89551M36458p08933M07412J76724q92945
4901B251820l73332Q4618Q14854l61573K03635O36578k53113Q09567M53570p97187
4891C469437j162981l28211N31944l07809q4585K67381l2986J042759O82786k33052
4881C844683r21268N68176j06102M75643L88447k13463R3557m6457k70445M43347
4871D256118L68183o5554p63728O0150O65158k81436o16133j70301J49479P039
4861C608975k84104J667329K21726j92462m16608j1277M47597J23754L42428j47858
4851E359500k18959o09502L90647J154348j029103p27383J78044R4134K16869
$$ plain form
4842 4808595 4679662 5094060 4628917 4264415 4905486 4677911 3663140 3551584 4880095
4833 4880095 4608401 3079716 4222572 4844101 3963593 3085738 3540142 3277928 3215660
4824 3215660 2636804 2356191 2760413 2482648 2431935 2521576 2931996 2961348 2844424 2329921
4814 2329921 2567409 2104451 1817528 2597379 3452357 4438335 3607453 3177366 3509339 3372280
4804 3372280 2864716 3617722 3235301 3012187 2420577 1735256 2082673 2676408 2830908 3024414
4794 3024414 2401300 1987812 1701331 1802755 2395039 1878462 2008272 3089150 2852774
4785 2852774 1694066 1782125 2367198 1951537 2241575 2520028 2264764 1921617 2064210 2609464
4775 2609464 2274255 2428236 1954527 1740919 1940441 2199002 2439454 2802027 3467662 3224490
$$ packed form
4842D808595j28933M14398m65143l64502O41071k27575j014771j11556J328511
4833D880095k71694j528685J142856O21529q80508q77855M54404k62214o2268
4824C215660n78856k80613M04222k77765n0713Q9641M10420K9352j16924n14503
4814B329921K37488m62958k86923P79851Q54978R85978q30882m30087L31973j37059
4804C372280n07564P53006l82421k23114n91610o85321L47417N93735J54500J93506
4794C024414o23114m13488k86481J01424N92284n16577J29810J080878k36376
4785B852774j158708Q8059N85073m15661K90038K78453k55264l43147J42593N45254
4775B609464l35209J53981m73709k13608J99522K58561K40452L62573O65635k43172
$$ plain form
4765 3224490 3660049 3246199 4038439 3985453 3106474 3167366 3215642 2828809 3133915 2152532
4755 2152532 2486227 3426051 4327394 4071766 4169512 4245287 3157253 2717739 2332164 2665847
4745 2665847 2900749 2796987 2762022 3035471 1939405 1813188 1579724 1354137 1926963 1591101
4735 1591101 882178 1293561 1559416 1908957 1846772 1629342 1179775 1187828 1404159 1546288
4725 1546288 1701600 1463544 1523450 1262026 1640938 1861319 1618147 1175357 346152 1555594
4715 1555594 1581352 1484036 1183966 2081599 2104221 2855030 2916494 1828996 2015529 2172080
4705 2172080 2621994 2903120 2447024 2636951 2948281 2663798 2851389 2103914 2094847 1637502
4695 1637502 2517559 3467353 3395088 3582666 2846185 2878825 3139913 3266862 2439346 2242111
$$ packed form
4765C224490M35559m13850P92240n2986q78979O0892M8276l86833L05106r81383
4755B152532L33695R39824R01343k55628R7746P5775j088034m39514l85575L33683
4745B665847K34902j03762l4965K73449j096066j26217k33464k25587N72826l35862
4735A591101p08923M11383K65855L49541o2185k17430m49567Q053K16331J42129
4725A546288J55312k38056N9906k61424L78912K20381k43172m42790q29205J209442
4715A555594K5758r7316l00070Q97633K2622P50809O1464j087498J86533J56551
4705B172080M49914K81126m56096J89927L11330k84483J87591p47475r067m57345
4695A637502Q80057R49794p2265J87578p36481L2640K61088J26949q27516j97235
$$ plain form
4685 2242111 2131364 1600810 1173987 1383582 954340 901549 1456321 1500497 738549 512131
4675 512131 1615749 1920136 858572 1297170 1272076 1245031 567726 50855 -3676 228807
4665 228807 948459 1673607 1740704 699356 711372 1063197 888371 203566 226962 -240190
4655 -240190 109659 716880 649108 1132938 541956 225690 590555 482382 1160255 938887
4645 938887 532451 1132804 1110266 -6119 -970722 -901179 51708 -114725 32886 -119754
4635 -119754 -281134 -242257 -576936 -153260 700264 586220 -50146 116478 843989 577129
4625 577129 368371 1090497 1080767 666983 239491 -161942 -35252 583163 179321 376351
4615 376351 886407 7017 -565639 -255236 -843983 -367900 229590 189088 95579 -256526
$$ packed form
4685B242111j10747n30554m26823K09595m29242n2791N54772M4176p61948k26418
4675E12131J103618L04387j061564M38598k5094k7045o77305n16871n4531K32483
4665B28807P19652P25148O7097j041348J2016L51825j74826o84805K3396m67152
4655b40190L49849O07221o7772M83830n90982l16266L64865j08173O77873k21368
4645I38887m06436O00353k2538j116385r64603O9543R52887j66433J47611j52640
4635a19754j61380L8877l34679M23676Q53524j14044o36366J66624P27511k66860
4625E77129k08758P22126r730m13784m27492m01433J26690O18415m03842J97030
4615C76351N10056q79390n72656L10403n88747M76083N97490m0502r3509l52105
$$ plain form
4605 -256526 -281688 -593005 295281 243975 57355 -359975 169515 318165 1106252 376719
4595 376719 -499152 -260171 -70742 682015 1045437 1177100 233045 -136703 -41571 -218209
4585 -218209 31044 677692 544461 195203 662009 614183 544750 -304248 165327 266026
4575 266026 404388 244373 -129268 -391836 -578321 -343120 13195 -273592 245302 265204
4565 265204 233728 446849 893222 1762192 623446 494936 597869 -55057 -397166 422265
4555 422265 686888 1244445 885488 1202727 1043489 314211 102222 181469 801685 1032844
4545 1032844 180440 -756163 -461474 469871 796564 294001 416208 518032 112111 -229432
4535 -229432 -776323 -47846 269928 -180357 -224747 365364 486490 -185539 444879 423295
$$ packed form
4605b56526k5162l11317Q88286n1306j86620m17330N29490J48650P88087p29533
4595C76719q75871K38981J89429P52757L63422J31663r44055l69748R5132j76638
4585b18209K49253O46648j33231l49258M66806m7826o9433q48998M69575J00699
4575B66026J38362j60015l73641k62568j86485K35201L56315k86787N18894J9902
4565B65204l1476K13121M46373Q68970j138746j28510J02933o52926l42109Q19431
4555D22265K64623N57557l58957L17239j59238p29278k11989P9247O20216K31159
4545A032844q52404r36603K94689R31345L26693n02563J22207J01824m05921l41543
4535b29432n46891P28477L17774m50285m4390N90111J21126o72029O30418k1584
$$ plain form
4525 423295 372361 664866 705819 705744 395442 472065 876555 1484476 1636310 1105811 1242462
4514 1242462 1857130 2063466 1533131 1672817 2494750 2361064 2378373 2945145 2388457 2220217
4504 2220217 2256736 2461247 2369961 2956612 3472539 3437819 3461388 2452229 2280526 1857685
4494 1857685 2194785 1784942 1626377 1418982 1579924 1284921 1341639 2367428 3208612 2966668
4484 2966668 2163909 2539071 2357029 2019444 2307847 1478866 1625610 2199832 1838935 2289539
4474 2289539 2510988 2705032 2925376 2873016 2488383 2027436 2044261 2104737 2280865 1748160
4464 1748160 1484110 1285057 992254 1229088 920907 382479 1303737 1473202 1819820 1707152
4454 1707152 1701039 1912413 1613369 1674688 1072255 1542263 1824340 1638980 1003899 854937
$$ packed form
4525D23295n0934K92505M0953p5l10302P6623M04490O07921J51834n30499J36651
4514A242462O14668K06336n30335J39686Q21933j33686J7309N66772n56688j68240
4504B220217L6519K04511r1286N86651N15927l4720K3569j009159j71703m22841
4494A857685L37100m09843j58565k07395J60942k95003N6718J025789Q41184k41944
4484B966668q02759L75162j82042l37585K88403q28981J46744N74222l60897M50604
4474B289539K21449J94044K20344n2360l84633m60947J6825O0476J76128n32705
4464A748160k64050j99053k92803K36834l08181n38428R21258J69465L46618j12668
4454A707152o113K11374k99044O1319o02433M70008K82077j85360o35081j48962
$$ plain form
4444 854937 1360973 1854674 1702447 985759 1152749 1324523 440145 426931 643514 -89694
4434 -89694 -362438 -394890 -54659 756410 1294417 502556 -146406 -149251 65412 354584
4424 354584 626792 450103 1121878 1022944 770956 1319084 1512487 1238099 1277894 1334756
4414 1334756 1764925 540753 -395986 541233 550031 1251474 766527 1010309 1904025 2147526
4404 2147526 2196166 925455 -13468 572285 757805 953962 260143 473396 531805 439283
4394 439283 -274499 342394 77055 20326 435887 894199 1184813 472726 260291 -146719
4384 -146719 116727 200845 -201083 926239 1064407 689944 295602 -139650 632196 791069
4374 791069 1225959 1292969 1164820 1301215 1464639 1304241 1870727 1982127 1688257 2517580
$$ packed form
4444H54937N06036M93701j52227p16688J66990J71774q84378j3214K16583p33208
4434h9694k72744l2452L40231Q11069N38007p91861o48962k845K14663K89172
4424C54584K72208j76689O71775r8934k51988N48128J93403k74388L9795N6862
4414A334756M30169j224172r36739R37219Q798P01443m84947K43782Q93716K43501
4404B147526M8640j270711r38923N85753J85520J96157o93819K13253N8409r2522
4394D39283p13782O16893k65339n6729M15561M58312K90614p12087k12435m07010
4384a46719K63446Q4118m01928J127322J38168l74463l94342m35252P71846J58873
4374G91069M34890O7010j28149J36395J63424j60398N66486J11400k93870Q29323
$$ plain form
4364 2517580 2582165 2190641 2253314 2652407 3058021 2904765 3358580 3873959 3402256 4183440
4354 4183440 4516601 4790664 5627886 6107645 6179371 5985153 7082361 7358859 7841532 8312133
4344 8312133 9227760 10006592 12005786 12932004 13901685 15711800 17998921 20942069 22243127
4335 22243127 24639528 27092870 29685877 30429319 30735317 31152476 30899358 29845068 28616030
4326 28616030 27809339 27000405 25467331 24679052 23893121 23774211 24036391 23784667 23867407
4317 23867407 24496301 26253681 27369034 29534912 31633862 32396612 32843933 33650911 34860929
4308 34860929 34198077 33810198 33299605 33001300 32259576 31224613 30139401 28032214 26427412
4299 26427412 24932608 23453856 22661348 21562971 20294364 21180147 20888267 19818265 19000627
$$ packed form
4364B517580O4585l91524O2673L99093M05614j53256M53815N15379m71703P81184
4354D183440L33161K74063Q37222M79759P1726j94218J097208K76498M82673M70601
4344H312133R15627P78832J999194R26218R69681J810115K287121K943148J301058
4335B2243127K396401K453342K593007P43442L05998M17159k53118j054290j229038
4326B8616030q06691q08934j533074p88279p85931j18910K62180k51724Q2740
4317B3867407O28894J757380J115353K165878K098950P62750M47321Q06978J210018
4308C4860929o62852l87879n10593k98305p41724j034963j085212k107187j604802
4299B6427412j494804j478752p92508j098377j268607Q85783k91880j070002q17638
$$ plain form
4290 19000627 18823226 18466529 19154989 19824357 20091810 19962008 21857758 22943701 24616254
4281 24616254 27704114 29119913 30997584 32177553 33915440 34857590 33805026 32421265
4273 32421265 30858567 29775933 27535580 25181431 23641906 22148383 20640429 18660783
4265 18660783 18212262 17937636 17040850 15890401 14610883 13730386 13737123 13747975 13125550 12756875
4255 12756875 12587095 12326151 12324490 11825931 11354783 11076062 10759647 11225680 10760452 11125814
4245 11125814 11331238 11111923 10350491 9875452 9521800 9523763 9282221 9171114 8899488 8614880
4235 8614880 7666192 7522508 7545390 7645738 7214803 7609316 7797402 7080459 6708378 5744181
4225 5744181 5939349 5328846 6430546 6216190 5711739 5282203 4864341 5164751 5054837
$$ packed form
4290A9000627j77401l56697O88460O69368K67453j29802J895750J085943J672553
4281B4616254L087860J415799J877671J179969J737887R42150j052564j383761
4273C2421265j562698j082634k240353k354149j539525j493523j507954j979646
4265A8660783m48521k74626q96786j150449j279518q80497O737J0852o22425l68675
4255A2756875j69780k60944j661m98559m71148k78721l16415M66033m65228L65362
4245A1125814K05424k19315p61432m75039l53652J963k41542j11107k71626k84608
4235H614880r48688j43684K2882J00348m30935L94513J88086p16943l72081r64197
4225E744181J95168o10503J101700k14356n04451m29536m17862L00410j09914
$$ plain form
4216 5054837 5052691 4902769 4641322 4947889 4913023 3686529 4143506 4481402 4051560 3565112
4206 3565112 3797345 4788681 4236398 4178633 4313830 4449041 4929337 4241760 4122501 3834893
4196 3834893 3446550 3448095 3293486 3561005 3070991 3169189 3632321 3455645 3431985 4001591
4186 4001591 3973995 3506656 3366732 3836802 3832358 3584812 2980262 2503786 3113865 4023653
4176 4023653 3712746 3913046 4114422 3686593 3846672 4384985 3722879 4237974 4025086 2876908
4166 2876908 2373527 3075115 2293640 2187657 2887236 2720998 2327707 2443914 2190903 1633702
4156 1633702 1725833 1730893 1405035 2044749 2181616 2264844 2646748 2302909 3522176 2399964
4146 2399964 1752472 2290391 2880893 3047040 2795624 3114139 3437112 3131149 2963154 3645356
$$ packed form
4216E054837k146j49922k61447L06567l4866j226494M56977L37896m29842m86448
4206C565112K32233R91336n52283n7765J35197J35211M80296o87577j19259k87608
4196C834893l88343J545j54609K67519m90014R8198M63132j76676k3660N69606
4186D001591k7596m67339j39924M70070m444k47546o04550m76476O10079R09788
4176D023653l10907K00300K01376m27829J60079N38313o62106N15095k12888j148178
4166B876908n03381P01588p81475j05983O99579j66238l93291J16207k53011n57201
4156A633702R2131N060l25858O39714J36867Q3228L81904l43839J219267j122212
4146B399964o47492N37919N90502J66147k51416L18515L22973l05963j67995O82202
$$ plain form
4136 3645356 4245472 3193201 2884863 2649884 2178100 1340610 2246203 3163505 2825106
4127 2825106 2864039 2393388 2328514 2930438 3048465 2968921 2998231 2583145 2251669 1953679
4117 1953679 2092152 2090889 1795772 1387505 2402307 2344039 1719205 2174219 2087539 1170919
4107 1170919 1658194 1772514 1905453 2814796 3911814 4011633 2302053 1862875 1823182 2197358
4097 2197358 2694818 2523062 2259786 2380105 2403575 2438648 2240748 3168298 3706200 3085433
4087 3085433 2754437 2691208 3247056 2851921 3945818 4796842 3543791 3303654 3996554
4078 3996554 4245191 4215285 3950842 4083745 3918525 3082483 3358189 3902964 3738529 3904648
4068 3904648 4438725 5455309 5392575 4749538 6270695 7047722 7077609 8008646 8889763 9300137
$$ packed form
4136C645356O00116j052271l08338k34979m71784q37490R05593R17302l38399
4127B825106L8933m70651o4874O01924J18027p9544K9310m15086l31476k97990
4117A953679J38473j263k95117m08267J014802n8268o24834M55014q6680r16620
4107A170919M87275J14320J32939R09343J097018R9819j709580m39178l9693L74176
4097B197358M97460j71756k63276J20319K3470L5073j97900R27550N37902o20767
4087C085433l30996o3229N55848l95135J093897Q51024j253051k40137O92900
4078C996554K48637k9906k64443J32903j65220q36042K75706N44775j64435J66119
4068C904648N34077J016584o2734o43037J521157P77027K9887R31037Q81117M10374
$$ plain form
4058 9300137 8810782 9964037 11432106 12514780 12499555 12394218 13208876 12185686 12256815
4049 12256815 11682619 11250906 10714676 10595826 10741724 11303486 10228415 10846601 10178521
4040 10178521 9690945 9669231 9817858 9321533 8683840 9266722 9602598 10402048 10988917 11449790
4030 11449790 12212324 13683674 15590150 17331486 19368503 20244511 21190587 21778225 21929546
4021 21929546 22445657 22108520 21823626 19864869 17730762 17120233 15721576 14378103 15228401
4012 15228401 15012311 14057544 13399904 13508020 12482352 11995927 11680801 12633775 13232840
4003 13232840 13653940 14431570 13950001 14100202 14713178 15368732 15779860 16318912 18467414
3994 18467414 19188807 19538697 20112288 19565837 19925582 20388025 19693193 18927387 19500851
$$ packed form
4058I300137m89355J153255J468069J082674j5225j05337Q14658j023190P1129
4049A2256815n74196m31713n36230j18850J45898N61762j075071O18186o68080
4040A0178521m87576k1714J48627m96325o37693N82882L35876P99450N86869M60873
4030A1449790P62534J471350J906476J741336K037017Q76008R46076N87638J51321
4021B1929546N16111l37137k84894j958757k134107o10529j398657j343473Q50298
4012A5228401k16090r54767o57640J08116j025668m86425l15126R52974N99065
4003A3232840M21100P77630m81569J50201O12976O55554M11128N39052K148502
3994A8467414P21393L49890N73591n46451L59745M62443o94832p65806N73464
$$ plain form
3985 19500851 19923119 18884486 19084015 19333440 20138981 21036893 21863320 21693796 22559189
3976 22559189 23882475 25453215 25875284 25420953 25782619 27150325 27009082 26734725 26573013
3967 26573013 27234008 27807222 28588531 28587420 27766707 28340095 28703596 28434200 28394123 29480247
3957 29480247 30328571 30255297 30145008 30551040 30918171 30418425 31644710 31639394 30478065 30348995
3947 30348995 30921731 30891395 30243281 30379502 30181821 30699914 31336970 32288271 32674035 33225772
3937 33225772 32897590 32683713 33538394 34373427 34209980 35406406 35472566 35107368 35467029
3928 35467029 35062616 33482419 32637104 32266960 32001403 31524543 30560381 29913132 29902263
3919 29902263 29029400 28085570 26831383 27816684 27593043 27727178 28183211 28311572 28065030
$$ packed form
3985A9500851M22268j038633J99529K49425Q05541Q97912Q26427j69524Q65393
3976B2559189J323286J570740M22069m54331L61666J367706j41243k74357j61712
3967B6573013O60995N73214P81309j111q20713N73388L63501k69396m0077J086124
3957B9480247Q48324p3274j10289M06032L67131m99746J226285n316j161329j29070
3947C0348995N72736l0336o48114J36221j97681N18093O37056R51301L85764N51737
3937C3225772l28182k13877Q54681Q35033j63447J196426O6160l65198L59661
3928C5467029m04413j580197q45315l70144k65557m76860r64162o47249j0869
3919B9902263q72863r43830j254187R85301k23641J34135M56033J28361k46542
$$ plain form
3910 28065030 28352042 28980863 28916403 30248303 32169670 33134318 33359195 34609543 36285057
3901 36285057 39740260 42471484 45251816 49672277 54083038 56893724 61857271 65781154
3893 65781154 68159598 69675641 69824276 69334504 66885525 64114022 61442919 60253896
3885 60253896 59456117 58191337 57305611 57062151 58033883 58416622 58532139 60527261 62367671
3876 62367671 65131097 67561447 71300498 76139319 81834392 89255946 97483195 105609314
3868 105609314 113900739 121080739 127506911 131497120 132976880 130638168 125641709 118883158
3860 118883158 112503431 105956047 99600687 94658978 91200426 89053139 85384083 83787343
3852 83787343 81906190 81127695 79857465 79462921 80760508 83180344 85062631 86983801
$$ packed form
3910B8065030K87012O28821o4460J331900J921367R64648K24877J250348J675514
3901C6285057L455203K731224K780332M420461M410761K810686M963547L923883
3893F5781154K378444J516043J48635m89772k448979k771503k671103j189023
3885F0253896p97779j264780q85726k43460R71732L82739J15517J995122J840410
3876F2367671K763426K430350L739051M838821N695073P421554Q227249Q126119
3868A05609314Q291425P180000O426172L990209J479760k338712m996459o758551
3860A18883158o379727o547384o355360m941709l458552k147287l669056j596740
3852H3787343j881153p78495j270230l94544J297587K419836J882287J921170
$$ plain form
3844 86983801 89847838 93577100 97597908 101085634 105185356 109478969 112771826 113970154
3836 113970154 113506932 111279403 106956649 101321011 95566660 90556197 86242652 82872523
3828 82872523 79076070 76207175 72327273 70102431 68166119 64968246 63394836 62629292
3820 62629292 60636609 60351516 59925125 59554903 58196823 57326128 58428739 58589210 58978542
3811 58978542 59814724 61291355 61882400 63776559 65269122 66867894 68217113 68575113 68740085
3802 68740085 67805363 65604887 63636694 61574329 59697882 57838719 54912038 53203282
3794 53203282 52935625 51925252 50492311 49629135 48758371 48531310 48599748 47518270 46938107
3785 46938107 46812795 46002234 46203246 46358211 47066659 48347362 48585482 48585320 48891770 50451540
$$ packed form
3844H6983801K864037L729262M020808L487726M099722M293613L292857J198328
3836A13970154m63222k227529m322754n635638n754351n010463m313545l370129
3828H2872523l796453k868895l879902k224842j936312l197873j573410p65544
3820F2629292j992683k85093m26391l70222j358080q70695J102611J60471L89332
3811E8978542Q36182J476631N91045J894159J492563J598772J349219L58000J64972
3802F8740085r34722k200476j968193k062365j876447j859163k926681j708756
3794E3203282k67657j010373j432941q63176q70764k27061O8438j081478n80163
3785D6938107j25312q10561K01012J54965P08448J280703K38120j62L06450J559770
$$ plain form
3775 50451540 51374137 51254171 51437726 51357949 50864044 50516021 49354380 47438079 46054239
3766 46054239 45756781 44423612 42437531 41627403 41717455 41564950 41356411 41202204 40135837
3757 40135837 40031700 40392722 40437958 41163460 41711697 43143396 43783047 44810608 45990134
3748 45990134 47362102 48945862 49540301 49191456 49566925 49388776 48331621 46483968 43860794
3739 43860794 42299476 41665921 40979233 39723252 39024510 37738717 37456165 36984962 35476925
3730 35476925 34994719 35567423 35401797 34894278 35161511 35487744 35391939 35564650 35857492 35345354
3720 35345354 35287304 35820955 36278812 35884750 35823763 35781805 36094490 35807752 34392971 34316318
3710 34316318 34344229 33514414 32707057 32245395 32546557 31662760 30307553 30282420 30158083 29595898
$$ packed form
3775E0451540R22597j19966J83555p9777m93905l48023j161641j916301j383840
3766D6054239k97458j333169j986081q10128R0052j52505k08539j54207j066367
3757D0135837j04137L61022M5236P25502N48237J431699O39651J027561J179526
3748D5990134J371968J583760N94439l48845L75469j78149j057155j847653k623174
3739D3860794j561318o33555o86688j255981o98742j285793k82552m71203j508037
3730C5476925m82206N72704j65626n07519K67233L26233r5805J72711K92842n12138
3720C5345354n8050N33651M57857l94062o0987m1958L12685k86738j414781p6653
3710C4316318K7911q29815q07357m61662L01162q83797j355207k5133j24337n62185
$$ plain form
3700 29595898 29765387 30408720 29903078 31136842 31088382 30888031 31814733 32843479 32505572
3691 32505572 32078070 33493135 33618598 34402560 34625151 34989726 35267343 34895181 35295995
3682 35295995 35099042 34426374 33752963 32896489 32526624 32616448 31898744 31547190 31807999 31356304
3672 31356304 30818490 30825097 31634641 30613204 29796264 29320878 28686203 29024785 28828929 27982929
3662 27982929 29301928 29999603 29275909 28729409 28870718 29688320 29413256 29837533 29444074
3653 29444074 29622935 29930403 29632382 29801660 29780833 29524375 29813109 29940693 29924388 29609928
3643 29609928 29539461 28603625 27573313 27257701 28178801 28221471 27814275 27064380 26999837 26101917
3633 26101917 26302011 26538046 26471753 25089108 23724554 23328255 22530318 22049819 21893909
$$ packed form
3700B9595898J69489O43333n05642J233764m8460k00351R26702J028746l37907
3691C2505572m27502J415065J25463P83962K22591L64575K77617l72162M00814
3682C5295995j96953o72668o73411q56474l69865Q9824p17704l51554K60809m51695
3672C1356304n37814O607Q09544j021437q16940m75386o34675L38582j95856q46000
3662B7982929J318999O97675p23694n46500J41309Q17602k75064M24277l93459
3653B9444074J78861L07468k98021J69278k0827k56458K88734J27584j6305l14460
3643B9609928p0467r35836j030312l15612R21100M2670m07196p49895o4543q97920
3633B6101917K00094K36035o6293j382645j364554l96299p97937m80499j55910
$$ plain form
3624 21893909 21872358 21260271 20564999 19883884 20606945 20143194 19724958 19980572 20761730 20620426
3614 20620426 20749097 21177721 20420922 19689858 19089968 18807729 18892386 18269284 18178312 17819845
3604 17819845 17746968 18031799 18013523 17705085 17373359 17386508 16750914 16696670 16211475 16146994
3594 16146994 16361531 15228417 15268667 15596508 15182244 14523190 14161543 13603706 14076491
3585 14076491 14001294 13701039 13821199 14077661 12895554 13535018 13097895 13853122 13480470
3576 13480470 13117318 12982139 13047788 13504905 12759465 13356404 13699342 13651915 13694502 12965911
3566 12965911 12535182 12662078 11808022 11815160 12346705 12367025 12732671 12289779 11739630 12082320
3556 12082320 10951182 11445515 12091906 12271456 12409021 12293251 12054924 12423570 11790288
$$ packed form
3624B1893909k1551o12087o95272o81115P23061m63751m18236K55614P81158j41304
3614B0620426J28671M28624p56799p31064n99890k82239Q4657o23102r0972l58467
3604A7819845p2877K84831j8276l08438l31726J3149o35594n4244m85195o4481
3594A6146994K14537j133114M0250L27841m14264o59054l61647n57837M72785
3585A4076491p5197l00255J20160K56462j182107O39464m37123P55227l72652
3576A3480470l63152j35179O5649M57117p45440N96939L42938m7427M2587p28591
3566A2965911m30729J26896q54056P138N31545K0320L65646m42892n50149L42690
3556A2082320j131138M94333O46391J79550J37565j15770k38327L68646o33282
$$ plain form
3547 11790288 11791759 12166557 12479733 12960464 13461452 13578004 13530084 14103459 14812007 13256008
3537 13256008 12775078 13621367 13361319 13092390 12851395 13067378 12266805 12391296 13129580
3528 13129580 13591362 13288540 12939505 14654250 13656420 13722051 13859267 14281107 15410473
3519 15410473 14668510 15317510 15820952 14536976 14925606 15833794 15499704 15517438 15718306
3510 15718306 15710485 16457021 16388832 17057576 18329750 19247154 18970598 19409812 19345047 19875815
3500 19875815 20271046 19558629 20406740 21370343 22706818 23620625 24626411 25440809 26552272
3491 26552272 27598021 27904963 27600163 27562004 27003738 25449776 24702657 24257564 24715404
3482 24715404 25078437 24599727 25104410 25668445 26255829 25855052 25800820 26657058 28658449
$$ packed form
3547A1790288J471L74798L13176M80731N00988J16552m7920N73375P08548j555999
3537A3256008m80930Q46289k60048k68929k40995K15983q00573J24491P38284
3528A3129580M61782l02822l49035J714745r97830O5631J37216M21840J129366
3519A5410473p41963O49000N03442j283976L88630R08188l34090J7734K00868
3510A5718306p821P46536o8189O68744J272174R17404k76556M39214o4765N30768
3500A9875815L95231p12417Q48111R63603J336475R13807J005786Q14398J111463
3491B6552272J045749L06942l04800l8159n58266j553962p47119m45093M57840
3482B4715404L63033m78710N04683N64035N87384m00777n4232Q56238K001391
$$ plain form
3473 28658449 30288432 31417351 32535809 34364004 34096492 33917066 35787800 37434825
3465 37434825 38739429 39509492 40109816 40742611 41304035 42454583 42674201 41483617 40404294
3456 40404294 38794955 37087828 35280776 34595364 33059344 32003555 32213182 31851528 32054586
3447 32054586 31350014 31781520 32479702 33370851 34588675 35803681 37244687 37979797 38674545
3438 38674545 39784084 41309843 41823242 41114458 40892892 41077238 41549348 41877731 42513124
3429 42513124 43459825 43373812 43247620 44278358 44102036 44971632 45750330 46397422 47406505
3420 47406505 49206511 50942072 52916209 55005792 58546759 62346377 66587315 71909235
3412 71909235 77688697 84291366 91016966 98212674 105048407 111233013 115572260 119568279
$$ packed form
3473B8658449J629983J128919J118458J828195k67512j79426J870734J647025
3465C7434825J304604P70063O00324O32795N61424J150548K19618j190584j079323
3456D0404294j609339j707127j807052o85412j536020j055789K09627l61654K03058
3447C2054586p04572M31506O98182Q91149J217824J215006J441006P35110O94748
3438C8674545J109539J525759N13399p08784k21566J84346M72110L28383O35393
3429D2513124R46701q6013j26192J030738j76322Q69596P78698O47092J009083
3420D7406505J800006J735561J974137K089583L540967L799618M240938N321920
3412G1909235N779462O602669O725600P195708O835733O184606M339247L996019
$$ plain form
3404 119568279 121665739 121411020 120622201 120750283 121800394 123845481 127599289 131699301
3396 131699301 138451581 146850356 157064007 167900252 179589077 195095971 212231168
3389 212231168 230725517 249107870 268941332 289491078 310568256 331933747 351281530
3382 351281530 370400940 386561315 397734600 403592542 403078469 396931359 385652936 370039829
3374 370039829 352040293 334877822 317227371 299257044 283344422 269178449 255638052
3367 255638052 242966982 232189891 222948862 214579877 206902389 199974038 194521886 188853263
3359 188853263 184433125 180165306 176873307 174320975 172573314 169944403 167234559 164430375
3351 164430375 162302458 157088638 152073878 146617526 138041651 131105839 123511831 117371328
$$ packed form
3404A19568279K097460k54719p88819J28082J050111K045087L753808M100012
3396A31699301O752280Q398775J0213651J0836245J1688825J5506894J7135197
3389B12231168J8494349J8382353J9833462K0549746K1077178K1365491J9347783
3382C51281530J9119410J6160375J1173285N857942n14073o147110j1278423j5613107
3374C70039829j7999536j7162471j7650451j7970327j5912622j4165973j3540397
3367B55638052j2671070j0777091r241029q368985p677488o928351n452152n668623
3359A88853263m420138m267819l291999k552332j747661k628911k709844k804184
3351A64430375k127917n213820n014760n456352q575875o935812p594008o140503
$$ plain form
3343 117371328 112350478 104683484 99444902 95048677 91309605 88432515 84902326 81802787
3335 81802787 79600591 76910827 74625550 72435180 70736400 69172460 67575719 65802608
3327 65802608 64401419 62568933 61084772 59782669 59176026 58006817 56909450 56373642
3319 56373642 54629179 53428529 51549446 50630438 49370083 48001787 47439652 46588171 45949064
3310 45949064 44655116 43605220 43116833 41867358 40760956 40444499 40456608 38996045 38578987
3301 38578987 36930891 36249906 36236511 35882856 34761472 33547222 32893906 32740986 32109102
3292 32109102 31393588 31117093 31005710 30491064 30968262 30497958 30619660 30884346 31954904
3283 31954904 32033896 32825295 33732225 33290215 34057467 34579383 34404710 33483528 32115468
$$ packed form
3343A17371328n020850p666994n238582m396225l739072k877090l530189l099539
3335H1802787k202196k689764k285277k190370j698780j563940j596741j773111
3327F5802608j401189j832486j484161j302103o06643j169209j097367n35808
3319E6373642j744463j200650j879083r19008j260355j368296n62135q51481o39107
3310D5949064j293948j049896m88387j249475j106402l16457J2109j460563m17058
3301C8578987j648096o80985j3395l53655j121384j214250o53316j52920o31884
3292C2109102p15514k76495j11383n14646M77198m70304J21702K64686J070558
3283C1954904P8992P91399R06930m42010P67252N21916j74673r21182j368060
$$ plain form
3274 32115468 31616455 31638733 30665703 29366645 29122235 29438282 29730749 29442621 28558309
3265 28558309 27980673 28273418 27556979 27807300 28452063 29350041 31103135 31020694 31684297
3256 31684297 34089721 36263273 38204677 40151263 42478528 43511174 44009659 43616430
3248 43616430 42178793 40950424 38975906 36835092 35514692 33007564 32300063 33634383
3240 33634383 32278102 31547575 30943894 30837567 31184973 30369316 31366768 32287978 33294027
3231 33294027 33505533 34793315 37402562 40142516 43519137 45174182 47654425 49965075
3223 49965075 51275828 51496677 51009772 48711697 45435749 42660293 41092105 38086557
3215 38086557 35873750 34969834 33159972 32339484 31081526 30636644 30772473 30556365 30030483
$$ packed form
3274C2115468m99013K2278r73030j299058k44410L16047K92467k88128q84312
3265B8558309n77636K92745p16439K50321O44763Q97978J753094q2441O63603
3256C1684297K405424K173552J941404J946586K327265J032646M98485l93229
3248D3616430j437637j228369j974518k140814j320400k507128p07501J334320
3240C3634383j356281p30527o03681j06327L47406q15657R97452R21210J006049
3231C3294027K11506J287782K609247K739954L376621J655045K480243K310650
3223D9965075J310753K20849m86905k298075l275948k775456j568188l005548
3215C8086557k212807r03916j809862q20488j257958m44882J35829k16108n25882
$$ plain form
3206 30030483 29497916 29467510 29591825 30367711 31990173 33990718 35270051 36902170 39531437
3197 39531437 42042252 42508174 43534129 42960190 42151617 40615723 38196856 35509877 33016722
3188 33016722 30383919 29026226 28393886 26964755 25911483 25414699 25404090 25486578 24638192
3179 24638192 24122283 24316842 23680023 23696247 23890124 23753931 24371811 25317918 26003324 25872686
3169 25872686 26919371 26477750 26168351 25425451 24541181 24246421 22595841 21520582 21211747
3160 21211747 20387642 19377647 19059309 17922243 17906132 17575127 16998597 16374151 15710455
3151 15710455 15794662 15500791 15312969 14587362 13871752 13929018 14075310 13320464 13890436 14244947
3141 14244947 14114633 13892226 13777507 13509020 12650574 13403864 13597587 12922539 13006642 12773392
$$ packed form
3206C0030483n32567l0406J24315P75886J622462K000545J279333J632119K629267
3197C9531437K510815M65922J025955n73939q08573j535894k418867k686979k493155
3188C3016722k632803j357693o32340j429131j053272m96784j0609Q2488q48386
3179B4638192n15909J94559o36819J6224J93877j36193O17880R46107O85406j30638
3169B5872686J046685m41621l09399p42900q84270k94760j650580j075259l08835
3160B1211747q24105j009995l18338j137066j6111l31005n76530o24446o63696
3151A5710455Q4207k93871j87822p25607p15610N7266J46292p54846N69972L54511
3141A4244947j30314k22407j14719k68487q58446P53290J93723o75048Q4103k33250
$$ plain form
3131 12773392 12328536 12688920 12388498 12799756 12657913 11621600 11817655 11664026 11059127
3122 11059127 11859425 11203675 10664263 10804658 10752451 10162861 10177816 10425850 9548878 9842722
3112 9842722 10180714 9648224 10601479 10392555 10018666 10210593 10727441 9637772 8961393
3103 8961393 8275900 8895774 8583427 8684230 9005802 8433034 8139834 8415682 9121024 9343270
3093 9343270 9853566 9927373 9916298 9564787 10399972 10585263 9598849 9775911 9683283 9748289
3083 9748289 9855834 9865429 10168940 9672656 9326784 8587421 9091418 9175810 9431250 9476765
3073 9476765 10129731 10077710 9754729 9881852 10010806 10907978 11138154 9862454 10098522 10225155
3063 10225155 9494630 8715578 9715155 8692669 8240194 8537669 9073708 8502609 8359002
$$ packed form
3131A2773392m44856L60384l00422M11258j41843j036313J96055j53629o04899
3122A1059127Q00298o55750n39412J40395n2207n89590J4955K48034q76972K93844
3112I842722L37992n32490R53255k08924l73889J91927N16848j089669o76379
3103H961393o85493O19874l12347J00803L21572n72768k93200K75848P05342K22246
3093I343270N10296P3807j1075l51511Q35185J85291r86414J77062r2628O5006
3083I748289J07545R595L03511m96284l45872p39363N03997Q4392K55440M5515
3073I476765O52966n2021l22981J27123J28954Q97172K30176j275700K36068J26633
3063A0225155p30525p79052R99577j022486m52475K97475N36039n71099j43607
$$ plain form
3054 8359002 8764450 9296626 9938532 9244811 9371580 8783783 8580087 8798948 9083275 9282954
3044 9282954 9926712 8590945 8667437 9038998 9715196 8766986 9028219 9099349 8191520 7694307
3034 7694307 8516455 8981524 8738025 8600917 7910973 7719028 8284288 9115490 9245205 8327521
3024 8327521 8509691 8844562 9617695 10627244 10563571 9642038 9532109 10006178 11127362
3015 11127362 11364135 11005491 11102683 10925450 11030828 10585212 10822601 10209966 9796240 9921524
3005 9921524 10496656 10668450 10094469 10357518 9938789 10632093 10506814 9582053 10710175
2996 10710175 11455438 11420972 11163591 10780619 11203162 12103663 13932602 14616922 14114779
2987 14114779 15656975 17319003 17096996 17091194 17415816 17289659 16623696 15824374 15589553
$$ packed form
3054H359002M05448N32176O41906o93721J26769n87797k03696K18861K84327J99679
3044I282954O43758j335767P6492L71561O76198r48210K61233P1130r07829m97213
3034G694307Q22148M65069k43499j37108o89944j91945N65260Q31202J29715r17684
3024H327521J82170L34871P73133J009549o3673r21533j09929M74069J121184
3015A1127362K36773l58644R7192j77233J05378m45616K37389o12635m13726J25284
3005I921524N75132J71794n73981K63049m18729O93304j25279r24761J128122
2996A0710175P45263l4466k57381l82972M22543R00501J828939O84320n02143
2987A4114779J542196J662028k22007n802L24622j26157o65963p99322k34821
$$ plain form
2978 15589553 15692256 15622191 13516292 14049649 13575665 13037407 12082510 12019150 11919735 12398529
2968 12398529 11578671 11251878 11181988 12240194 12817943 12569022 12726201 11631570 10719010
2959 10719010 11520262 12144505 11841313 11315154 11382074 11932901 11960001 12684386 12480074 13222662
2949 13222662 13528478 13793298 13915393 13431134 13547070 14155791 14144989 13923031 14003728 13412571
2939 13412571 13753220 14006902 14547173 14834266 14942066 15846301 15100477 14799705 14795902 15035362
2929 15035362 15266082 16010809 17051721 17805446 17493452 18176342 19416278 20879368 21329969
2920 21329969 21595152 22569631 23626083 25196099 26572538 26263864 25862791 26382906 26901848
2911 26901848 27755212 28044525 28908436 28698126 29014936 30313582 30439888 31696496 32501226
$$ packed form
2978A5589553J02703p0065k105899N33357m73984n38258r54897o3360r9415M78794
2968A2398529q19858l26793o9890J058206N77749k48921J57179j094631r12560
2959A0719010Q01252O24243l03192n26159O6920N50827K7100P24385k04312P42588
2949A3222662L05816K64820J22095m84259J15936O08721j0802k21958Q0697n91157
2939A3412571L40649K53682N40271K87093J07800R04235p45824l00772l803K39460
2929A5035362K30720P44727J040912P53725l11994O82890J239936J463090M50601
2920B1329969K65183R74479J056452J570016J376439l08674m01073N20115N18942
2911B6901848Q53364K89313Q63911k10310L16810J298646J26306J256608Q04730
$$ plain form
2902 32501226 33244699 34690460 36196137 38177924 39835391 41908611 44728452 47501445
2894 47501445 50182063 51884519 52503984 52697111 51580216 48147310 45621950 43578610
2886 43578610 41586412 40254365 39310213 38836222 38292094 37932206 37538428 36676360 36185889
2877 36185889 35977773 35678009 35860238 36157199 35383340 34933268 35512949 35134736 35594276
2868 35594276 34909219 33848064 33590054 34019954 34399987 33708332 33377723 33969878 34328126
2859 34328126 34649740 35142970 35695698 36346004 36809482 37218455 37500642 37514862 36587369 35747063
2849 35747063 36294773 36192520 34553718 34206842 34101004 33609233 33067995 31546483 31099437
2840 31099437 31149697 29949104 29180748 28743709 27700824 27515869 27528331 26565768 25903012
$$ packed form
2902C2501226P43473J445761J505677J981787J657467K073220K819841K772993
2894D7501445K680618J702456O19465J93127j116895l432906k525360k043340
2886D3578610j992198j332047r44152m73991n44128l59888l93778q62068m90471
2877C6185889k08116k99764J82229K96961p73859m50072N79681l78213M59540
2868C5594276o85057j061155k58010M29900L80033o91655l30609N92155L58248
2859C4328126L21614M93230N52728O50306M63478M08973K82187J4220r27493q40306
2849C5747063N47710j02253j638802l46876j05838m91771n41238j521512m47046
2840C1099437N0260j200593p68356m37039j042885j84955J2462r62563o62756
$$ plain form
2831 25903012 25710504 25430437 24584358 24587178 24513108 24770658 24961846 24660195 24063539 24658121
2821 24658121 25258674 24860290 24505769 25137828 25351067 25572915 26264964 26423538 26449576 26966388
2811 26966388 26200905 26187703 26458423 26538507 26611786 26311877 25111412 25640984 26598763 27798526
2801 27798526 28920288 28228860 27501382 27774888 28448580 28362471 29893252 31061523 31425135
2792 31425135 31303434 32095105 34133645 34879221 35854923 37983135 39598250 40587690 42082697
2783 42082697 44040427 45002339 46525988 47093200 47755054 47457480 48093366 48228864 49201119
2774 49201119 50413648 50850870 53002773 55085696 57075738 59201871 61335225 62846001
2766 62846001 65092624 67765956 70120147 71798218 73435479 75867845 78553809 81583472
$$ packed form
2831B5903012j92508k80067q46079K820p4070K57550J91188l01651n96656N94582
2821B4658121O00553l98384l54521O32059K13239K21848O92049J58574K6038N16812
2811B6966388p65483j3202K70720Q0084P3279k99909j200465N29572R57779J199763
2801B7798526J121762o91428p27478K73506O73692q6109J530781J168271L63612
2792C1425135j21701P91671K038540P45576R75702K128212J615115R89440J495007
2783D2082697J957730R61912J523649N67212O61854k97574O35886J35498R72255
2774D9201119J212529M37222K151903K082923J990042K126133K133354J510776
2766F2846001K246623K673332K354191J678071J637261K432366K685964L029663
$$ plain form
2758 81583472 84279226 87312521 89680265 92012773 94577414 95946682 97978020 100438780
2750 100438780 101500499 103161279 104765497 106827825 109186023 110897133 113201589 115955951
2742 115955951 117260663 119071509 122425000 125297838 128335650 132412805 135228399 139718026
2734 139718026 144936027 150167133 155918839 160860184 166467039 173567104 179941628 186785138
2726 186785138 193289982 198979851 204219483 209806497 215177100 219018721 221657733 224684589
2718 224684589 227514575 228895433 231180497 233643426 236452550 239508579 242020753 246126091
2710 246126091 250415364 254549046 258072669 260779126 263045664 264688937 266443455 266436899
2702 266436899 268718933 270727913 271951952 273409461 274993379 277302484 280237667 283566062
$$ packed form
2758H1583472K695754L033295K367744K332508K564641J369268K031338K460760
2750A00438780J061719J660780J604218K062328K358198J711110K304456K754362
2742A15955951J304712J810846L353491K872838L037812M077155K815594M489627
2734A39718026N218001N231106N751706M941345N606855P100065O374524O843510
2726A86785138O504844N689869N239632N587014N370603L841621K639012L026856
2718B24684589K829986J380858K285064K462929K809124L056029K512174M105338
2710B46126091M289273M133682L523623K706457K266538J643273J754518o556
2702B66436899K282034K008980J224039J457509J583918K309105K935183L328395
$$ plain form
2694 283566062 288208687 291871292 295823798 299036016 299740818 299751973 296497053 291265283
2686 291265283 284180653 276101914 266925939 257610598 249751757 242300180 236367494 231052236
2678 231052236 228646942 227583868 227040775 227918709 229780637 231225699 231446618 229616069
2670 229616069 225467097 219549685 213418850 206213549 197991170 189288792 182172298 176055617
2662 176055617 170509931 165562062 161057761 157130121 154211587 152228641 150243171 148078297
2654 148078297 146241721 145489950 145288676 145123872 145564702 145191678 144454588 143546683 142233333
2645 142233333 141713625 139492461 138383887 136879873 135356064 134382633 133840280 133902585 133354390
2636 133354390 132593659 132025162 130481896 129393647 128092804 126012515 124553199 122345540
$$ packed form
2694B83566062M642625L662605L952506L212218P04802J1155l254920n231770
2686B91265283p084630q078739r175975r315341p858841p451577n932686n315258
2678B31052236k405294j063074n43093Q77934J861928J445062K20919j830549
2670B29616069m148972n917412o130835p205301q222379q702378p116494o116681
2662A76055617n545686m947869m504301l927640k918534j982946j985470k164874
2654A48078297j836576p51771k01274j64804M40830l73024p37090r07905j313350
2645A42233333n19708k221164j108574j504014j523809r73431n42353O2305n48195
2636A33354390p60731n68497j543266j088249j300843k080289j459316k207659
$$ plain form
2628 122345540 120383986 118405763 116564104 114790309 112649661 111225081 110427203 109485129
2620 109485129 107858465 105909331 104614457 104426820 103563048 101281617 99679714 98223181
2612 98223181 97215443 96399897 95635359 94186333 93063799 92477146 90721826 89517520 89312179
2603 89312179 87625103 86503960 84804300 83732421 82151363 81006442 80104429 78883800
2595 78883800 78509229 78350022 77865755 76329241 75365677 75249928 75796101 74856977 74910487
2586 74910487 75566653 75302101 74933327 75477483 74705731 74384761 74467629 75589242 75412862
2577 75412862 74777589 75224251 76122815 75170431 75132213 75624063 74305260 74487663 74602683
2568 74602683 75089186 75359386 75765786 75767293 76175663 76626856 77191833 77161001 77699357 78486101
$$ packed form
2628A22345540j961554j978223j841659j773795k140648j424580p97878r42074
2620A09485129j626664j949134j294874j87637q63772k281431j601903j456533
2612I8223181j007738q15546p64538j449026j122534n86653j755320j204306k05341
2603H9312179j687076j121143j699660j071879j581058j144921r02013j220629
2595G8883800l74571j59207m84267j536514r63564j15749N46173r39124N3510
2586G4910487O56166k64552l68774N44156p71752l20970Q2868J121613j76380
2577G5412862o35273M46662Q98564r52384l8218M91850j318803J82403J15020
2568G4602683M86503K70200M06400J507M08370M51193N64977l0832N38356P86744
$$ plain form
2558 78486101 78485121 79165530 79477636 80097424 80461120 81030325 82281327 81885777 82255812 82564800
2548 82564800 82967609 82870691 82766862 82745080 83407477 83041982 82336766 82753303 83481102 84064728
2538 84064728 83930159 84435469 84119858 83914373 84071379 83966796 84093357 84232928 84348887
2529 84348887 84703712 83887671 84517278 85319730 86318085 86488842 85914998 84713428 85758424
2520 85758424 86052558 86181650 86049114 85365888 84640201 84891824 83852153 82773777 82182873
2511 82182873 81548710 81716306 82434456 82435669 82018580 82225538 82606596 83248884 82694789 82647428
2501 82647428 82606454 81360075 81526221 81352856 80759004 81403924 81686535 82225351 81633772
2492 81633772 81663834 81848293 82366846 82310982 81959766 82090313 81952068 81409702 80441791 80578831
$$ packed form
2558G8486101r80O80409L12106O19788L63696N69205J251002l95550L70035L08988
2548H2564800M02809r6918j03829k1782O62397l65495p05216M16537P27799N83626
2538H4064728j34569N05310l15611k05485J57006j04583J26561J39571J15959
2529H4348887L54825q16041O29607Q02452R98355J70757n73844j201570J044996
2520H5758424K94134J29092j32536o83226p25687K51623j039671j078376n90904
2511H2182873o34163J67596P18150J213m17089K06958L81058O42288n54095m7361
2501H2647428m0974j246379J66146j73365n93852O44920K82611N38816n91579
2492H1633772L0062J84459N18553n5864l51216J30547j38245n42366r67911J37040
$$ plain form
2482 80578831 79623178 79029890 79785345 79953600 79842464 78861016 79212786 80030077 79564887
2473 79564887 79743791 80696695 80548118 80315348 80811770 81938702 82646774 83703638 83763370
2464 83763370 84551957 85118571 86481889 87597077 88622943 89151474 90572405 91097020 92359022
2455 92359022 93339676 94537576 96685218 98897509 101100190 102207213 103655003 105964637
2447 105964637 109326233 112122576 116432977 120938725 125498575 130440189 135577598 140948048
2439 140948048 146248062 152189950 158841377 167234784 177088102 187595113 200163897 216508188
2431 216508188 234649654 255247629 281251849 310568117 340967128 374416999 410116785
2424 410116785 446435284 480908336 509404425 531421874 547902774 560359048 566459912
$$ packed form
2482H0578831r55653n93288P55455J68255j11136r81448L51770Q17291m65190
2473G9564887J78904R52904j48577k32770M96422J126932P08072J056864N9732
2464H3763370P88587N66614J363318J115188J025866N28531J420931N24615J262002
2455I2359022R80654J197900K147642K212291K202681J107023J447790K309634
2447A05964637L361596K796343M310401M505748M559850M941614N137409N370450
2439A40948048N300014N941888O651427Q393407R853318J0507011J2568784J6344291
2431B16508188J8141466K0597975K6004220K9316268L0399011L3449871L5699786
2424D10116785L6318499L4473052K8496089K2017449J6480900J2456274O100864
$$ plain form
2417 566459912 562270204 548629799 525745106 498191554 471684194 447998938 426256399
2410 426256399 405691047 386542473 368093951 349714147 331323561 314938508 298278138
2403 298278138 283352211 268646590 254129424 240639700 229373625 218481880 208512602
2396 208512602 201156755 194103707 187545069 182435700 177486091 173821223 169543673 165631831
2388 165631831 161022448 156950906 153078633 147848896 142507949 138103861 134422884 131058872
2380 131058872 128646303 125862967 124280795 121273084 119481585 118565506 117035849 115657864
2372 115657864 113247368 109563268 106605839 103133305 100036962 96369694 93551108 90086980
2364 90086980 87314765 86071871 84343482 81633807 79387446 78403804 76881375 75198558
$$ packed form
2417E66459912m189708j3640405k2884693k7553552k6507360k3685256k1742539
2410D26256399k0565352j9148574j8448522j8379804j8390586j6385053j6660370
2403B98278138j4925927j4705621j4517166j3489724j1266075j0891745r969278
2396B08512602p355847p053048o558638n109369m949609l664868m277550l911842
2388A65631831m609383m071542l872273n229737n340947m404088l680977l364012
2380A31058872k412569k783336j582172l007711j791499r16079j529657j377985
2372A15657864k410496l684100k957429l472534l096343l667268k818586l464128
2364I0086980k772215j242894j728389k709675k246361r83642j522429j682817
$$ plain form
2356 75198558 73475649 72077962 71214717 70821987 69943812 68395614 67983307 67079759 66130803
2347 66130803 65657212 65659582 66118425 65249684 64657908 65491939 65846618 66408999 66945551 67050085
2337 67050085 67773892 67933832 68941685 71128427 71946310 73670637 76066987 78005708 80974208
2328 80974208 85438445 90932751 96209600 101600199 106462633 111323668 112900348 113221247
2320 113221247 110756995 106650752 102567893 98153198 95099722 91910850 88876584 87111860
2312 87111860 86351113 85233584 82632363 82307208 81951659 81746753 81010446 81427934 82168367
2303 82168367 83005901 84403681 85014519 85896994 88163289 89161299 88582989 87119688 86364145
2294 86364145 85066953 82753388 81157593 79567865 78438759 77707759 76784985 75053688
$$ packed form
2356G5198558j722909j397687q63245l92730q78175j548198m12307r03548r48956
2347F6130803m73591K370M58843q68741n91776Q34031L54679N62381N36552J04534
2337F7050085P23807J59940J007853K186742Q17883J724327K396350J938721K968500
2328H0974208M464237N494306N276849N390599M862434M861035J576680L20899
2320A13221247k464252m106243m082859m414695l053476l188872l034266j764724
2312H7111860p60747j117529k601221l25155l55549k04906p36307M17488P40433
2303H2168367Q37534J397780O10838Q82475K266295R98010n78310j463301p55543
2294H6364145j297192k313565j595795j589728j129106p31000r22774j731297
$$ plain form
2286 75053688 73446774 72966230 72766626 72395618 72065887 72478415 73314579 75372907 76209812
2277 76209812 77001336 78776375 81428253 84295362 86128204 88771547 91606343 94600504
2269 94600504 96298094 97125535 97989163 98338810 96664486 95981439 94160409 91902524 89825754
2260 89825754 87845296 85605228 83928559 82072385 80502966 79100289 76743543 74042496
2252 74042496 71286507 68729710 67157497 65241137 62972401 60960047 59417081 56727780
2244 56727780 55542050 54948071 54173369 52722889 52379672 51456947 50260349 49729089 49605201
2235 49605201 48373780 48192616 48516707 47346036 47143416 47006104 47526888 47247739 46719584
2226 46719584 47390245 46527568 46034376 46730455 47037164 47052282 47707476 49160707 49580740
$$ packed form
2286G5053688j606914m80544j99604l71008l29731M12528Q36164K058328Q36905
2277G6209812P91524J775039K651878K867109J832842K643343K834796K994161
2269I4600504J697590Q27441Q63628L49647j674324o83047j821030k257885k076770
2260H9825754j980458k240068j676669j856174j569419j402677k356746k701047
2252G4042496k755989k556797j572213j916360k268736k012354j542966k689301
2244E6727780j185730n93979p74702j450480l43217r22725j196598n31260j23888
2235D9605201j231421j81164L24091j170671k02620j37312N20784k79149n28155
2226D6719584O70661q62677m93192O96079L06709J5118O55194J453231M20033
$$ plain form
2217 49580740 50034682 50724915 51965074 52866436 52858764 52820783 53122127 52612075 53258964 52625218
2207 52625218 52233200 52718362 52722806 52372759 51920865 51307452 49950008 48909109 48317838
2198 48317838 46949504 45613668 45017133 43646224 42202068 42023696 41460420 40484279 40199494
2189 40199494 40057409 39220607 39285384 38934898 38082696 37161972 37152285 37446736 36749760 37071582
2179 37071582 37164423 36313012 35847779 36077096 35469977 34950991 35118797 35516557 36436724 36998079
2169 36998079 36415322 37011815 36519773 36536172 37469658 37615803 38274953 38757017 39214867 39703368
2159 39703368 40417090 41370108 41554611 41955280 41492886 40432614 40082400 40335565 39654267
2150 39654267 39697683 39766952 39560675 39642936 39402776 39398133 38925222 38962081 38427757 38734584
$$ packed form
2217D9580740M53942O90233J240159R01362p672l7981L01344n10052O46889o33746
2207E2625218l92018M85162M444l50047m51894o13413j357444j040899n91271
2198D8317838j368334j335836n96535j370909j444156j78372n63276r76141k84785
2189D0199494j42085q36802O4777l50486q52202r20724r687K94451o96976L21822
2179C7071582R2841q51411m65233K29317o07119n18986J67806L97760R20167N61355
2169C6998079n82757N96493m92042J6399R33486J46145O59150M82064M57850M88501
2159C9703368P13722R53018J84503M00669m62394j060272l50214K53165o81298
2150C9654267M3416O9269k06277Q2261k40160m643m72911L6859n34324L06827
$$ plain form
2140 38734584 39312524 39123088 38593319 38689980 38488561 39079809 38957836 38080441 38159996 38218306
2130 38218306 38133666 38785403 39293127 39020030 39016371 39359932 39726237 40342151 41561520 43620480
2120 43620480 43463009 43270528 43860876 44468242 44163036 43542985 44343910 44126534 43886845
2111 43886845 44025471 44154316 43964090 43220717 43775084 43397980 42804580 43503725 43120463
2102 43120463 43059473 42820017 42190052 42189978 41906429 41640989 42276475 41219932 40746109 40787977
2092 40787977 40867948 41368313 41613108 42688975 42961127 43106922 43747995 43964296 43464277
2083 43464277 44306154 44548666 45222331 46130334 46414277 46129360 46535885 46896895 47165750
2074 47165750 47726616 48153272 47965840 47817475 47818648 47533416 48066514 48796373 49104048 50171916
$$ packed form
2140C8734584N77940j89436n29769R6661k01419N91248j21973q77395P9555N8310
2130C8218306q4640O51737N07724k73097l659L43561L66305O15914J219369K058960
2120D3620480j57471j92481N90348O07366l05206o20051Q00925k17376k39689
2111D3886845J38626J28845j90226p43373N54367l77104n93400O99145l83262
2102D3120463o0990k39456o29965p4k83549k65440O35486j056543m73823M1868
2092D0787977P9971N00365K44795J075867K72152J45795O41073K16301n00019
2083D3464277Q41877K42512O73665R08003K83943k84917M06525L61010K68855
2074D7165750N60866M26656j87432j48365J173k85232N33098P29859L07675J067868
$$ plain form
2064 50171916 49489178 49428023 49746859 50143111 50867268 50912597 50269933 49895665 50290491 49797519
2054 49797519 50116233 50196492 51361211 52299761 52442474 51752430 52171441 52254650 53015668 53599643
2044 53599643 53577947 53997647 54328130 54776905 55490164 57085787 56617775 56449056 57242151
2035 57242151 57140511 56862346 56539498 56694697 57497453 57380455 57215248 57171157 57368971 58412407
2025 58412407 58342856 57916726 58238531 58131402 57818830 58666270 59022374 59965556 60064633 60265565
2015 60265565 59778243 59873264 59799358 60286442 62001635 62210629 61149746 61484099 62113673
2006 62113673 62642092 63180351 63827727 64661260 64536307 64311646 64991547 65023268 66304261
1997 66304261 67125533 67277993 67945012 68146228 68286256 69729321 70064068 70653129 71176971
$$ packed form
2064E0171916o82738o1155L18836L96252P24157M5329o42664l74268L94826m92972
2054D9797519L18714Q0259J164719R38550J42713o90044M19011Q3209P61018N83975
2044E3599643k1696M19700L30483M48775P13259J595623m68012j68719P93095
2035E7242151j01640k78165l22848J55199Q02756j16998j65207m4091J97814J043436
2025E8412407o9551m26130L21805j07129l12572Q47440L56104R43182R9077K00932
2015F0265565m87322R5021p3906M87084J715193K08994j060883L34353O29574
2006F2113673N28419N38259O47376Q33533j24953k24661O79901L1721J280993
1997F6304261Q21272J52460O67019K01216J40028J443065L34747N89061N23842
$$ plain form
1988 71176971 71826003 73233152 74232337 76127691 77680991 78312143 79636297 80286162 80956510
1979 80956510 81982224 83489259 85483803 86810300 88467886 89234247 91880772 94063059
1971 94063059 95811338 98338892 99952022 100794990 103080265 106274720 108152283 109890864
1963 109890864 112234583 114986669 117299896 118348854 120155143 122776083 125855024 127876332
1955 127876332 130562590 133069734 135186296 136818310 137821494 139431135 141728662 143285622
1947 143285622 143826690 144937061 145848897 146011377 147264055 148963231 150004179 149996223 149973648
1938 149973648 151194489 151136435 150020047 149410539 148034954 145827809 142734810 140863211
1930 140863211 138355296 136584377 134243630 131418992 128180121 125885563 123689079 121140589
$$ packed form
1988G1176971O49032J407149R99185J895354J553300O31152J324154O49865O70348
1979H0956510J025714J507035J994544J326497J657586P66361K646525K182287
1971I4063059J748279K527554J613130Q42968K285275L194455J877563J738581
1963A09890864K343719K752086K313227J048958J806289K620940L078941K021308
1955A27876332K686258K507144K116562J632014J003184J609641K297527J556960
1947A43285622N41068J110371R11836J62480J252678J699176J040948p956k2575
1938A49973648J220841n8054j116388o09508j375585k207145l092999j871599
1930A40863211k507915j770919k340747k824638l238871k294558k196484k548490
$$ plain form
1922 121140589 118469003 115730544 113702890 109368162 106003357 103637437 101009099 98747849
1914 98747849 95623299 92527192 89632196 88002811 86154509 83751155 82072641 80194779
1906 80194779 78015657 76427745 74237175 72945187 71900318 70617470 69600657 68833156
1898 68833156 67663656 65808394 64462823 63945165 62434457 60736876 60077700 59805443 60246040
1889 60246040 59614912 58455309 57278896 57326116 56855714 55345141 55110285 55085628 54654103
1880 54654103 54013951 53721951 54332972 55215778 54600903 53846413 53867118 54067553 54377466 54439720
1870 54439720 54410667 54549369 55161223 54558578 55199946 55098102 55148801 54622233 54687799 54147172
1860 54147172 53425212 52962027 52306181 52645964 52376511 52659334 52426254 51083221 51509707
$$ packed form
1922A21140589k671586k738459k027654m334728l364805k365920k628338k261250
1914I8747849l124550l096107k894996j629385j848302k403354j678514j877862
1906H0194779k179122j587912k190570j291988j044869j282848j016813p67501
1898F8833156j169500j855262j345571n17658j510708j697581o59176k72257M40597
1889F0246040o31128j159603j176413M7220m70402j510573k34856k4657m31525
1880E4654103o40152k92000O11021Q82806o14875p54490K0705K00435L09913O2254
1870E4439720k9053J38702O11854o02645O41368j01844N0699n26568O5566n40627
1860E4147172p21960m63185o55846L39783k69453K82823k33080j343033M26486
$$ plain form
1851 51509707 50501193 49317830 48930651 49049304 48584265 48364730 47511599 47587084 48181612
1842 48181612 47372207 46607951 46427363 46706449 45918413 46553264 45668523 45880797 45984943
1833 45984943 45642665 46151010 46010081 46047755 45583205 44855173 44429226 44315386 44094190 44232430
1823 44232430 44771080 44303310 44363777 44148747 43329217 42597913 42949821 43833645 43745922 43703649
1813 43703649 43047353 42589521 43472534 44011330 43747011 43506302 43776989 43765386 44342922 44355709
1803 44355709 43924268 44063901 44239833 43902441 43807359 44458529 44463325 45094177 44413345 43607569
1793 43607569 43677011 44915193 45745801 45810978 46111568 46303744 47255590 47743681 47683076 48332937
1783 48332937 49333004 50514012 50087281 51168261 52339985 52945742 54772569 56985244
$$ packed form
1851E1509707j008514j183363l87179J18653m65039k19535q53131P5485N94528
1842D8181612q09405p64256j80588K79086p88036O34851q84741K12274J04146
1833D5984943l42278N08345j40929L7674m64550p28032m25947j13840k21196J38240
1823D4232430N38650m67770O0467k15030q19530p31304L51908Q83824q7723m2273
1813D3703649o56296m57832Q83013N38796k64319k40709K70687j1603N77536J2787
1803D4355709m31441J39633J75932l37392r5082O51170M796O30852o80832q05776
1793D3607569O9442J238182Q30608O5177L00590J92176R51846M88091o0605O49861
1783D8332937J000067J181008m26731J080980J171724O05757J826827K212675
$$ plain form
1775 56985244 58235658 60333548 62809900 65411374 67290219 68665478 70407974 72359755
1767 72359755 73952556 74818014 75090071 76350098 77079335 76725641 77245445 77025945 77574556
1758 77574556 78277316 78470216 79154980 79265928 78643964 78214543 76943750 74944863 72896623
1749 72896623 72427346 71532395 70237299 68346078 67000606 65954132 65495458 64570018 64194399
1740 64194399 64126730 63380477 62322464 62164875 61429686 61424264 61233973 60670999 60793754 60927895
1730 60927895 60948457 60848110 61678544 61501123 60769963 60713690 60927504 62144498 62780407 63156236
1720 63156236 63282599 63424156 64371714 64420789 65410605 65864368 66361428 67574810 67694291
1711 67694291 67795753 68272866 68660968 69322457 70191023 71047483 70783716 70923134 71990341
$$ packed form
1775E6985244J250414K097890K476352K601474J878845J375259J742496J951781
1767G2359755J592801Q65458K72057J260027P29237l53694N19804k19500N48611
1758G7574556P02760J92900O84764J10948o21964m29421j270793j998887k048240
1749G2896623m69277q94951j295096j891221j345472j046474m58674r25440l75619
1740F4194399o7669p46253j058013j57589p35189n422j90291n62974J22755J34141
1730F0927895K0562j00347Q30434j77421p31160n6273K13814J216994O35909L75829
1720F3156236J26363J41557R47558M9075R89816M53763M97060J213382J19481
1711F7694291J01462M77113L88102O61489Q68566Q56460k63767J39418J067207
$$ plain form
1702 71990341 72311605 73286629 74896614 76074928 76721358 78274651 79033990 79984124 79890366
1693 79890366 81014102 82244394 82781265 83707050 83890301 84635677 84813377 84782166 85900002
1684 85900002 87471615 88970993 90039721 91531861 92112423 92956279 93835670 93740862 95456664
1675 95456664 96925418 98620397 100093655 101072680 102540599 104334253 106149127 107440442
1667 107440442 108426339 108653406 109909682 111152380 112553092 114167069 115307023 116649097
1659 116649097 117580486 119144707 120673924 122470801 124826797 126747334 127369346 129186014
1651 129186014 130973272 131744653 132971945 134006931 134594567 135643640 136581932 138788997
1643 138788997 140378601 142078269 143549403 144915373 146087604 147707750 148783508 149329287
$$ packed form
1702G1990341L21264R75024J609985J178314O46430J553293P59339R50134r3758
1693G9890366J123736J230292N36871R25785J83251P45376J77700l1211J117836
1684H5900002J571613J499378J068728J492140N80562Q43856Q79391r4808J715802
1675I5456664J468754J694979J473258R79025J467919J793654J814874J291315
1667A07440442R85897K27067J256276J242698J400712J613977J139954J342074
1659A16649097R31389J564221J529217J796877K355996J920537O22012J816668
1651A29186014J787258P71381J227292J034986N87636J049073R38292K207065
1643A38788997J589604J699668J471134J365970J172231J620146J075758N45779
$$ plain form
1635 149329287 150622716 151206892 151248839 152670979 153919804 154379302 155303036 156112608 156885325
1626 156885325 156914782 156144018 156434440 156615574 155498882 153988521 153154295 153042587 152664956
1617 152664956 151574938 150651286 148844871 148091064 147100492 145528222 145329429 144256330 143907635
1608 143907635 143141217 141232907 139147358 137412239 136616977 136123739 136510656 136800703 136336407
1599 136336407 136000094 135720208 135771826 136095326 136213032 136212578 137121123 137241226 137050712 138461131
1589 138461131 139146655 140572553 142157509 144181119 145536370 147733405 150298743 152983388
1581 152983388 155440382 157030797 159208993 160288589 162619157 164876058 166197931 168863086
1573 168863086 171747081 173843626 176044621 177194677 179652463 180738989 181752774 182517444
$$ packed form
1635A49329287J293429N84176M1947J422140J248825M59498R23734Q09572P72717
1626A56885325K9457p70764K90422J81134j116692j510361q34226j11708l77631
1617A52664956j090018r23652j806415p53807r90572j572270j98793j073099l48695
1608A43907635p66418j908310k085549j735119p95262m93238L86917K90047m64296
1599A36336407l36313k79886N1618L23500J17706m54R08545J20103j90514J410419
1589A38461131O85524J425898J584956K023610J355251K197035K565338K684645
1581A52983388K456994J590415K178196J079596K330568K256901J321873K665155
1573A68863086K883995K096545K200995J150056K457786J086526J013785P64670
$$ plain form
1565 182517444 182563527 183162602 182665220 182068574 182377202 182743728 182123013 181664112 181791738
1556 181791738 181459874 181440176 180590763 180397986 180782808 181210954 181024423 180866685 181075106
1547 181075106 180877176 180614034 181103233 181678311 182376706 182611943 182640870 184037727 185088485
1538 185088485 185962726 187518769 188186198 189563531 190756156 192458755 193937564 195341676
1530 195341676 196481798 197632165 199052521 201139892 202921724 205145929 207761584 209838767
1522 209838767 212056704 215098599 219197477 223324983 228519264 234032823 240661221 247375153
1514 247375153 253402188 259521573 264556796 269791360 274491804 277383831 280057061 281040244
1506 281040244 281354755 281197426 280866650 280090536 278984181 276041902 276019715 274595302 273549819
$$ packed form
1565A82517444M6083N99075m97382n96646L08628L66526o20715m58901J27626
1556A81791738l31864j9698q49413j92777L84822M28146j86531j57738K08421
1547A81075106j97930k63142M89199N75078O98395K35237K8927J396857J050758
1538A85088485Q74241J556043O67429J377333J192625J702599J478809J404112
1530A95341676J140122J150367J420356K087371J781832K224205K615655K077183
1522B09838767K217937L041895M098878M127506N194281N513559O628398O713932
1514B47375153O027035O119385N035223N234564M700444K892027K673230R83183
1506B81040244L14511j57329l30776p76114j106355k942279k2187j424413j045483
$$ plain form
1497 273549819 271259503 268253977 263791464 258469210 252511426 245329221 238363341 230162696
1489 230162696 221918619 213168251 205908823 198196336 190707955 184707073 178649060 172779007
1481 172779007 167981216 163304602 159436358 155400258 152133171 147853339 144027007 141750397
1473 141750397 139486585 136887361 133922092 131892867 130874585 129021152 126990262 124987469
1465 124987469 123153240 121448892 118943348 117463888 115752122 114534935 112887708 111327672
1457 111327672 109445800 107906960 106372071 104802339 103391602 101740197 100363835 97988415
1449 97988415 96257386 93728429 91613013 90052672 88092304 86330014 84948527 83290860
1441 83290860 81475398 79594620 78815929 77027448 75517241 73010457 71277963 69497887
$$ packed form
1497B73549819k290316l005526m462513n322254n957784p182205o965880q200645
1489B30162696q244077q750368p259428p712487p488381o000882o058013n870053
1481A72779007m797791m676614l868244m036100l267087m279832l826332k276610
1473A41750397k263812k599224k965269k029225j018282j853433k030890k002793
1465A24987469j834229j704348k505544j479460j711766j217187j647227j560036
1457A11327672j881872j538840j534889j569732j410737j651405j376362k375420
1449I7988415j731029k528957k115416j560341j960368j762290j381487j657667
1441H3290860j815462j880778p78691j788481j510207k506784j732494j780076
$$ plain form
1433 69497887 69188352 68115702 66810127 65514629 64761055 63696109 62664556 62413256 61157522
1424 61157522 59784686 59376824 58825306 57593390 57727828 56505995 55796083 55397900 55476854
1415 55476854 54765068 54832205 54120469 52922088 52129556 52117925 51992097 51572320 51113561 50959168
1405 50959168 51448821 50923021 50323568 49511027 49506791 49104410 48355989 48718334 48884046 49606587
1395 49606587 49645549 49406530 50150505 51072465 50750954 50545672 51200244 51958893 52379351 52509659
1385 52509659 52774617 53110720 52531003 52002528 52244073 52373192 52464267 52523339 51924226 52429698
1375 52429698 52143057 52211861 52475953 52492567 51687423 50908229 50653446 50070689 50284664 50865001
1365 50865001 50468060 50712394 50528746 51419934 52244998 52273593 51677162 51786355 52805147
$$ packed form
1433F9497887l09535j072650j305575j295498p53574j064946j031553k51300j255734
1424F1157522j372836m07862n51518j231916J34438j221833p09912l98183P8954
1415E5476854p11786O7137p11736j198381p92532j1631j25828m19777m58759j54393
1405E0959168M89653n25800n99453q12541m236m02381p48421L62345J65712P22541
1395D9606587L8962k39019P43975R21960l21511k05282O54572P58649M20458J30308
1385E2509659K64958L36103n79717n28475K41545J29119R1075N9072n99113N05472
1375E2429698k86641O8804K64092J6614q05144p79194k54783n82757K13975N80337
1365E0865001l96941K44334j83648Q91188Q25064K8595n96431J09193J018792
$$ plain form
1356 52805147 53118657 54091079 54158663 54134351 53557555 53909806 54181892 54785932 55569988 55810156
1346 55810156 55588341 55074581 54250482 53528734 52903419 53032865 52298537 51668683 52309252
1337 52309252 51923849 51111846 51004958 50792288 50973610 51255364 51430927 50917011 51385070
1328 51385070 52166487 52570094 53074929 52965367 53613702 54019806 54540982 55512913 55979500
1319 55979500 56809803 57221973 56268795 55902285 56526461 56700028 56791367 57007626 57899208 58043592
1309 58043592 57421960 58564069 58773293 58744100 59885385 60583403 60708253 61493208 61320679
1300 61320679 61150879 61857427 62894838 64138679 64545512 65282934 65442892 67111762 69032775
1291 69032775 69840814 70332614 71519998 72387649 73110188 73675640 74799512 77066545 78640594
$$ packed form
1356E2805147L13510R72422O7584k4312n76796L52251K72086O04040P84056K40168
1346E5810156k21815n13760q24099p21748o25315J29446p34328o29854O40569
1337E2309252l85403q12003j06888k12670J81322K81754J75563n13916M68059
1328E1385070P81417M03607N04835j09562O48335M06104N21176R71931M66587
1319E5979500Q30303M12170r53178l66510O24176J73567R1339K16259Q91582J44384
1309E8043592o21632J142109K09224k9193J141285O98018J24850P84955j72529
1300F1320679j69800P06548J037411J243841M06833P37422J59958J668870J921013
1291F9032775Q08039M91800J187384Q67651P22539N65452J123872K267033J574049
$$ plain form
1282 78640594 79156267 80229914 82186068 84148810 84702537 86021492 88391277 90778502
1274 90778502 91563326 93600953 96398239 97492929 99899656 102293202 105121000 108087181
1266 108087181 111128034 114592363 118934701 122115051 126560420 131360360 136220731 142051589
1258 142051589 149181643 157005468 163686892 172312932 181835250 191669160 201869263 212117499
1250 212117499 223288385 234005999 244334790 254157867 262775663 270337162 276925787 280793891
1242 280793891 282385422 282128607 280409718 277592199 274347650 270282221 266471456 263091775
1234 263091775 259458439 257013706 254651918 251820951 248285431 244002578 238547939 233320535
1226 233320535 229957481 226609366 222974289 221408406 219581752 215864396 212798094 209637510
$$ packed form
1282G8640594N15673J073647J956154J962742N53727J318955K369785K387225
1274I0778502P84824K037627K797286J094690K406727K393546K827798K966181
1266A08087181L040853L464329M342338L180350M445369M799940M860371N830858
1258A42051589P130054P823825O681424Q626040R522318R833910J0200103J0248236
1250B12117499J1170886J0717614J0328791R823077Q617796P561499O588625L868104
1242B80793891J591531k56815j718889k817519l244549m065429l810765l379681
1234B63091775l633336k444733k361788k830967l535520m282853n454639n227404
1226B33320535l363054l348115l635077j565883j826654l717356l066302l160584
$$ plain form
1218 209637510 205936591 203073893 200936084 199425800 197618281 196741550 195933108 195333413
1210 195333413 192877708 191215372 189716959 188194877 187387781 187505971 186674239 185667170
1202 185667170 183307813 178942727 173810185 168076099 162956453 158278919 155263428 151829888
1194 151829888 147604518 143264949 140330291 135658240 132164677 129610288 126837533 124459784
1186 124459784 122908231 120329411 117928059 117218395 115055629 113340249 112130171 110767452
1178 110767452 108837771 106478208 105168427 102857433 100332535 97991822 96879968 95087084
1170 95087084 92808874 91082143 88700326 86372231 85385932 83690624 82699216 81573149
1162 81573149 79700644 78550414 77158677 76678485 76557510 76206611 76009103 74915775 73472060
$$ packed form
1218B09637510l700919k862698k137809j510284j807519q76731q08442n99695
1210A95333413k455705j662336j498413j522082q07096J18190q31732j007069
1202A85667170k359357m365086n132542n734086n119646m677534l015491l433540
1194A51829888m225370m339569k934658m672051l493563k554389k772755k377749
1186A24459784j551553k578820k401352p09664k162766j715380j210078j362719
1178A10767452j929681k359563j309781k310994k524898k340713j111854j792884
1170I5087084k278210j726731k381817k328095r86299j695308r91408j126067
1162H1573149j872505j150230j391737m80192j20975l50899j97508j093328j443715
$$ plain form
1153 73472060 73456862 72821757 72943141 71988500 70998966 71316390 71009677 70552940 69621390 69257592
1143 69257592 67531234 65785846 65131757 63951423 63247792 63388530 62930475 62491893 61933768
1134 61933768 61244074 61407661 60179207 59892359 59680866 60387392 60225548 59227276 59984843
1125 59984843 59543220 60094691 59887861 59656567 59326550 59442262 59486243 59047474 58414808 58715759
1115 58715759 59211101 58884739 58425168 59504963 60399423 60207342 60031172 60772012 61071331
1106 61071331 61552937 61839131 62472463 63120568 64561080 65286346 66243240 68725639 69735211
1097 69735211 71452107 73323837 75909098 78757905 82167517 84638423 89140347 94034176
1089 94034176 98517245 104234111 111503932 118877365 127348989 136717299 148566408 163293551
$$ packed form
1153G3472060j5198o35105J21384r54641r89534L17424l06713m56737r31550l63798
1143F9257592j726358j745388o54089j180334p03631J40738m58055m38582n58125
1134F1933768o89694J63587j228454k86848k11493P06526j61844r98272P57567
1125E9984843m41623N51471k06830k31294l30017J15712M3981m38769o32666L00951
1115E8715759M95342l26362m59571J079795Q94460j92081j76170P40840K99319
1106F1071331M81606K86194O33332O48105J440512P25266R56894K482399J009572
1097F9735211J716896J871730K585261K848807L409612K470906M501924M893829
1089I4034176M483069N716866P269821P373433Q471624R368310J1849109J4727143
$$ plain form
1081 163293551 181891373 205022689 233537554 265243112 297586438 332187328 364050013
1074 364050013 387174328 401382091 400688773 381589775 349751116 318231925 291436647
1067 291436647 269308607 251620800 237454546 226280084 218288675 211637280 206410923
1060 206410923 202572461 199864361 200000963 201324945 204068096 211005608 221218428 236300485
1052 236300485 256470072 281673377 308118017 335997626 366474086 392633594 408376256
1045 408376256 414712097 405285605 376980121 342896671 310117839 280644893 256162484
1038 256162484 235740585 218715781 204538910 191704651 179869686 168082731 158257227
1031 158257227 149620316 142037382 134437536 128701178 122993521 117937068 112470549 108770421
$$ packed form
1081A63293551J8597822K3131316K8514865L1705558L2343326L4600890L1862685
1074C64050013K3124315J4207763o93318j9098998l1838659l1519191k6795278
1067B91436647k2128040j7687807j4166254j1174462p991409o651395n226357
1060B06410923l838462k708100J36602J323982K743151O937512J0212820J5082057
1052B36300485K0169587K5203305K6444640K7879609L0476460K6159508J5742662
1045D08376256O335841r426492k8305484l4083450l2778832k9472946k4482409
1038B56162484k0421899j7024804j4176871j2834259j1834965j1786955r825504
1031A58257227q636911p582934p599846n736358n707657n056453n466519l700128
$$ plain form
1023 108770421 104867097 101118266 97165820 94784100 92216610 90292938 89345409 86950009
1015 86950009 85461318 84168692 82140191 80081231 78846203 77286881 74963617 72561366
1007 72561366 71014320 70418379 69368763 66894443 65890663 64146017 63502259 62527917 62412688
998 62412688 61318033 60700614 60028509 59287683 59035303 58303033 57837416 57300988 57936098
989 57936098 57009410 56180032 55316135 55310482 54914314 54273237 53582201 53238735 52814927 52124772
979 52124772 51590230 52085735 51294728 50607359 50847242 50830963 50928491 51541121 52096896 51825110
969 51825110 51235283 51073149 50025901 50338946 49765223 49541126 49766858 50254257 50019561
960 50019561 49474439 49616291 49363967 49612226 48584208 48309469 48828609 49188643 48978609
$$ packed form
1023A08770421l903324l748831l952446k381720k567490j923672r47529k395400
1015H6950009j488691j292626k028501k058960j235028j559322k323264k402251
1007G2561366j547046n95941j049616k474320j003780j744646o43758r74342j15229
998F2412688j094655o17419o72105p40826k52380p32270m65617n36428O35110
989E7936098r26688q29378q63897n653l96168o41077o91036l43466m23808o90155
979E2124772n34542M95505p91007o87369K39883j6279R7528O12630N55775k71786
969E1825110n89827j62134j047248L13045n73723k24097K25732M87399k34696
960E0019561n45122J41852k52324K48259j028018k74739N19140L60034k10034
$$ plain form
951 48978609 49064238 49640637 49492955 49346462 49957143 49957489 50702806 52057640 53215241 52816929
941 52816929 53247197 54000269 54645609 55931788 57067022 58805908 59765647 60480423 61629816
932 61629816 62903545 63725295 64405982 64746415 64853054 65474887 66444042 66602778 66460209
923 66460209 67903546 69005370 69155251 69570322 71182440 72022662 73800469 74140452 74789675
914 74789675 76726026 78261650 80464371 82466305 84904507 87149048 89497840 91352636
906 91352636 93879992 97011943 98606030 101128075 103491433 103299101 103566821 103426971 101918005
897 101918005 100647785 99060410 97302832 95855145 95098669 94638779 94544521 94118340 93427463
888 93427463 93245817 94559952 95584237 96322065 98366422 99899122 101231097 103210186 104074661
$$ packed form
951D8978609Q5629N76399j47682j46493O10681L46P45317J354834J157601l98312
941E2816929M30268P53072O45340J286179J135234J738886R59739P14776J149393
932F1629816J273729Q21750O80687L40433J06639O21833R69155J58736j42569
923F6460209J443337J101824J49881M15071J612118Q40222J777807L39983O49223
914G4789675J936351J535624K202721K001934K438202K244541K348792J854796
906I1352636K527356L131951J594087K522045K363358j92332K67720j39850j508966
897A01918005j270220j587375j757578j447687p56476m59890r4258m26181o90877
888I3427463j81646J314135J024285P37828K044357J532700J331975J979089Q64475
$$ plain form
879 104074661 104946563 106701748 107806466 108819136 109296432 109703394 110348498 108897220 107558228
870 107558228 106001582 103955131 101449722 98823169 96449022 94218574 92004643 90170398
862 90170398 87986098 87601348 86869097 85360925 84495322 85327708 85304066 84911065 84446697
853 84446697 83547953 82975955 82641924 82577606 81497565 80418250 78618266 77079704 75116729
844 75116729 72924364 70937421 68921166 67483422 65090427 62188872 60853802 59613067
836 59613067 57642619 56266240 55529321 54255253 52460442 51593259 50353294 48754796 47613878
827 47613878 46443843 47039187 46132887 44379052 44247969 44235914 42850054 41726446 40206016
818 40206016 39362435 39415153 38911951 38185402 38381026 37490874 36395531 35679907 35659352 35137624
$$ packed form
879A04074661Q71902J755185J104718J012670M77296M06962O45104j451278j338992
870A07558228j556646k046451k505409k626553k374147k230448k213931j834245
862I0170398k184300l84750p32251j508172q65603Q32386k3642l93001m64368
853H4446697q98744n71998l34031o4318j080041j079315j799984j538562j962975
844G5116729k192365j986943k016255j437744k392995k901555j335070j240735
836E9613067j970448j376379p36919j274068j794811q67183j239965j598498j140918
827D7613878j170035N95344r06300j753835j31083j2055j385860j123608j520430
818D0206016q43581N2718n03202p26549J95624q90152j095343p15624k0555n21728
$$ plain form
808 35137624 34843847 33557748 33358652 33111880 32303401 31652724 31157014 30973915 31370891
799 31370891 31226214 30033394 29179453 28583529 28154596 27845307 27655939 28276350 27846921
790 27846921 28241609 29171317 28676071 27978313 28289274 28018401 27621215 26441152 25662109
781 25662109 25689782 25497841 24836914 23823414 23955011 23774982 23797379 23320002 23565260 23109256
771 23109256 22794803 23100644 22022548 21853515 22939309 23048131 23485802 22990131 22410093
762 22410093 22038174 21686932 22291417 22192895 22053376 21813762 21484790 21875786 22032210 21451846
752 21451846 20306236 20492567 20115023 19812449 19497698 19182095 19518010 19723748 18852168
743 18852168 18192286 17364242 17517836 17058396 17344437 17451462 17499608 16942351 16862930 17491096
$$ packed form
808C5137624k93777j286099j99096k46772q08479o50677m95710j83099L96976
799C1370891j44677j192820q53941n95924m28933l09289j89368O20411m29429
790B7846921L94688R29708m95246o97758L10961k70873l97186j180063p79043
781B5662109K7673j91941o60927j013500J31597j80029K2397m77377K45258m56004
771B3109256l14453L05841j078096j69033J085794J08822M37671m95671n80038
762B2410093l71919l51242O04485r8522j39519k39614l28972L90996J56424n80364
752B1451846j145610J86331l77544l02574l14751l15603L35915K05738q71580
743A8852168o59882q28044J53594m59440K86041J07025M8146n57257p9421O28166
$$ plain form
733 17491096 17066761 16196339 16291066 17072081 17057967 16929498 16804076 16255942 16556194 16236453
723 16236453 17011430 17224593 16192453 15790661 15332495 15045262 14753848 14537769 13397723
714 13397723 13664284 13708630 14546863 14841614 14174297 13273271 13925028 14084040 13605428 13918100
704 13918100 14770355 14038389 13643398 14341375 13379491 13265930 12725470 13124293 13277656 12942359
694 12942359 13296635 12936544 12902610 12639376 13534746 13718207 13277243 12893018 12496314 12622985
684 12622985 12355831 12442458 12404013 12430939 12626589 12765348 12951276 12590206 12850145 12276852
674 12276852 12292197 12775482 12516691 12547049 12161320 12107130 11892344 11962360 13330973 12946039
664 12946039 12905523 12867752 12319938 12887908 11682036 12463512 11780159 11613778 11531873 11473996
$$ packed form
733A7491096m24335q70422R4727P81015j4114j28469j25422n48134L00252l19741
723A6236453P74977K13163j032140m01792m58166k87233k91414k16079j140046
714A3397723K66561M4346Q38233K94751o67317r01026O51757J59012m78612L12672
704A3918100Q52255p31966l94991O97977r61884j13561n40460L98823J53363l35297
694A2942359L54276l60091l3934k63234Q95370J83461m40964l84225l96704J26671
684A2622985k67154Q6627l8445K6926J95650J38759J85928l61070K59939n73293
674A2276852J5345M83285k58791L0358l85729n4190k14786P0016J368613l84934
664A2946039m0516l7771n47814N67970j205872P81476o83353j66381q1905n7877
$$ plain form
654 11473996 11704193 12203508 12835931 12057587 11487512 10737068 10502480 11512884 12287732
645 12287732 11300080 11377199 11640981 10926839 10835147 11261532 11446495 11115773 10790793 11023830
635 11023830 10402619 10318377 10726899 11491745 11914065 11754201 11308525 11180199 11197050 11335813
625 11335813 11724456 10717359 11013239 11299312 9973829 10112198 10225967 10971394 10674200
616 10674200 10098744 10516428 10562298 10181526 10418581 10786346 10670785 10329473 10657978 10933401
606 10933401 11174811 11493473 11532004 11546908 12104109 11719577 11314696 10873880 10138283 10242441
596 10242441 9946794 9948699 9688636 9451874 9852338 10132518 9514334 9652811 10336383 10252032
586 10252032 10515816 10771469 10486227 9248737 9264687 10162709 10030450 9424125 9656430 9913860
$$ packed form
654A1473996K30197M99315O32423p78344n70075p50444k34588J010404P74848
645A2287732r87652P7119K63782p14142r1692M26385J84963l30722l24980K33037
635A1023830o21211q4242M08522P64846M22320j59864m45676j28326J6851J38763
625A1335813L88643j007097K95880K86073j325483J38369J13769P45427k97194
616A0674200n75456M17684M5870l80772K37055L67765j15561l41312L28505K75423
606A0933401K41410L18662L8531J4904N57201l84532m04881m40816p35597J04158
596A0242441k95647J905k60063k36762M00464K80180o18184J38477O83572q4351
586A0252032K63784K55653k85242j237490J5950Q98022j32259o06325K32305K57430
$$ plain form
576 9913860 9479911 9900927 10502364 9534220 9720498 9177594 9651789 9576811 9389451 9670753
566 9670753 9291250 9319178 8983763 8746610 8972961 9609316 8590318 8691029 8880106 8960397
556 8960397 8337537 8784964 9344699 10468162 9672017 9037051 8819560 9343594 9418101 9065530
546 9065530 9289470 9377468 8952072 9185202 8775402 8436390 8435732 8584432 8790324 8056388
536 8056388 8425967 7717834 7910023 7879348 7774671 8070843 8163299 8813260 8925898 8757759
526 8757759 8339005 8289438 8301973 8374275 7919602 8057212 8427395 8469085 7743437 7662679 8231197
515 8231197 7985101 8201500 8018024 7097093 7215413 7572331 7958978 8782143 8547872 8697745
505 8697745 7936015 8091597 7929660 7082777 7271327 6666037 6148725 6744290 7416576 7338092
$$ packed form
576I913860m33949M21016O01437r68144J86278n42904M74195p4978j87360K81302
566I670753l79503K7928l35415k37153K26351O36355j018998J00711J89077Q0291
556H960397o22860M47427N59735J123463p96145o34966k17491N24034P4507l52571
546I065530K23940Q7998m25396K33130m09800l39012o58J48700K05892p33936
536H056388L69579p08133J92189l0675j04677K96172R2456O49961J12638j68139
526H757759m18754m9567J2535P2302m54673J37610L70183M1690p25648q0758N68518
515H231197k46096K16399j83476r20931J18320L56918L86647Q23165k34271J49873
505H697745p61730J55582j61937q46883J88550o05290n17312N95565O72286p8484
$$ plain form
495 7338092 6974840 6744967 6760708 6501904 7189427 7776426 7097381 7121703 7654793 8194088
485 8194088 8285811 7964703 7445960 7218996 7525854 7450457 7564874 7243102 7063218 7415734
475 7415734 7452547 7360426 7098566 7353024 7175592 8563929 8493967 7564402 7118341 6822325
465 6822325 7079966 7143332 7208049 7266417 7148493 6548311 5949448 5819906 6567279 6457060
455 6457060 6691761 6821644 6217037 6339764 6411226 7344420 6682953 6319320 6411789 6614081
445 6614081 7263004 6746829 6782219 6818218 5974112 6262425 6385458 6300018 5750368 6048731
435 6048731 6453696 5936559 6848074 6537030 6214674 7091360 6808419 6715558 6403643 6290639
425 6290639 6906224 6598245 6088343 7188673 6979808 6083596 6904757 7143943 5998851
$$ packed form
495G338092l63252k29873J5741k58804O87523N86999o79045K4322N33090N39295
485H194088R1723l21108n18743k26964L06858p5397J14417l21772j79884L52516
475G415734L6813r2121k61860K54458j77432J388337o9962r29565m46061k96016
465F822325K57641O3366O4717N8368j17924o00182n98863j29542P47373j10219
455F457060K34701J29883o04607J22727P1462R33194o61467l63633R2469K02292
445F614081O48923n16175L5390L5999q44106K88313J23033q5440n49650K98363
435F048731M04965n17137R11515l11044l22356Q76686k82941r2861l11915j13004
425F290639O15585l07979n09902J100330k08865q96212Q21161K39186j145092
$$ plain form
416 5998851 5778616 6705727 5991406 5529242 6135299 6650487 5928485 5686176 6392635 6627767
406 6627767 6900527 6930992 6565525 6468220 6093232 6072606 5982396 5702599 6051583 6477624
396 6477624 6298124 6278752 5841879 6133854 6103091 6512603 5557005 5916328 6003425 5186543
386 5186543 5839651 5553368 5909035 5940021 6463271 6360664 6068697 5888038 5833905 5473238
376 5473238 5786009 6729151 7644408 7450886 5963628 6041376 6161717 6108707 5737766 6341511
366 6341511 6911687 7159133 7617690 7227507 7000871 6207493 5606086 6218119 5627376 5302699
356 5302699 6067352 5803129 5290930 5657121 5586030 5342467 4979672 5122523 4917393 5231273
346 5231273 5913323 6315620 6319088 5450618 4549593 4622449 5122840 5224022 5461553 4683078
$$ packed form
416E998851k20235R27111p14321m62164O06057N15188p22002k42309P06459K35132
406F627767K72760L0465l65467r7305l74988k0626r0210k79797L48984M26041
396F477624j79500j9372m36873K91975l0763M09512r55598L59323Q7097q16882
386E186543O53108k86283L55667L0986N23250j02607k91967j80659n4133l60667
376E473238L12771R43142R15257j93522j487258P7748J20341n3010l70941O03745
366F341511N70176K47446M58557l90183k26636p93378o01407O12033n90743l24677
356E302699P64653k64223n12199L66191p1091k43563l62795J42851k05130L13880
346E231273O82050M02297L468q68470r01025P2856N00391J01182K37531p78475
$$ plain form
336 4683078 3894309 4934822 5951929 5880822 5416676 4770873 4408955 5648643 5496705
327 5496705 6009848 5681223 4752027 5582278 5988111 5879948 5564034 4643872 4984441 5293424
317 5293424 5146086 4905704 4737000 5084136 4745098 5444286 5303810 5463593 4907855 5083002
307 5083002 5091584 5967850 5695152 5647583 4931541 5231376 5769113 5318100 5844315 5453089
297 5453089 6090287 6099023 5470699 5943519 6236665 5911701 5875741 5745508 4214093 4738197
287 4738197 5311428 5299053 4715590 4812138 4871609 5149475 4755758 4927604 5174503 4830620
277 4830620 5210703 5463746 5392116 4714526 4927062 4411530 4578611 4786733 3667138 4204749
267 4204749 5442237 4642425 4702008 4992672 4706961 4699992 4604759 4182162 4638892 4830219
$$ packed form
336D683078p88769J040513J017107p1107m64146o45803l61918J239688j51938
327E496705N13143l28625r29196Q30251M05833j08163l15914r20162L40569L08983
317E293424j47338k40382j68704L47136l39038O99188j40476J59783n55738J75147
307E083002Q582Q76266k72698m7569p16042K99835N37737m51013N26215l91226
297E453089O37198Q736o28324M72820K93146l24964l5960j30233j531415N24104
287D738197N73231j2375n83463R6548N9471K77866l93717J71846K46899l43883
277D830620L80083K53043p1630o77590K12536n15532J67081K08122j119595N37611
267D204749J237488p99812N9583K90664k85711o969r5233m22597M56730J91327
$$ plain form
257 4830219 5120069 4747041 4701296 5257261 5102907 5187524 5422323 4830783 4031058 4189832
247 4189832 4798141 4537504 4754057 4851510 4464296 4058761 4080521 4252253 4727832 4581986
237 4581986 3844544 4234315 4506787 4572604 4454532 4554840 3932396 4602967 4924042 4162197
227 4162197 4546189 4476574 4979445 4465573 4297102 4919842 4417772 4188346 4917096 5406817
217 5406817 5383723 4876591 4966273 4857127 4979204 5203084 4986218 5004131 4658584 4721968
207 4721968 4583190 3464727 4343782 4780808 4673932 4551438 4420378 4395184 3880838 4040298
197 4040298 3951242 4141124 4843913 5211371 4603994 4229114 4486121 4436260 4648357 5115364
187 5115364 4619345 4465488 4721626 4213998 3820015 4336668 3779132 4323813 5294011 4550932
$$ packed form
257D830219K89850l73028m5745N55965j54354Q4617K34799n91540p99725J58774
247D189832O08309k60637K16553R7453l87214m05535K1760J71732M75579j45846
237D581986p37442L89771K72472O5817j18072J00308o22444O70571L21075p61845
227D162197L83992o9615N02871n13872j68471O22740n02070k29426P28750M89721
217E406817k3094n07132Q9682j09146J22077K23880k16866J7913l45547O3384
207D721968j38778j118463Q79055M37026j06876j22494j31060k5194n14346J59460
197D040298q9056J89882P02789L67458o07377l74880K57007m9861K12097M67007
187E115364m96019j53857K56138n07628l93983N16653n57536N44681R70198p43079
$$ plain form
177 4550932 4761814 4596594 4490411 4741770 4181915 4740064 5117177 5141087 4729255 5365419
167 5365419 5758074 5522479 6046931 5525917 5357929 5426217 5787989 6122405 6200969 5632257
157 5632257 5873161 6674034 6446278 7172548 7313579 7360199 7333493 7586415 7859529 6925479
147 6925479 7784240 8036540 8335496 8312384 8856017 9926333 10205778 10262607 10959660 12046114
137 12046114 11853242 13019719 13551047 13676904 13970977 14672634 15831485 17717536 18564194
128 18564194 18849006 20096238 22068086 24267938 27233426 29881153 32196379 34854787
120 34854787 38777565 43163933 48066015 52624498 57158821 61739908 66151820 73157956
112 73157956 82776527 93975460 108873520 128952991 153853243 177687447 202943568
$$ packed form
177D550932K10882j65220j06183K51359n59855N58149L77113K3910m11832O36164
167E365419L92655k35595N24452n21014j67988O8288L61772L34416P8564n68712
157E632257K40904Q00873k27756P26270J41031M6620k6706K52922K73114r34050
147F925479Q58761K52300K98956k3112N43633J070316K79445N6829O97053J086454
137A2046114j92872J166477N31328J25857K94073P01657J158851J886051Q46658
128A8564194K84812J247232J971848K199852K965488K647727K315226K658408
120C4854787L922778M386368M902082M558483M534323M581087M411912P006136
112G3157956R618571J1198933J4898060K0079471K4900252K3834204K5256121
$$ plain form
105 202943568 233238132 254640144 266626958 272603543 261413960 233420608 203570707
98 203570707 177006669 156291644 139218221 124605155 113228844 103562332 94829495 87331698
90 87331698 80129652 74754460 69894608 64774326 59959815 55933654 52240894 48599860
82 48599860 45044461 41911251 39660554 37306831 35890577 33891171 32008561 30115189
74 30115189 28931891 27307944 26319415 25241378 24411931 23358303 22669108 21573791 20451486
65 20451486 20342690 19040744 18155164 17189496 16782569 15953581 15402358 15538195 15028455 14416461
55 14416461 13454685 13033618 12577801 12068177 11906884 11221329 11158040 11093197 10790651 10579401
45 10579401 10360539 10058716 9912237 9085197 8921854 8950469 8716443 9163147 8393756 8175377
$$ packed form
105B02943568L0294564K1402012J1986814N976585j1189583k7993352k9849901
98B03570707k6564038k0715025j7073423j4613066j1376311r666512q732837p497797
90H7331698p202046n375192m859852n120282m814511m026161l692760l641034
82D8599860l555399l133210k250697k353723j416254j999406j882610j893372
74C0115189j183298j623947r88529j078037q29447j053628o89195j095317j122305
65B0451486j08796j301946q85580r65668m06927q28988n51223J35837n09740o11994
55A4416461r61776m21067m55817n09624j61293o85555o3289o4843l02546k11250
45A0579401k18862l01823j46479q27040j63343K8615k34026M46704p69391k18379
$$ plain form
35 8175377 8071536 7817412 7718351 7141392 7028913 6490864 6463877 6840514 6242549 6107036
25 6107036 6309791 6147203 6072303 5838616 5788319 5621932 5865398 5997883 5684634 5577897
15 5577897 5050081 4806215 5325527 4761922 4484881 4240983 4364646 4530480 4600686 4205538
5 4205538 4492160 3987885 3867464 4501988 4258460
0 4258460
$$ packed form
35H175377j03841k54124r9061n76959j12479n38049k6987L76637n97965j35513
25F107036K02755j62588p4900k33687n0297j66387K43466J32485l13249j06737
15E577897n27816k43866N19312n63605k77041k43898J23663J65834P0206l95148
5D205538K86622n04275j20421O34524k43528
0D258460
$$ Imaginary data points
##PAGE= N=2
##DATA TABLE= (X++(I..I)), XYDATA
$$ plain form
16383 -33451679 -33295726 -33328155 -33056428 -32483188 -31718759 -31096624 -31358052 -31412966 -30615989 -29587353
16373 -29587353 -29447851 -29585520 -28523929 -27843052 -27929497 -27438225 -26875739 -26937949 -26915720 -26543804
16363 -26543804 -25415106 -25188534 -25080520 -24740135 -24399872 -23661471 -23814459 -23731902 -23147673
16354 -23147673 -22702692 -22035263 -21546478 -21597461 -22370964 -22353494 -21957509 -21419108 -20804357 -20397156
16344 -20397156 -19696587 -19553426 -19386560 -19334491 -19228708 -18816079 -18236242 -17955828 -17605745
16335 -17605745 -17380830 -17458340 -17194519 -16732135 -16267099 -15992087 -15740141 -15348962 -15833450
16326 -15833450 -15807616 -15820556 -14459530 -14438670 -14462957 -14768721 -14233787 -13635389 -13694276 -13056145
16316 -13056145 -12017029 -12380126 -13093926 -12435736 -11675188 -11472214 -11379071 -11003373 -11194039
$$ packed form
16383c3451679J55953l2429K71727N73240P64429O22135k61428n4914P96977J028636
16373b9587353J39502j37669J061591O80877q6445M91272N62486o2210K2229L71916
16363b6543804J128698K26572J08014L40385L40263P38401j52988Q2557N84229
16354b3147673M44981O67429M88785n0983p73503J7470L95985N38401O14751M07201
16344b0397156P00569J43161J66866N2069J05783M12629N79837K80414L50083
16335a7605745K24915p7510K63821M62384M65036K75012K51946L91179m84488
16326a5833450K5834j2940J361026K0860k4287l05764N34934N98398n8887O38131
16316a3056145J039116l63097p13800O58190P60548K02974R3143L75698j90666
$$ plain form
16307 -11194039 -11037355 -11042152 -9966864 -9711441 -9904676 -9566502 -9533712 -9260521 -9580223 -9766248
16297 -9766248 -9379039 -8280254 -7301852 -7179629 -7639371 -7435693 -7265359 -7165485 -7355435
16288 -7355435 -7060317 -6842460 -7236503 -6876740 -6354410 -6281394 -6093629 -5716876 -5271170 -5583607
16278 -5583607 -5094854 -4518305 -5141424 -5038484 -5084251 -4751854 -4178975 -3883120 -3777678 -3487237
16268 -3487237 -3573534 -3020090 -2628532 -2191203 -2616273 -2927647 -2556867 -2415816 -2096202 -1764731
16258 -1764731 -2093951 -2153390 -2058389 -2091262 -2411287 -1487118 -1276691 -886560 -607351 -1200379
16248 -1200379 -1245831 -390073 248810 461843 408459 297135 359399 603092 1024262 682963
16238 682963 572240 555713 310242 965641 1359711 1437835 2218541 2040822 1176145 1325584
$$ packed form
16307a1194039J56684m797J075288K55423j93235L38174L2790K73191l19702j86025
16297i766248L87209J098785R78402J22223m59742K03678J70334R9874j89950
16288g355435K95118K17857l94043L59763N22330P3016J87765L76753M45706l12437
16278e583607M88753N76549o23119J02940m5767L32397N72879K95855J05442K90441
16268c487237q6297N53444L91558M37329m25070l11374L70780J41051L19614L31471
16258a764731l29220n9439R5001l2873l20025R24169K10427L90131K79209n93028
16248a200379m5452Q55758O38883K13033n3384j11324O2264K43693M21170l41299
16238F82963j10723j6527k45471O55399L94070P8124P80706j77719q64677J49439
$$ plain form
16228 1325584 1589414 1836896 1909282 2180434 2233531 2596094 2436652 1777191 2563581 2755015
$$ packed form
16228A325584K63830K47482P2386K71152N3097L62563j59442o59461P86390J91434
$$ [...]
##END NTUPLES=NMR SPECTRUM
##END=
