##TITLE=1H_DE-80H_X3
 200.13MHz, d2o
 8 sc
 
 19ns.26.2.2025
##JCAMPDX= 6.0         $$ Bruker NMR JCAMP-DX V2.0
##DATA TYPE= NMR SPECTRUM
##DATA CLASS= NTUPLES
##ORIGIN= UXNMR, Bruker Analytische Messtechnik GmbH
##OWNER= pz
$$ XWIN-NMR		Version 3.5
$$ Tue Oct 21 10:29:06 2025 Russian Standard Time (UT+4h)  Yarkov@DPX200
##.OBSERVE FREQUENCY= 200.1313
##.OBSERVE NUCLEUS= ^1H
##.ACQUISITION MODE= SIMULTANEOUS
##.ACQUISITION SCHEME= undefined
##.AVERAGES= 8
##.DIGITISER RES= 18
##SPECTROMETER/DATA SYSTEM= spect
##.PULSE SEQUENCE= zg30
##.SOLVENT NAME= CDCl3
##.SHIFT REFERENCE= (INTERNAL, CDCl3, 0, 15.4836)
##AUDIT TRAIL= $$ (NUMBER, WHEN, WHO, WHERE, WHAT)
$$ ##TITLE= Audit trail, XWIN-NMR		Version 3.5
$$ ##JCAMPDX= 5.01
$$ ##ORIGIN= Bruker BioSpin GmbH
$$ ##OWNER= Yarkov
$$ C:/Bruker/XWIN-NMR/data/yarkov2/nmr/H-C/1/pdata/1/auditp.txt
$$ ##AUDIT TRAIL=  $$ (NUMBER, WHEN, WHO, WHERE, WHAT)
(   1,<2025-10-21 10:28:10.00 +0400>,<Yarkov>,<DPX200>,
      <created by zg, POWCHK disabled, PULCHK disabled
       configuration hash MD5:
       00 E9 B6 7A A2 85 ED C7 34 08 36 98 17 FE 4E 26
       data hash MD5: 16K
       AA E3 EC 46 B3 72 0C 89 5A 88 E4 AD 82 01 D6 B9>)
(   2,<2025-10-21 10:28:16.42 +0400>,<Yarkov>,<DPX200>,
      <Start of raw data processing
       efp BC_mod = 2 LB = 0.25 FT_mod = 6 PKNL = 1 PHC0 = -4079.816 PHC1 = 14.22191 SI = 16K 
       data hash MD5: 16K
       5F 78 D0 73 CA 4E 3D 5C 07 C4 A6 8F 2B A5 E1 C8>)
$$ ##END=
$$ 
$$ hash MD5
$$ 7F E1 1F E3 89 1E A1 C3 18 0D 25 B3 14 43 75 5F
##$RELAX= 
##$RELAX= 
##$RELAX= 
##$RELAX= 
##$RELAX= 
##$RELAX= 
$$ Bruker specific parameters
$$ --------------------------
##$DU= <C:/Bruker/XWIN-NMR>
##$EXPNO= 1
##$NAME= <H-C>
##$PROCNO= 1
##$TYPE= <nmr>
##$USER= <yarkov2>
##$AMP= (0..31)
100 100 100 100 100 100 100 100 100 100 100 100 100 100 100 100 100 100 
100 100 100 100 100 100 100 100 100 100 100 100 100 100 
##$AQSEQ= 0
##$AQ_mod= 1
##$AUNM= <au_zg>
##$AUTOPOS= <>
##$BF1= 200.13
##$BF2= 200.13
##$BF3= 200.13
##$BF4= 200.13
##$BF5= 200.13
##$BF6= 200.13
##$BF7= 200.13
##$BF8= 200.13
##$BYTORDA= 1
##$CFDGTYP= 0
##$CFRGTYP= 5
##$CHEMSTR= <none>
##$CNST= (0..31)
1 1 145 1 1 1 1 1 1 1 1 1 1 1 1 1 1 1 1 1 1 1 1 1 1 1 1 1 1 1 1 1 
##$CPDPRG= <>
##$CPDPRG1= <>
##$CPDPRG2= <>
##$CPDPRG3= <>
##$CPDPRG4= <mlev>
##$CPDPRG5= <mlev>
##$CPDPRG6= <mlev>
##$CPDPRG7= <mlev>
##$CPDPRG8= <mlev>
##$CPDPRGB= <>
##$CPDPRGT= <>
##$D= (0..31)
0 0.7 0 0 0 0 0 0 0 0 0 0.03 0 0 0 0 0 0 0 0 0 0 0 0 0 0 0 0 0 0 0 0 
##$DATE= 1761028089
##$DBL= (0..7)
120 120 120 120 120 120 120 120 
##$DBP= (0..7)
150 150 150 150 150 150 150 150 
##$DBP07= 0
##$DBPNAM0= <>
##$DBPNAM1= <>
##$DBPNAM2= <>
##$DBPNAM3= <>
##$DBPNAM4= <>
##$DBPNAM5= <>
##$DBPNAM6= <>
##$DBPNAM7= <>
##$DBPOAL= (0..7)
0.5 0.5 0.5 0.5 0.5 0.5 0.5 0.5 
##$DBPOFFS= (0..7)
0 0 0 0 0 0 0 0 
##$DE= 6
##$DECBNUC= <off>
##$DECIM= 32
##$DECNUC= <off>
##$DECSTAT= 4
##$DIGMOD= 1
##$DIGTYP= 9
##$DL= (0..7)
0 120 120 120 120 120 120 120 
##$DP= (0..7)
$$ [...]
##$SUBNAM2= <"">
##$SUBNAM3= <"">
##$SUBNAM4= <"">
##$SUBNAM5= <"">
##$SUBNAM6= <"">
##$SUBNAM7= <"">
##$SUBNAM8= <"">
##$SUBNAM9= <"">
##$SW= 18.0517328524113
##$SWIBOX= (0..15)
0 0 2 0 0 0 0 0 0 0 0 0 0 0 0 0 
##$SW_h= 3612.71676300578
##$TD= 16384
##$TD0= 1
##$TE= 0
##$TE2= 300
##$TE3= 300
##$TEG= 300
##$TL= (0..7)
0 120 120 120 120 120 120 120 
##$TP= (0..7)
150 150 150 150 150 150 150 150 
##$TP07= 0
##$TPNAME0= <>
##$TPNAME1= <>
##$TPNAME2= <>
##$TPNAME3= <>
##$TPNAME4= <>
##$TPNAME5= <>
##$TPNAME6= <>
##$TPNAME7= <>
##$TPOAL= (0..7)
0.5 0.5 0.5 0.5 0.5 0.5 0.5 0.5 
##$TPOFFS= (0..7)
0 0 0 0 0 0 0 0 
##$TUNHIN= 0
##$TUNHOUT= 0
##$TUNXOUT= 0
##$USERA1= <user>
##$USERA2= <user>
##$USERA3= <user>
##$USERA4= <user>
##$USERA5= <user>
##$V9= 5
##$VALIST= <valist>
##$VCLIST= <CCCCCCCCCCCCCCC>
##$VD= 0
##$VDLIST= <DDDDDDDDDDDDDDD>
##$VPLIST= <PPPPPPPPPPPPPPP>
##$VTLIST= <TTTTTTTTTTTTTTT>
##$WBST= 1024
##$WBSW= 4
##$XGAIN= (0..3)
0 0 0 0 
##$XL= 0
##$YL= 0
##$YMAX_a= 339814
##$YMIN_a= -444318
##$ZGOPTNS= <>
##$ZL1= 120
##$ZL2= 120
##$ZL3= 120
##$ZL4= 120
##$ABSF1= 0
##$ABSF2= 0
##$ABSG= 0
##$ABSL= 0
##$ALPHA= 0
##$AQORDER= 0
##$ASSFAC= 0
##$ASSFACI= 0
##$ASSFACX= 0
##$ASSWID= 0
##$AUNMP= <proc_1d>
##$AZFE= 0.1
##$AZFW= 0.1
##$BCFW= 0
##$BC_mod= 2
##$BYTORDP= 0
##$COROFFS= 0
##$CY= -3
##$DATMOD= 1
##$DC= 0
##$DFILT= <>
##$DTYPP= 0
##$F1P= 0
##$F2P= 0
##$FCOR= 1
##$FTSIZE= 16384
##$FT_mod= 6
##$GAMMA= 0
##$GB= 0
##$INTBC= 1
##$INTSCL= 3.241238e-09
##$ISEN= 128
##$LB= 0.25
##$LEV0= 0
##$LPBIN= 0
##$MAXI= 10000
##$MC2= 0
##$MEAN= 0
##$ME_mod= 0
##$MI= 1.114404
##$NCOEF= 0
##$NC_proc= -7
##$NLEV= 6
##$NOISF1= 3.799351
##$NOISF2= 2.8
##$NSP= 0
##$NTH_PI= 0
##$NZP= 0
##$OFFSET= 15.48356
##$PC= 1
##$PHC0= -4079.816
##$PHC1= 14.22191
##$PH_mod= 1
##$PKNL= yes
##$PPARMOD= 0
##$PSCAL= 0
##$PSIGN= 0
##$REVERSE= no
##$SF= 200.130007633875
##$SI= 16384
##$SIGF1= 3
##$SIGF2= 2
##$SINO= 0.751879
##$SIOLD= 32768
##$SREGLST= <19F.Aceton>
##$SSB= 0
##$STSI= 16384
##$STSR= 0
##$SW_p= 3612.71676300578
##$SYMM= 0
##$S_DEV= 0
##$TDeff= 16384
##$TDoff= 0
##$TI= <>
##$TILT= no
##$TM1= 0
##$TM2= 0
##$TOPLEV= 0
##$USERP1= <user>
##$USERP2= <user>
##$USERP3= <user>
##$USERP4= <user>
##$USERP5= <user>
##$WDW= 1
##$XDIM= 16384
##$YMAX_p= 511058074
##$YMIN_p= -1851593
$$ End of Bruker specific parameters
$$ ---------------------------------
##NTUPLES= NMR SPECTRUM
##VAR_NAME=  FREQUENCY,     SPECTRUM/REAL,   SPECTRUM/IMAG
##SYMBOL=    X,             R,               I
##VAR_TYPE=  INDEPENDENT,   DEPENDENT,       DEPENDENT
##VAR_FORM=  AFFN,          ASDF,            ASDF
##VAR_DIM=   16384,         16384,           16384
##UNITS=     HZ,            ARBITRARY UNITS, ARBITRARY UNITS
##FACTOR=    0.220516191357247, 1,           1
##FIRST=     3098.72490264055, 0,            0
##LAST=      -513.991860365227, 0,           0
##MIN=       -513.991860365227, -1851593,    0
##MAX=       3098.72490264055, 511058074,    0
$$ Real data points
##PAGE= N=1
##DATA TABLE= (X++(R..R)), XYDATA
$$ [...]
6466C650497J42711o1241q0643L1860p6880k12561k35084m02662K0589j18912
6456B657674P5345j27645k74157J13206j9990n4475n5098o9665r1160o2516q1608
6445B009911N6203m7704n6442P2967n036r1794P778J20360l5741k31976P287L14924
6433B120737r8669J0467j06842M46p3134j72938J44025J60177m549j91697M9242
6422A837265p3776P7653n190R7395l1295n8431k73579L2312J03676P8355Q3710
6411A868095j58251R5192R540m1242p7608k8718Q0405K18685J72691j36793j93577
6400A808419k12007J8098P3777j04915J63758r4494L6018J12221n2595j02202
6390A646078J56928j09650k1499J03385j13294J5749K55782R6740k181p7661O9314
$$ plain form
6466 3650497 3793208 3731967 3651324 3683184 3606304 3393743 3158659 2755997 2776586 2657674
6456 2657674 2733019 2605374 2331217 2444423 2424433 2369958 2314860 2245195 2154035 2091519 2009911
6445 2009911 2066114 2018410 1961968 2034935 2029899 1938105 1945883 2066243 2030502 1798526 1805813 2120737
6433 2120737 2022068 2032535 1925693 1926139 1853005 1680067 1824092 1984269 1979720 1788023 1837265
6422 1837265 1763489 1841142 1835952 1933347 1902052 1843621 1570042 1602354 1706030 1784385 1868095
6411 1868095 1709844 1805036 1814576 1773334 1695726 1667008 1747413 1966098 2138789 2001996 1808419
6400 1808419 1596412 1614510 1688287 1583372 1747130 1652636 1688654 1800875 1748280 1646078
6390 1646078 1803006 1693356 1671857 1775242 1661948 1677697 1933479 2030219 2028038 1950377 2019691
6379B019691l1596K8069j54312j38857K21643l094L0795J33831K8955l7620p801
6368B089704j52700j16802K4007Q9937K50957R211k84254P9877J35812j21648
6358B004101Q9219j6736j16162J42421J50377j6776l5585L4165p3189J06667J6021
6347B284523j04982q5865j00260q5237J28565L58194J93538j31024j21686P2264
6337B408030J14878l1297o6754J06613J27750j49948j42786l6045R4129j05995
6327B318575J45647J4621r2076J19515j53966K3830J18994q2411m3977K01550
6317B570302K3986l27230L2456J6971j03282J5381J8717K49188k3338k19179J1242
6306B265214N1570j44196j05614J1139P2314K6626J53379J14999r5711j39469
$$ plain form
6379 2019691 1988095 2016164 1861852 1722995 1944638 1941544 1972339 2106170 2135125 2097505 2089704
6368 2089704 1937004 1820202 1844209 1934146 2185103 2194314 1910060 1989937 2125749 2004101
6358 2004101 2093320 2076584 1960422 2102843 2253220 2236444 2200859 2235024 2161835 2268502 2284523
6347 2284523 2179541 2093676 1993416 1908179 2036744 2394938 2588476 2457452 2335766 2408030
6337 2408030 2522908 2491611 2424857 2531470 2659220 2509272 2366486 2330441 2424570 2318575
6327 2318575 2464222 2478843 2386767 2506282 2352316 2376146 2495140 2412729 2368752 2570302
6317 2570302 2594288 2267058 2299514 2316485 2213203 2228584 2247301 2496489 2473151 2253972 2265214
6306 2265214 2316784 2172588 2066974 2078113 2150427 2177053 2330432 2445431 2349720 2210251
6296B210251J39784j14356J0533K41247j59728k77714L31881J00238J94979j36347
6286B540768o6561K18852L8757r7236j74366O7275o8347O1378J12518J21153J39275
6275B893466R329K01075L7355k13478J39029J07955J65270Q6650o802j52450n0197
6264C217202k06638q7760K0964J30306k2717J06233q8598k02887L3448J15663
6254C015216j75096M3310K6987J16498R3311p1288j49635k3350m7912J46905J68642
6243C143588k44072k13574J68977k40466M3827K31178k9502Q9434p5892L3494
6233B906992k47624K00807R0805O1445K45222k66355r2344N9298J20832Q5648
6223C164726j68169j3645j46827o38L1301R1060J7833J65683k81271L2556K26756
$$ plain form
6296 2210251 2350035 2235679 2246212 2487459 2327731 2050017 2381898 2482136 2677115 2540768
6286 2540768 2474207 2693059 2731816 2634580 2460214 2527489 2459142 2520520 2633038 2754191 2893466
6275 2893466 2902795 3103870 3141225 2927747 3066776 3174731 3340001 3426651 3419849 3267399 3217202
6264 3217202 3010564 2922804 2943768 3074074 3051357 3157590 3068992 2866105 2899553 3015216
6254 3015216 2840120 2883430 2910417 3026915 3120226 3048938 2899303 2875953 2828041 2974946 3143588
6243 3143588 2899516 2685942 2854919 2614453 2658280 2889458 2859956 2949390 2873498 2906992
6233 2906992 2659368 2860175 2950980 3012425 3257647 2991292 2898948 2958246 3079078 3164726
6223 3164726 2996557 2982912 2836085 2835447 2866748 2957808 2975641 3141324 2860053 2892609 3119365
6212C119365K39204J88830j12951J06013n9600R083J60491J93173P4964k5480
6202C893092J33327j19175J1612N1581j41824J39804K81340J48668J47006P581
6192D553012j68447l7105Q000M7621m1420K88646o6152k4593J39297n6538J6322
6181D658643L658M9183n6325o0747N4406J12428O0275l2467o1852J22082J15872
6170D965156J07038Q8785J04880k12132J17025J64311J05885j67881l7023J00896
6160E336940o1867J07082N1693J49282j15468J01214J23421R6936k7798j27975
6150E633460j28058j6444j2491N7833r5425p6811R7083j23313q4561O3439j1747
6139E302965J13067O1894j801Q3246o2253J32180j47115p711J42687n3702l2030
$$ plain form
6212 3119365 3358569 3547399 3434448 3540461 3480861 3489944 3650435 3843608 3918572 3893092
6202 3893092 4026419 3907244 3918856 3970437 3828613 3968417 4249757 4398425 4545431 4553012
6192 4553012 4384565 4347460 4355460 4403081 4361661 4650307 4584155 4559562 4698859 4642321 4658643
6181 4658643 4662301 4711484 4655159 4594412 4648818 4761246 4821521 4789054 4727202 4849284 4965156
6170 4965156 5072194 5160979 5265859 5053727 5170752 5335063 5440948 5273067 5236044 5336940
6160 5336940 5275073 5382155 5433848 5583130 5467662 5568876 5692297 5789233 5761435 5633460
6150 5633460 5505402 5488958 5476467 5534300 5438875 5362064 5459147 5335834 5251273 5314712 5302965
6139 5302965 5416032 5477926 5476125 5559371 5497118 5629298 5482183 5474472 5617159 5563457 5531427
6128E531427J03021K4847K00017J40837N4300J27823R1081j54425l03L79852r9489
6117F398988p5770P995M28676K38673k23989J03369K87719K65841k6420K40744
6107G645826J37041K56486L25585L4525P6412K54920M46990L12207K16611J0944
6097I717547P1154O70645L79258M5579K46363O02411N59184N47710J83970K79939
6087A3303760N63838M97935N77757O30024P57074N67794P10164Q98174P86924
6078A9293444J002944J363645J297682J283433J261886J556097J533190K136548
6070C0728869K099838K387943K994607L316242L682374L710241M019850L765279
6062E6705243L620127K857438J704165M42398p89030j415534k063383j944967
$$ plain form
6128 5531427 5634448 5659295 5859312 6000149 6054449 6182272 6273353 6118928 6118625 6498477 6398988
6117 6398988 6323218 6331213 6759889 6998562 6774573 6877942 7165661 7431502 7405082 7645826
6107 7645826 7782867 8039353 8364938 8399463 8475875 8730795 9177785 9489992 9706603 9717547
6097 9717547 9788701 10459346 10838604 10884183 11130546 11732957 12292141 12839851 13023821 13303760
6087 13303760 13867598 14365533 14943290 15573314 16330388 16898182 17608346 18506520 19293444
6078 19293444 20296388 21660033 22957715 24241148 25503034 27059131 28592321 30728869
6070 30728869 32828707 35216650 38211257 41527499 45209873 48920114 52939964 56705243
6062 56705243 60325370 63182808 64886973 65329371 64540341 63124807 61061424 59116457
6054E9116457j899579j583666j555864j037736r80430l94899j72066J27141L77930
6045E1997288O88084R55838R47012J615507J936073K345480K489947K959938L823319
6036F9758486M641976N410402O393858O632571O826144O787771N708440M342343
6028A16501991K610385l14322k737236m545056n558974o176658o184175n952615
6020H7643340n136852m469922l759180l675262l136125k538933k306155j989735
6012F0631176j811803j407670j331256p26710n57833k1454M01044Q44451J254470
6003E7274415J803438K299029K488741K629578K657385K131582J619794N59325
5995G3463287o29069k159736l145835l875811l988411l925356l986850l493998
$$ plain form
6054 59116457 57216878 55633212 54077348 53039612 52059182 51664283 51492217 51619358 51997288
6045 51997288 52685372 53641210 54588222 56203729 58139802 60485282 62975229 65935167 69758486
6036 69758486 74400462 79810864 86204722 92837293 99663437 106451208 112159648 116501991
6028 116501991 119112376 118798054 116060818 111515762 105956788 99780130 93595955 87643340
6020 87643340 82506488 78036566 74277386 70602124 67465999 64927066 62620911 60631176
6012 60631176 58819373 57411703 56080447 55353737 54795904 54774450 55175494 56019945 57274415
6003 57274415 59077853 61376882 63865623 66495201 69152586 71284168 72903962 73463287
5995 73463287 72834218 70674482 67528647 63652836 59664425 55739069 51752219 48258221
5987D8258221k849568k760650k815168k321775k115486j875407j811787j713635
5979B9994745j513294j175658j173007j012286r53677p10108n54854p70032o47772
5970B1484057q56197p83353l62358q96998r18275o35774o45354n74179n93862
5961A5217707n86300k14541n84703m10723l85001k17011m23848l81477k99016
5952A1715087l11483k87958r5735j20791l40254j0699k3827j00350j90697k65788
5942I967505k24171R460k29350j21437j57138k21265J48637K94m07575j19875
5932H645085l5831P6062Q6140m8711j42309k57400j10375j60156J58487K2744
5922H233736k32958j39003p4649J47277r63Q4780R3901j7872L9732J40405q2014
$$ plain form
5987 48258221 45408653 42648003 39832835 37511060 35395574 33520167 31708380 29994745
5979 29994745 28481451 27305793 26132786 25120500 24166823 23456715 22901861 22131829 21484057
5970 21484057 20627860 19844507 19482149 18585151 17666876 17031102 16385748 15811569 15217707
5961 15217707 14631407 14416866 13832163 13421440 13036439 12819428 12395580 12014103 11715087
5952 11715087 11403604 11115646 11019911 10899120 10558866 10548167 10524340 10423990 10233293 9967505
5942 9967505 9743334 9752794 9523444 9402007 9244869 9023604 9172241 9172535 8764960 8645085
5932 8645085 8609254 8685316 8771456 8722745 8580436 8323036 8212661 8052505 8210992 8233736
5922 8233736 8000778 7861775 7787126 7934403 7933440 8018220 8112121 8094249 8133981 8274386 8192372
5911H192372n9179m6441k01660j09979r2259j68173r4161J71367j73506l23429
5901G094952r6465L7651j71442m0325j60625k22159o1160J55528j4722j06634
5891F414599j16385q2683J28378o2968k81965K222J75075m8911N0621j64544n1133
5880E962306K31818O5647J06913k3795k61665J59073n0009j95090N8793l8040
5870F015951N1998J6563p4311k20154k78178J31651P0157j45554l13325R3805
5860E348603N0221K9882k29811n1783J93376N8768j35078j48028p0205r3516m0542
5849D911887J281p2072j45498k3482N4838O9544J6586r8902j31461j0814O4704
5838D636611J04902J1591p6502L9268k04560Q274j38198P9841r3971P0715o1519
$$ plain form
5911 8192372 8133193 8086752 7885092 7775113 7682854 7514681 7420520 7591887 7418381 7094952
5901 7094952 6998487 7036138 6864696 6824371 6663746 6441587 6380427 6535955 6521233 6414599
5891 6414599 6298214 6215531 6343909 6280941 5998976 6001198 6176273 6127362 6177983 6013439 5962306
5880 5962306 6194124 6259771 6366684 6342889 6081224 6240297 6190288 5995198 6053991 6015951
5870 6015951 6067949 6084512 6010201 5790047 5511869 5643520 5713677 5568123 5254798 5348603
5860 5348603 5398824 5428706 5198895 5147112 5340488 5399256 5264178 5116150 5045945 4952429 4911887
5849 4911887 4913168 4841096 4695598 4672116 4726954 4796498 4813084 4714182 4582721 4571907 4636611
5838 4636611 4741513 4753104 4676602 4715870 4511310 4519584 4381386 4461227 4367256 4437971 4376452
5827D376452k87633J46549J81037J78464p6199r9046k66424n9435K03363J49916
5817D447044j39465j57625j26273J81509N6131p0612l79867L6130J06230K93733
5807D246935k5148k24799J51195m7252q0874k6894o0778q3107o3344j15825L02519
5796C972628K21091o2943l13092r277K06996k08280J13183J01696j13941M5780
5786C953841R1043j65507R7754n3937J52115O5217k63462k7876j2204R8281k28698
5775C706567J21579J95823O0580m661K79464o9211q0522R798p6045n6547P9325
5764D166150J66634j40381j03137J36091M3199j36271m4431m9J17098J17889K5781
5753D348573n6806M26204j7335L6704J5198N516L2989k5931O9150j03325R8795
$$ plain form
5827 4376452 4088819 4235368 4416405 4594869 4518670 4419624 4153200 4093765 4297128 4447044
5817 4447044 4307579 4149954 4023681 4205190 4261321 4190709 3810842 3846972 3953202 4246935
5807 4246935 4221787 3996988 4148183 4100931 4020057 3993163 3932385 3849278 3785934 3670109 3972628
5796 3972628 4193719 4130776 3817684 3808407 4015403 3807123 3920306 4022002 3908061 3953841
5786 3953841 4044884 3879377 3977131 3923194 4075309 4140526 3877064 3849188 3836984 3935265 3706567
5775 3706567 3828146 4023969 4084549 4079888 4359352 4290141 4209619 4219417 4143372 4086825 4166150
5764 4166150 4332784 4192403 4089266 4225357 4268556 4132285 4087854 4087805 4204903 4322792 4348573
5753 4348573 4291767 4717971 4700636 4737340 4752538 4758054 4791043 4765112 4834262 4730937 4829732
5742D829732K18352j89118K2878O9106Q1490j81357J09798J76919k27351J50100
5732E060549J41935o5018j1780P2019o2616P6158J90184J61974L68145j11646
5722E819904o8742L19713O5881L3870J68006O5087J50042J80062o8223j10897
5712F554703J09209K22818K34974K99382l5926J1921J52359J45652k09588r9505
5702G385999j01216O8689K97309P79q2193N1974J5814n9864J28091J83206O3420
5691G952008p164J98K45965K53464J21489J28517L02512M75343M3920K67103N16884
5680A0300239K90928N19290L96265O79625O95073L65532J06506L61954p4022l42092
5670A3299298l32388j91050n1420J43863J28185k9929K06816K03156J26717L65035
$$ plain form
5742 4829732 5048084 4858966 4881844 4950950 5032440 4851083 4960881 5137800 4910449 5060549
5732 5060549 5202484 5137466 5125686 5197705 5135089 5211247 5401431 5563405 5931550 5819904
5722 5819904 5751162 6070875 6136756 6170626 6338632 6403719 6553761 6733823 6665600 6554703
5712 6554703 6663912 6886730 7121704 7421086 7385160 7397081 7549440 7695092 7485504 7385999
5702 7385999 7284783 7353472 7650781 7651560 7569367 7621341 7637155 7577291 7705382 7888588 7952008
5691 7952008 7944844 7945042 8191007 8444471 8565960 8694477 8996989 9472332 9516252 9783355 10300239
5680 10300239 10591167 11110457 11506722 12186347 12881420 13246952 13353458 13715412 13641390 13299298
5670 13299298 12966910 12775860 12724440 12868303 12996488 12966559 13173375 13376531 13503248 13868283
5660A3868283J28590M40230L21939L34291M02222L75123M54952M44755N52895
5651A7323280M72920P25479O28804P61713J193704J001486R89090J239763J045212
5642B5381451J119898Q38884O29890Q48851J031655R97662J442863J468441J757690
5633C5517285J747459K248493K479426K678714L247360L385307L691278M231402
5625E9226724M778723N480220O468154O910411P890069Q646050R219226J0037878
5617A18657455J0510042J0814494J0785164J0428741R760003Q299876O851884
5610A86107659N128970K561190k85099k961736m976454o692370p408138p780562
5602A63693460q324768q488573q764905q997262q828286q260916p681631p041922
$$ plain form
5660 13868283 13996873 14437103 14759042 15093333 15495555 15870678 16325630 16770385 17323280
5651 17323280 17796200 18521679 19150483 19912196 21105900 22107386 23096476 24336239 25381451
5642 25381451 26501349 27340233 27970123 28818974 29850629 30848291 32291154 33759595 35517285
5633 35517285 37264744 39513237 41992663 44671377 47918737 51304044 54995322 59226724
5625 59226724 64005447 69485667 75953821 82864232 90754301 99400351 108619577 118657455
5617 118657455 129167497 139981991 150767155 161195896 170955899 179255775 186107659
5610 186107659 191236629 193797819 193512720 190550984 185574530 178882160 171474022 163693460
5602 163693460 155368692 146880119 138115214 129117952 120289666 112028750 104347119 97305197
5594I7305197o530419o071843n380707m911972m282607l849091l747892l392767
5586E9137899l269427k928422k446494k611757k331390k071433j910897j940835
5578C9627244j776379k001064j612600j599321j763893j241531j215489j332260
5570B7084707j259284j209221r79705j061152q55565p00062j006260r26156q35751
5561A8251551n45122o71770n27335n68958m76949l49127n04283m27232l51895
5552A3828880m49579n43279m88753k19104j67668p7950k69798k54698l84030k52848
5542A0721173j12957k97330k9899k85208l60384j8005k41431k45383l7559l80606
5532H712411N9430k31125o7655k56067k19038l1766k17711j24673N7128l4517
$$ plain form
5594 97305197 90774778 84702935 79322228 74410256 70127649 66278558 62530666 59137899
5586 59137899 55868472 52940050 50493556 47881799 45550409 43478976 41568079 39627244
5578 39627244 37850865 35849801 34237201 32637880 30873987 29632456 28416967 27084707
5570 27084707 25825423 24616202 23636497 22575345 21719780 21019718 20013458 19087302 18251551
5561 18251551 17706429 17034659 16507324 15938366 15461417 15112290 14608007 14180775 13828880
5552 13828880 13379301 12836022 12347269 12128165 11960497 11882547 11612749 11358051 10974021 10721173
5542 10721173 10608216 10310886 10280987 9995779 9635395 9617390 9375959 9130576 9093017 8712411
5532 8712411 8771841 8540716 8473061 8216994 7997956 7966190 7748479 7623806 7680934 7646417
5522G646417k42239j27578j79542L5111n1921M8648k04438j55631j44649k20221
5512F403957j47124m5868j05630j42653K1011o5187r0609l5283j58916J6209L3432
5501E683339L3267k38549P0279J54975q0991n0948j22266j57904j19430J14435
5491E286207Q9409K9856j34840q3594M1721m7772j33456Q0974N0350k31127r9081
5480D848647M9973L4227j22623j05841k7511k0833K6873m6032r6127R770r7341
5469D453182M0639q170J38824k35653j90310Q2707j9347J19828J6123q9729l2174
5458D275920o7783O5929K5910j87745j302m6387n4940N2155K41066K4035j99219
5447D127639n9055L9634q2530M0526q7141J41870l5287J27756K87608l07759k5041
$$ plain form
5522 7646417 7404178 7276600 7097058 7132169 7080248 7128896 6924458 6768827 6624178 6403957
5512 6403957 6256833 6210965 6105335 5962682 5983693 5918506 5827897 5792614 5633698 5649907 5683339
5501 5683339 5716606 5478057 5548336 5703311 5622320 5571372 5449106 5291202 5171772 5286207
5491 5286207 5375616 5405472 5270632 5187038 5228759 5180987 5047531 5128505 5178855 4947728 4848647
5480 4848647 4898620 4932847 4810224 4704383 4676872 4656039 4682912 4636880 4540753 4550523 4453182
5469 4453182 4493821 4485651 4624475 4388822 4198512 4281219 4261872 4381700 4397823 4308094 4275920
5458 4275920 4208137 4274066 4299976 4112231 4110929 4064542 4009602 4061757 4302823 4326858 4127639
5447 4127639 4068584 4108218 4025688 4066214 3979073 4120943 4085656 4213412 4501020 4193261 4168220
5436D168220J84696J11290K1752J49798K27381K01526J00107K44291L27212K03166
5426E939439l7750k04951j48701l26664l99443o2145R8249k37204l59133K8660
5416D290357j98564l7733M9619l17943p3387J29228j10724j12738P9277l3704
5406C663688j08043n1311j02436j24888Q4181J49995q9077j39651O982k13083
5396C076357R3847Q1586J62716j94089r8844j27547m4150J05417q804m530L0947
5385C072906M4581j01270L756N6500m104r9257j2294M5582M7441K1382j48370
5374B926853o9932l1179L0298P3229p1825l8237p0346L5536q5229k9380M5384
5363B715172J55572O0549k43440L9374o4250N9482j2783k19952O0975O0678N0317
$$ plain form
5436 4168220 4352916 4464206 4485958 4635756 4863137 5064663 5164770 5409061 5736273 5939439
5426 5939439 5901689 5696738 5548037 5221373 4821930 4759785 4858034 4620830 4261697 4290357
5416 4290357 4091793 4054060 4103679 3785736 3712349 3841577 3730853 3618115 3697392 3663688
5406 3663688 3555645 3504334 3401898 3277010 3361191 3511186 3422109 3282458 3289440 3076357
5396 3076357 3170204 3251790 3414506 3220417 3121573 2994026 2949876 3055293 3046489 3041959 3072906
5385 3072906 3117487 3016217 3019973 3076473 3072369 2973112 2960818 3006400 3053841 3075223 2926853
5374 2926853 2856921 2825742 2856040 2929269 2857444 2819207 2748861 2784397 2699168 2669788 2715172
5363 2715172 2870744 2931293 2687853 2727227 2662977 2722459 2709676 2489724 2550699 2611377 2661694
5352B661694K86715L0248j82577J09648J29410r269k38023l4354j31171J79433
5342B801754K5564o6562n300R3228k9888Q9672j7772o5538n1588P7128K92269
5331C142967r1885j08558N1990k0167p5515N4883N0698J52177l8426j7983J07809
5320C207990J28832m0745p1783r670M1430R3488J56975L1237Q7984N8225Q2449
5309C766412O6510l0294J21185M7617j04448o9103p3852J34650j22478q777O2156
5298C789578P9458m7388j5558J05936j3650j05509j1375o220j69018o0271l5464
5287C510519O9470R2880j582n6719l05990J62006J93110J8999P2933r7678n7918
5276C600030Q5284j7934K077j04278k8885M6418J35446J0589J14413Q8382m4638
$$ plain form
5352 2661694 2948409 2978657 2796080 2905728 3035138 3025869 2787846 2753492 2622321 2801754
5342 2801754 2827318 2760756 2755456 2848684 2818796 2908468 2890696 2825158 2773570 2850698 3142967
5331 3142967 3051082 2942524 2994514 2974347 2898832 2953715 3004413 3156590 3118164 3100181 3207990
5320 3207990 3336822 3296077 3224294 3214624 3256054 3349542 3506517 3537754 3625738 3683963 3766412
5309 3766412 3832922 3802628 3923813 3971430 3866982 3797879 3724027 3858677 3736199 3727422 3789578
5298 3789578 3869036 3821648 3806090 3912026 3898376 3792867 3781492 3775272 3606254 3545983 3510519
5287 3510519 3579989 3672869 3671287 3614568 3308578 3470584 3663694 3682693 3755626 3657948 3600030
5276 3600030 3685314 3667380 3669457 3565179 3536294 3582712 3718158 3728747 3843160 3931542 3886904
5265C886904J08174P8420K49729j16676J46927K13322n558k45010L18305j14235
5255D520302Q2484J92250P4639K00484J03375j1031L83687J85840J6885J81895
5245E930810O6703o6200K45075N1449j43457p0889k87842k00484k6408R0633k07333
5234E382057q6645J40869j34561o3591M0274j85479o6807q9159k53344M7438K39930
5223D970982J41621J67132p2896k25127J03553K0271n220j02447K6776J59867
5213E184512n9424j2182J36745J26318L916j47210N9722J97586K08454P4501p5604
5202E697334j30506P3307J69959K0574J92236J28230J80751K66894p2810j03324
5192F422645K0015k11886J09381r3903k17186j84730j01363k03527j17213j64887
$$ plain form
5265 3886904 3995078 4073498 4323227 4206551 4353478 4566800 4561242 4316232 4634537 4520302
5255 4520302 4602786 4795036 4869675 5070159 5173534 5162503 5546190 5732030 5748915 5930810
5245 5930810 5997513 5931313 6176388 6227837 6084380 6013491 5725649 5525165 5498757 5589390 5382057
5234 5382057 5295412 5436281 5301720 5238129 5278403 5092924 5026117 4936958 4683614 4731052 4970982
5223 4970982 5112603 5279735 5206839 4981712 5085265 5105536 5100316 4997869 5024645 5184512
5213 5184512 5125088 5112906 5249651 5375969 5379885 5232675 5292397 5489983 5698437 5772938 5697334
5202 5697334 5566828 5640135 5810094 5830668 6022904 6151134 6331885 6598779 6525969 6422645
5192 6422645 6442660 6230774 6340155 6246252 6029066 5844336 5742973 5539446 5422233 5257346
5182E257346J71964Q1763J5304j33423o293M1280q3252K4467n366k65087K14029
5171E312732J36807O3116j83845k6022N6117n8364j137J37325r2028N3762J04538
5160E503001j80726J03705Q9538R1861J51076J01922m7533l9086O0651K49779
5150F084188O9906j45197r1484j7953L3914L9741l7074j48250n766J30184L9361
5139E951570M8283N9183M5804P8497n2721l9041L17715j92095n5354Q5736R0056
5128F337633p8654m4288K45141j28234O4362J80773k9863O6419j12845N7691K27000
5117F785135J66229N8576J07979J3649M9684j1105J09519j60084r8476j66877
5107F854229J81025M0285p5379J18911N2833J14590J55899k5191j12812K18021
$$ plain form
5182 5257346 5429310 5511073 5526377 5392954 5386661 5427941 5344689 5369156 5363790 5098703 5312732
5171 5312732 5449539 5512655 5328810 5302788 5358905 5300541 5299404 5436729 5344701 5398463 5503001
5160 5503001 5322275 5425980 5515518 5607379 5758455 5860377 5812844 5773758 5834409 6084188
5150 6084188 6154094 6008897 5917413 5899460 5933374 5973115 5936041 5787791 5782025 5912209 5951570
5139 5951570 5999853 6059036 6104840 6183337 6130616 6091575 6409290 6217195 6161841 6247577 6337633
5128 6337633 6258979 6214691 6459832 6331598 6395960 6576733 6546870 6613289 6500444 6558135 6785135
5117 6785135 6951364 7009940 7117919 7131568 7181252 7170147 7279666 7119582 7021106 6854229
5107 6854229 7035254 7075539 7000160 7119071 7171904 7286494 7442393 7417202 7304390 7522411
5097G522411M0653m2503J30218j14755K16232J90646K01785j67837j19832J44255
5087H001273p7464p2720j56743J66699K42788J19302j33190Q9688O3719P5756
5077H319108O7712j38306K6333L08891j24047O3668J87593Q5594J65532j09209
5067H852869j97457P4713K00550J34570q899J07772k10782J58123K9293n8849
5057I081903J17468K30948q937J25976J33972M0089Q5052J92152K62179J49439
5047A0410241R6563J60368K05922J28934p6894Q4082P1160R8241K00458J80190
5037A1559265K90091L25318Q8167K2726L56512J66627L74981L17045L50427J44118
5027A3995277L76860L76060M67474J88667M67560L87511M14061L29829M14736
$$ plain form
5097 7522411 7563064 7520561 7650779 7536024 7752256 7942902 8144687 7976850 7857018 8001273
5087 8001273 7923809 7851089 7694346 7861045 8103833 8223135 8089945 8179633 8243352 8319108
5077 8319108 8386820 8248514 8274847 8583738 8459691 8523359 8710952 8796546 8962078 8852869
5067 8852869 8655412 8730125 8930675 9065245 9056346 9164118 8953336 9111459 9140752 9081903
5057 9081903 9199371 9430319 9421382 9547358 9681330 9721419 9806471 9998623 10260802 10410241
5047 10410241 10506804 10667172 10873094 11002028 10925134 11009216 11080376 11178617 11379075 11559265
5037 11559265 11849356 12174674 12262841 12285567 12642079 12808706 13183687 13500732 13851159 13995277
5027 13995277 14372137 14748197 15215671 15404338 15871898 16259409 16673470 17003299 17418035
5018A7418035M92276O27657L44824O10486L65649L41658P23363O61657P35676
5009B2321281O57167O44185J127231R39573R47628J086772R55233J320420J334091
5000C1333581J267731J372103J635068J929641K032110J934198K233095K366086
4992D6103613K711104K999943L171774L630714L775998M077778M570443M781387
4984G5822754M998859M842619M775827M044415L354844K379893J422620M86482
4976A02128313Q4393n34779l15508l76987j01286m1745R7699L85623P64776J076360
4966A03166859J343611J670411K127931K578198L044537L645961M223331M801004
4958A26601843N650824O641064P670124Q484099R166801R783876J0004373J0042702
$$ plain form
5018 17418035 17910311 18537968 18882792 19493278 19858927 20200585 20923948 21585605 22321281
5009 22321281 22978448 23622633 24749864 25689437 26637065 27723837 28679070 29999490 31333581
5000 31333581 32601312 33973415 35608483 37538124 39570234 41504432 43737527 46103613
4992 46103613 48814717 51814660 54986434 58617148 62393146 66470924 71041367 75822754
4984 75822754 80821613 85664232 90440059 94484474 97839318 100219211 101641831 102128313
4976 102128313 102212706 101677927 101362419 100985432 100884146 100842401 100940100 101325723 102090499 103166859
4966 103166859 104510470 106180881 108308812 110887010 113931547 117577508 121800839 126601843
4958 126601843 132252667 138893731 146563855 155047954 164214755 173998631 184003004 194045706
4950A94045706R589591Q505781O738250M728193K362050J18940j713407k800376
4942B21574728k930727k546722k043121j254885m37666K2159O32601J003721J296979
4933B15317067J623963J847667J837108J667867J890871J571751J493917J783534
4925B29033745K097023K684560L467707L746557L862653L884628L552409K548601
4917B54877883J242274j016297l514284n817405p601849r437938r786096r830744
4909B09115544q812611p323454o042568m490916l282280k270991j387330j065885
4901A74439509j506102k116918l657208n295344o894375q008163q107462p609442
4893A31244495p320880o273673n471073m941693m476177m066440l356505l346260
$$ plain form
4950 194045706 203635297 212141078 218879328 223607521 225969571 226088511 224375104 221574728
4942 221574728 218644001 216097279 214054158 212799273 212361607 212383766 213016367 214020088 215317067
4933 215317067 216941030 218788697 220625805 222293672 224184543 225756294 227250211 229033745
4925 229033745 231130768 233815328 237283035 241029592 244892245 248776873 252329282 254877883
4917 254877883 256120157 255103860 251589576 245772171 238170322 228732384 218946288 209115544
4909 209115544 200302933 192979479 186936911 182445995 179163715 176892724 175505394 174439509
4901 174439509 172933407 170816489 167159281 161863937 154969562 146961399 138853937 131244495
4893 131244495 123923615 117649942 112178869 107237176 102760999 98694559 95338054 91991794
4885I1991794k704833k148676k086540j524153j840107j313471j156209j372362
4877G7845443j106251j370167j775660k147013j963753k093189j917828j625046
4869F3846536j622332j416006j179702j033803p01401p91272q99336p24559p45844
4860E4732281p13603r14156r44301j111880r29185j039213r65912j035479r61844
4851D6116708j105707j110338j237876j308052j173787j270923j379575j096581
4843C6433869j050456j203326q89793r30304j051616o54953q83886r52830q03462
4834B8013243o89091p42498q97608o25492l79666m54877m34864k60517o21164
4825B2907466k89902l31768m39392l85686k69607m63553k60950l78532m61604
$$ plain form
4885 91991794 89286961 87138285 85051745 83527592 81687485 80374014 79217805 77845443
4877 77845443 76739192 75369025 73593365 71446352 69482599 67389410 65471582 63846536
4869 63846536 62224204 60808198 59628496 58594693 57893292 57102020 56202684 55478125 54732281
4860 54732281 54018678 53104522 52160221 51048341 50119156 49079943 48114031 47078552 46116708
4851 46116708 45011001 43900663 42662787 41354735 40180948 38910025 37530450 36433869
4843 36433869 35383413 34180087 33290294 32359990 31308374 30653421 29769535 28816705 28013243
4834 28013243 27324152 26581654 25684046 25058554 24678888 24224011 23789147 23528630 22907466
4825 22907466 22617564 22285796 21846404 21460718 21191111 20727558 20466608 20088076 19626472
4816A9626472q2614j36189j43352l42255k45156L4305k13895k34902j62583l5577
4806A8064254k36960j37366j19139j05661o1278q4642j74300j44172k11350m7573
4796A6741813j1341M0350J22069j08459k92021J1749J34622R7349o2671N3863
4786A6727323M7883n0070O6290P0254q4758j49835j69939J2360Q6650J93276M0401
4775A6789835j59931l7130K9062J30869r0223k02453j08782Q715j4710J5652m259
4764A6356645k2369J42980r504J36652M3278j31224q9752N5457p191j0620K2004
4753A6486356O0727J73144n9269m7591R3330j73138K1732R9416k28695M5235j23955
4742A6347292J40044k68837j53146J41344J1838J2786j45213k0937K24000J38141
$$ plain form
4816 19626472 19543858 19407669 19264317 18922062 18676906 18711211 18497316 18262414 18099831 18064254
4806 18064254 17827294 17689928 17570789 17465128 17403850 17319208 17144908 17000736 16789386 16741813
4796 16741813 16730472 16770822 16892891 16784432 16492411 16504160 16638782 16736131 16673460 16727323
4786 16727323 16775206 16725136 16791426 16861680 16776922 16627087 16457148 16469508 16556158 16749434 16789835
4775 16789835 16629904 16592774 16621836 16752705 16662482 16460029 16351247 16359962 16345252 16360904 16356645
4764 16356645 16334276 16477256 16467752 16604404 16647682 16516458 16426706 16482163 16474972 16464352 16486356
4753 16486356 16547083 16720227 16660958 16613367 16706697 16533559 16555291 16654707 16426012 16471247 16347292
4742 16347292 16487336 16218499 16065353 16206697 16218535 16231321 16086108 16065171 16289171 16427312
4732A6427312K81872l1039k2217J02616J04701R7148J79754K54995K7779N6236
4722A7479157K0468K52539L88497q0528L48308L73418K02242j86876K72489K25346
4712A9295060K54049J78936L17477P0167K58901M19335L08680M22782N61301O86058
4702B2772746L39654N02506N22132N93308M94181O04292O45898N70357M73449
4693B7518523O78504P18202N03581P21173P97431P26249R65607J016024J028041
4684C4673335J112733R19063J196147J577811J622877J696095J986789K297825
4676D7082675K455995K696295K608690K914377L315661L720646M277486M758861
4668G3830686N187025N905685O400274O991181P585289Q502495R501240J0821379
$$ plain form
4732 16427312 16709184 16678145 16655928 16758544 16863245 16960393 17140147 17395142 17422921 17479157
4722 17479157 17499625 17752164 18140661 18060133 18408441 18781859 18984101 18797225 19069714 19295060
4712 19295060 19549109 19728045 20045522 20115689 20374590 20793925 21102605 21525387 22086688 22772746
4702 22772746 23112400 23614906 24137038 24730346 25224527 25828819 26474717 27045074 27518523
4693 27518523 28197027 28915229 29418810 30139983 30937414 31663663 32629270 33645294 34673335
4684 34673335 35786068 36705131 37901278 39479089 41101966 42798061 44784850 47082675
4676 47082675 49538670 52234965 54843655 57758032 61073693 64794339 69071825 73830686
4668 73830686 79017711 84923396 91323670 98314851 105900140 114402635 123903875 134725254
4660A34725254J2630736J4892900J7780720K1663732K5232582K8099269K9178744
4653B84203937K8391217K5529306J9300226R469879k791955j5153925k3548523
4646C25400162k6382462k5527155k2897008j9734398j7124270j5183871j3226401
4639A85324597j1591810j0907448j0287361r511802q502268p661239p101930p017206
4631A12743533o677081o440626n978923n380960n296932m813363m330004l851557
4623F9974087l385795l119786k940103k773760k485271k528743k273584j936613
4615D8530432j988295j856353j900393j775086j889724j510198j461109j516264
4607C4633010j495391j231561j083013j221440r33804q73626q61872p56954q21657
$$ plain form
4660 134725254 147355990 162248890 180029610 201693342 226925924 255025193 284203937
4653 284203937 312595154 338124460 357424686 366894565 364102610 348948685 325400162
4646 325400162 299017700 273490545 250593537 230859139 213734869 198550998 185324597
4639 185324597 173732787 162825339 152537978 143026176 134523908 126862669 119760739 112743533
4631 112743533 106066452 99625826 93646903 88265943 82969011 78155648 73825644 69974087
4623 69974087 66588292 63468506 60528403 57754643 55269372 52740629 50467045 48530432
4615 48530432 46542137 44685784 42785391 41010305 39120581 37610383 36149274 34633010
4607 34633010 33137619 31906058 30823045 29601605 28667801 27794175 26932303 26175349 25353692
4598B5353692o37987n46837o91680l62795o01514o05690m13631k57466m07209
4589B0828883m95680k51398j9885o87999l51553l97759k04114l90412m43306m82112
4579A7104665j83867l02360k58927J37859l72878m6801j59381j20314o2627j24270
4569A5611099l21929R1164k92694q2172J31673P044J45879k1262j58706j87812
4559A4922284j28967j68325k26070j95770k23873L4103k65918J36856K16420J11282
4549A4212022L463j74725J31408K96987J69477J54408K43754K16609J54201L83652
4539A5791256L50482N91639N61378N88969M62119M55475N59868K81027J37209
4530A9779422L02444K24623O9759J1958j45630N8482K13346K55084J38422j38753
$$ plain form
4598 25353692 24715705 24168868 23477188 23114393 22512879 21907189 21493558 21236092 20828883
4589 20828883 20333203 20081805 20061920 19373921 19022368 18624609 18420495 18030083 17586777 17104665
4579 17104665 16920798 16618438 16359511 16497370 16124492 16077691 15918310 15797996 15735369 15611099
4569 15611099 15289170 15380334 15087640 15005468 15137141 15144185 15290064 15268802 15110096 14922284
4559 14922284 14793317 14624992 14398922 14203152 13979279 14013382 13747464 13884320 14100740 14212022
4549 14212022 14215485 14040760 14172168 14469155 14638632 14793040 15036794 15253403 15407604 15791256
4539 15791256 16141738 16733377 17294755 17883724 18345843 18801318 19361186 19642213 19779422
4530 19779422 20081866 20306489 20376248 20388206 20242576 20301058 20514404 20769488 20907910 20769157
4520B0769157j66953K9727m3833j1873j30810j13639J09436j90816l25194j85507
4510A9739695l51550l19126J36614M419J4081j89546j64396l14159n72621p27368
4500A7256043q48487m23794l50529n58208m06117l23009j97835l01258k23577
4491A3623229l06477k23672j58898k19314l48008l26279j88081j59133l96708
4482A1296659r3259p1148j87494k91450m19046Q0284j79459O5381j07100k21530
4472I871838j86471P6567l7441O5035j40130k5869k76611N8302j10080l18699
4462H976441k5128j03335j84312n4921m8007Q869j24020n7340M853p8248J3039
4451H327891j58834j18292k09979r7104J62337j12200j34639j84463j10846k14577
$$ plain form
4520 20769157 20602204 20631931 20588098 20576225 20445415 20331776 20441212 20250396 19925202 19739695
4510 19739695 19388145 19069019 19205633 19210052 19224133 19034587 18870191 18556032 17983411 17256043
4500 17256043 16407556 15983762 15633233 15075025 14668908 14345899 14148064 13846806 13623229
4491 13623229 13316752 13093080 12934182 12714868 12366860 12040581 11852500 11693367 11296659
4482 11296659 11203400 11132252 10944758 10653308 10234262 10314546 10135087 10200468 10093368 9871838
4472 9871838 9685367 9761934 9724493 9789528 9649398 9623529 9346918 9405220 9295140 8976441
4462 8976441 8951313 8847978 8663666 8608745 8560738 8569607 8445587 8388247 8393100 8314852 8327891
4451 8327891 8169057 8050765 7840786 7743682 7906019 7793819 7659180 7474717 7363871 7149294
4441G149294N7037j68861k15147j04436P5567J26864J07233k58529l20771q8088
4431F360163J17306Q7115l53604J50662J5060K462r1584j41418j06915J11451
4421F150698n6801J48733J00357j05750o4140L3752K6969p115k04881j00970J7917
4410E938769N79L8722J72173j26692L5824j11415r3645j09591j7532P8433M9707
4399E855332j16425j40538O3375j00655L6666k9969K8634K87209O0008R985R1957
4388F045579J6251J5205j71823J89661K15111J93902p2791j04310j87100K9736
4378F169421J92029l0714k68879k01491J69391j14624l53558r596J86014o1711
4368E676282j92624O8466J48009J99971j11159q8455K05886j36721R229J69304
$$ plain form
4441 7149294 7206331 7037470 6822323 6717887 6793454 6920318 7027551 6769022 6448251 6360163
4431 6360163 6477469 6564584 6210980 6361642 6376702 6379164 6287580 6146162 6039247 6150698
4421 6150698 6093897 6242630 6342987 6237237 6173097 6206849 6233818 6226703 6021822 5920852 5938769
4410 5938769 5939348 5978070 6150243 6023551 6059375 5947960 5854315 5744724 5727192 5805625 5855332
4399 5855332 5738907 5598369 5661744 5561089 5597755 5567786 5596420 5883629 5943637 5953622 6045579
4388 6045579 6061830 6077035 5905212 6094873 6309984 6503886 6431095 6326785 6139685 6169421
4378 6169421 6361450 6330736 6061857 5860366 6029757 5915133 5561575 5551979 5737993 5676282
4368 5676282 5483658 5552124 5700133 5900104 5788945 5700490 5906376 5769655 5778884 5948188
4358E948188O6585o7215J55044K8237n3319J73617N9271l9030k8535J78629M52534
4347F874006K14570k76549o2323P4977j16586k01055l46689j91219K0173J02773
4337F092078r4841k55843L92938o3142k08998n7600K3045J13281M0077K7727L9490
4326F048212Q7742r6143q359l4978j57833K9278K01840J15809K73349j55989j46133
4315F156795o9981J15441K36572J73583j25572n9010J65265p5027J15866K29765
4305F863697R2852J52642O1414n861j3222j97096J74423J84070j0974K1952J16791
4294G440688j14633J12018p2982J44174K06604j12848J21811K3000l2604Q1970
4284G797198K4239K23048K7688j93804J03580O7934j6575K17782J96406q3504
$$ plain form
4358 5948188 6014773 5947558 6102602 6130839 6077520 6251137 6310408 6271378 6242843 6421472 6874006
4347 6874006 7088576 6812027 6749704 6824681 6708095 6507040 6160351 5969132 5989305 6092078
4337 6092078 5997237 5741394 6134332 6071190 5862192 5804592 5827637 5940918 5980995 6008722 6048212
4326 6048212 6135954 6039811 6031452 5996474 5838641 5867919 6069759 6185568 6458917 6302928 6156795
4315 6156795 6086814 6202255 6438827 6612410 6486838 6427828 6593093 6518066 6633932 6863697
4305 6863697 6956549 7109191 7170605 7164744 7151522 6954426 7128849 7312919 7301945 7323897 7440688
4294 7440688 7326055 7438073 7365091 7509265 7715869 7603021 7724832 7747832 7715228 7797198
4284 7797198 7821437 8044485 8072173 7878369 7981949 8049883 8033308 8251090 8447496 8363992
4274H363992K58708o6625K04418Q0174k13170R9629L8597R6048J32991R7053J26922
4263I218737J06910J10661k2870J31016K9081J78061J76171P5948J79996J08624
4253A0292335J91642J56762Q3999M4129K07587M17178J93566J41245Q9760K70481
4243A2088684L04122L32085K55553K49484L84847J04246K55047K56386M88609
4234A4719063N06079N10603P05305L32286N30024O40141N70901N99247Q03195
4225A9916844P37175Q11275J082246R45136P13176R68289J310120J322434J238834
4216B9045529J494622J489582J429913J791394J984593J894493K007917K308482
4208D3446525K601414K720061K595476K642494K947580L275349L239410L250165
$$ plain form
4274 8363992 8622700 8556075 8760493 8840667 8627497 8727126 8765723 8861771 8994762 9091815 9218737
4263 9218737 9325647 9436308 9413438 9544454 9573535 9751596 9927767 10003715 10183711 10292335
4253 10292335 10483977 10640739 10724738 10768867 10976454 11393632 11587198 11728443 11818203 12088684
4243 12088684 12392806 12724891 12980444 13229928 13614775 13719021 13974068 14230454 14719063
4234 14719063 15225142 15735745 16441050 16773336 17303360 17943501 18514402 19113649 19916844
4225 19916844 20654019 21465294 22547540 23492676 24205852 25174141 26484261 27806695 29045529
4216 29045529 30540151 32029733 33459646 35251040 37235633 39130126 41138043 43446525
4208 43446525 46047939 48768000 51363476 54005970 56953550 60228899 63468309 66718474
4200F6718474L522607L530122L540405L609259L917417M019012L880520L897897
4192I6635713L987056M058951M280343M455131M120830M094563M039814L814044
4184A29486445L611905L742490L255550L147138K852781L030005K717514K521371
4176A54365199K295387K144020J756857J297180J136035O95520K37323k35360
4168A63692161m62726o20929r69551j262461j532355j668930j901102k172254
4160A53101853k479522k719683k918675l019399l399066l467084l909770m044946
4152A27143708l989536m021439m017516m036040m028140l980344m012974l961398
4144I5096321l818578l729344l796556l583548l588474l627232l491356l371301
$$ plain form
4200 66718474 70241081 73771203 77311608 80920867 84838284 88857296 92737816 96635713
4192 96635713 100622769 104681720 108962063 113417194 117538024 121632587 125672401 129486445
4184 129486445 133098350 136840840 140096390 143243528 146096309 149126314 151843828 154365199
4176 154365199 156660586 158804606 160561463 161858643 162994678 163690198 163927521 163692161
4168 163692161 163229435 162608506 161638955 160376494 158844139 157175209 155274107 153101853
4160 153101853 150622331 147902648 144983973 141964574 138565508 135098424 131188654 127143708
4152 127143708 123154172 119132733 115115217 111079177 107051037 103070693 99057719 95096321
4144 95096321 91277743 87548399 83751843 80168295 76579821 72952589 69461233 66089932
4136F6089932l217290k900130k884567k818996k658120k750580k350485k407011
4128D4102753k046835k085361j769283j621576j868586j535450j465367j557952
4120C0152343j437971j379316r56555j018452r59462r70046p75606p94916p91422
4111B1068597o71245q45115m83225m70879l86169m49216n05514l44736m41412
4102A6471086l58533k16578l70676m13547j82001l60089j87603p0546R7316k10468
4092A4198361m23452j52333J03598k22485j94969k66363o4897j91811j02720Q9835
4082A2772764j08965j1619j18552l37366q2296p3297r0422k56672p0601j23290
4072A1499684n2971J85641n4680k97913m8802p0721j62195k78717K4145L5587
$$ plain form
4136 66089932 62872642 59972512 57087945 54268949 51610829 48860249 46509764 44102753
4128 44102753 42055918 39970557 38201274 36579698 34711112 33175662 31710295 30152343
4120 30152343 28714372 27335056 26378501 25360049 24400587 23430541 22654935 21860019 21068597
4111 21068597 20397352 19552237 19069012 18598133 18211964 17762748 17257234 16912498 16471086
4102 16471086 16112553 15895975 15525299 15111752 14929751 14569662 14382059 14311513 14408829 14198361
4092 14198361 13774909 13622576 13726174 13503689 13308720 13042357 12977460 12785649 12682929 12772764
4082 12772764 12663799 12652180 12533628 12196262 12113966 12040669 11950247 11693575 11622974 11499684
4072 11499684 11446713 11632354 11577674 11279761 11230959 11160238 10998043 10719326 10743471 10779058
4062A0779058j86825j13041J48756J89007k62103j49919j27876j09537M182K5249
4052A0196951K95635q7937k72974p6850j02871Q4655L28358J9192j28475M7220
4042A0302904j44583n8975r0097p7369j58885K46464K5403J07372J6505K27312
4032A0396051k8548N0931K57961R8576J03684L1182J71589o3696J39359P2156
4022A1229245j29060K68174J99368J12876k3837p609J61024O6162j59461O5960
4012A1782842J30738K4490M4169O8246Q3848q1742R4312o440n7390K0578N5903
4001A2159554J22976k34121L7409j09920j63030p0646l088k28095j13832M8339
3991A1445546j06623m7731r5126k79484L3849j53746j48928j29057j63008j13499
$$ plain form
4062 10779058 10592233 10479192 10627948 10816955 10554852 10404933 10277057 10167520 10171702 10196951
4052 10196951 10492586 10404649 10131675 10054825 9951954 10036609 10364967 10384159 10255684 10302904
4042 10302904 10158321 10099346 10009249 9931880 9772995 10019459 10044862 10152234 10168739 10396051
4032 10396051 10367503 10418434 10676395 10774971 10878655 10909837 11081426 11017730 11157089 11229245
4022 11229245 11100185 11368359 11567727 11680603 11656766 11649157 11810181 11876343 11716882 11782842
4012 11782842 11913580 11938070 11982239 12050485 12134333 12052591 12146903 12140463 12083073 12103651 12159554
4001 12159554 12282530 12048409 12085818 11975898 11812868 11742222 11739134 11511039 11397207 11445546
3991 11445546 11338923 11291192 11196066 10916582 10950431 10796685 10647757 10518700 10355692 10242193
3981A0242193j96420k09339l4904o6346j87870K76300K0268j03361o2933j89219
3971I488369l7779k6091J50005N8285j3362J73463q8389q9928p2078k4144K15340
3960I733691o0316L2860J31925L7077o7863J62658J70035O992J30832Q2581m7264
3949A0313208J88962L98167j12377m3715J31022J33637J44645p4694K31745L59954
3939A1670554K27141O9709J3529J84569n366K39031M12168J90994J17711L68426
3929A3488466j98715R3371L54246J68675J36087M2837N7535J46875J06369j27846
3919A4267900j97260K20541K18347J91543k143L00463K2680j56448P4414L93604
3909A5333641P5709P2342J44304j91557J97110M54912K93885m4760R6616J15037
$$ plain form
3981 10242193 10045773 9836434 9801530 9735184 9547314 9823614 9843882 9740521 9677588 9488369
3971 9488369 9450590 9424499 9574504 9632789 9619427 9792890 9704501 9614573 9542495 9518351 9733691
3960 9733691 9673375 9706235 9838160 9875237 9807374 9970032 10140067 10147059 10277891 10360472 10313208
3949 10313208 10502170 10900337 10787960 10744245 10875267 11008904 11153549 11078855 11310600 11670554
3939 11670554 11897695 11967404 11980933 12165502 12160136 12399167 12811335 13002329 13120040 13488466
3929 13488466 13289751 13383122 13737368 13906043 14042130 14084967 14142502 14289377 14395746 14267900
3919 14267900 14070640 14291181 14509528 14701071 14698928 14999391 15022071 14865623 14940037 15333641
3909 15333641 15409350 15481692 15625996 15434439 15631549 16086461 16380346 16335586 16432202 16547239
3899A6547239J76731K55991K63639K70663K44054L05149J48390M72368M76065
3890A9160289L04800M11606L88634N44214P15412M52362M68848P65686Q61693
3881B4073544Q67022P89436J145896R71331J063151J186346J317337J307120J700172
3872C4421355J615315J693989J715887J576144J883503J695544J837038J853676
3864D8292451J878852J501501J469332J602212J679461J407863J438182J550036
3856F0819890J450788J338985J402775J121270O53473Q65272N45650L19642K28197
3847F8745942J54913k46288j30653k56055l84871l38705k75347l40511n48235
3838F6380190o04282k92768r7400j75949n0570j68263p9817P8167L53118N66143
$$ plain form
3899 16547239 16723970 16979961 17243600 17514263 17758317 18063466 18211856 18684224 19160289
3890 19160289 19465089 19876695 20265329 20809543 21524955 21977317 22446165 23211851 24073544
3881 24073544 24940566 25730002 26875898 27847229 28910380 30096726 31414063 32721183 34421355
3872 34421355 36036670 37730659 39446546 41022690 42906193 44601737 46438775 48292451
3864 48292451 50171303 51672804 53142136 54744348 56423809 57831672 59269854 60819890
3856 60819890 62270678 63609663 65012438 66133708 66787181 67652453 68198103 68517745 68745942
3847 68745942 68900855 68654567 68523914 68267859 67882988 67544283 67268936 66928425 66380190
3838 66380190 65775908 65483140 65385740 65209791 65159221 64990958 64911141 64989308 65342426 65908569
3828F5908569O36002J191650J350263J587056J545374K251788K203159K839383
3820G9513244L420781L587834M094149M216609M822742M981913N487489N543174
3812A15667935N530316N961568N986172N713915N537154N510125N607629N554530
3804A61069344N352595N194884N172299N345750M931521M687549M048283L552849
3796A99355074L037006K695494K174817J615043J207712N40668P21837L03677
3788B11651328M0589P3053K11933j2621J56269K21672L7942K96493K86047O34597
3778B13597302Q58809R63587J707566J630114K129269K112220K245933K659821
3770B27904621K805412K802395L055552L568354L553064L526569L839303L610319
$$ plain form
3828 65908569 66544571 67736221 69086484 70673540 72218914 74470702 76673861 79513244
3820 79513244 82934025 86521859 90616008 94832617 99655359 104637272 110124761 115667935
3812 115667935 121198251 127159819 133145991 138859906 144397060 149907185 155514814 161069344
3804 161069344 166421939 171616823 176789122 182134872 187066393 191753942 195802225 199355074
3796 199355074 202392080 205087574 207262391 208877434 210085146 210625814 211347651 211651328
3788 211651328 211691917 211764970 211976903 211964282 212120551 212342223 212380165 212676658 212962705 213597302
3778 213597302 214456111 215419698 217127264 218757378 220886647 222998867 225244800 227904621
3770 227904621 230710033 233512428 236567980 240136334 243689398 247215967 251055270 254665589
3762B54665589M046989M185493M075763L922339L821263L690836L616385L735763
3754B85760420L631097L465519L753076M169496M202000N015820N735097O739836
3746C22472361P937031R285131J0887813J2806994J4265239J5826331J6845480
3739D10326380J7576126J7437094J6294740J4692816J2571154R614883O845322
3732E05358515L957732J657712Q4115j415784j697609j815571j811869j545077
3724E02772164j800824l277653n020976p160277r602403j2626465j5814145j8224409
3716D29245012k0058757k0987156k1564573k1321509k0325356j9169790j7427544
3709B88390327j6128334j4776307j3562489j2313124j1148061j0492103r782044
$$ plain form
3762 254665589 258712578 262898071 266973834 270896173 274717436 278408272 282024657 285760420
3754 285760420 289391517 292857036 296610112 300779608 304981608 309997428 315732525 322472361
3746 322472361 330409392 339694523 350582336 363389330 377654569 393480900 410326380
3739 410326380 427902506 445339600 461634340 476327156 488898310 498513193 505358515
3732 505358515 509316247 510973959 511058074 509642290 507944681 506129110 504317241 502772164
3724 502772164 500971340 497693687 492672711 485512434 475910031 463283566 447469421 429245012
3716 429245012 409186255 388199099 366634526 345313017 324987661 305817871 288390327
3709 288390327 272261993 257485686 243923197 231610073 220462012 209969909 200187865
3702B00187865r016913q226152p872293p322751p108520o533613o380684o045447
3694A41681492n418723n441875n136115n041153n011886m399906m400425m256744
3686A02574665m036769m026856l797384l731834l758011l407956l219914l169349
3678G3426592l237677k863947k625623k554189k579196k450385k260910k288872
3670E2565793j977851j692226j694578j611354j539942j393553j409885j359427
3662C9886977q80639j057583q63578r31359r24758q10570j040323r04271o48689
3653C1825207q70889p96611p84252n34108n29437o89751m79730m69214n79897
3644B6091318n54632m76583m82658m13012l34192l29540m78576l62914m35346
$$ plain form
3702 200187865 191170952 182944800 175072507 167749756 160641236 154107623 147726939 141681492
3694 141681492 136262769 130820894 125684779 120643626 115631740 111231834 106831409 102574665
3686 102574665 98537896 94511040 90713656 86981822 83223811 79815855 76595941 73426592
3678 73426592 70188915 67324968 64699345 62145156 59565960 57115575 54854665 52565793
3670 52565793 50587942 48895716 47201138 45589784 44049842 42656289 41246404 39886977
3662 39886977 39006338 37948755 37085177 36153818 35229060 34418490 33378167 32473896 31825207
3653 31825207 30954318 30157707 29373455 28839347 28309910 27620159 27140429 26671215 26091318
3644 26091318 25536686 25060103 24577445 24164433 23830241 23500701 23022125 22659211 22223865
3635B2223865l65186m11516m70549k26270l48629n62419l88727j28155l53640
3626A8968774m84133k47876k46580k60114j04038j79330k34279l75529l23088
3617A6513807j88863k39073k01974r9814k78115l06352k19280R0332j36599m36353
3607A4497716k00526j76501k11244o8403r8437j61390j85361j76374p1130j85337
3597A2963013k50683l3147k51675k70425p116k0317j58845j55180j41524l26969
3587A1347132l19047Q936K74436j59446j72356k40958q7654O4577k41490j44787
3577A0329343p7204j14133l05783o9307O970K3215k12612l7963n455k22035j24694
3566I190342k59330j00899J24515R931k35468k86402R2277N1821l45098q841n0023
$$ plain form
3635 22223865 21858679 21447163 20976614 20750344 20401715 19839296 19450569 19322414 18968774
3626 18968774 18484641 18236765 17990185 17730071 17626033 17446703 17212424 16836895 16513807
3617 16513807 16324944 16085871 15883897 15784083 15505968 15199616 14980336 15070668 14934069 14497716
3607 14497716 14297190 14120689 13909445 13841042 13742605 13581215 13395854 13219480 13148350 12963013
3597 12963013 12712330 12679183 12427508 12157083 12149967 12129650 11970805 11815625 11674101 11347132
3587 11347132 11028085 11037021 11311457 11152011 10979655 10738697 10651043 10715620 10474130 10329343
3577 10329343 10252139 10138006 9832223 9762916 9769886 9793101 9580489 9542526 9537071 9315036 9190342
3566 9190342 8931012 8830113 8954628 8964559 8729091 8442689 8534966 8586787 8241689 8232848 8182825
3555H182825R5601n7140j3730j45355l4597J741j05284n0373j10836l5122J1211
3544G738941j9092k77016o6298K8784J34585k7453J39047j61549j87223j16034
3534G186692N4195P7170j85905J10628R3433j4625j67551j28861m2056O4194O2273
3523G109587O6070N1977r9318J1853k3278j10698p8183R4899J91898l4884j3427
3512G166496p0230J46675J29192M809R9030j06413J58535J16565J79522j30608
3502G693573q0409J60654J33348K3732J42067J95878n7821J07660Q5610J6946
3492H421238m3766J87478P3909K63050R7022J75535R6516n7935J84956K92611
3482I690614J37896J21083M132L69072K23152K33244J37041L36204L83047K26657
$$ plain form
3555 8182825 8278426 8221286 8207556 8062201 8027604 8029345 7924061 7873688 7762852 7727730 7738941
3544 7738941 7719849 7442833 7376535 7405319 7539904 7512451 7651498 7489949 7302726 7186692
3534 7186692 7240887 7318057 7132152 7242780 7336213 7321588 7154037 7025176 6983120 7047314 7109587
3523 7109587 7175657 7227634 7128316 7140169 7116891 7006193 6928010 7022909 7214807 7179923 7166496
3512 7166496 7096266 7242941 7372133 7376942 7475972 7369559 7528094 7644659 7824181 7693573
3502 7693573 7613164 7773818 7907166 7930898 8072965 8268843 8211022 8318682 8404292 8421238
3492 8421238 8377472 8564950 8638859 8901909 8998931 9174466 9270982 9213047 9398003 9690614
3482 9690614 9828510 9949593 9953725 10322797 10545949 10779193 10916234 11252438 11635485 11862142
3472A1862142J81277K74684J13523J25697J47404J10437K31381M45282L10655
3463A3802482L08805L75550M35464M15083K54688M59894J67239j17418k06349
3454A5895438r2855j24386m6634J1829M65091L39983K91732M6629k94580j14114
3444A6378133l81564m98028m23940j97594k02959j44105J79619j43098Q1948J34929
3434A4783341L41362M87502N42263P61767N80029Q78134Q51422M97149K84320
3425B0007289J08276m48220n92733n22581p69875m25593p16110n82552n66000
3416A5491901q34974p65124n22503o52090m55714m45264n74203l02397j64893
3407A0774739k20536k59397l12787j40882m2240k2706j99346K75134K79946J00560
$$ plain form
3472 11862142 12043419 12318103 12431626 12557323 12704727 12815164 13046545 13491827 13802482
3463 13802482 14111287 14486837 14922301 15337384 15592072 16051966 16219205 16101787 15895438
3454 15895438 15802583 15678197 15631563 15643392 16108483 16448466 16740198 16786827 16492247 16378133
3444 16378133 15996569 15498541 15074601 14877007 14674048 14529943 14709562 14566464 14648412 14783341
3434 14783341 15124703 15612205 16154468 16916235 17496264 18374398 19225820 19722969 20007289
3425 20007289 20115565 19667345 19074612 18552031 17782156 17356563 16640453 16057901 15491901
3416 15491901 14656927 13891803 13369300 12717210 12261496 11816232 11242029 10939632 10774739
3407 10774739 10554203 10294806 9982019 9841137 9798897 9776191 9576845 9851979 10131925 10232485
3397A0232485J24857N80840K47099j30179q1674m49218n63604n29782l53031l76935
3387H700858n10671k39533l33270l75414j26798j70264j70247j88859j77853k83057
3377F124892p8309M5356j84915k28174n8794Q6606j33536k1149k3019j84031j7062
3366E327865q635P5164m17n4510r7744j31538j30262N2769J35089q7573J41505
3355E221713J49102k35142j09098j26739j09332p0327K47275R7217J50032j49942
3345E064759k24241O1409j55750M3583P9537K9126Q6025j97122j27554j7451L4111
3334D676432J03517o8302n304J20498j4338J6227K09630j5152j21674K993M9743
3323D954270j15463j65878J15918j91869M7705K85289P6257k9944O6632m2122
$$ plain form
3397 10232485 10357342 10938182 11185281 11055102 10973428 10524210 9960606 9430824 9077793 8700858
3387 8700858 8190187 7950654 7617384 7241970 7115172 6944908 6774661 6585802 6407949 6124892
3377 6124892 6046583 6091939 5907024 5678850 5620056 5706662 5573126 5551977 5528958 5344927 5327865
3366 5327865 5319230 5394394 5393977 5339467 5241723 5110185 4979923 5032692 5167781 5080208 5221713
3355 5221713 5370815 5135673 5026575 4899836 4790504 4720177 4967452 5064669 5214701 5064759
3345 5064759 4840518 4901927 4746177 4789760 4869297 4898423 4984448 4787326 4659772 4642321 4676432
3334 4676432 4779949 4711647 4706343 4826841 4812503 4828730 5038360 5023208 4901534 4904527 4954270
3323 4954270 4838807 4672929 4788847 4596978 4644683 4929972 5006229 4976285 5042917 5000795
3313E000795J80437j14984j41869k3891K87311J16125K51559j06950J64898K25986
3303E839417l4747J93151J93732j52677J47783L1899n9472o304j29837j78519
3293E844426k44315Q446R5108J27725M9422K3958l66981O2213j34748Q3367R4776
3282E643397l5569j1795j919P0140J40257K8545K20422K11759J47205K6617Q1292
3271F520351J44810k00651k25952J74396N3760k60814j89751N2679p9435r2989
3261E896404m8373P4513r4297j00249o5346J1052J62546j79223j3985M9339o6809
3250E625572k2398o1741q4248q9461q9539J38637J30463j62988j03608J39975
3240E420664L8661R2975K74192j68434k13780m836Q2106j77524p1210o8616N9333
$$ plain form
3313 5000795 5181232 5066248 4924379 4900488 5187799 5303924 5555483 5448533 5613431 5839417
3303 5839417 5804670 5997821 6191553 6038876 6186659 6218558 6159086 6152782 6022945 5844426
3293 5844426 5600111 5608557 5703665 5831390 5880812 5904770 5537789 5600002 5465254 5548621 5643397
3282 5643397 5607828 5596033 5594114 5664254 5804511 5833056 6053478 6265237 6412442 6439059 6520351
3271 6520351 6665161 6464510 6238558 6412954 6466714 6205900 6016149 6068828 5989393 5896404
3261 5896404 5848031 5922544 5828247 5727998 5662652 5673704 5836250 5657027 5643042 5692381 5625572
3250 5625572 5603174 5541433 5457185 5367724 5278185 5416822 5547285 5384297 5280689 5420664
3240 5420664 5459325 5552300 5826492 5658058 5444278 5439442 5521548 5344024 5272814 5204198 5263531
3229E263531K18955J92241j9515l817L6125m9793M8211j09267L8488Q866o5958
3218E558067p1173J4785M3452p7425K82268m4474j05510O9484K8729J22506j9162
3207E801547j17070L9643J49014R2672l1937L7327j39476j12850J201r8245R2905
3196E714731j0006n8854N4856k0686l7959J67453L1690L8884j39280r3034L586
3185E651381J60304N7993r7256r065N7647j46734K08935J15101J3700l6547j51426
3174E824033J85424J30222R8960J9054L2696q3463m6440j65546k43149M6381M7390
3163E845562m8917J82498q0792n7313R0832Q4488R9733J77961j62128j81110n1106
3152E899708K14776N4869p3940N0890J60821J04422j75112q1638J00589J80760
$$ plain form
3229 5263531 5482486 5674727 5655212 5651395 5687520 5637727 5685938 5576671 5615159 5624025 5558067
3218 5558067 5486894 5501679 5545131 5467706 5749974 5705500 5599990 5669474 5698203 5820709 5801547
3207 5801547 5684477 5724120 5873134 5965806 5933869 5971196 5831720 5718870 5720071 5621826 5714731
3196 5714731 5704725 5645871 5700727 5680041 5642082 5809535 5841225 5880109 5740829 5647795 5651381
3185 5651381 5811685 5869678 5772422 5763357 5821004 5674270 5883205 5998306 6012006 5975459 5824033
3174 5824033 6009457 6139679 6238639 6257693 6290389 6206926 6160486 5994940 5751791 5798172 5845562
3163 5845562 5796645 5979143 5898351 5841038 5931870 6016358 6116091 6294052 6131924 5950814 5899708
3152 5899708 6114484 6169353 6095413 6146303 6307124 6411546 6236434 6154796 6255385 6436145
3142F436145j54319J03769O321q0940R4070L0985j54916J68454K70601O8821k6280
3131F762711m1508k73711r6759N0269P8336p3211n3793m107k0029r3781K09994
3120F444411K371N6191J00379j89045J4477n0569J55412J78055j74448j33229
3110F404005O8078K4772k43502N6195O8130l9075j26337K15541J44295p0414J00922
3099F602610j55707k21604j36129j03301R3627J86371k4595n2328L3303J92181
3089F414428j023j07436l7135M8310j48232Q179j19875n3037j65436J62748k7432
3078E974059n5211k2142J66453p8783j96668P4523J26568k02337k65171p6683
3068E444608J57043K23961j57451p6678L1515j755m7237j4364k10562j35275R0935
$$ plain form
3142 6436145 6281826 6385595 6391916 6310976 6405046 6436031 6281115 6449569 6720170 6788991 6762711
3131 6762711 6721203 6447492 6350733 6401002 6479338 6406127 6352334 6348227 6328198 6234417 6444411
3120 6444411 6446782 6502973 6603352 6414307 6428784 6378215 6533627 6711682 6537234 6404005
3110 6404005 6472083 6496855 6253353 6309548 6377678 6338603 6212266 6427807 6572102 6501688 6602610
3099 6602610 6446903 6225299 6089170 5985869 6079496 6265867 6241272 6188944 6222247 6414428
3089 6414428 6413405 6305969 6268834 6317144 6168912 6177091 6057216 6004179 5838743 6001491 5974059
3078 5974059 5918848 5896706 6063159 5984376 5787708 5862231 5988799 5786462 5521291 5444608
3068 5444608 5601651 5825612 5668161 5591483 5622998 5621243 5574006 5559642 5349080 5213805 5304740
3057E304740P6014k52906j65939J16800O7889q8646K28115K9384J03869q4816
3047E334504P3750j57095j08436j90227J1054l359j42722L15525Q1382l13503
3037D900873n2314J01596o0402K2011k95553O6959L27060m9446j8695j80934k9160
3026D731995k3151L3562o8301j83914N8359J41133K11668j71767j01524j08301
3016D519759M4846J06787j21921j17882J28833j6667k79065J34154N4147k4110
3006D428881j2068K1283N8507k08541M006n1490K9663j50748J81268j82726l5294
2995D082741J42220j03951m0958L7534j01217P2023J95337K50236j88944m34546
2985C910475j65001M22107M1513j25223j15855k51466L4875q560j56324R1346
$$ plain form
3057 5304740 5380754 5127848 4961909 5078709 5146598 5057952 5286067 5315451 5419320 5334504
3047 5334504 5408254 5251159 5142723 4952496 4963550 4960191 4817469 5132994 5214376 4900873
3037 4900873 4848559 4950155 4889753 4911764 4616211 4683170 5010230 4960784 4942089 4761155 4731995
3026 4731995 4708844 4742406 4674105 4490191 4548550 4689683 4901351 4729584 4628060 4519759
3016 4519759 4564605 4671392 4549471 4431589 4560422 4543755 4264690 4398844 4452991 4428881
3006 4428881 4416813 4438096 4496603 4288062 4292068 4240578 4270241 4119493 4300761 4118035 4082741
2995 4082741 4224961 4121010 4080052 4117586 4016369 4088392 4283729 4533965 4345021 3910475
2985 3910475 3745474 4167581 4209094 4083871 3968016 3716550 3751425 3742865 3586541 3677887
2975C677887J18652m7669m6389j05574K7648J2638j89584Q8862J20041j47644
2965C508868o4250q9880n9226l572o064R9006J19607m9299J49224j08951k57770
2954C237693O1636J33950j70045l891P3387J13193j11996q1188J9811j235k2669
2943C248646L0806j41196o2790P3143J41294K4356o7383j27741p6189j01598o4537
2932B876811M0381j23092q3521Q9564J04114P1246k51308j24455J08065L8538
2922B746343j11984j88849j6374J85809j27423K4012K1041J28325L6584j7104
2912B680380l0680k15119l1843K01246q4094n7926j42460K40602P1734k15237
2902B416603j85542J82425J46188j21518j21254J5182K56842O0162j57536j88999
$$ plain form
2975 3677887 3796539 3748870 3702481 3596907 3624555 3637193 3447609 3536471 3656512 3508868
2965 3508868 3444618 3354738 3295512 3291940 3285876 3384882 3504489 3455190 3604414 3495463 3237693
2954 3237693 3299329 3433279 3263234 3259343 3332730 3445923 3333927 3252739 3272550 3271315 3248646
2943 3248646 3279452 3138256 3075466 3148609 3289903 3314259 3246876 3119135 3042946 2941348 2876811
2932 2876811 2917192 2794100 2710579 2800143 2904257 2975503 2724195 2599740 2707805 2746343
2922 2746343 2634359 2445510 2429136 2614945 2487522 2511534 2532575 2660900 2697484 2680380
2912 2680380 2649700 2434581 2402738 2603984 2519890 2461964 2319504 2560106 2631840 2416603
2902 2416603 2231061 2413486 2559674 2438156 2316902 2332084 2588926 2649088 2491552 2302553
2892B302553Q7770j00814J37120J4036j73952k05814j2047R7978k7973q6914l5533
2881A996410l5871J12445O0955p4228R4447j24601n6475J46399l2836N7848n6724
2870B087769r1996k709k7209l6401k5302j81857J26041K59692j27043p0662k3411
2859A886912J196l087N8092n0491j86837M4557J44013k1346L3214o0766j98786
2848A646671J16507O1505j14905k06882K0736j1679M7449M1329j5534p6403l5391
2837A473403J20125J11765j00673j12993Q1910m88l34145K38024j82725J06357
2827A400560j7084n0143J11719N6330j80146j43048L7791n2250q1904K42131R6004
2816A419960J76311O1110j72083M3498j59695j75241j3857K52451q7512m7233
$$ plain form
2892 2302553 2390323 2289509 2426629 2440665 2266713 2060899 2048852 2146830 2118857 2031943 1996410
2881 1996410 1960539 2072984 2133939 2059711 2154158 2029557 1973082 2119481 2086645 2144493 2087769
2870 2087769 1995773 1993064 1965855 1929454 1904152 1722295 1848336 2108028 1980985 1910323 1886912
2859 1886912 1888108 1885021 1943113 1892622 1705785 1750342 1894355 1873009 1906223 1845457 1646671
2848 1646671 1763178 1824683 1709778 1502896 1523632 1511953 1559402 1600731 1585197 1508794 1473403
2837 1473403 1593528 1705293 1604620 1491627 1573537 1573049 1238904 1476928 1294203 1400560
2827 1400560 1383476 1333333 1445052 1501382 1321236 1178188 1215979 1163729 1081825 1323956 1419960
2816 1419960 1596271 1657381 1485298 1528796 1369101 1193860 1180003 1432454 1344942 1297709
2806A297709J38702k12622m8520L8532M2469l1867J74556R0468k42183J5972p6304
2795A186912N4489j73726j8376j26092L79132L9838l6671l1313j6163j80600L7843
2784A115273j01964R5318J03893O9125K6079j07972k0013j43392J62506j14886
2774A083967m8061N5999J9524q417p0239J02472k2376j50315p7859l2919R7387
2763I49163j21145J11403K56314p1295k94649J72831K32947p0777o5855j33923
2753I65014N3947r7616N225j63139L5581L7339j52655J02360r863n9932m0201
2742F76060j12457O3064J0955N4832K7956k7417M2527r0724J3899P5371j00507
2731F33559j05326J65895J16408R0704q3965j14266q2949R1618M2466l4688L3614
$$ plain form
2806 1297709 1436411 1223789 1175269 1213801 1256270 1224403 1398959 1489427 1247244 1263216 1186912
2795 1186912 1241401 1067675 1049299 923207 1302339 1342177 1305506 1274193 1258030 1077430 1115273
2784 1115273 1013309 1108627 1212520 1281645 1307724 1199752 1179739 1036347 1198853 1083967
2774 1083967 1035906 1091905 1111429 1103012 1032773 1135245 1112869 962554 884695 851776 949163
2763 949163 828018 939421 1195735 1124440 829791 1002622 1235569 1164792 1098937 965014
2753 965014 1018961 921345 926570 763431 799012 836351 683696 786056 776193 716261 676060
2742 676060 563603 626667 637622 692454 720410 692993 735520 644796 658695 734066 633559
2731 633559 528233 694128 810536 901240 817275 703009 620060 711678 754144 719456 753070
2720G53070l205j85898m7110Q613J44085M3550k3574J59274n6489Q1629o2106
2709H11839K1919N192q5410R134k8852l3173p6020j25938k762l837K2724J94404
2697G09220j8584j2800P5094l8126l8921j22394J3138N0247j6292J44747N6391
2686H01720j33002j96003M0949P9064j03434j39917J45412M9002j82821K01000
2676E61970J91299j78898J6141J14260k89417j10895J60862m4354n7420J22143
2666D85691J26224j33557N4946Q018m5951q4083M7455O9443L7844J68273j33866
2655F00437j42392m020O1487j17747j38978j7833J20186q5681k4825K47906J8650
2644E17190q8088o8162P4124J3357l3646J60621j79826R8792j2355k6299P2924
$$ plain form
2720 753070 749865 563967 516857 525470 669555 713105 689531 848805 792316 873945 811839
2709 811839 833758 838950 753540 762674 733822 700649 624629 498691 495929 492092 514816 709220
2697 709220 690636 677836 752930 714804 675883 553489 566627 616874 600582 745329 801720
2686 801720 668718 472715 513664 592728 489294 349377 494789 543791 360970 561970
2676 561970 753269 574371 590512 704772 415355 304460 465322 420968 363548 485691
2666 485691 611915 478358 533304 541322 495371 411288 458743 528186 566030 734303 600437
2655 600437 458045 454025 515512 397765 258787 240954 361140 275459 250634 498540 517190
2644 517190 429102 360940 435064 448421 414775 575396 395570 494362 482007 455708 528632
2633E28632j68967j43208K74882J59645Q857r0319k27768j76747J12905M14136
2623F92048p371k26522j16173j7239r2849K98708m6587j77920N3823L11756j80404
2612D91270j75799K28357k4128M9060o1600n7968n682m5335J48631n2796l3440
2601D60570J70448K35777j15748r4235j03071k2452J4059r0495P7829N9696j35903
2590D56475m2756o4572j5527J6285J83982K69395l77901r4575J04723M2183Q005
2579D85717j2777k9497k48212J17594J6857j87976n236R6423N7213j2258r7898
2568A79950O7929n0612q5335K8718J00893J11882l8875k23070K11418N1257j10611
2557B43544K37569j25108n1164o760L48462k09008K8551K3993j43097Q8025O5618
$$ plain form
2633 528632 359665 216457 491339 650984 659841 569522 341754 165007 277912 692048
2623 692048 684677 458155 341982 324743 231894 530602 484015 306095 359918 671674 491270
2612 491270 315471 543828 519700 568760 507160 449192 443510 398175 546806 494010 460570
2601 460570 631018 866795 751047 656812 553741 531289 545348 454853 532682 592378 456475
2590 456475 413719 349147 333620 349905 533887 803282 425381 330806 435529 477712 485717
2579 485717 472940 443443 195231 312825 329682 141706 136470 232893 290106 277848 179950
2568 179950 247879 197267 111932 140650 241543 353425 314550 91480 302898 354155 243544
2557 243544 481113 356005 304841 298081 646543 437535 466086 490079 346982 435007 500625
2546E00625N1806n9625O3798q8330K4748j07646o3479j7335j6976L9369q4596
2535B42359P4929J67576j7756j69923j71333K874J59141J54119J00574j52982
2525C89578j06194R2389N8054j2091j3569j48016m7239j50865J2203J25423j04292
2514I5381J80011J1620J0367J53689j44635m5757L2781M7665m6653k91455k9449
2503b6435M0583J69529J4062l1095K00237r0354L9905j95842J80Q6240j03195
2492A03815o1923k4509j95495K69601J70639j29768p3390K968o2248K96736J05428
2481D01854j78472q6451j737J14278j12552k19835j7142L29432J04982p2469N6112
2470C18000j58341j39742K56753m5568P6384Q5267k08574j38097J14328J14024
$$ plain form
2546 500625 552431 492806 556604 468274 493022 385376 321897 304562 287586 326955 242359
2535 242359 317288 484864 467108 297185 125852 128726 287867 441986 542560 389578
2525 389578 283384 375773 433827 421736 408167 260151 212912 62047 74250 199673 95381
2514 95381 275392 287012 297379 451068 306433 260676 293457 341122 294469 3014 -26435
2503 -26435 14148 183677 197739 166644 366881 276527 316432 120590 120770 207010 103815
2492 103815 41892 17383 -178112 91489 262128 132360 58970 61938 -310 296426 401854
2481 401854 223382 136931 135194 249472 136920 -82915 -100057 229375 334357 261888 318000
2470 318000 159659 19917 276670 231102 307486 392753 184179 46082 160410 274434
2460B74434k11446j7766K24666n4077J01325k75619Q7294O5768R8513o768j7393
2449B68931J70241j7939J9269n4040O5312L20354j16643l33236J26695J1953j33672
2438C27225O6159R1252r8387M8018p7020J53039N3891O5272k65023j50697J51372
2427C65101j8388K03820L043L1048j65498P5537M3189p1080Q859j71913q0452
2416B23266K3772J57617J05273L3439J88668N1491j4806j9198j70519R1133J59580
2405H29716o9763l0072J59496N0511n5963P3734K7927O9524j11498j00231L01090
2394A144471J12069J2052Q7818r337n2837m4501J56476j63096M21608N0609M6848
2383A762180Q5193j04704J59652J12302J78984R3340K48263N4568P2920Q4252
$$ plain form
2460 274434 62988 45222 269888 215811 317136 41517 128811 194579 293092 286324 268931
2449 268931 439172 421233 440502 386462 451774 772128 655485 322249 448944 460897 327225
2438 327225 393384 484636 386249 434267 357247 510286 564177 629449 364426 213729 365101
2427 365101 346713 550533 553576 584624 419126 494663 537852 466772 475631 303718 223266
2416 223266 247038 404655 509928 543367 732035 783526 768720 749522 579003 670136 829716
2405 829716 759953 729881 889377 939888 883925 957659 985586 1055110 943612 843381 1144471
2394 1144471 1256540 1268592 1356410 1347073 1294236 1249735 1406211 1243115 1664723 1715332 1762180
2383 1762180 1847373 1742669 1902321 2014623 2193607 2286947 2535210 2589778 2662698 2746950
2373B746950Q7519K2026L6031K29783j3543J12182K79047J29649Q3880J02935
2363C816459K14363L07988K99907L78443K85663M03458M84704L41979O51962N19747
2353G704673O64794P69346R73121Q39081R99883J266785J236765J433961J360235
2344A7248644J314676J322262J638423K125991K693163L543851M861836O234197
2336D0983043P604829P414717P605292Q215165O048670L373725p62523o682852
2328G3800066r359824q300262o986554n332135m306281l696857l219634k602685
2320B9995834k531873k180741k088364j909450j394330j576357j596040j302487
2312A5416192r95138j232528j138133r23236r00710n38046n89982o34978m78266
$$ plain form
2373 2746950 2834469 2856495 2892526 3122309 3108766 3220948 3499995 3629644 3713524 3816459
2363 3816459 4030822 4338810 4638717 5017160 5302823 5706281 6190985 6532964 7184926 7704673
2353 7704673 8369467 9138813 10111934 10951015 11950898 13217683 14454448 15888409 17248644
2344 17248644 18563320 19885582 21524005 23649996 26343159 29887010 34748846 40983043
2336 40983043 48587872 56002589 63607881 71823046 77871716 81245441 80482918 73800066
2328 73800066 64440242 56139980 49153426 43821291 39515010 35818153 32598519 29995834
2320 29995834 27463961 25283220 23194856 21285406 19891076 18314719 16718679 15416192
2312 15416192 14421054 13188526 12050393 11127157 10226447 9688401 9098419 8463441 7985175
2303G985175l00689l10756k70929l34300n42762k14826p3619k89032j92027m45982
2293E010253m23477l04740k47998l4805l16863k29414j15907k70975j44949r1961
2283B829164K1728k36619k71398j51954j5513R4970n4755L1224k90587j14551
2273A841709j49808k3817j95218K5744N4073N5646j63754j36988J93384q0350
2263A420621j08186j63230J2933Q6468j24483K2887M6109j3591N0171o6120J02950
2252A266529k42557k50555J80015O3815J03339N217k76928j15094J60853K4791
2242I19425J94501j26331K0419m0143k34337Q9798j76171p9783L0719J29764j95031
2231E32830J47697K33451j31224M4587M83k63065j49388O4652q8900J61402j4675
$$ plain form
2303 7985175 7684486 7373730 7102801 6768501 6225739 6010913 5937294 5648262 5456235 5010253
2293 5010253 4586776 4282036 4034038 3999233 3682370 3452956 3337049 3066074 2921125 2829164
2283 2829164 2850892 2614273 2342875 2190921 2175408 2270378 2215623 2246847 1956260 1841709
2273 1841709 1691901 1668084 1472866 1498610 1552683 1608329 1444575 1307587 1500971 1420621
2263 1420621 1312435 1149205 1162138 1248606 1124123 1147010 1193119 1179528 1229699 1163579 1266529
2252 1266529 1023972 773417 953432 1017247 1120586 1125803 848875 733781 894634 919425
2242 919425 1113926 987595 1008014 967871 733534 823332 647161 567378 598097 727861 532830
2231 532830 680527 913978 782754 827341 827824 564759 415371 480023 391123 552525 537850
2220E37850j58139O7824M8931L1779j8669N941r4333O4161m085J4625J1263O8196
2208E75344r732P825j62939j03118j4233o7908l9485R1635K9607r917J71763j27427
2196C41415j3423N5566j09373j49352J3833n9598J19614k1081Q7315l0492J21972
2185C56396l05217j11636K1105j9573J1166o0844J19412J30456o9922k44383O8168
2174a04872J44141J11518n9382j11465l8941M4288j12099J65544j13058N3511
2164b0815J43960J71089r7025k24257J31195p424n2982m0633Q6488L4645R3592
2153B17833j74588o1736q0485n4722Q5602j1729p2824M3695R6391P9362p917n616
2141E3266m9797L9265P8645j18328m1695p6684j823J00492n4428l3382J2994J25502
$$ plain form
2220 537850 379711 447535 496466 528245 509576 515517 421184 485345 481260 495885 507148 575344
2208 575344 565612 573437 410498 307380 293147 225239 185754 277389 306996 297079 468842 341415
2196 341415 327992 383558 274185 124833 138666 79068 198682 177601 264916 234424 356396
2185 356396 51179 -60457 -39352 -58925 -47759 -108603 10809 141265 71343 -173040 -104872
2174 -104872 39269 150787 91405 -20060 -59001 -14713 -126812 38732 -74326 -20815
2164 -20815 123145 294234 197209 -27048 104147 96723 43741 3108 89596 124241 217833
2153 217833 43245 -18491 -98976 -153698 -68096 -79825 -152649 -108954 -12563 66799 58882 53266
2141 53266 3469 42734 121379 3051 -38644 -115328 -117151 -16659 -71087 -104469 -91475 34027
2129C4027L6559p5924L3052P98n8963k09609p2579J42949J67683j11753r4721
2118b08481k9298j5533N5786J826J35853j0815k0784p178Q2703J07440n9599k26207
2106a94287J4618J38404j80573l1931j64516K54541l2495J75193p0538o576j28138
2095b26298P5569J3354r346J42302n9107p9021j19622r5396N3861J07233J04721
2084i1750R8742j30738k237J21518P2671k68903P6212K8511J5008K9246j44727
2073a96447R7115j3456N8297K0749r408K12697K1795J23977j9320J7381J3337
2062C26717n337o926k4592j9001R66k18717P7830j07719P1204J28785j78492p3033
2050b8315j29889K03137m8357J03870Q2849j70852j48845M5349j6242j29168R4462
$$ plain form
2129 34027 70586 -5338 27714 28512 -30451 -240060 -312639 -169690 -2007 -113760 -208481
2118 -208481 -237779 -253312 -197526 -195700 -59847 -70662 -91446 -98624 -15921 91519 31920 -194287
2106 -194287 -179669 -41265 -221838 -253769 -418285 -163744 -196239 -21046 -91584 -98160 -226298
2095 -226298 -150729 -137375 -146721 -4419 -63526 -142547 -262169 -357565 -303704 -196471 -91750
2084 -91750 6992 -123746 -125983 -4465 68206 -200697 -124485 -95974 -80966 -51720 -196447
2073 -196447 -99332 -112788 -54491 -33742 -43150 169547 191342 315319 295999 313380 326717
2062 326717 321380 314454 289862 270861 271827 53110 130940 23221 94425 223210 44718 -28315
2050 -28315 -158204 44933 -3424 100446 183295 12443 -136402 -91053 -107295 -236463 -142001
2039a42001O8325J30712j95940j04221J28052N4983j65523R1247J9835J91199
2029G6668N5688l39632k7816R0078j05235j69000j31735J60759Q3125k7630m9811
2018c84541K67543J61767j03968N1260M9918l8546R4735m0025j92175r1251J20456
2007a04827P3766l2181N8211o7472L1367q7894Q7122o8635L3947k82339O0747
1996b98188L03357K2308j97332p8081L5118K11974J14386j79681P9617j92913
1986a79435j7777Q0930l49896p4795L2594K6671j8445J08173J31587j03430o5482
1975d29305J52945K65778P5875q5012j96169l5204K51612N5482k86083o595m606
1964b41282p4648j32202J81033J54467j04405r6626j28838j8008K4559O8542L4195
$$ plain form
2039 -142001 -73676 57036 -138904 -243125 -115073 -60090 -225613 -134366 -114531 76668
2029 76668 132356 -207276 -235092 -145014 -250249 -419249 -550984 -390225 -307100 -334730 -384541
2018 -384541 -116998 44769 -59199 -7939 41979 3433 98168 58143 -134032 -225283 -104827
2007 -104827 -31061 -63242 -5031 -72503 -41136 -129030 -41908 -110543 -76596 -358935 -298188
1996 -298188 5169 27477 -169855 -247936 -212818 -844 113542 -66139 13478 -179435
1986 -179435 -197212 -116282 -466178 -540973 -508379 -481708 -500153 -391980 -260393 -363823 -429305
1975 -429305 -276360 -10582 65293 -19719 -215888 -251092 520 56002 -230081 -236676 -241282
1964 -241282 -315930 -448132 -267099 -112632 -217037 -313663 -442501 -460509 -435950 -367408 -333213
1953c33213R6140J5762m8913L4807J68939m0196j5636m8771k453k98390j1815
1942d83739K57281j47794l7064Q6370J21348j54976J546j6040J37776j1005P0304
1931a75993m0829o396Q9909j80201K5028j82101J95930o4815K7734L0597P3992
1920b07145M2777r9457P5612k7417j44881k1172K35767J33893l827j6553j03269
1909a35672j3868M6940O552J94441k52264m9795J00665N4894r8642j58548l2238
1898c37535J39758k4382j86604j21431N4882J33965L2747j23485L7925j64850
1888e59010J49159K11175j81225R5838L9186L7158L5189k22488m8334j3373J82386
1877b74339j13794O227J24199M6808K3947j84169O0940k4378o8167j61721J58554
$$ plain form
1953 -333213 -237073 -221311 -270224 -235417 -66478 -106674 -122310 -171081 -173534 -471924 -483739
1942 -483739 -226458 -374252 -411316 -324946 -203598 -358574 -357028 -373068 -235292 -246297 -175993
1931 -175993 -216822 -223218 -133309 -313510 -288482 -470583 -274653 -339468 -311734 -281137 -207145
1920 -207145 -164368 -263825 -188213 -215630 -360511 -381683 -145916 -12023 -15850 -32403 -135672
1909 -135672 -149540 -102600 -96048 98393 -153871 -203666 -103001 -48107 -146749 -305297 -337535
1898 -337535 -197777 -222159 -408763 -530194 -475312 -341347 -308600 -432085 -394160 -559010
1888 -559010 -409851 -198676 -379901 -284063 -244877 -207719 -172530 -395018 -443352 -456725 -274339
1877 -274339 -388133 -381906 -257707 -210899 -186952 -371121 -310181 -334559 -402726 -564447 -405893
1866d05893J64667j0472J40006J4934j51386J39009k0527j68871o588j1900K70558
1855d6463k17395k28971L5747J39025J23583j1024j26498m8363J22966m4483P6510
1844b25366J10762p1140q7111j7367j91014m1628J86819J29321j37438Q2182K57144
1833d836L5709k66380M4342k15827m1660J52227M7927j3608r707J038J0424j07227
1821c67578j43035K28646J11247p127K0912j81685O3240j03155J46005N9515k10349
1810c83364j0444J05874O147o9271K9027p391J81011k7886k03130l3614N2666
1799c60375L5816M783j22457q728L9666J88513P1325o6484Q6579J22967k25157
1788b33552r8371J97892J31682j05496j27109j90881j26327R4992O8381J73480
$$ plain form
1866 -405893 -241226 -251698 -111692 -96758 -248144 -109135 -129662 -298533 -305121 -317021 -46463
1855 -46463 -263858 -492829 -457082 -318057 -194474 -205498 -331996 -380359 -257393 -301876 -225366
1844 -225366 -114604 -185744 -272855 -290222 -481236 -522864 -336045 -206724 -344162 -261980 -4836
1833 -4836 30873 -235507 -191165 -406992 -448652 -296425 -248498 -262106 -271813 -270775 -260351 -367578
1821 -367578 -510613 -281967 -170720 -177847 -156935 -338620 -275380 -378535 -232530 -173015 -383364
1810 -383364 -393808 -287934 -281787 -351058 -322031 -329422 -148411 -176297 -379427 -413041 -360375
1799 -360375 -324559 -319776 -442233 -450961 -411295 -222782 -151457 -217941 -131362 -8395 -233552
1788 -233552 -331923 -134031 -2349 -107845 -234954 -425835 -552162 -457170 -388789 -215309
1778b15309j89579J20227m5675N8986j209n0505J2566j05941J73686L5772j75982
1767c82963j8545L8848L7275P5962J51878J2300r1028l6094K2398R3148J496k8876
1755a24201l7011j9576Q4513j79030K5506p1370k1777J8525r5998n3552N0950
1744d23021J36485J06011j4662j12496K53836q6971j89513k17224J21364J45315
1734b80876j1845m1326n256o4537O5342r4788N7985J4459P5199j08126J44777
1723b48992r6174m3975J53892k3783j32057L88357O8997r3947J14327k53080j23727
1712b90162m4068J35319J66152l84836R6396L4105j0604R69R9280n2289K3934
1701b25804O8904q2709m6908Q1419J64117n5471j6980q0403j35485j18421Q684
$$ plain form
1778 -215309 -404888 -284661 -330336 -271350 -272559 -323064 -310498 -416439 -242753 -206981 -382963
1767 -382963 -401508 -362660 -325385 -249423 -97545 -85245 -176273 -212367 -189969 -96821 -95325 -124201
1755 -124201 -161212 -180788 -96275 -275305 -249799 -321169 -342946 -324421 -420419 -473971 -423021
1744 -423021 -286536 -180525 -195187 -307683 -53847 -140818 -330331 -547555 -426191 -280876
1734 -280876 -292721 -334047 -339303 -403840 -338498 -433286 -375301 -360842 -285643 -393769 -248992
1723 -248992 -345166 -389141 -235249 -259032 -391089 -2732 66265 -27682 86645 -166435 -290162
1712 -290162 -334230 -198911 -32759 -417595 -321199 -287094 -297698 -296729 -197449 -249738 -225804
1701 -225804 -156900 -239609 -286517 -205098 -40981 -96452 -113432 -193835 -329320 -447741 -439057
1690d39057K8850P3056O3794K3179j78731O8921R1919N6942N1401r4809M2229
1679b12306K22600k22115p3010k9783K3794r6204K89402j53694j4704Q6839p4673
1668b53854j19479k1844J41853K1764j22456j41998J57556N4205J18397J63501
1658b355j41646j44805k3061n0002n381J08028j29192k4356P8898q1973J17250
1647b98595P1579K3943k02911L8242J81548o3658q5298L0544J27031j29490Q2858
1636b24207J39118j42590k35123j00846K75119J59744j42706o5346K74728N1422
1626a0687q8742j46205l2126R9271j2530l3344j29510R8357j382P6797m889j7307
1614b02297j92249P184p433J0393M3536L1155P6526K7204l9993q3835n1989j51422
$$ plain form
1690 -439057 -410207 -337151 -273357 -250178 -428909 -359988 -268069 -211127 -159726 -254535 -212306
1679 -212306 10294 -211821 -284831 -314614 -290820 -387024 -97622 -251316 -266020 -179181 -253854
1668 -253854 -373333 -395177 -253324 -231560 -354016 -496014 -338458 -284253 -165856 -2355
1658 -2355 -144001 -288806 -311867 -361869 -367250 -259222 -388414 -412770 -333872 -415845 -298595
1647 -298595 -227016 -203073 -405984 -367742 -186194 -249852 -335150 -304606 -177575 -307065 -224207
1636 -224207 -85089 -227679 -462802 -563648 -288529 -128785 -271491 -336837 -62109 -10687
1626 -10687 -99429 -245634 -277760 -178489 -191019 -224363 -353873 -255516 -256898 -180101 -184990 -202297
1614 -202297 -394546 -387362 -394795 -384402 -340866 -309711 -233185 -205981 -245974 -329809 -381798 -533220
1602e33220r4254K93068K07995j01723o8213p7552L4017M8856M3636J47600p1592
1591a71382n9469k09853R9183P0732k3547p9897n1633j23569K19524L16332m5795
1580e9374k20129N1164l4255j48691J86660J9853j15849r6117J62300J24293k6005
1569a56150q7265R634j52269Q7521l233J09154J14165j40524q1540j47155N8532
1558c89130J72082j32196Q0452j8423n5234j49384n429K37440O0071j81919J56756
1547b24914j03580L9221j10949J69367L766j0844J1267k73688k167M6408K06604
1536b49509P5498j18543J80944O1121j58979K4737Q7968M94N5553K5860j59206
1525a74062j57907K6301j9314J1576Q4702k06047Q4178J12797m4153R7833r9485
$$ plain form
1602 -533220 -627474 -334406 -126411 -228134 -296347 -373899 -339882 -291026 -247390 -99790 -171382
1591 -171382 -230851 -440704 -341521 -270789 -294336 -374233 -425866 -549435 -329911 -13579 -59374
1580 -59374 -279503 -228339 -262594 -411285 -224625 -204772 -320621 -416738 -254438 -130145 -156150
1569 -156150 -243415 -233781 -386050 -298529 -301762 -192608 -78443 -218967 -300507 -447662 -389130
1558 -389130 -217048 -349244 -268792 -287215 -342449 -491833 -497262 -259822 -199751 -381670 -224914
1547 -224914 -328494 -289273 -400222 -230855 -227089 -237933 -226666 -500354 -502521 -456113 -249509
1536 -249509 -174011 -292554 -111610 -50489 -209468 -184731 -96763 -96269 -40716 -14856 -174062
1525 -174062 -331969 -305668 -324982 -313406 -228704 -434751 -350573 -237776 -281929 -184096 -283581
1514b83581p0667J22894K4997J5408n9607j05299l6164J94751l8226j73937J80679
1503b28752k8557J59526J8762j25100q5025N5976j50533o797K00765m9439k0419
1492b59593J2109J35728m9140r7048N9180o4439p5734L5705N1621j31282j16927
1481d99820N3022O746J99819Q6801j45930N4087N171K59823O1109n5910j31459
1470a06541k74767O4628L8337m3801r234J79306M2791M7890O0523L7902k24240
1459a87206n3734k20931J21124m8663q1153j3495J7252k9069M99601l8824k81721
1448c16819P6577J45849J29426j71896k46199O5137p3006K1440N3766J14379R2696
1437a08650M5263k0066j20805j5180n0784l4400n545R9530j07416k7035n893p5673
$$ plain form
1514 -283581 -354248 -231354 -206357 -190949 -250556 -355855 -392019 -197268 -235494 -409431 -228752
1503 -228752 -257309 -97783 -79021 -204121 -289146 -233170 -383703 -390500 -189735 -239174 -259593
1492 -259593 -247484 -111756 -160896 -257944 -198764 -263203 -338937 -303232 -251611 -382893 -499820
1481 -499820 -446798 -440052 -240233 -153432 -299362 -245275 -240104 19719 80828 24918 -106541
1470 -106541 -381308 -316680 -278343 -322144 -331378 -152072 -109281 -61391 -868 37034 -187206
1459 -187206 -240940 -461871 -340747 -389410 -470563 -484058 -466806 -495875 3726 -35098 -316819
1448 -316819 -240242 -94393 35033 -136863 -383062 -317925 -390931 -369491 -315725 -201346 -108650
1437 -108650 -63387 -83453 -204258 -219438 -270222 -304622 -310167 -210637 -318053 -345088 -350981 -426654
1425d26654J9989J62824m8013N4946j12904J44719r9884n5088o0279j205J94874
1414b26675K0167k31278j15298R2209O0772j38452q028k4910j363K37640N2562
1403b82654M7989K4155k2843Q265j03264j14939K2061L5604K59784J33959j69236
1392a61119j97720M7553K37498o5881j52109J85407o4392j21744O8498j33386
1382c57395j31935l1222L07542J02155J06514R3950j04135r6873o3032O5188J29563
1371B0320l23593q9630K39970l3236R36k8092j13715J01121J875M5083n7887o5908
1359c02756J46737j60415J75789j73703J19490J24283j0787r1014J3850R8819
1349e9707k79720k13372K22582Q1912J17798K01670J32538j00064j08539k40791
$$ plain form
1425 -426654 -406665 -243841 -291854 -236908 -349812 -205093 -304977 -360065 -420344 -421549 -226675
1414 -226675 -206508 -437786 -553084 -460875 -400103 -538555 -546583 -571493 -572856 -335216 -282654
1403 -282654 -234665 -210510 -233353 -225088 -328352 -443291 -421230 -385626 -125842 8117 -161119
1392 -161119 -358839 -311286 -73788 -139669 -291778 -106371 -170763 -292507 -224009 -357395
1382 -357395 -489330 -520552 -213010 -110855 -4341 89609 -14526 -111399 -174431 -109243 20320
1371 20320 -303273 -392903 -152933 -186169 -185233 -213325 -327040 -225919 -224044 -178961 -236848 -302756
1359 -302756 -156019 -316434 -140645 -314348 -194858 -70575 -81362 -172376 -158526 -59707
1349 -59707 -339427 -552799 -330217 -248305 -130507 71163 203701 103637 -4902 -245693
1339b45693j21140l4481O5728L1169O9946o6519L0323J55299o0329Q5903j85061
1328b74855n8678k27568L2033L14488j7248Q97J89296p4387n9612j95686M8402
1317c22918r2681L4233P1739j33535Q3972J60207J750p800M3284j34315P917q3664
1305c71811M5239N9915m6159j02265P9540P0577o0987M5615j1557N5586r6813
1294c33120L18027j8437p6957k11663n7361j61401K554J77247J57335P5023M1587
1283h7166j81252j70030O3658J65965O885q5425J10726j29060K04544j24510j87942
1272d13607J14868j63180P8099K37856J11525j32392j46621j9758P9365p3188
1262c27033P217K52197N5521j8399K6988j33498N8515J36816p9002J8877l6523
$$ plain form
1339 -245693 -366833 -401314 -335586 -304417 -234471 -300990 -270667 -115368 -175697 -89794 -274855
1328 -274855 -333533 -561101 -529068 -214580 -231828 -230931 -41635 -116022 -175634 -371320 -322918
1317 -322918 -415599 -381366 -309627 -443162 -359190 -198983 -197233 -205033 -161749 -296064 -288147 -371811
1305 -371811 -326572 -266657 -312816 -415081 -335541 -264964 -325951 -280336 -291893 -236307 -333120
1294 -333120 -15093 -33530 -110487 -322150 -379511 -540912 -538358 -361111 -203776 -128753 -87166
1283 -87166 -268418 -438448 -374790 -208825 -201940 -287365 -176639 -305699 -101155 -225665 -413607
1272 -413607 -298739 -461919 -383820 -145964 -34439 -166831 -313452 -333210 -253845 -327033
1262 -327033 -319816 -67619 -12098 -30497 -3509 -137007 -78492 58324 -20678 -1801 -38324
1251c8324o1202m6853j6963l727p4746K9280N3897l05777j7226J38811m8350K0255
1239c70925J9737o6289K39899j95726O154L73088j66968j02907Q514J89370j8383
1228h4436j27938n6664q6135O54l3893J64330m4479J90769K8347J3846J3139j30564
1216a53024Q3526n7303l19885J32869J1194K874J14342J12245k59637r1164Q6595
1205c37368K08510N6940n1300j00102M972J45988j24654j42431Q2467O2840j36500
1194c30638P6300K3939M8359p7538j05649L3001Q2977j41911K9389R2401L02423
1183C3053J12805j15802j48437r6042k02974K24583J60911p4147k8212Q6388P9998
1172C2124L3107l2587j94983n6593j0609n4067k9510k3831J05510k1311j95939
$$ plain form
1251 -38324 -99526 -146379 -163342 -167069 -241815 -212535 -158638 -464415 -481641 -342830 -391180 -370925
1239 -370925 -351188 -417477 -177578 -373304 -367150 5938 -161030 -263937 -255423 -66053 -84436
1228 -84436 -212374 -269038 -355173 -354519 -388412 -224082 -268561 -77792 -49445 -35599 -22460 -153024
1216 -153024 -69498 -126801 -446686 -313817 -302623 -299749 -185407 -73162 -332799 -423963 -337368
1205 -337368 -128858 -71918 -123218 -223320 -218348 -72360 -197014 -339445 -256978 -194138 -330638
1194 -330638 -254338 -230399 -182040 -259578 -365227 -332226 -249249 -391160 -361771 -269370 33053
1183 33053 145858 30056 -118381 -214423 -417397 -192814 -31903 -106050 -134262 -47874 32124
1172 32124 65231 32644 -162339 -218932 -229541 -283608 -313118 -336949 -231439 -252750 -448689
1161d48689J95881j9253K17630k24318K7588K67651k1056j72025k9034K02401
1151c224M4236o3665p3171j05806j80612Q2789J01969J5464q9807r0021K09046
1140a52802R8442j65481j5848J76521m2493j77523k36757J74313K2577J54895
1130a64156m3143M2093k7120j56406K69808j28730k7047k65179K8323j36222P1609
1119e36170L20934R7580o578q3307j33260l732j282l4253J17045J26352o9463
1108b06134K8980K17409j07162Q7173J4739k10837R8123j33352J62714m0264j22037
1097b10648q1272k6042l2264O0365J7837K2778L3092N2266l4325j02460L4579
1086b66094p1469r8572p707N8372k6159M5286j13273J38926K25447j01968P2751
$$ plain form
1161 -448689 -252808 -272061 -54431 -278749 -251161 16490 -4566 -176591 -205625 -3224
1151 -3224 41012 -22653 -95824 -201630 -382242 -299453 -197484 -182020 -271827 -361848 -152802
1140 -152802 -54360 -219841 -235689 -59168 -101661 -279184 -515941 -341628 -319051 -164156
1130 -164156 -207299 -165206 -192326 -348732 -78924 -207654 -234701 -499880 -471557 -607779 -536170
1119 -536170 -215236 -117656 -124234 -207541 -340801 -344533 -345815 -380068 -263023 -136671 -206134
1108 -206134 -177154 40255 -66907 20266 35005 -175832 -77709 -211061 -48347 -88611 -210648
1097 -210648 -291920 -317962 -350226 -289861 -272024 -249246 -216154 -163888 -198213 -300673 -266094
1086 -266094 -337563 -436135 -443842 -385470 -411629 -366343 -479616 -340690 -115243 -217211 -144460
1075a44460R6524k71343k4447J47581M0156J40193r0380Q126J56886L3831j33504
1064d0837J366K2515j04670k38191O9904J60879J6529k35728j56425J29075j2714
1053c88297J06212J73270J1307M4032O2307o0357j7080k317k07346o8936J76118
1042a71087l3350j37351J15312J26253L8522j42044J3810l2345J11906J26996
1032A6622J9151k16339k61177R7438j26569K28872m3228J4476j25709K43919R8942
1021e3602k11498M184m320j69609J12874L2426R7410J14343p8287M8696q1439
1010a88822k19588n4841J12824J88693k8572J8285K09910l71824k61274K41801
1000c53408K56162j09863j66198J17292O7867K7959Q6285j59051k67m2131m4887
$$ plain form
1075 -144460 -47936 -319279 -343726 -196145 -155989 -15796 -106176 -98050 58836 92667 -40837
1064 -40837 -39471 -16956 -121626 -359817 -289913 -129034 -112505 -348233 -504658 -375583 -388297
1053 -388297 -282085 -108815 -97508 -53476 8831 -51526 -68606 -70923 -278269 -347205 -171087
1042 -171087 -204437 -341788 -226476 -100223 -61701 -203745 -189935 -222280 -110374 16622
1032 16622 35773 -180566 -441743 -344305 -470874 -242002 -285230 -270754 -396463 -152544 -53602
1021 -53602 -265100 -260916 -265236 -434845 -321971 -289545 -192135 -77792 -156079 -107383 -188822
1010 -188822 -408410 -463251 -350427 -161734 -190306 -172021 37889 -333935 -595209 -353408
1000 -353408 -97246 -207109 -373307 -256015 -188148 -160189 -73904 -232955 -233222 -275353 -320240
989c20240J95654J14448j18747j68701M4409k0303J19762k21785J21636J24039
979a29828P9931j04258j88664N7397k8150r9473j19576K03115J00723J17196n7071
968a68658j43617J49247J20797j19227k9714j12164k3497K3551r2546j1945J95130
957b12643R0169j95372j49231J04696r432J0278M2992L5177N1273o1850r1730
946c85673R2236k3412j83190K6851N6751q662M5834J23946L6601P9251k9967j04305
934b73739L2749K5707J61959J10021M9793j50264j29038N7020j3411l2869K661
923a59411L1428m1311M4953m8783P373p2675l5216p5488p4489p505J00587j84888
911e15425Q9341J77805q3343j737l5871K8530R6806j54585j36929K42157J94227
$$ plain form
989 -320240 -124586 -10138 -128885 -297586 -253177 -273480 -153718 -375503 -253867 -129828
979 -129828 -49897 -154155 -342819 -285422 -313572 -413045 -532621 -329506 -228783 -111587 -168658
968 -168658 -312275 -163028 -42231 -161458 -191172 -303336 -326833 -303282 -395828 -407773 -212643
957 -212643 -122474 -317846 -467077 -362381 -371813 -361535 -318543 -283366 -232093 -293943 -385673
946 -385673 -293437 -316849 -500039 -473188 -416437 -425099 -379265 -255319 -218718 -139467 -169434 -273739
934 -273739 -240990 -215283 -53324 56697 106490 -43774 -172812 -115792 -129203 -162072 -159411
923 -159411 -127983 -169294 -124341 -173124 -165751 -238426 -273642 -349130 -423619 -431124 -330537 -515425
911 -515425 -426084 -248279 -331622 -333359 -369230 -340700 -243894 -398479 -535408 -293251 -99024
900i9024K20969j7627n6150k08582P440Q2006O5605J2209r4p1293k03684K3517
888b44708j87531P9218K85350r0834m7004Q3798q2145o993j07586j01956J17449
877c02942m5311J32921O2946j38616j57049K32316J77109l8552p0886N4769J4211
866g9084L7495k23188N3123K0624p8303j38808K45256N811j01557J30002j89559
855c18188J08710P5804k289Q607q5919K4213O2906N2524J23760o2500l3529l2669
843g8570K22k02834q9908J47510m4177j33927L1772K51067j4078J3424K01154
832H1655o5495j19959j12791k68982Q9089K05994J12883j86901j3278J65528j36897
821b49154K83744j5536k05962k323J24876j43937p3959J49619m8778M6461P0337
$$ plain form
900 -99024 121945 104318 48168 -160414 -152974 -70968 -5363 6846 6752 -64541 -268225 -244708
888 -244708 -432239 -353021 -67671 -158505 -205509 -121711 -203856 -210849 -318435 -420391 -302942
877 -302942 -348253 -215332 -152386 -291002 -448051 -215735 -38626 -77178 -148064 -93295 -79084
866 -79084 -41589 -264777 -211654 -191030 -269333 -408141 -162885 -157074 -258631 -128629 -318188
855 -318188 -209478 -133674 -135963 -127356 -213275 -189062 -126156 -73632 50128 -12372 -45901 -78570
843 -78570 -78348 -281182 -371090 -223580 -267757 -401684 -369912 -118845 -132923 -119499 81655
832 81655 16160 -103799 -216590 -485572 -396483 -190489 -77606 -264507 -277785 -112257 -249154
821 -249154 34590 19054 -186908 -189231 -64355 -208292 -282251 -132632 -181410 -134949 -64612
810f4612l40119K8283Q6460Q8565J49976j22096q9826K07843J0448j71986N5012
799a62052L0159j28241o3035k564k4969O936J46791l71l6715p3765m1942J76708
787a73060R5375r7723m7509J09940q9705j03689J50817L270k9458o9058j88349
776d39149K6919J64799j87298l4365L03153J18874k2092m5754j99674m8209J36623
765b26173K21864m5892J43313j40357J6716j12608o7912n4289o2614J47501j8335
754a98786J1240m8004q9820J39167Q0132l0112J16744L5667n0292K8271o3438
743f9231j24373J6017q6779J01175m8972J3282Q9804K64528m60111q3542r3584
732d81786K8421K12886l5611j43666J14572R0602M8457Q694m2843j79550J3368
$$ plain form
810 -64612 -404731 -376448 -289988 -201423 -51447 -173543 -263369 -55526 -45078 -217064 -162052
799 -162052 -131893 -260134 -323169 -325733 -350702 -343766 -196975 -197346 -234061 -307826 -349768 -173060
787 -173060 -77685 -175408 -222917 -112977 -202682 -306371 -155554 -152284 -181742 -250800 -439149
776 -439149 -412230 -247431 -434729 -469094 -165941 -47067 -69159 -114913 -314587 -362796 -226173
765 -226173 -4309 -50201 93112 -47245 -30529 -143137 -211049 -265338 -327952 -180451 -198786
754 -198786 -187546 -235550 -325370 -186203 -106071 -136183 -19439 16228 -34064 -5793 -69231
743 -69231 -193604 -177587 -264366 -163191 -212163 -198881 -109077 155451 -304660 -388202 -481786
732 -481786 -453365 -240479 -276090 -419756 -305184 -214582 -166125 -157431 -200274 -379824 -366456
721c66456q7030K94962N5564k52206J22826o8369j32852r6475J72190K9198m1247
$$ plain form
721 -366456 -453486 -158524 -102960 -355166 -232340 -300709 -433561 -530036 -357846 -328648 -369895
$$ [...]
##END NTUPLES=NMR SPECTRUM
##END=
