##TITLE=1H_DE-80H_X3
 200.13MHz, d2o
 8 sc
 
 19ns.26.2.2025
##JCAMPDX= 6.0         $$ Bruker NMR JCAMP-DX V2.0
##DATA TYPE= NMR SPECTRUM
##DATA CLASS= NTUPLES
##ORIGIN= UXNMR, Bruker Analytische Messtechnik GmbH
##OWNER= pz
$$ XWIN-NMR		Version 3.5
$$ Tue Sep 30 10:32:15 2025 Russian Standard Time (UT+4h)  Yarkov@DPX200
##.OBSERVE FREQUENCY= 200.1313
##.OBSERVE NUCLEUS= ^1H
##.ACQUISITION MODE= SIMULTANEOUS
##.ACQUISITION SCHEME= undefined
##.AVERAGES= 8
##.DIGITISER RES= 18
##SPECTROMETER/DATA SYSTEM= spect
##.PULSE SEQUENCE= zg30
##.SOLVENT NAME= CDCl3
##.SHIFT REFERENCE= (INTERNAL, CDCl3, 0, 15.4847)
##AUDIT TRAIL= $$ (NUMBER, WHEN, WHO, WHERE, WHAT)
$$ ##TITLE= Audit trail, XWIN-NMR		Version 3.5
$$ ##JCAMPDX= 5.01
$$ ##ORIGIN= Bruker BioSpin GmbH
$$ ##OWNER= Yarkov
$$ C:/Bruker/XWIN-NMR/data/yarkov2/nmr/H-C/1/pdata/1/auditp.txt
$$ ##AUDIT TRAIL=  $$ (NUMBER, WHEN, WHO, WHERE, WHAT)
(   1,<2025-09-30 10:31:28.57 +0400>,<Yarkov>,<DPX200>,
      <created by zg, POWCHK disabled, PULCHK disabled
       configuration hash MD5:
       00 E9 B6 7A A2 85 ED C7 34 08 36 98 17 FE 4E 26
       data hash MD5: 16K
       38 84 56 03 A5 8E 1F 4A 26 D8 E4 F6 8C EF 19 F9>)
(   2,<2025-09-30 10:31:33.42 +0400>,<Yarkov>,<DPX200>,
      <Start of raw data processing
       efp BC_mod = 2 LB = 0.25 FT_mod = 6 PKNL = 1 PHC0 = -2078.854 PHC1 = 16.19097 SI = 16K 
       data hash MD5: 16K
       4B 3C 1D A0 45 1F 02 10 F2 E2 27 5A 6E 61 DD 1A>)
(   3,<2025-09-30 10:31:37.93 +0400>,<Yarkov>,<DPX200>,
      <abs ABSG = 5 
       data hash MD5: 16K
       A3 F2 BF 74 5A AA 94 D3 67 14 1C 1B A3 83 01 89>)
$$ ##END=
$$ 
$$ hash MD5
$$ C9 C6 9B 73 93 83 C3 EC 98 3E 37 72 36 01 04 F7
##$RELAX= 
##$RELAX= 
##$RELAX= 
##$RELAX= 
##$RELAX= 
##$RELAX= 
$$ Bruker specific parameters
$$ --------------------------
##$DU= <C:/Bruker/XWIN-NMR>
##$EXPNO= 1
##$NAME= <H-C>
##$PROCNO= 1
##$TYPE= <nmr>
##$USER= <yarkov2>
##$AMP= (0..31)
100 100 100 100 100 100 100 100 100 100 100 100 100 100 100 100 100 100 
100 100 100 100 100 100 100 100 100 100 100 100 100 100 
##$AQSEQ= 0
##$AQ_mod= 1
##$AUNM= <au_zg>
##$AUTOPOS= <>
##$BF1= 200.13
##$BF2= 200.13
##$BF3= 200.13
##$BF4= 200.13
##$BF5= 200.13
##$BF6= 200.13
##$BF7= 200.13
##$BF8= 200.13
##$BYTORDA= 1
##$CFDGTYP= 0
##$CFRGTYP= 5
##$CHEMSTR= <none>
##$CNST= (0..31)
1 1 145 1 1 1 1 1 1 1 1 1 1 1 1 1 1 1 1 1 1 1 1 1 1 1 1 1 1 1 1 1 
##$CPDPRG= <>
##$CPDPRG1= <>
##$CPDPRG2= <>
##$CPDPRG3= <>
##$CPDPRG4= <mlev>
##$CPDPRG5= <mlev>
##$CPDPRG6= <mlev>
##$CPDPRG7= <mlev>
##$CPDPRG8= <mlev>
##$CPDPRGB= <>
##$CPDPRGT= <>
##$D= (0..31)
0 0.7 0 0 0 0 0 0 0 0 0 0.03 0 0 0 0 0 0 0 0 0 0 0 0 0 0 0 0 0 0 0 0 
##$DATE= 1759213888
##$DBL= (0..7)
120 120 120 120 120 120 120 120 
##$DBP= (0..7)
150 150 150 150 150 150 150 150 
##$DBP07= 0
##$DBPNAM0= <>
##$DBPNAM1= <>
##$DBPNAM2= <>
##$DBPNAM3= <>
##$DBPNAM4= <>
##$DBPNAM5= <>
##$DBPNAM6= <>
##$DBPNAM7= <>
##$DBPOAL= (0..7)
0.5 0.5 0.5 0.5 0.5 0.5 0.5 0.5 
##$DBPOFFS= (0..7)
0 0 0 0 0 0 0 0 
##$DE= 6
$$ [...]
##$SUBNAM3= <"">
##$SUBNAM4= <"">
##$SUBNAM5= <"">
##$SUBNAM6= <"">
##$SUBNAM7= <"">
##$SUBNAM8= <"">
##$SUBNAM9= <"">
##$SW= 18.0517328524113
##$SWIBOX= (0..15)
0 0 2 0 0 0 0 0 0 0 0 0 0 0 0 0 
##$SW_h= 3612.71676300578
##$TD= 16384
##$TD0= 1
##$TE= 0
##$TE2= 300
##$TE3= 300
##$TEG= 300
##$TL= (0..7)
0 120 120 120 120 120 120 120 
##$TP= (0..7)
150 150 150 150 150 150 150 150 
##$TP07= 0
##$TPNAME0= <>
##$TPNAME1= <>
##$TPNAME2= <>
##$TPNAME3= <>
##$TPNAME4= <>
##$TPNAME5= <>
##$TPNAME6= <>
##$TPNAME7= <>
##$TPOAL= (0..7)
0.5 0.5 0.5 0.5 0.5 0.5 0.5 0.5 
##$TPOFFS= (0..7)
0 0 0 0 0 0 0 0 
##$TUNHIN= 0
##$TUNHOUT= 0
##$TUNXOUT= 0
##$USERA1= <user>
##$USERA2= <user>
##$USERA3= <user>
##$USERA4= <user>
##$USERA5= <user>
##$V9= 5
##$VALIST= <valist>
##$VCLIST= <CCCCCCCCCCCCCCC>
##$VD= 0
##$VDLIST= <DDDDDDDDDDDDDDD>
##$VPLIST= <PPPPPPPPPPPPPPP>
##$VTLIST= <TTTTTTTTTTTTTTT>
##$WBST= 1024
##$WBSW= 4
##$XGAIN= (0..3)
0 0 0 0 
##$XL= 0
##$YL= 0
##$YMAX_a= 333721
##$YMIN_a= -286837
##$ZGOPTNS= <>
##$ZL1= 120
##$ZL2= 120
##$ZL3= 120
##$ZL4= 120
##$ABSF1= 15.48466
##$ABSF2= -2.567189
##$ABSG= 5
##$ABSL= 3
##$ALPHA= 0
##$AQORDER= 0
##$ASSFAC= 0
##$ASSFACI= 0
##$ASSFACX= 0
##$ASSWID= 0
##$AUNMP= <proc_1d>
##$AZFE= 0.1
##$AZFW= 0.1
##$BCFW= 0
##$BC_mod= 2
##$BYTORDP= 0
##$COROFFS= 0
##$CY= -3
##$DATMOD= 1
##$DC= 0
##$DFILT= <>
##$DTYPP= 0
##$F1P= 0
##$F2P= 0
##$FCOR= 1
##$FTSIZE= 16384
##$FT_mod= 6
##$GAMMA= 0
##$GB= 0
##$INTBC= 1
##$INTSCL= 3.241238e-09
##$ISEN= 128
##$LB= 0.25
##$LEV0= 0
##$LPBIN= 0
##$MAXI= 10000
##$MC2= 0
##$MEAN= 0
##$ME_mod= 0
##$MI= 1.114404
##$NCOEF= 0
##$NC_proc= -7
##$NLEV= 6
##$NOISF1= 3.799351
##$NOISF2= 2.8
##$NSP= 0
##$NTH_PI= 0
##$NZP= 0
##$OFFSET= 15.48466
##$PC= 1
##$PHC0= -2078.854
##$PHC1= 16.19097
##$PH_mod= 1
##$PKNL= yes
##$PPARMOD= 0
##$PSCAL= 0
##$PSIGN= 0
##$REVERSE= no
##$SF= 200.130007413891
##$SI= 16384
##$SIGF1= 3
##$SIGF2= 2
##$SINO= 0.751879
##$SIOLD= 32768
##$SREGLST= <19F.Aceton>
##$SSB= 0
##$STSI= 16384
##$STSR= 0
##$SW_p= 3612.71676300578
##$SYMM= 0
##$S_DEV= 0
##$TDeff= 16384
##$TDoff= 0
##$TI= <>
##$TILT= no
##$TM1= 0
##$TM2= 0
##$TOPLEV= 0
##$USERP1= <user>
##$USERP2= <user>
##$USERP3= <user>
##$USERP4= <user>
##$USERP5= <user>
##$WDW= 1
##$XDIM= 16384
##$YMAX_p= 401377049
##$YMIN_p= -859802
$$ End of Bruker specific parameters
$$ ---------------------------------
##NTUPLES= NMR SPECTRUM
##VAR_NAME=  FREQUENCY,     SPECTRUM/REAL,   SPECTRUM/IMAG
##SYMBOL=    X,             R,               I
##VAR_TYPE=  INDEPENDENT,   DEPENDENT,       DEPENDENT
##VAR_FORM=  AFFN,          ASDF,            ASDF
##VAR_DIM=   16384,         16384,           16384
##UNITS=     HZ,            ARBITRARY UNITS, ARBITRARY UNITS
##FACTOR=    0.220516191357247, 1,           1
##FIRST=     3098.94515034502, 0,            0
##LAST=      -513.771612660756, 0,           0
##MIN=       -513.771612660756, -859802,     0
##MAX=       3098.94515034502, 401377049,    0
$$ Real data points
##PAGE= N=1
##DATA TABLE= (X++(R..R)), XYDATA
$$ [...]
6523B755168j65280k27518j32158Q051N6666N9187M6160r432k6922k2714j58781
6512B182427k1313j4323j23630Q33J11779j1652n2524k4711J54368j80577L3950
6501B054627J59758q7323p7960P7547l4387Q279k6698j9N7415o8373m3891L8841
6489B057816J71676n6891N1738n004P6737j25769o7328k4129J22225P1179o2416
6478B209834N165O3015R8459r3246p6414J65847M3842K8402r9901o5729j1802
6467B267472n1622p5310J6871k2715J02380k0575l2249O9338k6456j09171j55997
6456A961966K8092o6306k29332p319N8694j45677J29362L2575J4409k047o0132
6445A714285n5238o0680j1883j8413N021q49O9002J15116m5329o628N7332l7637
$$ y = [2755168, 2589888, 2362370, 2230212, 2238263, 2294929, 2354116, 2400276, 2390844, 2363922, 2341208, 2182427, 2161114, 2146791, 2023161, 2023994, 2135773, 2124121, 2071597, 2046886, 2201254, 2020677, 2054627, 2214385, 2127062, 2049102, 2126649, 2092262, 2100541, 2073843, 2073824, 2131239, 2062866, 2018975, 2057816, 2229492, 2172601, 2224339, 2219335, 2296072, 2170303, 2102975, 2078846, 2201071, 2272250, 2209834, 2214999, 2278014, 2376473, 2283227, 2206813, 2372660, 2416502, 2444904, 2345003, 2279274, 2267472, 2215850, 2140540, 2157411, 2134696, 2237076, 2216501, 2184252, 2253590, 2227134, 2117963, 1961966, 1990058, 1923752, 1694420, 1687101, 1745795, 1600118, 1729480, 1762055, 1776464, 1774417, 1714285, 1659047, 1598367, 1586484, 1568071, 1573092, 1572243, 1641245, 1756361, 1711032, 1704404, 1761736, 1724099]
6433A724099l4236J11858M3676R2993N6794j93228J16519k3111M9186j00313K7306
6422A871543O643R3608j14883j2060J3179L5450Q9732q0226O2048J01850J4100
6411B080984n5495K5603J7230n4674j01119p4009j44368Q8427J20387j4413j3249
6400A875304q526k421M9390r9349q9159M004J61302m6582O3716j1755q4281J2210
6388A823853L2014j1788k9241n7366J19780J14463k7776M2853M0693n1091J4736
6377B011130l9356q5640J444J58517N1551p2691J19193j9003M4689k3950J4587
6366B160471K487J41430P9903L8358j40972k49866M5720Q0646L009j41196M0114
6355B060104N0619p6077K7140N6906r0602Q6898o7113m5504N0958J19578q941
$$ y = [1724099, 1689863, 1801721, 1845397, 1938390, 1995184, 1801956, 1918475, 1895364, 1944550, 1844237, 1871543, 1878186, 1971794, 1856911, 1844851, 1858030, 1893480, 1983212, 1902986, 1965034, 2066884, 2080984, 2025489, 2051092, 2068322, 2013648, 1912529, 1838520, 1694152, 1782579, 1902966, 1888553, 1875304, 1866778, 1864357, 1913747, 1814398, 1725239, 1729243, 1890545, 1843963, 1907679, 1895924, 1811643, 1823853, 1855867, 1844079, 1814838, 1757472, 1877252, 1991715, 1963939, 2006792, 2047485, 1996394, 2011130, 1971774, 1886134, 1887578, 2046095, 2097646, 2024955, 2144148, 2125145, 2169834, 2145884, 2160471, 2162958, 2304388, 2384291, 2422649, 2281677, 2031811, 2077531, 2158177, 2161186, 2019990, 2060104, 2110723, 2034646, 2061786, 2118692, 2028090, 2114988, 2047875, 2002371, 2053329, 2172907, 2163966]
6344B163966j58160q5891J94736J58875q9384q6861L8386L9853q9066J29323O7054
6333B282831M863p9905l1016N565J61527K3046j05350r2303N871r0859j8552P7111
6321B142829p8225R9908k1562p0683J99844J0577j34185R8912n7519m1172n4869
6310B093855J40178L2732j33975J3915P7168m8734k1252Q790J05919J67552j36039
6299B300109k15096L032J74734Q29R850J26740j8452J6462N8241k12885M0287
6288B283851J6519l0400k1049p596J06755n3921M6166M2424m1733M3241J20294
6277B504551J04266N0601j76244K1144N4521q2550Q8052N6191K5487N2893J22781
6266B821693O3176K4715O90Q9192J59190J7029O0052L6661R0125K9445P6983J98541
$$ y = [2163966, 2005806, 1919915, 2114651, 2273526, 2184142, 2097281, 2135667, 2175520, 2086454, 2215777, 2282831, 2287694, 2207789, 2176773, 2182338, 2343865, 2366911, 2261561, 2169258, 2175129, 2084270, 2065718, 2142829, 2064604, 2164512, 2142950, 2072267, 2272111, 2282688, 2148503, 2247415, 2189896, 2148724, 2093855, 2234033, 2266765, 2132790, 2146705, 2223873, 2175139, 2153887, 2162677, 2268596, 2436148, 2300109, 2085013, 2088045, 2262779, 2263608, 2273458, 2400198, 2381746, 2398208, 2456449, 2243564, 2283851, 2300370, 2269970, 2248921, 2241325, 2348080, 2294159, 2340325, 2382749, 2341016, 2384257, 2504551, 2608817, 2659418, 2483174, 2504318, 2558839, 2476289, 2564341, 2620532, 2646019, 2698912, 2821693, 2884869, 2909584, 2910274, 2999466, 3158656, 3175685, 3235737, 3272398, 3362523, 3391968, 3468951, 3667492]
6254C667492N9104P0521k8791J59565j0676j80406n7470j08841o7023j12778n9655
6243C331042Q9755r6070m1086j5874m3275j3611m08q899k6911M6179j4912J7387
6231C223317r294o961q3337P3533o104l6440J09977q1633J24429K5758O4935l263
6219C394917r9260M5771O3037n2206O8743J01992o7183L5279j4095M5798N0298
6208C573091O6144R1970P323K2711O4138J67334k2739J13949L1498m4941R1744
6197D162222j9835J68202L2303J90686M0383J44314l7677o9161J55661J75778
6187D942876J05481Q6293N9471p7610J25307K2928n962K3228K74702l7029j7179
6176E502506J54327l939J04545j22876J119O038Q2494J39962N6850J40868n0300
$$ y = [3667492, 3726596, 3797117, 3768326, 3927891, 3917215, 3736809, 3679339, 3570498, 3503475, 3390697, 3331042, 3420797, 3324727, 3283641, 3267767, 3224492, 3210881, 3210473, 3201574, 3174663, 3220842, 3205930, 3223317, 3214023, 3207062, 3123725, 3197258, 3191154, 3154714, 3264691, 3183058, 3307487, 3333245, 3398180, 3394917, 3295657, 3341428, 3404465, 3352259, 3421002, 3522994, 3455811, 3491090, 3476995, 3522793, 3573091, 3639235, 3731205, 3738528, 3761239, 3825377, 3992711, 3969972, 4083921, 4115419, 4070478, 4162222, 4142387, 4310589, 4342892, 4533578, 4573961, 4718275, 4680598, 4611437, 4767098, 4942876, 5048357, 5134650, 5194121, 5116511, 5241818, 5264746, 5258784, 5282012, 5556714, 5519685, 5502506, 5656833, 5652894, 5757439, 5634563, 5635682, 5641720, 5724214, 5864176, 5921026, 6061894, 6011594]
6165F011594j2058l7830J09346J21864r9329J91561R9318N6557R299J52843P1071
6154F674236M419m0195P595J00838J44477O5039L605R6005L45584J08429j92296
6143G317736l6209K6624l4092K3099J52502k4291m2259j17595K06353J53426J1930
6132G637224p6074Q2723R8600J9504P5653N7468m8481j08778l7190J03312r9493
6121G704468M6966M2905J55669L4628j24978q423o6932Q730j9593Q3055N3562
6110G910057J55001O9308q8857m2499J44944l4473L8237J09256L3553J00402J85858
6099H580787K10250j0532J85068K13467J57044N0626J43951K40555K24493K49750
6089A0245459J53628K85737J49504L53026L23751J92070M59319L42663K65357
$$ y = [6011594, 5999536, 5961706, 6071052, 6192916, 6093587, 6285148, 6384466, 6441023, 6450322, 6603165, 6674236, 6678655, 6638460, 6646055, 6746893, 6891370, 6956409, 6960014, 7056019, 7401603, 7510032, 7317736, 7281527, 7308151, 7274059, 7297158, 7449660, 7425369, 7383110, 7265515, 7471868, 7625294, 7637224, 7561150, 7643873, 7742473, 7761977, 7837630, 7895098, 7846617, 7737839, 7700649, 7803961, 7704468, 7751434, 7794339, 7950008, 7984636, 7859658, 7851235, 7784303, 7793033, 7773440, 7856495, 7910057, 8065058, 8134366, 8045509, 8003010, 8147954, 8113481, 8151718, 8260974, 8294527, 8394929, 8580787, 8791037, 8780505, 8965573, 9179040, 9336084, 9386710, 9530661, 9771216, 9995709, 10245459, 10399087, 10684824, 10834328, 11187354, 11511105, 11703175, 12162494, 12505157, 12770514]
6080A2770514K72661M15902M16309M72932N65635M77947L75447N56462Q51568
6071A7175377O79732O99581R14059R91947J143275J097224J279727J490968J528143
6062B7000033J722205K029169K448793K627331K711871K923058K852213K573571
6054D6888244K197228J602398P89945R3522o25000r97199j342609j570854j382755
6045D5652920j330932j080612q17808n49129k64814m1391Q9735N00634Q62774
6036D3021377R39269J183177J328841J656948J903500K163981K673500L029259
6028E7899852L612560M307801M821513M884906N016704M520845L447278K133927
6020I0645386N40673j282352k557820l455236m369046m728607m639366m283261
$$ y = [12770514, 13043175, 13459077, 13875386, 14348318, 14913953, 15391900, 15767347, 16323809, 17175377, 17855109, 18554690, 19468749, 20460696, 21603971, 22701195, 23980922, 25471890, 27000033, 28722238, 30751407, 33200200, 35827531, 38539402, 41462460, 44314673, 46888244, 49085472, 50687870, 51477815, 51571337, 50946337, 49949138, 48606529, 47035675, 45652920, 44321988, 43241376, 42423568, 41874439, 41609625, 41568234, 41657969, 42158603, 43021377, 43960646, 45143823, 46472664, 48129612, 50033112, 52197093, 54870593, 57899852, 61512412, 65820213, 70641726, 75526632, 80543336, 85064181, 88511459, 90645386, 91186059, 89903707, 87345887, 83890651, 79521605, 74792998, 70153632, 65870371]
6012F5870371l969508l555136l004067k736494k241882j811739j601913j277878
6004D5671754j069486q48384n35543k50261n488O4589N40208P18981J065619J482248
5994D6834237J658668J906274J760334J576047J198152M64156m76112j224312
5986E3697444j920366k514121k709396k946943k935502k943044k636709k363193
5978C2728170k156318j930847j699273j576431j413047j071084j066683j002534
5970B0811953r17156p54916p24957p49688q12842o67160n99093n99655n66517
5961A4419969m19522l65650n65934m36079m53208m50743m04109k86833l41751
5952A0696140l14498j17517l05674j51898j32012r1681k63177k79778j01533N658
$$ y = [65870371, 61900863, 58345727, 55341660, 52605166, 50363284, 48551545, 46949632, 45671754, 44602268, 43753884, 43218341, 42968080, 42962592, 43027181, 43567389, 44286370, 45351989, 46834237, 48492905, 50399179, 52159513, 53735560, 54933712, 55397868, 54921756, 53697444, 51777078, 49262957, 46553561, 43606618, 40671116, 37728072, 35091363, 32728170, 30571852, 28641005, 26941732, 25365301, 23952254, 22881170, 21814487, 20811953, 19894797, 19139881, 18414924, 17665236, 16852394, 16185234, 15586141, 14986486, 14419969, 14000447, 13634797, 13068863, 12632784, 12179576, 11728833, 11324724, 11037891, 10696140, 10381642, 10264125, 9958451, 9806553, 9674541, 9582860, 9319683, 9039905, 8938372, 8944030]
5942H944030j72356j70856p4957q2241o7716j63672L4206j25842k39191P5436
5932G956841n0452j23585j97340j05807j47132N8230r3515j69968j47443j63680
5922F816149j50240O6389N9282q9840j03890n0945J44032J6708J7827O4860j08762
5911F681570j03457L5518R093j7272R887l18m3648M0145n234o4192p3322j34815
5899F333955l1910l9233l8853k6283j12484N0711j29492j13625p5706j2461r1653
5888E712966q0418k1718n3511Q9396r337l3126M2505J1699j02764q4417m8431
5877E422844J18877O7490o7349j15927J23568J35979m7718p8620q8221l6085J24093
5866E558931N0921M1375l1452j99358m5948q1625l9199J72564P9837j73984k68169
$$ y = [8944030, 8771674, 8600818, 8525861, 8443620, 8375904, 8212232, 8246438, 8120596, 7881405, 7956841, 7906389, 7782804, 7585464, 7479657, 7332525, 7390755, 7297240, 7127272, 6979829, 6816149, 6665909, 6732298, 6791580, 6701740, 6597850, 6546905, 6690937, 6707645, 6725472, 6790332, 6681570, 6578113, 6613631, 6622724, 6605452, 6615339, 6615021, 6571373, 6611518, 6606284, 6542092, 6468770, 6333955, 6302045, 6262812, 6223959, 6197676, 6085192, 6135903, 6006411, 5892786, 5817080, 5804619, 5712966, 5632548, 5610830, 5557319, 5646715, 5637378, 5604252, 5646757, 5658456, 5555692, 5471275, 5422844, 5541721, 5609211, 5541862, 5425935, 5549503, 5685482, 5637764, 5559144, 5470923, 5434838, 5558931, 5609852, 5651227, 5619775, 5420417, 5374469, 5292844, 5253645, 5426209, 5506046, 5332062, 5063893]
5855E063893j30986J14419K9503K849m2030j1588M3397O366k32796j03732J6855
5844D756150J70255n5161m3357N4321l2341j06913J2112J70450L2811n8901n4661
5833D844765J47078K0415k24180J5289l7550O5234J1900O2123j09987n9321P2336
5822D808102K5659j19192j4886J64238J60713n9689l4262M1656O7985J517L8183
5811E080024J81113j3913o6067M7407J46512j43150n2303J12355R4592p0446J10165
5800E426289m7634k4919j38923q2932l2274Q5128J61801p1718m036q2388m2303
5789E146091J37441o2231O281o2289m7847j50704p5893M1826R1648k2480j37273
5778D864570P4937m6769R8324N2930q5640k156P5071N4951k4284j0093K064j9955
$$ y = [5063893, 4932907, 5047326, 5076829, 5079678, 5037648, 5026060, 5069457, 5075823, 4843027, 4739295, 4756150, 4926405, 4871244, 4827887, 4882208, 4849867, 4742954, 4755066, 4925516, 4958327, 4899426, 4844765, 4991843, 5012258, 4788078, 4803367, 4765817, 4831051, 4842951, 4905074, 4795087, 4735766, 4808102, 4833761, 4714569, 4699683, 4863921, 5024634, 4964945, 4930683, 4972339, 5040324, 5041841, 5080024, 5261137, 5247224, 5181157, 5228564, 5375076, 5231926, 5179623, 5291978, 5386570, 5316124, 5426289, 5378655, 5353736, 5214813, 5131881, 5099607, 5184735, 5346536, 5274818, 5270782, 5188394, 5146091, 5283532, 5221301, 5227582, 5165293, 5117446, 4966742, 4890849, 4932675, 5024323, 5001843, 4864570, 4939507, 4892738, 4991062, 5043992, 4958352, 4956196, 5031267, 5086218, 5061934, 5051841, 5053905, 5033950]
5766E033950N6647O9335K30390l1244k1628J10255L6375P5766r479J06359K83097
5755E939823J29547M0438K12872n3943q5035P4181J34296K3428r3593n1353L3331
5744F303992K09909l8892N6952n8271p0233N5243J01673L2711O3163K03088N8758
5733F918093J36289P007N5293Q8921K51967k0143J77844K68160p8176p615M5248
5722G842888l707R1171l5692o8771Q6337l3907j98178P895J48331L2469j0248
5711G858588N7947J38727n8134N6703R2125j8063L5053J8306J45824N4017O8200
5700H449293M3668L6162r1845J08837K97511K16913k0032J24791K70016J21106
5690I556420p8370M4038q3843P8067j35460j65252m0892k0873Q1935j01428J81644
$$ y = [5033950, 5090597, 5159932, 5390322, 5359078, 5337450, 5447705, 5484080, 5559846, 5550367, 5656726, 5939823, 6069370, 6109808, 6322680, 6268737, 6183702, 6257883, 6392179, 6415607, 6322014, 6270661, 6303992, 6513901, 6475009, 6531961, 6473690, 6403457, 6458700, 6560373, 6593084, 6656247, 6859335, 6918093, 7054382, 7061389, 7116682, 7205603, 7457570, 7437427, 7615271, 7883431, 7805255, 7797640, 7842888, 7839181, 7930352, 7894660, 7825889, 7912226, 7878319, 7680141, 7688036, 7836367, 7868836, 7858588, 7916535, 8055262, 7997128, 8053831, 8145956, 8127893, 8162946, 8181252, 8327076, 8381093, 8449293, 8492961, 8529123, 8437278, 8546115, 8843626, 9060539, 9040507, 9165298, 9435314, 9556420, 9478050, 9522088, 9438245, 9516312, 9380852, 9215600, 9174708, 9153835, 9235770, 9134342, 9315986]
5679I315986m7129R8979k264P3105K6770J52792K81975P0822J93642K99273R2232
5668A0556183L23290J35385J82235N38798N18728M11465O39192O47592L86692
5659A4339560M85888L21876R1663J16993k03042l82918n5369j48163m0535M6745
5649A4572698j5662K08791L07984L55840L64863L82607L97927N61357N54928P98118
5639A8489451Q50193Q00255O99356Q75938Q76059J226219J467374J352693J544563
5630B8182101J706782J770375J912486J897916J841216J849631J977201K014977
5622D3152685K089375K378184K944509L321633L652323M334930M684787N299073
5614G1857499N877136O402809O903360P327767P552487P712491P739572P316966
$$ y = [9315986, 9268857, 9367836, 9365572, 9438677, 9465447, 9618239, 9900214, 9971036, 10164678, 10463951, 10556183, 10879473, 11014858, 11197093, 11735891, 12254619, 12666084, 13305276, 13952868, 14339560, 14825448, 15147324, 15238987, 15355980, 15152938, 14770020, 14714651, 14566488, 14525953, 14572698, 14557036, 14765827, 15073811, 15429651, 15794514, 16177121, 16575048, 17136405, 17691333, 18489451, 19339644, 20139899, 20839255, 21715193, 22591252, 23817471, 25284845, 26637538, 28182101, 29888883, 31659258, 33571744, 35469660, 37310876, 39160507, 41137708, 43152685, 45242060, 47620244, 50564753, 53886386, 57538709, 61873639, 66558426, 71857499, 77734635, 84137444, 91040804, 98368571, 105921058, 113633549, 121373121, 128690087]
5606A28690087O763984N693973M255990K835955Q54405j005826k550536m017150
5598A41520882n033791n847349o352467o606196p090359o902351p101383p004068
5590H9582918o415537n719963n250304m733545m290494l935979l516101l215088
5582E2505907k872098k555497k345535k076371j851747j832560j767259j623815
5574C5581025j279110j341316j327739j134132j068844j076247j048608r54970
5566B6350059r94801q98487p10569p45755p20041o12562o94628m97181o97526
5557A9778509o73332p05165o09167m94768o65053m89852n48569n08709m01722
5548A4682172l36394n24999m23952l97688l77499l27623l89897l70176k22344
$$ y = [128690087, 135454071, 141148044, 145404034, 148239989, 149094394, 148088568, 145538032, 141520882, 136487091, 130639742, 124287275, 117681079, 110590720, 103688369, 96586986, 89582918, 83167381, 77447418, 72197114, 67463569, 63173075, 59237096, 55720995, 52505907, 49633809, 47078312, 44732777, 42656406, 40804659, 38972099, 37204840, 35581025, 34301915, 32960599, 31632860, 30498728, 29429884, 28353637, 27305029, 26350059, 25355258, 24456771, 23746202, 23000447, 22280406, 21667844, 20973216, 20476035, 19778509, 19105177, 18400012, 17790845, 17296077, 16631024, 16141172, 15592603, 15083894, 14682172, 14345778, 13820779, 13396827, 12999139, 12621640, 12294017, 11904120, 11533944, 11311600]
5539A1311600k93601l42786l11509k95982k07294k43574k95111j02751j77148
5530I041844m03151l26750j54152j36297k02539j38656k23046j84200k99221o9720
5520F904112j21283j00046r6001k03973m4219o5836n6529k09532j75499j19265
5510E711929r2554j18501k8148m8741k1684m7258k3390K8279M1611j18337n8908
5499E224298m411q7697j44228j03706K6231m5952j466p6241j01323j84181K0602
5488D521926M2896P3446J57941q4401L1819K8185r5973n5129O3640m3728R032
5477D649654J47439j50489j22959P8642k8108n3656J20426j14079j66474n2026
5467D308370J81390K06520j33364j23997m3712j9841m9921j47890m0313J18305
$$ y = [11311600, 11017999, 10675213, 10363704, 10067722, 9860428, 9616854, 9321743, 9218992, 9041844, 8638693, 8311943, 8157791, 8021494, 7818955, 7680299, 7457253, 7273053, 6973832, 6904112, 6782829, 6682783, 6586782, 6382809, 6338590, 6272754, 6216225, 6006693, 5831194, 5711929, 5619375, 5500874, 5472726, 5423985, 5402301, 5355043, 5331653, 5359932, 5401543, 5283206, 5224298, 5219887, 5132190, 4987962, 4884256, 4910487, 4864535, 4863069, 4786828, 4685505, 4501324, 4521926, 4564822, 4638268, 4796209, 4711808, 4743627, 4771812, 4675839, 4620710, 4684350, 4640622, 4649654, 4797093, 4646604, 4523645, 4602287, 4574179, 4520523, 4640949, 4526870, 4360396, 4308370, 4489760, 4696280, 4562916, 4438919, 4395207, 4375366, 4325445, 4177555, 4137242, 4255547]
5457D255547J43352j24734j8751R9885r4545l5473j7291k5647O1098K8552k6339
5446D245654M108L9218j9329M3428M5527Q0673p7482n5350m4727K8600O1465M9135
5434D400920j01395k912K43057J2236N8364k2533k8917m5812j1472O2555R6284
5423D660375Q0225J15256j1548K91164l4409P7964J93866J23521K49012M22176
5413F167602K71590K20978L25084K29579K03353J04901k4129j0450k31774m50133
5403F806601m04140m19945k70476j29081j94018k47615r5929o4930k30329j30851
5393D619287O475J0873j25037k25096J23425o2366O312J5639K2396j50306K712
5382D244314R0947L639M5682n5638p2035K0402P7598k10271j63789K1644m6861
$$ y = [4255547, 4398899, 4274165, 4255414, 4355299, 4260754, 4225281, 4207990, 4182343, 4243441, 4271993, 4245654, 4249762, 4288980, 4269651, 4313079, 4358606, 4439279, 4361797, 4306447, 4261720, 4290320, 4351785, 4400920, 4299525, 4296613, 4539670, 4551906, 4610270, 4587737, 4558820, 4513008, 4501536, 4564091, 4660375, 4740600, 4855856, 4844308, 5135472, 5101063, 5179027, 5372893, 5496414, 5745426, 6167602, 6439192, 6660170, 6985254, 7214833, 7418186, 7523087, 7498958, 7488508, 7256734, 6806601, 6402461, 5982516, 5712040, 5582959, 5388941, 5141326, 5045397, 4980467, 4750138, 4619287, 4625762, 4636635, 4511598, 4286502, 4409927, 4347561, 4353873, 4369512, 4391908, 4241602, 4244314, 4335261, 4338900, 4384582, 4328944, 4256909, 4277311, 4354909, 4144638, 3980849, 4002493, 3955632]
5371C955632k0206K7143j21435J6415K4142q1962k0806j2854J8522J33736r5467
5360C822860k3849N6709O133N6341o9522j44558q8014L7308J38481O1845o8684
5349C785050Q3947j37121J2353L8287k873j87411N9022R670O7367J21246r135
5338C840402q1569m0016K30585k5611k4666O8365n6166m8429Q7554J41461j31338
5327C960572l8095L9194p2406m9256J88031J02547k1979P6975j87063k7654R3790
5316D064656o270J38690J62687l3410Q9715P8661m2746k3821P750k0754K00816
5305D615974M8410J63420p9148q5053n2170l5947J84883K3754k2426j34365r8011
5294D529321K9762O3913j0124K1243R1104j63612p3864j99373m4421L1128j9394
$$ y = [3955632, 3935426, 3962569, 3841134, 3857549, 3881691, 3799729, 3778923, 3766069, 3784591, 3918327, 3822860, 3799011, 3855720, 3861853, 3918194, 3848672, 3704114, 3616100, 3653408, 3791889, 3853734, 3785050, 3868997, 3731876, 3744229, 3782516, 3779643, 3592232, 3651254, 3660924, 3728291, 3849537, 3840402, 3758833, 3718817, 3949402, 3923791, 3899125, 3967490, 3911324, 3862895, 3950449, 4091910, 3960572, 3922477, 3961671, 3889265, 3840009, 4028040, 4130587, 4108608, 4185583, 3998520, 3970866, 4064656, 4058386, 4197076, 4359763, 4326353, 4416068, 4494729, 4451983, 4428162, 4435912, 4415158, 4615974, 4664384, 4827804, 4748656, 4663603, 4611433, 4575486, 4760369, 4784123, 4761697, 4627332, 4529321, 4559083, 4622996, 4612872, 4634115, 4725219, 4561607, 4487743, 4288370, 4243949, 4275077, 4255683]
5283D255683J35764l1530o3145O9766N1899J1138J15602o8715L8390o2768o9077
5272D383007M5024P2384n4914M7065M4554K3636O0252K4740J37312k353j5057
5261D765650O652q887J62576J04825o3542P9003J71053M2968q987k2651r6316
5250E132344M3661J45198J78334J06448P0803J42912R8414j3800K1628J59481
5240F085423K32085K89217K47525K44683K61607P8488J47645j1334j10648k6148
5230G438543j61024k1476p7670j98004j83700j50612j96408o3710J520j21721
5220F265738R1305N2102j14954n2656L5343K8048n7561J07942k6940o558j31483
5209F190326J72294J63794L481j6767o8687J22487J24597R5239m6688n8564J97552
$$ y = [4255683, 4391447, 4359917, 4296772, 4366538, 4418437, 4429575, 4545177, 4476462, 4514852, 4452084, 4383007, 4428031, 4500415, 4445501, 4492566, 4537120, 4560756, 4621008, 4645748, 4783060, 4780707, 4765650, 4772302, 4763415, 4925991, 5030816, 4967274, 5046277, 5217330, 5260298, 5251311, 5228660, 5132344, 5176005, 5321203, 5499537, 5605985, 5676788, 5819700, 5918114, 5904314, 5925942, 6085423, 6317508, 6606725, 6854250, 7098933, 7360540, 7439028, 7586673, 7575339, 7464691, 7438543, 7277519, 7256043, 7178373, 6980369, 6796669, 6646057, 6449649, 6385939, 6387459, 6265738, 6357043, 6409145, 6294191, 6241535, 6276878, 6304926, 6247365, 6355307, 6328367, 6321809, 6190326, 6362620, 6526414, 6529895, 6513128, 6444441, 6566928, 6691525, 6786764, 6740076, 6681512, 6879064]
5198F879064J66718J35008R1049J0747N6319K3345J17035k3401p4220J93815K75027
5187G850506L15759K75514J02969L5525P402O7987k09835r1266j61588j69576
5177H023397j05206j67280k19692j11448o9267m3700j943K11188J2302q3254j03207
5166G341890p1690O2280K4089J30898J37894J2410j3214J22807J46989J27135
5156H021488J00667N8612J17564J52832Q7689M4651p356J84592K14384J47302
5146I122425J49277J24707p1447o149R2733n3840l8551j38842j1018q7316q588
5135I073391q4747o2430R680j1445q3604r1372M4983Q3615J83863R2095M1549
5124I195578J59883J88603L9867P4416M9450J02933P1183J47364m6450j4770j18594
$$ y = [6879064, 7045782, 7180790, 7271839, 7282586, 7338905, 7362250, 7479285, 7455884, 7381664, 7575479, 7850506, 8166265, 8441779, 8544748, 8580273, 8587675, 8655662, 8445827, 8354561, 8192973, 8023397, 7918191, 7750911, 7531219, 7419771, 7350504, 7306804, 7304861, 7516049, 7528351, 7445097, 7341890, 7270200, 7332480, 7356569, 7487467, 7625361, 7637771, 7624557, 7747364, 7894353, 8021488, 8122155, 8180767, 8298331, 8451163, 8538852, 8583503, 8576147, 8760739, 8975123, 9122425, 9271702, 9396409, 9324962, 9318813, 9411546, 9357706, 9319155, 9180313, 9169295, 9081979, 9073391, 8988644, 8926214, 8935894, 8924449, 8840845, 8749473, 8794456, 8878071, 9061934, 9154029, 9195578, 9355461, 9544064, 9583931, 9658347, 9707797, 9810730, 9881913, 10029277, 9982827, 9968057, 9849463]
5113I849463J65759R8072n0200r1346o828q635l2439j7945Q1683K0564K9186m7892
5101I989442J30699R3795J10929J68828J30028K8155j80828N2089J39083J56957
5091A0819177j9356K211j5085J16922K20714J17083J20009P2355o3650j29782
5081A1240598k8082L0080j21693q348M1617J14602j25330M3483K5823O9128J33408
5070A1415286k1310j32018m0962n656o2727M5954J59706N8991N9947r595L7064
5059A1504680J44354J12120j6343j56668p3643K25619J09532M6456N8279K7191
5049A1981577J18610M2536L7837n7716K58261J97796R6051K38259J25662j6999
5039A3021874J02417J96349J04852Q2762K58951K23780n7985J97106K62432J96196
$$ y = [9849463, 10015222, 10113294, 10063094, 9971748, 9964920, 9956285, 9923846, 9905901, 9987584, 10008148, 10037334, 9989442, 10120141, 10213936, 10324865, 10493693, 10623721, 10651876, 10471048, 10523137, 10662220, 10819177, 10799821, 10802032, 10786947, 10903869, 11124583, 11241666, 11361675, 11434030, 11370380, 11240598, 11212516, 11242596, 11120903, 11112555, 11154172, 11268774, 11143444, 11186927, 11212750, 11281878, 11415286, 11393976, 11261958, 11220996, 11215340, 11152613, 11198567, 11358273, 11417264, 11477211, 11467616, 11504680, 11649034, 11761154, 11744811, 11588143, 11514500, 11740119, 11849651, 11896107, 11954386, 11981577, 12100187, 12142723, 12180560, 12122844, 12381105, 12578901, 12674952, 12913211, 13038873, 13021874, 13124291, 13320640, 13425492, 13508254, 13767205, 13990985, 13933000, 14130106, 14392538, 14588734]
5029A4588734J18264K37085J20022K50861J91700J62887K37416L12125K22853
5020A6441947K12421K77132J68116K21267K64443K75671J20925M49599L79638
5011A8811159L78115K47972L53178L48975N41679M72197L52670N33156P50482
5002B2789583N73222M64793P25351O50249O12567P53280Q69654R48223Q88380
4993B9275302Q85076J220705J348294J413870J438109J577649J765145J841873
4985D0766023K025469K130679K390814K587878K826152L023028L336691L665777
4977F2752511L757139L845215L720320L475690K677224J920942J432114N44275
4969H4125430L2422l57673o07606o65884o24120m60974j80339J6875L89349Q29112
$$ y = [14588734, 14706998, 14944083, 15064105, 15314966, 15506666, 15669553, 15906969, 16219094, 16441947, 16654368, 16931500, 17099616, 17320883, 17585326, 17860997, 17981922, 18431521, 18811159, 19189274, 19437246, 19790424, 20139399, 20681078, 21153275, 21505945, 22039101, 22789583, 23362805, 23827598, 24552949, 25203198, 25815765, 26569045, 27438699, 28386922, 29275302, 30160378, 31381083, 32729377, 34143247, 35581356, 37159005, 38924150, 40766023, 42791492, 44922171, 47312985, 49900863, 52727015, 55750043, 59086734, 62752511, 66509650, 70354865, 74075185, 77550875, 80228099, 82149041, 83581155, 84125430, 84157852, 83800179, 83192573, 82526689, 81902569, 81441595, 81261256, 81278131, 81667480, 82496592]
4959H2496592J123958J450816J723960K242187K668814K876908L429895M110901
4951A02124031M609684N119311N666588O334855O823684P404892P773560P770921
4943A53627526P569887O734002N378816L782567K077505L74584q45634j541537
4935A77157716k055024k140223j897342j511122j084617j83776M96385P41791
4927A69523788J042947J289327J417049J445058J137840J106196J140669J211706
4919A79314580J286569J614582J831275K197409K466801K339141K014499J523929
4911A94588785N03376p60019k204785l718807n070810o057187o575985o817313
4903A63887255o608503o047837m982871m005613k904825k053703j576343j399969
$$ y = [82496592, 83620550, 85071366, 86795326, 89037513, 91706327, 94583235, 98013130, 102124031, 106733715, 111853026, 117519614, 123854469, 130678153, 138083045, 145856605, 153627526, 161197413, 167931415, 173310231, 177092798, 179170303, 179544887, 178699253, 177157716, 175102692, 172962469, 171065127, 169554005, 168469388, 168285612, 168781997, 169523788, 170566735, 171856062, 173273111, 174718169, 175856009, 176962205, 178102874, 179314580, 180601149, 182215731, 184047006, 186244415, 188711216, 191050357, 193064856, 194588785, 195092161, 194332142, 192127357, 188408550, 183337740, 177280553, 170704568, 163887255, 157278752, 151230915, 146248044, 142242431, 139337606, 137283903, 135707560, 134307591]
4895A34307591j890331k670566l602638m296858n032623n523319n759401n488478
4887A00043377m952130m837690m234239l705995l218284k880215k450857k272592
4879G1491375j912531j590129j411877j179588j111881j014073r81318j064886
4871F1225092j124525j112079j428349j420282j512202j365851j337785j280732
4863E0643287j152315r73760p86004p45470n84146o47857n98077o58443p78689
4854D3718526p31573n16524p44398o01155n04907o15621l26791k10125k7782O5140
4844C9504790m22274j74587j0836j6077k19877k32040k83444m22867m17942n62026
4834C6742820p69098p55303q23283r01428j118325j239418r47386r70421q77058
$$ y = [134307591, 132417260, 129746694, 126144056, 121847198, 116814575, 111291256, 105531855, 100043377, 95091247, 90253557, 86019318, 82313323, 79095039, 76214824, 73763967, 71491375, 69578844, 67988715, 66576838, 65397250, 64285369, 63271296, 62289978, 61225092, 60100567, 58988488, 57560139, 56139857, 54627655, 53261804, 51924019, 50643287, 49490972, 48517212, 47731208, 46985738, 46401592, 45753735, 45155658, 44497215, 43718526, 42986953, 42470429, 41726031, 41124876, 40619969, 40004348, 39677557, 39467432, 39439650, 39504790, 39082516, 38907929, 38897093, 38881016, 38661139, 38429099, 38145655, 37722788, 37304846, 36742820, 35973722, 35218419, 34395136, 33493708, 32375383, 31135965, 30188579, 29218158, 28341100]
4825B8341100r93819q83102r07074p32896o07937n67608m23695n18669n15072
4816B2191228l40516k34323l43917l07735j50954k31297l1491j73295r1483m9443
4806B0236774o0155q232r9744J151n1228M6405K21031J00692J14711K29057j4697
4795B0715765J1815j29753l39025k69779j55746l24291m00798k82182l01263j57720
4785A8367023q2559j13008k01444k03289j62128k6513K8578J47852o7647K5673
4775A7712538Q8266J52939L2226L9333J39857k9318J35821o9599j73428k16975
4765A7811660j67171l2332k88220j328J2539k22520J20466L0972j52549K1851
4755A7133368j3418j84346k1672L397N3555O0577P3210M3744R9513K5442O3617
$$ y = [28341100, 27347281, 26464179, 25557105, 24824209, 24216272, 23648664, 23224969, 22706300, 22191228, 21850712, 21616389, 21272472, 20964737, 20813783, 20582486, 20550995, 20377700, 20286217, 20236774, 20176619, 20168387, 20068643, 20069794, 20018566, 20064971, 20286002, 20386694, 20501405, 20730462, 20715765, 20727580, 20597827, 20258802, 19989023, 19833277, 19508986, 19108188, 18826006, 18524743, 18367023, 18284464, 18171456, 17970012, 17766723, 17604595, 17578082, 17606660, 17754512, 17686865, 17712538, 17800804, 17953743, 17985969, 18025302, 18165159, 18135841, 18271662, 18202063, 18028635, 17811660, 17644489, 17612157, 17323937, 17322609, 17335148, 17112628, 17233094, 17264066, 17111517, 17133368, 17119950, 16935604, 16913932, 16917329, 16970884, 17031461, 17104671, 17148415, 17247928, 17273370, 17336987]
4744A7336987J8204q9071L5747J69501j9775O8083Q9874l3589r631L2407j07399
4733A7491338P6786o091L7144R646m196m5608j41057P7862J62650O2402J04718
4722A7825594J8364J65485N6073j3291K04516R5258N4752J48054J76693p8832
4712A8652666K07764N0754J08192K66061N4219J94628K65866l0856J95340R7554
4702B0062188J11318K34254L03481K63256L83597K83252M08229M37119L83904
4693B2870598L50415O05964N91817N01168O78196N45742O25818P94685J005663
4684B8570066P43833Q05325Q82875R82213R01090Q98918R89632J186208J192991
4675C7153151J164083J254446J182866J460217J543486J622208J706817K020120
$$ y = [17336987, 17355191, 17266120, 17301867, 17471368, 17451593, 17519676, 17609550, 17575961, 17566330, 17598737, 17491338, 17568124, 17562033, 17599177, 17608823, 17604627, 17559019, 17417962, 17495824, 17658474, 17720876, 17825594, 17843958, 18009443, 18065516, 18052225, 18256741, 18351999, 18406751, 18554805, 18731498, 18652666, 18860430, 18911184, 19019376, 19285437, 19339656, 19534284, 19800150, 19769294, 19964634, 20062188, 20173506, 20407760, 20711241, 20974497, 21358094, 21641346, 22049575, 22486694, 22870598, 23221013, 23826977, 24418794, 24919962, 25598158, 26143900, 26769718, 27564403, 28570066, 29313899, 30119224, 31002099, 31984312, 32885402, 33784320, 34773952, 35960160, 37153151, 38317234, 39571680, 40754546, 42214763, 43758249, 45380457, 47087274, 49107394]
4667D9107394K347600K519739K699971L220205L713827M124281M525299N150435
4659G7408751N508531N848087O601604P167425P729776Q791210J0159459J1843800
4651A41058643J3708843J6122289J8664951K0686907K1651189K0771793J6997651
4644B69662266R976965J883010m872430j0037111j4893994j8616993j9485131
4637B13616582j8355963j6786949j4836495j3051439j1187358r739891q525101
4630A21133386p325390o237920n270023m473672m070139l700876l433481l136940
4622H3484945l099503l261735l127927l151491l288783l134013k897618k812680
4614E8711195k668344k435840k340521k088492j717924j658203j668991j484791
$$ y = [49107394, 51454994, 53974733, 56674704, 59894909, 63608736, 67733017, 72258316, 77408751, 82917282, 88765369, 95366973, 102534398, 110264174, 119055384, 129214843, 141058643, 154767486, 170889775, 189554726, 210241633, 231892822, 252664615, 269662266, 279639231, 281522241, 276649811, 266612700, 251718706, 233101713, 213616582, 195260619, 178473670, 163637175, 150585736, 139398378, 129658487, 121133386, 113807996, 107570076, 102300053, 97826381, 93756242, 90055366, 86621885, 83484945, 80385442, 77123707, 73995780, 70844289, 67555506, 64421493, 61523875, 58711195, 56042851, 53607011, 51266490, 49177998, 47460074, 45801871, 44132880, 42648089]
4606D2648089j367922j208241j235940j337424j247901r94122j046823q41841
4598C3367875r37682j019853p44140p55864q26576o37344n23815n65648n02409
4589B6854544n36429l29940l88131l31754k97511m39084k70146j00382l43355
4580B3817812k71480p9047k74105l09855m00125j51082k10593m31778k38545j01214
4570B1349988j19903k31152k80763k37232j91984j23598j22805j88360k83872
4561A9570319j21246r0790r3718j94924k0920k84129k49298k71252k98422j28783
4551A7816837k51456k89609k80778o2904o0230p2791l7599K19320K19848J97786
4541A7398424K4140J94281K51528K44654L78145M88486M65353N47805N44905N13359
$$ y = [42648089, 41280167, 40071926, 38835986, 37498562, 36250661, 35256539, 34209716, 33367875, 32430193, 31410340, 30666200, 29910336, 29083760, 28446416, 27922601, 27356953, 26854544, 26318115, 25988175, 25600044, 25268290, 24970779, 24531695, 24261549, 24161167, 23817812, 23546332, 23467285, 23193180, 22883325, 22483200, 22332118, 22121525, 21689747, 21451202, 21349988, 21230085, 20998933, 20718170, 20480938, 20288954, 20165356, 20042551, 19854191, 19570319, 19449073, 19358283, 19264565, 19069641, 19048721, 18764592, 18515294, 18244042, 17945620, 17816837, 17565381, 17275772, 16994994, 16932090, 16871860, 16799069, 16761470, 16980790, 17200638, 17398424, 17422564, 17616845, 17868373, 18113027, 18491172, 18979658, 19445011, 19992816, 20537721, 21051080]
4531B1051080N06814P44201N19850N74587O54037M81970P7205L23534M30456K28385
4521B5592119J27667L21832J37505j7951k7267k11993p5352J6619M5037r7397
4511B5810819M3680Q8336J48406J88341K74998K16079L66058O54632O87631P16861
4501B9195841J097668J393161J283424J308521J186501O99826P6677m64376r62440
4492C4814803j453703j648435j902958j886082j610915j452344j346324j006809
4484B2507233p18912j046984r18037o03584o97602m53475m66524n57570m34131
4475A6610414m04211l40690l84841k89004k62026l57426j89118k8009j79533j70464
4465A4005092j52452k11258n1343n825J11674N1663m4222j2943K9753j30835j95802
$$ y = [21051080, 21557894, 22302095, 22821945, 23396532, 24050569, 24532539, 24609744, 24933278, 25363734, 25592119, 25719786, 26041618, 26179123, 26161172, 26133905, 25921912, 25846560, 25863179, 25908216, 25810819, 25854499, 25942835, 26091241, 26279582, 26554580, 26770659, 27136717, 27791349, 28478980, 29195841, 30293509, 31686670, 32970094, 34278615, 35465116, 36164942, 36241619, 35777243, 34814803, 33361100, 31712665, 29809707, 27923625, 26312710, 24860366, 23514042, 22507233, 21788321, 20741337, 19823300, 19219716, 18522114, 18068639, 17602115, 17044545, 16610414, 16206203, 15865513, 15480672, 15191668, 14929642, 14572216, 14383098, 14355089, 14175556, 14005092, 13852640, 13641382, 13590039, 13584214, 13695888, 13747551, 13703329, 13690386, 13720139, 13589304, 13393502]
4454A3393502N2792j63634k68330j61589j45401j73098j23104m5882j35453o8204
4444A2161599Q6034Q8277k315p7255k68232j89950j50028n6301j14563j30317
4434A1346949k66831j12270o6906j60733m6931J647J11975j6861j56429n4580
4424A0579030n62J09516M4779O8801r4373P8648j24060J5630J96602j01112p8106
4413A0694793o914j1923o1489j55238q2745Q3105J57349Q6914P252J7924K4254
4402A0753282J27506J21551J47324j66490j89502o6222J00045j97344j99113j04660
4392A0326377r7330k28068j44249J1703j49732M1786q9070N232P3856r4298n3412
4381I602795K90384K75967O2459q5495M6907M6929o9871M3329j55700k17804q5498
$$ y = [13393502, 13446294, 13282660, 13014330, 12852741, 12707340, 12534242, 12411138, 12365256, 12229803, 12161599, 12247633, 12335910, 12333595, 12256340, 11988108, 11798158, 11648130, 11591829, 11477266, 11346949, 11080118, 10967848, 10900942, 10740209, 10693278, 10694925, 10806900, 10790039, 10633610, 10579030, 10578468, 10687984, 10732763, 10801564, 10707191, 10785839, 10661779, 10677409, 10874011, 10772899, 10694793, 10687879, 10675956, 10614467, 10459229, 10376484, 10459589, 10616938, 10703852, 10711104, 10729028, 10753282, 10880788, 11002339, 11149663, 10983173, 10793671, 10727449, 10827494, 10630150, 10431037, 10326377, 10229047, 10000979, 9856730, 9868433, 9718701, 9760487, 9671417, 9676649, 9750505, 9656207, 9602795, 9893179, 10169146, 10231605, 10146110, 10193017, 10239946, 10170075, 10213404, 10057704, 9839900, 9754402]
4370I754402P7213L0028j99248q5523o5292M9526Q8026p3238N7955k8562n2645
4359I552642Q4602k3289J9041K5641k06845k09472Q5665k8072j19678J8164k01426
4348H996973Q629M1334N06m8077K21384j13762q468P1404P6123N8979L6270p8317
4336I262978k25611r6201j13978j36173j51629N8497q67j91345J6719p7074j49803
4325H195513N001n446j1855J03102Q242P5245M2947r1293j4084K2350k8775k2437
4313H278510J9319p7304N0367J20931m740L6892J01765j6783M4259k3789N4495
4302H583922J413P7694R820j9584K7917K12228M6128K71421J32220l6200j8070
4291I288909K1747Q1764n8702J5890O2231R6894J7783p4039J40921J04738M315
$$ y = [9754402, 9831615, 9861643, 9662395, 9576872, 9511580, 9561106, 9649132, 9575894, 9633849, 9605287, 9552642, 9637244, 9613955, 9632996, 9658637, 9451792, 9242320, 9327985, 9299913, 9180235, 9198399, 8996973, 9005602, 9046936, 9047442, 8999365, 9220749, 9106987, 9098519, 9169923, 9246046, 9305025, 9341295, 9262978, 9037367, 8941166, 8827188, 8691015, 8539386, 8597883, 8597016, 8405671, 8422390, 8345316, 8195513, 8200514, 8195068, 8183213, 8286315, 8294557, 8369802, 8412749, 8321456, 8307372, 8329722, 8300947, 8278510, 8297829, 8220525, 8270892, 8391823, 8387083, 8423975, 8525740, 8508957, 8553216, 8529427, 8583922, 8585335, 8663029, 8672849, 8653265, 8681182, 8893410, 8939538, 9210959, 9343179, 9306979, 9288909, 9310656, 9392420, 9333718, 9349608, 9411839, 9508733, 9526516, 9452477, 9593398, 9698136, 9702451]
4280I702451L6912L4264J93054J72668N6577j8624P7622m697L9423P5017J8840
4269A0383507J7925J52562J05614J86075k6133J11988Q4354K4403J7455J03684
4259A1161434J79563J51763O7795m6829K44037J30177K4541J44635R1421j1665
4249A2136872J99588J25804J87739O6725R6252K24093K07910J85832J13395J33096
4239A3677306K62381R8546K85543K42326K32284L52331K07851L30977M24017M31277
4229A6544839M28750L47980M50300O40045N24829N40980O70267N98993O43293
4220B1390276Q34478R60779P79315Q88054R32678J054420J231376J272150J278864
4211C0622390J367187J508774J518525J603544J610790J921060J827152K150901
$$ y = [9702451, 9739363, 9773627, 9966681, 10139349, 10195926, 10177302, 10254924, 10250227, 10289650, 10364667, 10383507, 10401432, 10553994, 10659608, 10845683, 10819550, 10931538, 11015892, 11040295, 11057750, 11161434, 11340997, 11492760, 11560555, 11513726, 11757763, 11887940, 11912481, 12057116, 12148537, 12136872, 12336460, 12462264, 12650003, 12716728, 12812980, 13037073, 13244983, 13430815, 13544210, 13677306, 13939687, 14038233, 14323776, 14566102, 14798386, 15150717, 15358568, 15689545, 16113562, 16544839, 16973589, 17321569, 17771869, 18411914, 18936743, 19477723, 20147990, 20746983, 21390276, 22224754, 23185533, 23964848, 24852902, 25785580, 26840000, 28071376, 29343526, 30622390, 31989577, 33498351, 35016876, 36620420, 38231210, 40152270, 41979422, 44130323]
4203D4130323K232056K116927K278352K409424K544330K743726K772660K733494
4195F3961292K847572K975449L132449L009963L070717L173520L167532L260526
4187H8599020L357897L326564L292246L346236L348941L168324L276294L070437
4179A14785959K749788K777984K487118K446185K359911K141664K047849J857876
4171A33654334J607462J416726J347644J014110N82621L69107J99069p6408n35799
4162A39578866q57460j100269j335588j425761j560370j725044j705568k065763
4154A27803043k188030k252081k596220k702421k969468l286072l143517l287844
4146A05377390l580535l523254l468064l462401l271330l420642l433448l195474
$$ y = [44130323, 46362379, 48479306, 50757658, 53167082, 55711412, 58455138, 61227798, 63961292, 66808864, 69784313, 72916762, 75926725, 78997442, 82170962, 85338494, 88599020, 91956917, 95283481, 98575727, 101921963, 105270904, 108439228, 111715522, 114785959, 117535747, 120313731, 122800849, 125247034, 127606945, 129748609, 131796458, 133654334, 135261796, 136678522, 138026166, 139040276, 139622897, 139992004, 140191073, 140114665, 139578866, 138721406, 137621137, 136285549, 134859788, 133299418, 131574374, 129868806, 127803043, 125615013, 123362932, 120766712, 118064291, 115094823, 111808751, 108665234, 105377390, 101796855, 98273601, 94805537, 91343136, 88071806, 84651164, 81217716, 78022242]
4138G8022242l287749l243913k971049l000659l048617k832936k682111k695252
4130E4259956k536467k269779k130326k238540k194158j963224j869809j635104
4122C7422549j595468j494639j510834j276042j250366j218377j101532j142121
4114B6833170r05462p57253p40454q28377p22401p06177n88872n48690n33887
4105B0501597n87405n62697n05058m89028l16448k98171l97868k49733k04763
4096A6890426k14411k24803j20240k22943l02791j56881r1753j81279k84279k54592
4086A4836454l62412j10217r7246j57072j66069k29165j00477k14778l72557k5941
4076A3000520k50345j41319q9766j39094j26746j15675j75276j19311o6494n9094
$$ y = [78022242, 74734493, 71490580, 68519531, 65518872, 62470255, 59637319, 56955208, 54259956, 51723489, 49453710, 47323384, 45084844, 42890686, 40927462, 39057653, 37422549, 35827081, 34332442, 32821608, 31545566, 30295200, 29076823, 27975291, 26833170, 25927708, 25170455, 24430001, 23601624, 22879223, 22173046, 21584174, 21035484, 20501597, 19914192, 19351495, 18846437, 18357409, 18040961, 17742790, 17344922, 17095189, 16890426, 16676015, 16451212, 16330972, 16108029, 15805238, 15648357, 15556604, 15375325, 15091046, 14836454, 14474042, 14363825, 14266579, 14109507, 13943438, 13714273, 13613796, 13399018, 13026461, 13000520, 12750175, 12608856, 12519090, 12379996, 12253250, 12137575, 11962299, 11842988, 11776494, 11717400]
4066A1717400k60603J069m4586j58809k10773q1263j43463j09250K5590R551j9781
4055A0725082j11496k5880j35606q1945j01249P6593j08470j6058R577j19154
4045A0111394j2096l4124p0485o1875j60847K7431j4239K2154o4776K074m3472
4034I701139N4690q8781J686J57583M0956J00448Q2082n9475j60435L7526K3501
4023I890920J13086R2409R667l1408J66727L6798J8770J2878Q6492Q4715N5625
4012A0536679j21404j26948J05930K2175Q345o8660Q0593P778J06104j17077l1829
4001A0401686P1081L8781j1547J23405k7393L036J3319J8118k1835j16836J0748
3990A0502563J29253M9113J9510l8114R0826L0339M2654q1213N4624J38997O2190
$$ y = [11717400, 11456797, 11457866, 11413280, 11254471, 11043698, 10962435, 10818972, 10709722, 10735312, 10744863, 10725082, 10613586, 10587706, 10452100, 10370155, 10268906, 10345499, 10237029, 10220971, 10230548, 10111394, 10099298, 10065174, 9994689, 9932814, 9771967, 9799398, 9785159, 9807313, 9742537, 9744611, 9701139, 9755829, 9667048, 9668734, 9826317, 9867273, 9967721, 10049803, 9990328, 9829893, 9867419, 9890920, 10004006, 10096415, 10106082, 10074674, 10241401, 10278199, 10296969, 10309847, 10396339, 10481054, 10536679, 10415275, 10288327, 10394257, 10416432, 10424777, 10356117, 10436710, 10444488, 10550592, 10433515, 10401686, 10472767, 10511548, 10500001, 10623406, 10596013, 10599049, 10612368, 10630486, 10608651, 10491815, 10502563, 10631816, 10680929, 10700439, 10662325, 10753151, 10783490, 10826144, 10744931, 10799555, 10938552, 11000742]
3979A1000742Q4095n9154M5454l2614k199n9166Q4346J14969l7959m588N523l5040
3967A1104409Q6098n4514N8805M2550J02442m3067j17321o2376Q2414k1886M7104
3956A1224658J08671K5393j35474P2979L369Q2033O5280k5610o691N7142J95670
3945A1667420J3618p6884R5155J32340O7687K3153N1189n1134M9363N9373K0536
3934A2051816K52590K28093O681p4984J49954J48621P5334K25542K30928N0718
3924A3345293K13522J20658Q7165Q1479O568J39522J37655P2561K18789R4482
3914A4517694J32686J48988K75396J68183O2164J48793K05778L1473R1322L09676
3904A6092153J26263J61123K21338Q6350K16464K61797K16461J81837K71610K95618
$$ y = [11000742, 11084837, 11025683, 11071137, 11038523, 11036324, 10977158, 11061504, 11176473, 11138514, 11133926, 11139449, 11104409, 11190507, 11135993, 11194798, 11237348, 11339790, 11296723, 11179402, 11117026, 11199440, 11177554, 11224658, 11333329, 11358722, 11223248, 11296227, 11299596, 11381629, 11446909, 11421299, 11414608, 11471750, 11667420, 11681038, 11604154, 11699309, 11831649, 11899336, 11922489, 11973678, 11922544, 11971907, 12031280, 12051816, 12304406, 12532499, 12539180, 12464196, 12614150, 12762771, 12838105, 13063647, 13294575, 13345293, 13558815, 13679473, 13766638, 13848117, 13854685, 13994207, 14131862, 14204423, 14423212, 14517694, 14650380, 14799368, 15074764, 15242947, 15305111, 15453904, 15659682, 15691155, 15782477, 16092153, 16218416, 16379539, 16600877, 16687227, 16903691, 17165488, 17381949, 17563786, 17835396, 18131014]
3894A8131014K98562K65888K53346M04411L03868K61920K13120L52186M64236
3885B0948551M39174M19819N23652L99172O50746O60315M51731O32617O27239
3876B5753016P51575Q36816Q02103Q03300R92777R96445J008201J246258J157851
3867C4348342J455157J402306J496958J527052J427648J505477J482793J524585
3859D6170318J509947J491576J547388J398965J232764J329833J269811J207814
3851E7158416R96045J143014J024025R68949Q20717Q51962P36279M74045L83711
3842F4557163L27206K77143J8214J50788r8482r848R8370j7231K22847J84078
3832F5710248L48882L86783M37076O03917P50544Q53192Q50980Q83696J079813
$$ y = [18131014, 18429576, 18695464, 18948810, 19353221, 19657089, 19919009, 20132129, 20484315, 20948551, 21387725, 21807544, 22331196, 22730368, 23381114, 24041429, 24493160, 25125777, 25753016, 26504591, 27341407, 28143510, 28946810, 29939587, 30936032, 31944233, 33190491, 34348342, 35803499, 37205805, 38702763, 40229815, 41657463, 43162940, 44645733, 46170318, 47680265, 49171841, 50719229, 52118194, 53350958, 54680791, 55950602, 57158416, 58154461, 59297475, 60321500, 61290449, 62111166, 62963128, 63699407, 64173452, 64557163, 64884369, 65161512, 65179726, 65330514, 65232032, 65222184, 65320554, 65303323, 65526170, 65710248, 66059130, 66445913, 66882989, 67486906, 68237450, 69090642, 69941622, 70825318, 71905131]
3823G1905131J233158J321093J517507J717501K033971K160861K448709K770523
3815H7108454K903958L159677L480157L715138M002003M153552M399690M555649
3807A17478278M682482M766519M772975M692017M434722M695143M420803M353752
3799A54296691M154236M285105M141183M133555L906391L694180L490203L046326
3791A85147870K716436K198944J810449J519749J175731O36492J37701J03636
3783A95447008R5809r6915k51244l45451k57616k04307k18830k00279J01628J19358
3773A94189161L31090O36924Q37610Q90331J295065J662680K040935K302802K836237
3764B07022835K912972L040040L696183M085555M353122M534903M552652M539191
$$ y = [71905131, 73138289, 74459382, 75976889, 77694390, 79728361, 81889222, 84337931, 87108454, 90012412, 93172089, 96652246, 100367384, 104369387, 108522939, 112922629, 117478278, 122160760, 126927279, 131700254, 136392271, 140826993, 145522136, 149942939, 154296691, 158450927, 162736032, 166877215, 171010770, 174917161, 178611341, 182101544, 185147870, 187864306, 190063250, 191873699, 193393448, 194569179, 195205671, 195343372, 195447008, 195542817, 195445902, 195194658, 194849207, 194591591, 194387284, 194168454, 193968175, 194069803, 194189161, 194520251, 195157175, 195994785, 196885116, 198180181, 199842861, 201883796, 204186598, 207022835, 209935807, 212975847, 216672030, 220757585, 225110707, 229645610, 234198262, 238737453]
3756B38737453M312123M056139L601858L410722K775016K477690K487406K207411
3748B64065818K124499K069505K245474K474996K456618K729672K973630L543671
3740B84683883L855543M338733N218961O132005P221311Q272398R573722J0407564
3732C39704120J0735370J0936962J0347441R328720P812372O096481L966194K070063
3724D00997723L79326q21703j613940k413226k383158k548331k605864l055182
3716C85935645l599146m817572o327098q249000j0326452j2344969j3931075j5349108
3708C10991225j6272199j6531699j6360285j6041747j5123543j3841969j2758293
3701B04061490j1688453j0664890r461520q675976p893048p275731o784010o293561
$$ y = [238737453, 243049576, 247105715, 250707573, 254118295, 256893311, 259371001, 261858407, 264065818, 266190317, 268259822, 270505296, 272980292, 275436910, 278166582, 281140212, 284683883, 288539426, 292878159, 298097120, 304229125, 311450436, 319722834, 329296556, 339704120, 350439490, 361376452, 371723893, 381052613, 388864985, 394961466, 398927660, 400997723, 401377049, 400555346, 398941406, 396528180, 394145022, 391596691, 388990827, 385935645, 382336499, 377518927, 371191829, 362942829, 352616377, 340271408, 326340333, 310991225, 294719026, 278187327, 261827042, 245785295, 230661752, 216819783, 204061490, 192373037, 181708147, 172246627, 163570651, 155677603, 148401872, 141617862, 135324301]
3693A35324301n970381n620932n128669m868533m733216m544938m307143l940448
3685I6210041l734243l618919l534187l395987l213947l040124k962026k701664
3677G0008944k795536k780235k706848k724085k566713k234671k209228k150192
3669D9841436k077676k000305j642409j732382j818843j672453j425993j265643
3661C6205732j371259j153335j238513j116834j184145j000715r03924q71818
3653B7365189q60399q46323n91991p66634o78215n56648p14780n60270l95855
3644B1394074n85909n56166m59237l78722n03231l85056k52797k49617m39996
3635A7583343k81326l59550l71599k19904k83944k92407k11340l19231j33585
$$ y = [135324301, 129353920, 123732988, 118604319, 113735786, 109002570, 104457632, 100150489, 96210041, 92475798, 88856879, 85322692, 81926705, 78712758, 75672634, 72710608, 70008944, 67213408, 64433173, 61726325, 59002240, 56435527, 54200856, 51991628, 49841436, 47763760, 45763455, 44121046, 42388664, 40569821, 38897368, 37471375, 36205732, 34834473, 33681138, 32442625, 31325791, 30141646, 29140931, 28237007, 27365189, 26504790, 25658467, 25066476, 24299842, 23621627, 23064979, 22350199, 21789929, 21394074, 20808165, 20251999, 19792762, 19414040, 18910809, 18525753, 18272956, 18023339, 17583343, 17302017, 16942467, 16570868, 16350964, 16067020, 15774613, 15563273, 15244042, 15110457]
3626A5110457l25195k42643j80156j55115j51642k60515J9227k00821k02846k33314
3616A3177437k06784k00330k19297l55180l10454o8171k31905j32259j09291j63252
3606A1180514k63776j53550k20331o2953k50545l10014r9536j19308j13677k34654
3596I352170j09862O1803j20519j58027j53426k9304o7653k57203l157q6154j26480
3585H302188J78374q8505j73991J567j02262J0777j88396L2626l4953r2620L6049
3574G880854j11633j36904j38580l5557j20480q4367n3585k6766l442J1729L2040
3563G213309o4602R2010j65869k93375q6934K361m9812k2455N6072j66233j36916
3552F377556J28857n2788k1665n7611p0151P1711O216j16327P079m947J19749
$$ y = [15110457, 14785262, 14542619, 14362463, 14207348, 14055706, 13795191, 13814418, 13613597, 13410751, 13177437, 12970653, 12770323, 12551026, 12195846, 11885392, 11817221, 11585316, 11453057, 11343766, 11180514, 10916738, 10763188, 10542857, 10479904, 10229359, 9919345, 9819809, 9700501, 9586824, 9352170, 9242308, 9304111, 9183592, 9025565, 8872139, 8842835, 8775182, 8517979, 8514822, 8428668, 8302188, 8480562, 8392057, 8218066, 8219633, 8117371, 8128148, 7939752, 7972378, 7937425, 7844805, 7880854, 7769221, 7632317, 7493737, 7458180, 7337700, 7253333, 7199748, 7172982, 7169540, 7181269, 7213309, 7148707, 7240717, 7074848, 6781473, 6694539, 6696900, 6647088, 6624633, 6680705, 6514472, 6377556, 6506413, 6453625, 6431960, 6374349, 6304198, 6375909, 6382125, 6265798, 6272877, 6267930, 6387679]
3541F387679l4419r320M2210n6801l3723m8645R182l6668O4517k8340L3117J06314
3529F395103K7215l1689j7920K7363J70928l7274j88905N6958O5036J13215J99241
3518F779271M1583j53592J30827O6181J05365J30596k4426J59609K34280q1818
3508G387876M4558L246J20903J68096Q3757J08617M9410K75451J91518P5116Q1431
3497H589979J36392K66053L48798K25334K67787K03674L41817L45386L72620K43978
3487A1341818K40697M32114M87365L10477K41716L73858M51449M12116M28872
3478A4720482L01096K29857L60107L54576K33179J57321J54124K81482l6711j3077
3468A6742436J39484L4876R3983j32814j46048j43482k19572l09630k44983j53055
$$ y = [6387679, 6353260, 6343940, 6386150, 6329349, 6295626, 6246981, 6256163, 6219495, 6284012, 6255672, 6288789, 6395103, 6422318, 6390629, 6372709, 6400072, 6571000, 6533726, 6344821, 6401779, 6466815, 6580030, 6779271, 6820854, 6667262, 6798089, 6864270, 6969635, 7100231, 7075805, 7235414, 7469694, 7387876, 7432434, 7435680, 7556583, 7724679, 7808436, 7917053, 7966463, 8241914, 8433432, 8508548, 8589979, 8726371, 8992424, 9341222, 9566556, 9834343, 10038017, 10379834, 10725220, 11097840, 11341818, 11582515, 12014629, 12501994, 12812471, 13054187, 13428045, 13879494, 14291610, 14720482, 15021578, 15251435, 15611542, 15966118, 16199297, 16356618, 16510742, 16792224, 16755513, 16742436, 16881920, 16916796, 17010779, 16877965, 16731917, 16588435, 16368863, 16059233, 15814250, 15661195]
3458A5661195k63378j36005j64907j79096r6700R7620K68834L97075L78753M96588
3448A6459979L52730N4402j9851j42454k38153n35674q07460m32343m21615m74918
3438A3794643l74163l19581j68261j52701k94351j4901o7735o948k7883m4083
3428A2324036J37232J78206K22762R3110K07685L21735M36635M93407P65352P51564
3418A5931724R28947Q77612N11929K34662l74891l59784p38528j352209j090516
3409A4568946r81348r25022p10162n55305m43528m27429m69394l41002k50188
3400I465568k60134k10844j27469j52343K8077j02929J4751j11025j9113j6282
3390H508257J09981L32938L59056M54561L86561J84450J57121K0620j63007l46407
$$ y = [15661195, 15397817, 15261812, 15096905, 14917809, 14821109, 14918729, 15187563, 15584638, 15963391, 16459979, 16812709, 16867111, 16847260, 16704806, 16466653, 15930979, 15123519, 14691176, 14269561, 13794643, 13420480, 13100899, 12932638, 12779937, 12485586, 12470685, 12402950, 12396002, 12368119, 12324036, 12461268, 12639474, 12862236, 12955346, 13163031, 13484766, 13921401, 14414808, 15180160, 15931724, 16860671, 17738283, 18250212, 18484874, 18109983, 17750199, 17011671, 15659462, 14568946, 13587598, 12662576, 11952414, 11397109, 10953581, 10526152, 10056758, 9715756, 9465568, 9205434, 8994590, 8867121, 8714778, 8742855, 8639926, 8654677, 8543652, 8524539, 8508257, 8618238, 8951176, 9310232, 9764793, 10151354, 10335804, 10492925, 10513545, 10350538, 10004131]
3380A0004131o27837m58863l79290n21722l49829k84247k84395k70107l47008
3371F480833k51981j05844k37760j79726n0033j64525j55972L4469m7226j52561
3361E169674K1995n6099q5741K5005q4849l1327j2365q4528k11701J44591O326
3350D800981r3910j16386q2304j08761J33228J18916p7678j45945m1242j3427
3340D373472r3611J50640k5002j79102o6847L5542J19461N1179K1191p3010j57297
3329D156616J72821r2164n7645R0152l0698j59408M1571M0864j5597J6424Q2502
3318D245438K8331k5704j00264O9729n2370N4103J4563p9682J2077J5431Q202
3307D189854O1768J02857r3246K3012M8530J06917J6571J1850J2065Q0306K25035
$$ y = [10004131, 9376294, 8917431, 8538141, 8016419, 7666590, 7382343, 7097948, 6827841, 6480833, 6228852, 6123008, 5885248, 5705522, 5655489, 5490964, 5334992, 5369461, 5322235, 5169674, 5191669, 5135570, 5049829, 5074834, 4989985, 4958658, 4946293, 4861765, 4650064, 4794655, 4800981, 4707071, 4590685, 4508381, 4399620, 4532848, 4651764, 4574086, 4428141, 4386899, 4373472, 4279861, 4430501, 4405499, 4226397, 4159550, 4195092, 4314553, 4365732, 4386923, 4313913, 4156616, 4329437, 4237273, 4179628, 4269780, 4239082, 4079674, 4121245, 4162109, 4146512, 4162936, 4245438, 4273769, 4248065, 4147801, 4217530, 4165160, 4219263, 4233826, 4154144, 4166221, 4181652, 4189854, 4251622, 4354479, 4261233, 4284245, 4332775, 4439692, 4456263, 4468113, 4480178, 4560484, 4785519]
3296D785519J17664J4228m4823M6307j19482L3112K1732o8027k16490Q7793m5436
3285D612097o6564k7410j18498L7283K7523J2276j12899m3085j1220Q5310J43059
3274D537872J6066P7224J45569K1506J9903J37270j8690J33912o9581o7800j13752
3263D819499j309j41883j35777k4363q4908k8633q9787o0867J0810N5643o2542
3252D255883j85803l7108Q7645p4629l2041k2441k1888j32533O2683o1248J4028
3241C852548l3567n9526j01501K8484O0417j50116l5546J05531L8755j37322j21789
3230C446368J09260L8421J4900o7369r9656k19992M986q343J30706n8370p3760
3219C217151j16951R8934O0451j30418J8466Q665m0861j00528J09114Q836k4994
$$ y = [4785519, 4903183, 4917411, 4872588, 4918895, 4799413, 4832525, 4854257, 4786230, 4569740, 4657533, 4612097, 4545533, 4518123, 4399625, 4436908, 4464431, 4476707, 4363808, 4320723, 4309503, 4394813, 4537872, 4553938, 4631162, 4776731, 4798237, 4818140, 4955410, 4936720, 5070632, 5001051, 4933251, 4819499, 4818190, 4676307, 4540530, 4516167, 4431259, 4402626, 4312839, 4251972, 4262782, 4318425, 4255883, 4070080, 4032972, 4120617, 4045988, 4013947, 3991506, 3969618, 3837085, 3899768, 3838520, 3852548, 3818981, 3759455, 3657954, 3686438, 3746855, 3596739, 3561193, 3666724, 3705479, 3568157, 3446368, 3555628, 3594049, 3608949, 3541580, 3441924, 3221932, 3226918, 3218575, 3349281, 3290911, 3217151, 3100200, 3199134, 3259585, 3129167, 3147633, 3156298, 3115437, 3014909, 3124023, 3132859, 3107865]
3208C107865j00826J39391O6170p3398p999j33720m3474J8153o0485J33480J84104
3197C229261j29564q9441M1090m7836L7299k2979q2525N128P5618L208L633m4255
3185B978637j8993Q8858r2129j02488n4580n915j0436n546Q8155O508J23539p8171
3173B917439p9086Q7000J0096K036K6059m5353j76433J33144K253n0718j41448
3162B684989J13224o2476j09341L32132o5460l8274l1021P4827m5447R467J10609
3151B973229j92374M4668N1105O477N0880p6614p4234j4890Q1082Q1520j02121
3140B828728l6151L0736q120k0217K4417O1678N1114K4072k8320J36637m1687
3129C022887J4840N888l9344J20606R1954j40347K0788m6606q1169m0355L9255
$$ y = [3107865, 3007039, 3146430, 3212600, 3139202, 3131203, 2997483, 2954009, 2972162, 2911677, 3045157, 3229261, 3099697, 3010256, 3051346, 3003510, 3040809, 3017830, 2935305, 2940433, 3016051, 3019259, 3022892, 2978637, 2959644, 3048502, 2956373, 2853885, 2799305, 2793390, 2782954, 2777408, 2865563, 2872071, 2995610, 2917439, 2838353, 2925353, 2935449, 2937485, 2963544, 2918191, 2741758, 2874902, 2877155, 2826437, 2684989, 2798213, 2735737, 2626396, 2958528, 2893068, 2854794, 2823773, 2898600, 2853153, 2862620, 2973229, 2780855, 2825523, 2876628, 2883105, 2933985, 2857371, 2783137, 2768247, 2849329, 2930849, 2828728, 2792577, 2823313, 2815193, 2794976, 2819393, 2881071, 2932185, 2956257, 2927937, 3064574, 3022887, 3037727, 3043615, 3004271, 3124877, 3216831, 3076484, 3097272, 3050666, 2969497, 2929142, 2968397]
3118B968397o7739q4688J13995q0578p5007j08074J33596n5661j3204l3146R0856
3107B788747Q1818O3730J84396J920j35970l8999p6284k1522J41541l1956n4331
3096B903090j13283r9035m0433J3071n1310J5293J2044P4597j30010o435N764
3085B583353j07362q4163Q0964R1099j02791j2651N7989k07237N4314R5339j03060
3074B345794K7177j02567M0230L6811j1844m4622j99819l4035P9452K0135m5811
3063B110901q7669m9314j9144j20757O7585M8048j27756j8827j0263J3303K4455
3052A830562M7619o5183n5313J09860M9696q6006l9522K2979M7966k7140j19870
3041A715648m6905P5399k9417j45741q7813j7903O6234K5289q4925N9857J38167
$$ y = [2968397, 2900658, 2815970, 2929965, 2849387, 2774380, 2666306, 2799902, 2744241, 2731037, 2697891, 2788747, 2870565, 2934295, 3118691, 3120611, 2984641, 2945642, 2869358, 2847836, 2989377, 2957421, 2903090, 2789807, 2690772, 2650339, 2663410, 2612100, 2627393, 2639437, 2714034, 2584024, 2577589, 2583353, 2475991, 2391828, 2472792, 2563891, 2461100, 2448449, 2506438, 2299201, 2353515, 2448854, 2345794, 2372971, 2270404, 2310634, 2347445, 2335601, 2290979, 2091160, 2057125, 2136577, 2156712, 2110901, 2023232, 1973918, 1954774, 1834017, 1901602, 1949650, 1821894, 1803067, 1792804, 1806107, 1830562, 1878181, 1812998, 1757685, 1867545, 1917241, 1831235, 1791713, 1814692, 1862658, 1835518, 1715648, 1668743, 1744142, 1714725, 1568984, 1481171, 1463268, 1529502, 1554791, 1469866, 1529723, 1667890]
3030A667890J5576r2916r7049P195Q070Q4438j5441j6515j44127n5616n6325l2571
3018A272609k2468p7618J62849Q5140J23547j78519o7620J40364L7495j35849
3008A339930n7967j9858J81967n792k7167j17038j68370J86235m7056j14301Q3087
2997A233670K0198p5148J75401k9318M2700q6473j19026J07233j28656j7790K5979
2986A148770o2250R0132l2086Q0061N3198j35334j12191o0818J43819L9999j18026
2975A035274l7355J35905M5771l3807j07767p2940q2867K1592J4817K1057J30247
2964A069927j7507J0456n7619N1429J26713q2621m1503o6017m1374L3689M6167
2953A031740r067r8475j76876Q9514K4320Q5277n0718j09209P5028K8281J74821
$$ y = [1667890, 1683466, 1590550, 1493501, 1500696, 1508766, 1593204, 1577763, 1561248, 1417121, 1361505, 1305180, 1272609, 1250141, 1172523, 1335372, 1420512, 1544059, 1365540, 1297920, 1438284, 1475779, 1339930, 1281963, 1262105, 1444072, 1438280, 1411113, 1294075, 1125705, 1311940, 1264884, 1150583, 1233670, 1253868, 1178720, 1354121, 1324803, 1367503, 1281030, 1162004, 1269237, 1140581, 1122791, 1148770, 1086520, 1176652, 1144566, 1224627, 1277825, 1142491, 1030300, 969482, 1113301, 1153300, 1035274, 997919, 1133824, 1179595, 1145788, 1038021, 965081, 882214, 903806, 918623, 939680, 1069927, 1052420, 1062876, 1005257, 1056686, 1183399, 1100778, 1059275, 993258, 951884, 985573, 1031740, 1022673, 924198, 747322, 836836, 861156, 946433, 895715, 786506, 861534, 889815, 1064636]
2942A064636j00781N1440j05774j05138N5851N2360o4506L8965J00513k1486q1184
2931H84896o275Q3555o020o4021K9250K1280n816k1538j11194J8732m4070r9259
2919F79520K779J37100j853j203K5468q6538j5104N5291j28347j4346n0846J56263
2907G58184o7460N3310P9430j79169n1523K6585q209J23914K8556l4947O7339
2896G96010r4544m4420M1893J03409o4497J259J3431m2361k9348l7373K05000
2885H48459m8337j41140J1170N5637L9267m7005n3070N3126N8002j19155Q4225
2874G41179k6376N188q020j2872l4791l7100r017K7887k4868l2845N951R1949
2862F86265L2196n6083l9648J4628n5451q1423L86O3077J29067q2411j58856r8856
$$ y = [1064636, 963855, 1015295, 909521, 804383, 860234, 912594, 848088, 887053, 987566, 966080, 884896, 878621, 962176, 956156, 892135, 921385, 942665, 936849, 915311, 804117, 822849, 778779, 679520, 682299, 819399, 817546, 816343, 841811, 755273, 740169, 795460, 667113, 652767, 601921, 758184, 690724, 744034, 823464, 644295, 592772, 619357, 611148, 735062, 763618, 728671, 796010, 701466, 657046, 698939, 802348, 737851, 739110, 752541, 710180, 680832, 643459, 848459, 800122, 658982, 670152, 725789, 765056, 718051, 664981, 718107, 776109, 656954, 741179, 714803, 719991, 711971, 699099, 664308, 627208, 618191, 646078, 621210, 588365, 594316, 686265, 718461, 662378, 622730, 637358, 581907, 500484, 500870, 563947, 693014, 610603, 451747, 352891]
2850C52891m159J15991K9896k1901J16594P4553j78393j24960J48215k9022n0864
2839D28841L1829N5574O1411k0548K642o1129l4102N4377J17249o1346o0254j0823
2827E03721Q0383l9290L1418o3658Q591j73624O1793K2194l1775m8561M6233M3349
2815D40774p0956N9934p3465J1326J27863j46239j2614J1398P8529n9536m6236
2804C20778m852J25345J41468j13219k3618q5323M9393o5412L9582K3247J47230
2793E54619j6561j12026m6298R9228j32653k709n6554n8023K1323O1518L5673
2782C47537K8211j11625P9086M9688Q323n0293m3846K75L7793l6662j79077O6945
2770A96355J03045Q9007l7342J6018L2538N3266J0864q0679J12258m9230q2101
$$ y = [352891, 348732, 464723, 494619, 472718, 589312, 663865, 485472, 360512, 508727, 479705, 428841, 460670, 516244, 577655, 557107, 559749, 498620, 464518, 518895, 636144, 574798, 514544, 503721, 584104, 544814, 576232, 512574, 521165, 347541, 409334, 431528, 399753, 351192, 397425, 440774, 369818, 429752, 356287, 367613, 495476, 349237, 336623, 348021, 426550, 367014, 320778, 315926, 441271, 582739, 469520, 445902, 360579, 409972, 344560, 384142, 407389, 554619, 538058, 426032, 379734, 478962, 346309, 343600, 287046, 229023, 250346, 311864, 347537, 375748, 264123, 343209, 392897, 401220, 350927, 307081, 307356, 345149, 308487, 129410, 196355, 299400, 388407, 351065, 367083, 399621, 452887, 463751, 383072, 495330, 446100, 363999]
2759C63999M970j5949m3608N3081j66516O5606R2443m2696J17194j61661J4049
2748B80912J28467j4354j94135m6573o5870Q0009J0773J11565J0435r7472r5750
2737A08007j5643J42794K7103O972n8213k1021Q6423R9930j07037J2141J0904
2726B92360J8432j34790L8932J1879r4797n9364K16410p7145m5762n0725p9086
2715C6344n4418Q6969P0308q6284O8374J16911J9931o5502j02744q682J2173M6968
2703A40348L4678q5616J87990n2975M0900P646K4549Q5848m0777p1513j59444
2692A11634j6866R4215q9632N7796J4523k2077J42007M4099n5200j21928j31036
2681B7535M9513j09358J84453J64990n0975j25897O260O3160k7806Q357j2340
$$ y = [363999, 368969, 353020, 309412, 362493, 195977, 261583, 354026, 311330, 428524, 266863, 280912, 409379, 395025, 200890, 154317, 88447, 168456, 179229, 290794, 301229, 203757, 108007, 92364, 235158, 262261, 269233, 211020, 189999, 276422, 376352, 269315, 281456, 292360, 310792, 176002, 214934, 226813, 132016, 72652, 289062, 211917, 166155, 115430, 36344, -18074, 68895, 139203, 52919, 121293, 238204, 258135, 192633, 89889, 81207, 93380, 140348, 175026, 89410, 277400, 224425, 265325, 272971, 297520, 383368, 342591, 271078, 111634, 94768, 188983, 99351, 157147, 171670, 149593, 291600, 335699, 280499, 158571, 27535, 77048, -32310, 152143, 317133, 266158, 140261, 146521, 209681, 181875, 190232, 177892]
2670A77892j46528J39940j2555N228K2844M3516o9688r4575P158Q0702n5221j0904
2658H7809K2505K2293P8340P821K33j44665J63933m0855j85716P7069K9650j4954
2646A03463N4852J9468q3318J3836p527o9129l5566K3739J47014M0258l9474l2935
2634A34681Q8042n6458r1429p4202R823P6500J56025R232j52542R72K9172K0102
2622A49918M2268q4636k1715J5291o1359l1656J3437j3989L6939P7058P0537Q3582
2610B75675o277j73628L3327k1110r5163l171J81704M0871N5315O8967n6487k5741
2598B74282m4768Q5119M7076m91O2342j32642p5121J6740K6600L744k23763L5543
2586G4661K164m4219j7766n7646J864J28158P9388p0627j2624L8891o8285J88357
$$ y = [177892, 31364, 171304, 158749, 163977, 186821, 230337, 160649, 66074, 73232, 153934, 98713, 87809, 110314, 132607, 210947, 218768, 219001, 74336, 238269, 197414, 11698, 88767, 118417, 103463, 158315, 177783, 94465, 108301, 100774, 31645, -3921, 19818, 166832, 207090, 167616, 134681, 222723, 166265, 74836, 634, 10457, 86957, 242982, 252214, 99672, 100644, 129816, 149918, 192186, 107550, 85835, 101126, 39767, 8111, 21548, 7559, 44498, 121556, 192093, 275675, 269398, 95770, 129097, 107987, 12824, 9653, 191357, 232228, 287543, 356510, 300023, 274282, 229514, 314633, 361709, 361218, 423560, 290918, 215797, 232537, 259137, 262881, 39118, 74661, 76825, 32606, 14840, -42806, -40942, 87216, 166604, 95977, 83353, 122244, 53959, 242316]
2574B42316J3785j26896L7067P8488o8409p5385j7620J9146N4608l7108J24985
2563B44977k1178j05696p7427k151q814J23900q4313n0150L8935q5380m6499J68753
2551I4957J86318m3143L8407j77385q8504Q0916p509K5409l6642k4974L4876K6054
2539A08780o6221J17438q5164L2025o1395j33168P0041N9720P2693k5368J3056
2528A02437p9070L2274O0543L2367r4587l6794J1088P173J2076J696L5671R265
2516I4139M5551J9588j36103p893O1794k2091N3485J08608k014j25069M9576K1152
2504A60723k1750L653p7965j5400Q847L1724O8556J8360k0582O8900N6612j04090
2492A77588j10094K9506j10323k6169J31103J05636j9605J1263p3587j95050N8565
$$ y = [242316, 256101, 129205, 166272, 244760, 176351, 100966, 83346, 102492, 157100, 119992, 244977, 223799, 118103, 40676, 38525, 29711, 153611, 69298, 19148, 58083, -27297, -73796, 94957, 281275, 238132, 276539, 99154, 10650, 91566, 84057, 109466, 72824, 47850, 82726, 108780, 42559, 159997, 74833, 106858, 45463, -87705, -17664, 42056, 114749, 89381, 102437, 23367, 55641, 116184, 148551, 53964, 17170, 28258, 35431, 47507, 49203, 84874, 94139, 139690, 159278, 23175, 15282, 77076, 54985, 108470, 217078, 215064, 89995, 139571, 160723, 138973, 142626, 64661, 49261, 58108, 89832, 158388, 176748, 156166, 225066, 281678, 177588, 67494, 97000, -13323, -39492, 91611, 197247, 177642, 188905, 115318, -79732, -21167]
2481b1167Q3275L9566m7493J963J9666N7375R2192K0347r041l0678j49088K666
2469E9583p434k651Q0532k7792j35l073r804J3443j7907j7787K556J01396l768
2456A67159J1919l4597Q9861k2590K8304N9880q5750J49061L205j00650j43432
2445A22370P9746J43528L0228r9867J7397J64021j48989j62319q522J43945J39368
2434D20906q8262L5098J7996Q431l4293L3908j35522l1168L0210J57319J03332
2423E17955K2026m1738n4140j0958j54037O1487M7665q2609j07027M1386j8799
2412B21211L9254J10595q811K0484P5998O2412P7670K4510p3676J56418r3255
2401F12810j01038M1848M8697p9911J24878K5020l3710K6745j8962j55625M1365
$$ y = [-21167, 62108, 101674, 54181, 56144, 75810, 133185, 225377, 245724, 236683, 206005, 56917, 59583, 52149, 49498, 130030, 102238, 102103, 99030, 89226, 102669, 84762, 66975, 69531, 170927, 167159, 179078, 144481, 234342, 211752, 240056, 299936, 214186, 363247, 366452, 265802, 122370, 202116, 345644, 375872, 276005, 293402, 457423, 308434, 146115, 137593, 281538, 420906, 332644, 367742, 385738, 394169, 359876, 393784, 258262, 227094, 257304, 414623, 517955, 539981, 498243, 444103, 433145, 279108, 340595, 388260, 305651, 198624, 240010, 221211, 260465, 371060, 362249, 382733, 458731, 521143, 598813, 623323, 549647, 706065, 612810, 511772, 553620, 602317, 522406, 647284, 672304, 638594, 665339, 646377, 490752, 532117]
2390E32117K52853q1667k2033R098J12639j97P2744j6277J0652J09348J4673m3542
2378I50408N728j26448P8102J71574K15860J47773L1874p617J31497J23685L3456
2367A755892J4689J93834O0348M6049L06825K28553J60516J03962K22800K99843
2357C393311K33599K05516K51890L07284L11745J73813M40501L57359M68181O14921
2347F758120N15990R14964Q82157R48139Q81530Q30964J005295R23266J210036
2338A4870461J449406J780659K290982K967003L501449M473012N223868O074754
2330D2631594O662515M467356P30824k081833k775420k055945m511723o461503
2322C6605865m704374l941985l374469k567606k335861k115012j598871j175976
$$ y = [532117, 784970, 703303, 681270, 690368, 803007, 802810, 875554, 859277, 869929, 979277, 993950, 950408, 956136, 829688, 907790, 1079364, 1295224, 1442997, 1474871, 1467254, 1598751, 1722436, 1755892, 1770581, 1964415, 2024763, 2070812, 2377637, 2606190, 2766706, 2870668, 3093468, 3393311, 3626910, 3832426, 4084316, 4391600, 4703345, 4877158, 5317659, 5675018, 6143199, 6758120, 7274110, 8189074, 9071231, 10019370, 10900900, 11731864, 12737159, 13660425, 14870461, 16319867, 18100526, 20391508, 23358511, 26859960, 31332972, 36556840, 42631594, 49294109, 53761465, 54492289, 52410456, 49635036, 47579091, 43067368, 36605865, 31901491, 27959506, 24585037, 22017431, 19681570, 17566558, 15967687, 14791711]
2314A4791711j074095r63867r90468q52057o91433r24376q76338p07559n02101
2305G209417n35419o71201o46360l34023l78582m00012k79440j94956l47283j41980
2295C280161m931l12203j79159r9574n3848j53817k2357j14020j92052j60609
2285A987591j5883j16303j8788p3287j15575L073j48455l6496p4705M4732r3528
2274A342376l5653p600j58207j93145Q6171p7251m188J06317K4915q3223j46748
2263H53764j4168q2096j4587J6228q2238o4811O5225l0155r847l5196j30103p2568
2251C99448J2789N3479k3761l8713j10508l0122J09657j34499j01810J74731L4540
2240C45231j20100r8161j0104j3321M2297J10555q9114p5204l6407j09842R9591
$$ y = [14791711, 13717616, 12753749, 11763281, 10911224, 10219791, 9295415, 8419077, 7711518, 7209417, 6673998, 6002797, 5356437, 5022414, 4643832, 4243820, 3964380, 3769424, 3422141, 3280161, 3275230, 2963027, 2783868, 2684294, 2630446, 2476629, 2454272, 2340252, 2148200, 1987591, 1971708, 1855405, 1836617, 1763330, 1647755, 1650828, 1502373, 1465877, 1391172, 1435904, 1342376, 1306723, 1299123, 1140916, 947771, 1033942, 956691, 952503, 1058820, 1083735, 1000512, 853764, 839596, 757500, 742913, 759141, 676903, 612092, 677317, 647162, 637315, 602119, 472016, 399448, 412237, 465716, 441955, 403242, 292734, 262612, 372269, 237770, 135960, 310691, 345231, 225131, 126970, 116866, 103545, 145842, 256397, 167283, 92079, 55672, -54170, 45421]
2229D5421Q0610O951r5656o750N1350N5066L5554p2824R0004M5022O3040p2589
2217B25199q8056J8353J4349q8128M7804j74833O4764j5967j736n2887k7966L8316
2205d0788j2561O6355J69673j6636j21134J05352j85260l0255J17835q7494k8754
2194f3667O6545K8530K9956J6427n5912l7165o9793k0738n3505M41l392L5980
2182a26293J48513P583p3581J14755N4846j21949N0558J8074k5404L5942K3860
2171A06904p95j09206r4016J40986k1163r4418Q0373M209n9043n815O5877l8121
2159b4228m4464J3539p980L6104j956o768m6098o6539N046L980j3626R3103k715
2146f2602l6511O5046P5443m9797J13435l0051O1378L8466k14311J5480L6936
$$ y = [45421, 126031, 132982, 37326, 30576, 81926, 136992, 172546, 99722, 189726, 234748, 297788, 225199, 137143, 155496, 169845, 81717, 129521, -45312, 19452, 3485, 1749, -51138, -79104, -40788, -53349, 13006, 182679, 166043, 44909, 150261, -34999, -65254, 52581, -34913, -63667, 2878, 31408, 61364, 77791, 21879, -15286, -85079, -105817, -159322, -158881, -162273, -126293, 22220, 29803, -43778, 70977, 125823, 3874, 54432, 72506, 47102, 83044, 106904, 106109, -3097, -97113, 43873, 22710, -71708, 8665, 12874, -46169, -51984, 13893, -24228, -68692, -55153, -63133, -27029, -28985, -35753, -81851, -148390, -143344, -139364, -152990, -59887, -62602, -99113, -34067, 41376, -8421, 105014, 74963, 136341, 174807, -39504, -24024, 12912]
2135A2912L8244P0867l3001N934j96681k2067P9145M2569p9954k6779N8253J834
2123d8724m5940R0279j7035O859n649m6961P5977o8680q583n3838O8345m3107
2111i7057k390k0960J35173j06730l2078J24109p8089j23427j3611J21752J08000
2100A4692Q0580j25945r4254P1988J56466j16025j42357P7436J58333q4149j57286
2089a60521L2947J10761q001R0838p1660l3610j9116O5539p8375M4133N0424q4879
2077f1520N7750l3837o3483Q8366Q6348l5593m6653J18318J43460j91441j17878
2066e6163p1944J0381J18492J20422j4849j5703J14367O9290n3347P1992p0331
2055B22607j03784L3846K3628j43285m6912N2205k738L3021p7118n9827L2213
$$ y = [12912, 51156, 122023, 89022, 94956, -101725, -123792, -44647, -2078, -82032, -108811, -50558, -48724, -94664, -4385, -21420, -14561, -20210, -67171, 8806, -59874, -68457, -122295, -53950, -97057, -99447, -120407, 14766, -91964, -124042, 67, -78022, -201449, -215060, -93308, 14692, 95272, -30673, -124927, -52939, 103527, -12498, -154855, -77419, 80914, -3235, -160521, -127574, -16813, -24814, 66024, -5636, -39246, -58362, 7177, -71198, -27065, 23359, -61520, -3770, -37607, -101090, -12724, 73624, 38031, -8622, 109696, 253156, 61715, -56163, -128107, -117726, 766, 121188, 106339, 90636, 205003, 274293, 220946, 292938, 222607, 118823, 152669, 176297, 33012, -13900, 38305, 35567, 68588, -8530, -68357, -36144]
2044c6144J0187Q6708J929O1145j51814r6270J6919k9589N5647k1600o1270p27
2032a64879J3109P6901p2208n5751l539j14686P1506O9835j3245M8485J4783J59804
2020C0115k3489j42435J7059l8461n7993J23242n0584j20544J56558P8439m9916
2009g8009m0099M183j84790r2228R2175J22384k1147N1372N8328q7952j7965R6877
1997i6871L7804j05702K4168l9544J56295r1886J47764j30516j95350N4086Q6224
1986a53528N2462r9782J9457l0572M6014j0647Q2530j6770R5965k3206J7769L5065
1974A4757m2987j21855l3910J9184J67712p8831N608N1929N4041q6918j3451J1096
1962e3625r6489q7686K5150K1322J31518J2368n7940R509j27425J39635R324j48721
$$ y = [-36144, -25957, 60751, 62680, 123825, -27989, -124259, -107340, -136929, -81282, -102882, -164152, -164879, -151770, -74869, -147077, -202828, -206367, -321053, -249547, -179712, -192957, -144472, -129689, 30115, 6626, -135809, -118750, -157211, -215204, -91962, -142546, -263090, -106532, -28093, -78009, -118108, -113925, -298715, -390943, -298768, -176384, -197531, -146159, -87831, -175783, -193748, -96871, -59067, -164769, -140601, -180145, -23850, -115736, 32028, -98488, -293838, -239752, -153528, -101066, -200848, -181391, -211963, -165949, -176596, -94066, -110836, -14871, -38077, -20308, 14757, -28230, -150085, -183995, -164811, 2901, -75930, -70322, -18393, 35648, -51270, -64721, -53625, -150114, -237800, -212650, -191328, -59810, -47442, -105382, -95873, -223298, -83663, -74339, -223060]
1950b23060j6241Q2480J3886P4591j5561l600k35066K6741M021J2613J55537l6623
1938a60282R2009q3741k4657K4232k3147M3773O2593O503o5250l8525r822j13364
1926b89678m2090O3529P5213J9055J30344k2069j18179N963N870l6287m5993L1707
1914b22615p0133l218J05553J55398J13317j06387j25949J52048o7387m6878r1818
1903b08069j5N8260N3838M3766q0979O3942P190r9905j20013M2707J47067n9012
1891a51223j06697P3812J39805N2413q062n6147K4999j933M3923j00036N96J24744
1879C6194j14638k9129k1033P529n6378M7220J07940j25599j9488j19219p1901
1868c58502J45928J44285J11418j74252j02398O0740N0462j14628J28253J13428
$$ y = [-223060, -239301, -156821, -142935, -68344, -83905, -87505, -322571, -295830, -291809, -279196, -123659, -160282, -68273, -152014, -176671, -152439, -175586, -131813, -69220, -62717, -127967, -166492, -176314, -289678, -331768, -268239, -193026, -173971, -43627, -65696, -183875, -177912, -172042, -208329, -254322, -222615, -292748, -295966, -190413, -35015, 78302, -28085, -154034, -1986, -69373, -116251, -208069, -208084, -149824, -95986, -52220, -133199, -69257, -62067, -161972, -281985, -239278, -92211, -151223, -257920, -184108, -44303, 8110, 48, -56099, -31100, -33033, 10890, -89146, -88550, 36194, -78444, -107573, -128606, -121077, -177455, -130235, -22295, -147894, -167382, -286601, -358502, -212574, -68289, 43129, -131123, -233521, -172781, -122319, -236947, -108694, 4734]
1858D734j22256p1402k7452J0978J35787R9714j3065q7938k9125n5368p7170Q9023
1846a43540N1049j9542j00399K8347r4440L6253K31N7662J73796J12327m0428
1835F1316j61575l9359N4193q8396o2005J21013l0119K4384P9833o7762j30n957
1823a14564n8972k0017j1966P8214k0859P4642P2145M0294j4129j47863j4424
1812a37499K3036R512M4907j79544J0407Q9203K5970N5716j912m432O4633j06213
1800a06216j5944N545N0554Q3288P333N0091o5923j02925L461J16304q3945K2181
1788c6196R5573j10463p7846j53529k3146L8934O9071J1978P9030P0343n0100
1777h6351l304l683n778m65n2755m443R5101J23983o3753j19126n3934M6252m123
$$ y = [4734, -117522, -188924, -216376, -205398, -69611, 30103, 17038, -70900, -100025, -155393, -232563, -143540, -92491, -112033, -212432, -184085, -278525, -242272, -242041, -184379, -10583, 101744, 61316, -100259, -139618, -85425, -173821, -235826, -114813, -144932, -120548, -40715, -108477, -108607, -114564, -173536, -193553, -205519, -127305, -148164, -73522, -1377, 38917, 24788, -123075, -137499, -114463, -104951, -60044, -239588, -229181, -139978, -114008, -58292, -60204, -64636, -3, -106216, -122160, -116615, -66061, 17227, 24560, 74651, 8728, -94197, -90736, 25568, -58377, -36196, 59377, -51086, -128932, -282461, -305607, -266673, -197602, -185624, -106594, -36251, -86351, -89655, -93338, -99116, -99581, -152336, -156779, -61678, 62305, -1448, -120574, -174508, -128256, -132379]
1764a32379m3727N3034M4353K4048n4931Q0090q1152j2905L9188K6617r0569n0136
1752a98469L5852J14344p6364M2667m7979P1439R771p7803L7595Q3182P0370o137
1740E8468q3191p0240P0498o7988k4491K058j68595Q7076J05620M4376J4528j27706
1728a59587P3362o1812p4820K3562l203J26807Q8547n5691k04476k8286K37748
1717c7849k1524n246m032j29550k4348J17806N484M5594L9973p9254J69314K8377
1705A04745j57626r3774j6177L7523n8263o9534N6676O3776l6228j02610r280
1694b80772P5117J29062Q7018Q2042N1043j83022M178n9245K2540r0653q1786
1683b44478P7466o6715J71648m671J2974J5761R4249j4207j16762N3231j18921
$$ y = [-132379, -176106, -123072, -78719, -54671, -109602, -29512, -110664, -123569, -84381, -57764, -148333, -198469, -162617, -48273, -124637, -81970, -129949, -58510, -48739, -126542, -88947, -5765, 64605, 58468, -24723, -94963, -24465, -92453, -116944, -114886, -283481, -196405, -90785, -46409, -31881, -159587, -86225, -148037, -222857, -199295, -202498, -75691, 12856, -42835, -247311, -275597, -37849, -59373, -64619, -68651, -198201, -222549, -104743, -99259, -53665, -13692, -92946, 76368, 104745, -52881, -146655, -162832, -125309, -183572, -253106, -196430, -132654, -168882, -271492, -280772, -205655, -76593, 10425, 92467, 143510, -39512, -35334, -94579, -72039, -162692, -244478, -167012, -233727, -62079, -66750, -53776, -38015, 56234, 42027, -74735, -21504, -140425]
1672a40425k1708Q2943O812j07566K8944L646k2365o154Q023R830N8083j18110
1660b18047n7878P2613N5770o1361J79144m2187m1914n6464k7701j1122P8347
1649a30800J31402k896j0814q7847r121P2987k9320j2312N8132l3769p04m0483
1637i5545L4445J7638J29861k821j7770n7321j05614R058o748L2153K2844j37805
1625a77625J07391L3872m2310N7227n241M74n4304l7175l5028L0214M815k2685
1613a40375J9829j8103q9674J12879P5507o8173N9642r7043P0050p8950m1508
1602a95919L0469k378J21643j33285n1238J11852R5352K0270m0825R4523J21667
1591A72131k3686o0771p289k3265j20529j77431Q2781R9610r0495Q6555M8889
$$ y = [-140425, -162133, -79190, -72378, -179944, -151000, -147354, -169719, -175873, -167850, -158020, -99937, -218047, -275925, -203312, -147542, -208903, -29759, -71946, -113860, -170324, -198025, -209147, -130800, 602, -2294, -13108, -100955, -110076, -37089, -66409, -78721, -20589, -54358, -55062, -95545, -61100, -43462, 86399, 83578, 65808, 8487, -97127, -88069, -94817, -62664, -39820, -177625, -70234, -36362, -78672, -21445, -26686, -26212, -80516, -117691, -152719, -122505, -117690, -140375, -120546, -138649, -228323, -115444, -39937, -108110, -48468, -145511, -75461, -154411, -195919, -165450, -167828, -46185, -179470, -230708, -118856, -23504, -3234, -44059, 50464, 172131, 148445, 87674, 80385, 57120, -63409, -240840, -158059, -58449, -148944, -62389, -13500]
1580a3500P0709o3833j83436n68N9458r4853j859K4079J22780M4166p523q475
1568e2855p7917L0096j20588J78796J10695L386j04903j07262k5508L0313l0270
1557a66017N9840M227L3074j3160o7348Q3705J8442J6923R5958j3906p2898k7534
1545d8694O6001K5441q2123L3688L4924j96544K0351J16689J4541p1670r536O7421
1533b9511n1101l393j29478n2771K30619j36504P0374J39579n8805j9577j31596
1522a72164J4802N2438l330j2426P2465l5181k1293k4032M408j1787n1379K0170
1510a67309L0536O4758K14440M21k1456J2100j05818p8098q6949J39551P4491
1499G6667j88573p1906K21281K3415j27930K0156n3191J9046r2825Q4204K9646
$$ y = [-13500, 57209, -6624, -190060, -190628, -131170, -226023, -227882, -203803, -81023, -36857, -44380, -52855, -130772, -100676, -221264, -42468, 68227, 71613, -33290, -140552, -166060, -135747, -166017, -106177, -101950, -68876, -82036, -149384, -65679, -47237, -30314, 65644, 51738, -21160, -48694, 17307, 42748, -39375, -5687, 29237, -167307, -146956, -30267, -15726, -87396, -96932, -29511, -80612, -84005, -213483, -266254, -35635, -172139, -101765, 37814, -20991, -40568, -172164, -157362, -104924, -108254, -120680, -48215, -83396, -104689, -128721, -124313, -136100, -187479, -167309, -136773, -72015, 142425, 142846, 121390, 133490, 27672, -50426, -137375, 2176, 76667, -111906, -183812, 37469, 60884, -67046, -46890, -100081, -81035, -173860, -89656, -60010]
1488f0010N709o3188J85118q1217j01080j2459R3959R3582k4400m3917p3517P6205
1476e215M6126J5668K2324m1268m7992k0143O8536k6355j12161l1155K31026m2872
1464E6519m5132k6005l2867K758L5483o0523j33705J7710k7035O9360l572J06228
1452d0781P0604j8881J3959K8229n9752j06574j1937J243L0181O2255J32612n1687
1440D9471j24344r2921n7736J47434n1608J21176m7458q7036J3835Q6866J7404
1429b4917j11332N9348k5358p1470J65729p6441p1371K42L5940J18066O3028r0682
1417b9218n5901N4791j10846l994P9638k7059P9226K6333r6001o5435P3488o2416
1405a37394J0258Q4355q5471o9535R4731k8926J88126o1464o5578k0325K8538
$$ y = [-60010, -54301, -117489, 67629, -13588, -114668, -127127, -33168, 60414, 36014, -7903, -81420, -5215, 40911, 56579, 78903, 37635, -10357, -30500, 38036, 11681, -100480, -131635, 99391, 56519, 11387, -14618, -47485, -44727, -9244, -69767, -203472, -185762, -212797, -143437, -147009, -40781, 29823, 10942, 24901, 53130, -6622, -113196, -125133, -123890, -93709, -31454, 101158, 49471, -74873, -167794, -225530, -78096, -129704, -8528, -55986, -143022, -129187, -42321, -24917, -136249, -76901, -102259, -173729, -8000, -84441, -155812, -155570, -119630, -1564, 61464, -29218, -85119, -30328, -141174, -145168, -65530, -92589, -13363, 12970, -83031, -148466, -74978, -137394, -127136, -42781, -128252, -197787, -103056, -131982, 56144, -5320, -70898, -91223, -62685]
1394f2685J59678o3573m9073J3271N4246j7282j88117m927L1375J28778M9077
1383E0768j08172l9792M2232L8959j81289j3241R7920N948k02086l6991K56270
1372h9474P0760J16555N1048r8843k9745R4086l4670M799L2411j4125P635N0675
1360A61112q8473M5073N0560j23038J58272j29375j99878j20008R5284Q2524q0147
1349a48094j1865J23932L975m1243j8271J32789K6747N7654P238j47232k7645
1338d2015k12950L7925K27564l1060k8970j03390K5353n1595J04062J44247Q3530
1327A52701j85689k9641k9811K3613l7564M1107n614N7072M2599l9755j5600j4790
1315d1372q0952P4683O6258q0072p016J03602O5888j69148J27670o2998J752M0457
$$ y = [-62685, 96993, 33420, -15653, -2382, 51864, 34582, -153535, -158462, -127087, 1691, 50768, -57404, -97196, -54964, -16005, -197294, -210535, -112615, -106667, -308753, -345744, -89474, -18714, 97841, 148889, 50046, 20301, 114387, 79717, 84516, 116927, 102802, 110437, 161112, 72639, 117712, 168272, 45234, 203506, 74131, -125747, -245755, -150471, -67947, -148094, -159959, -36027, -32052, -73295, -91566, 41223, 67970, 125624, 132862, -14370, -42015, -254965, -217040, 10524, -20536, -49506, -152896, -127543, -179138, -75076, 69171, 152701, -32988, -62629, -92440, -68827, -106391, -65284, -70898, -13826, 28773, -10982, -26582, -41372, -122324, -47641, 18617, -61455, -68471, 35131, 101019, -68129, 59541, -3457, -1705, 38752]
1303C8752j8145L1132q5808r8887P5635J02484o1599l5339m8448O4372J29249
1292I3398p2950P0797p0820R4806q7486r7710R9450j3099p9018q8796J36745O2
1280a4621p1675o298Q1941k2113J7661M1245l7951m773n3522J10869j17877q2276
1268a59390J09718m0658M4020K262p4672K5517K84406l4854j87541L1686m7106
1257d6612L8073k6201j9434j40l6084k2859J19154q9802m8812k2855R1232O3204
1245a136r7677P3567J23445K1490j69005N584k7738P8524N4164j11206J19538
1234F9550j51056J28564n2878r336J6524p432l4945m3389L1325o4963R2416Q2367
1222E6747n8865P9529L0460p3910J4358n4906Q435M4715J9703j08748k268q064
$$ y = [38752, 20607, 51739, -34069, -132956, -57321, 45163, -16436, -51775, -100223, -35851, 93398, 20448, 91245, 20425, 115231, 27745, -69965, 29485, 16386, -62632, -151428, -14683, -14621, -86296, -92594, -10653, -32766, -15105, 26140, -11811, -16584, -70106, 40763, -77114, -159390, -49672, -90330, -46310, -44048, -118720, -93203, 191203, 156349, -31192, 494, -46612, -8539, -34740, -54174, -54314, -90398, -113257, 5897, -83905, -132717, -155572, -64340, -1136, -98813, -25246, 98199, 119689, -49316, -43732, -71470, 7054, 61218, -49988, 69550, -81506, 47058, -5820, -15156, 1368, -6064, -41009, -84398, -53073, -118036, -25620, 56747, -2118, 77411, 107871, 33961, 48319, -6587, 1848, 46563, 66266, -42482, -44750, -52814]
1210e2814M6276k0237M2697j11107k5919M5633N3280m5786R5656j12893N344K0280
1198e9590o1229J10147L0310J1849L7361L823o6802L5652p4091n6126M7165M6996
1186E465j1493O6641M7725j09835n2060q0865J7169j650N3723p2778n972K0574
1174a23356J15588M8730k4411k8270O4806L8814l3535K3709j41979J11596m739
1163D6953o6033n6173K2102n0142k150o5J00403M682M9680r5122L3667j6601o250
1150c5049m3457K5671M9505p6484p468J84293L7589r0407m9518j5144n0670k6878
1138i8017J00054J27995Q0482n0181j42652j05584K20878Q8954j25000j50856
1128e3927j04230J12399K2561j74295j6624J1068M9438J75448k9237j88795J19761
$$ y = [-52814, -6538, -26775, 15922, -95185, -121104, -75471, -22191, -67977, 27679, -85214, -79870, -59590, -120819, -10672, 19638, 31487, 68848, 72671, 5869, 41521, -32570, -88696, -41531, 5465, -6028, 60613, 108338, -1497, -53557, -134422, -117253, -118903, -65180, -137958, -143930, -123356, -7768, 40962, 16551, -11719, 53087, 91901, 58366, 82075, -59904, 51692, 46953, -19080, -75253, -53151, -103293, -105443, -105508, -5105, -423, 49257, -45865, -12198, -28799, -35049, -78506, -52835, -3330, -79814, -87282, 97011, 134600, 44193, -5325, -20469, -71139, -98017, 2037, 130032, 210514, 160333, 17681, -87903, 132975, 221929, 96929, -53927, -158157, -45758, -23197, -197492, -214116, -203048, -153610, 21838, -7399, -196194, -76433]
1117g6433R6763J39762P339J08795j95467k31620R9910J2922L2266m5834K692
1106d8905J72667m605j65998p7001J19204J33188L0907Q5226k06819n8448N6994
1095C6410j08147O5826j06755P1320P0895j05537j47666J68736j4694j19188m1459
1084b30259R8321J47177k4531N0845L5323k6729L0308N638j11331N6257L56p693
1072B3682O9787K3796o8918j01872k31593O6335J97956J0652K078N2713J38872
1061A83488Q2842j15066j03123K998k3862o549m2804Q9678j11626j06438J66733
1050A6271J22936l7642l7274j22221R2744l605j10967J65381J9278l4996N273
1039G5178n2810r7524L9463O2918K204j5546J4156M8307P1466j33876M1093k0901
$$ y = [-76433, 20330, 160092, 167431, 276226, 80759, -150861, -50951, -38029, -5763, -51597, -48905, 123762, 119157, -46841, -123842, -4638, 128550, 159457, 244683, 37864, -20584, 36410, -71737, -5911, -112666, -41346, 29549, -75988, -223654, -54918, -69612, -188800, -230259, -131938, 15239, -9292, 41553, 76876, 50147, 80455, 86093, -25238, 31019, 31375, 23682, 93469, 117265, 48347, -53525, -285118, -218783, -20827, -10175, -8097, 44616, 183488, 266330, 151264, 48141, 51139, 27277, 20728, -22076, 67602, -44024, -150462, 16271, 139207, 101565, 64291, -57930, 34814, 31209, -79758, 85623, 104901, 69905, 75178, 22368, -75156, -35693, 27225, 29429, 13883, 28039, 76346, 147812, 13936, 55029, 34128]
1027C4128R5239P613j30749J7831l3801j0235J4041n1322l4258P4406N434j568
1015a3241J12381o5322j04220L6489q273L2657o1717o4893J43606J22570m0861
1004H9176L207m8629n1511n633L0P5205Q178K2397M4969j12145K8871J55553J4380
991B24048r9939j75131r9772N6367q8829j1363J70324Q5621n9666j26824J44489
980A9325J30929R4983j60496m1143n390J5883m8111q0970M3273M7252J10717l9577
968H6675j04269O5403N2487q9865M6558J17398N0458j79182j38649J46184K443
957E5641j05381K3463m3152m9728k1022J36092J22457r6890m236l3795O0292j51151
945a07410N6877L9723m2743J81479j03389q3484j3276M8921n2370M2086P514P6099
$$ y = [34128, 129367, 136980, 6231, 24062, -9739, -19974, -5933, -57255, -91513, -17107, -11673, -13241, 99140, 33818, -70402, -33913, -42186, -9529, -71246, -136139, 7467, 130037, 89176, 92383, 43754, -7757, -13390, -13360, 61845, 70023, 92420, 137389, 25244, 54115, 209668, 224048, 124109, -51022, -150794, -94427, -183256, -194619, -24295, 61326, 1660, -125164, 19325, 150254, 245237, 84741, 43598, 38208, 54091, 5980, -74990, -31717, 15535, 126252, 86675, -17594, 47809, 100296, 10431, 56989, 174387, 224845, 45663, -92986, 53198, 55641, -49740, -26277, -69429, -119157, -140179, -4087, 118370, 21480, 17244, -16551, 43741, -107410, -50533, -10810, -53553, 127926, 24537, -58947, -72223, -23302, -75672, -33586, -26072, 50027]
933E0027J595R909o9734m2709r5402M7521R3282J7755j17474j06589J60397l1419
921h2841N8933J404n2961q641Q5769R6132n1745K3064K1884n5138n2686K0373
909C547Q7954M6537j0945n8961J07165j08088J04823j3324q7987j23725n5017
898a08021J50606l0947Q7958j8407r5766o0307J17339p054l314J9446o7998O5628
886D9163L2756j09995J68096N3633m1567K4219j14529k4356N6368l2708k9346
875C1734j0777j9616r7645J22326j3108K0975O376J03568k7818k3162n1892J17063
863A58024k1938j70315O5525L1922r3496M0851Q5530m4112M912n3964R0928j13172
851a9305l0685J6316q9188N1674J67020O0809j53128J226J99729j03543r8112
$$ y = [50027, 51622, 61531, -8203, -50912, -146314, -98793, -5511, 12244, -105230, -211819, -51422, -82841, -23908, -22504, -75465, -84106, 1663, 97795, 46050, 69114, 90998, 35860, -16826, 3547, 91501, 138038, 127093, 68132, 175297, 67209, 172032, 158708, 70721, -53004, -108021, 42585, 11638, 99596, 81189, -14577, -74884, 42455, 35401, 32087, 51533, -16465, 49163, 81919, -28076, 140020, 193653, 152086, 176305, 61776, 37420, 93788, 61080, 31734, 20957, 1341, -96304, 26022, 12914, 33889, 40265, 143833, 116015, 92853, 40961, 158024, 136086, -34229, 31296, 63218, -30278, 10573, 96103, 51991, 56903, 2939, 93867, -19305, -49990, -33674, -122862, -71188, 95832, 156641, 3513, 4739, 204468, 100925, 2813]
840B813n993N474O1120j3037r2741m900K06394o8236j35257L6084M92j7128o8894
827i3809N8171o2687l3069K5712J28224N5138j18284j23940K5108K55945l326
816A13183j288J0310j06610J29465R6622j24201j26025L2336m2118M7997m8745
805a9074R3135j48935o8862P2574M6373O7445m2037k044r595J1605l2160K3060
793h515J35229j03589R2143O1865o5420n4494q836n4093P691l6016R6467J13596
781A76028r2825j13197J26486J17602j13574R1162j8264k08467J01476k5648j79524
770a38745P8809N3230O5847J20192m232j00987r5594M1238n5738J45451l7904
759G1567j49579L3600L477J10820j57062n6298Q7830K01148j21293j03176j68254
$$ y = [2813, -3180, 2294, 63414, 50377, -42364, -47264, 159130, 90894, -44363, -8279, -7787, -24915, -93809, -35638, -98325, -131394, -105682, 22542, 77680, -40604, -164544, -139436, 116509, 113183, 111895, 122205, 15595, 145060, 241682, 117481, -8544, 23792, -18326, 29671, -19074, 74061, -74874, -143736, -71162, -24789, 42656, 619, -1425, -11020, 585, -31575, -8515, 126714, 23125, 115268, 177133, 111713, 57219, 48383, -5710, 1981, -34035, 62432, 176028, 83203, -29994, 96492, 214094, 100520, 191682, 173418, -35049, 66427, 40779, -138745, -59936, -6706, 59141, 179333, 175101, 74114, -21480, 19758, -35980, 109471, 71567, -78012, -44412, -40935, 69885, -87177, -143475, -55645, 145503, 24210, -78966, -247220]
748b47220N4372P6814O0513O672J15920L4315L1426q2L568O6801r0329j52795
736d0025n1640k33N2551M359k073M0113J52725j310m0723j3982j10771L0216M7303
723F6510J31697M2664r4988j2967m742j10404n1158k7277k2719O2244j27028O3030
711h5138J35275M1567l4686q4535J19353r9112O3056L2909q9336J43279j04112
700C8520j32417J48286R0239o8768n835l0205M1642j28318J5081L7865L2064k9521
688H633n5476J4944K5219K46564n4748j60056j69419k5505P4375O8781N1101k0052
676D361n9666j15824K070J07668j4907J4621M6707J02990n7262r1129J25734J00232
664A65595j57847j04780k0157J29785N6863L8850o8218O2606m644j41969J7618
$$ y = [-247220, -192848, -116034, -55521, -48849, 67071, 101386, 132812, 132730, 136298, 203099, 112770, -40025, -91665, -91898, -39347, -34988, -37061, 3052, 155777, 154467, 113744, 99762, -11009, 19207, 66510, 198207, 240871, 145883, 132916, 128174, 17770, -33388, -60665, -83384, -21140, -148168, -85138, 50137, 91704, 57018, -27517, 91836, -7276, 55780, 88689, -647, 142632, 38520, -93897, 54389, 144628, 75860, 70025, 39820, 81462, -46856, -31775, 6090, 38154, 8633, -46843, -31899, -6680, 239884, 185136, 25080, -144339, -169844, -95469, -26688, 24413, 4361, -55305, -171129, -169059, -61391, -76298, -61677, -14970, 88020, 30758, -60371, 65363, 165595, 7748, -97032, -117189, 12596, 69459, 108309, 40091, 102697, 98053, -43916, -26298]
653b6298k3614q2480J08492P54Q6813l4472J3146R0524j45367r8485q42J7513
641i4316m2878L8024L3249m20J42430K8054q2334M6934J0436J3717m3292j21839
629g2235n1083O7759J61777p5611j24987J76263O1070m5442m9347K3739K6922
618I8825l8539p6103q7260j18558Q6179n6368O7092J56525m7604o6716l8249K7235
606i3541M7249k5484O1107L5267m6589r0405k5811N1445n6476m7093L8689J17756
594c3886O8767L8448L0811l2902L8074Q3078n2282n9289J43942P8112r0213R94
582B13654j23756L6582N7069N1326p9846j67496m7562j0599R6906K3471J6652
571F6401q5210P3659o535k0761q7246j33517Q1327J95985M0865J1877l4293l1634
$$ y = [-26298, -49912, -132392, -23900, -23146, 63667, 29195, 42341, 132865, -12502, -110987, -111829, -94316, -137194, -99170, -65921, -66341, 76089, 104143, 21809, 68743, 79179, 92896, 49604, -72235, -123318, -55559, 106218, 30607, -94380, 81883, 142953, 97511, 48164, 71903, 98825, 60286, -15817, -103077, -221635, -135456, -191824, -124732, 31793, -15811, -82527, -120776, -93541, -46292, -71776, -10669, 24598, -21991, -112396, -138207, -86762, -143238, -190331, -151642, -33886, 34881, 73329, 104140, 71238, 109312, 192390, 140108, 80819, 224761, 302873, 212660, 213654, 89898, 126480, 183549, 234875, 155029, -12467, -60029, -70628, 26278, 49749, 66401, -18809, 54850, 48315, 27554, -59692, -193209, -111882, 84103, 124968, 136845, 102552, 70918]
559G0918j7968n642Q0409k9092l0677J6737l9681m3008J63073q772p8852n6201
$$ y = [70918, 52950, 47308, 127717, 98625, 67948, 84685, 45004, 1996, 165069, 156297, 77445, 21244]
$$ [...]
##END NTUPLES=NMR SPECTRUM
##END=
