##TITLE=1H_DE-80H_X3
 200.13MHz, d2o
 8 sc
 
 19ns.26.2.2025
##JCAMPDX= 6.0         $$ Bruker NMR JCAMP-DX V2.0
##DATA TYPE= NMR SPECTRUM
##DATA CLASS= NTUPLES
##ORIGIN= UXNMR, Bruker Analytische Messtechnik GmbH
##OWNER= pz
$$ XWIN-NMR		Version 3.5
$$ Tue Sep 30 10:27:21 2025 Russian Standard Time (UT+4h)  Yarkov@DPX200
##.OBSERVE FREQUENCY= 200.1313
##.OBSERVE NUCLEUS= ^1H
##.ACQUISITION MODE= SIMULTANEOUS
##.ACQUISITION SCHEME= undefined
##.AVERAGES= 8
##.DIGITISER RES= 18
##SPECTROMETER/DATA SYSTEM= spect
##.PULSE SEQUENCE= zg30
##.SOLVENT NAME= CDCl3
##.SHIFT REFERENCE= (INTERNAL, CDCl3, 0, 15.4847)
##AUDIT TRAIL= $$ (NUMBER, WHEN, WHO, WHERE, WHAT)
$$ ##TITLE= Audit trail, XWIN-NMR		Version 3.5
$$ ##JCAMPDX= 5.01
$$ ##ORIGIN= Bruker BioSpin GmbH
$$ ##OWNER= Yarkov
$$ C:/Bruker/XWIN-NMR/data/yarkov2/nmr/H-C/1/pdata/1/auditp.txt
$$ ##AUDIT TRAIL=  $$ (NUMBER, WHEN, WHO, WHERE, WHAT)
(   1,<2025-09-30 10:26:12.32 +0400>,<Yarkov>,<DPX200>,
      <created by zg, POWCHK disabled, PULCHK disabled
       configuration hash MD5:
       00 E9 B6 7A A2 85 ED C7 34 08 36 98 17 FE 4E 26
       data hash MD5: 16K
       F2 80 18 2A 42 20 8E 4F 26 C4 AC 75 C2 2F 5B 4F>)
(   2,<2025-09-30 10:26:35.20 +0400>,<Yarkov>,<DPX200>,
      <Start of raw data processing
       efp BC_mod = 2 LB = 0.25 FT_mod = 6 PKNL = 1 PHC0 = -2078.854 PHC1 = 16.19097 SI = 16K 
       data hash MD5: 16K
       B2 B4 51 D6 F4 84 91 F7 6E A2 21 CA 0E 74 7D 54>)
(   3,<2025-09-30 10:26:43.60 +0400>,<Yarkov>,<DPX200>,
      <abs ABSG = 5 
       data hash MD5: 16K
       6D 93 FD 87 56 F1 E4 25 68 A2 9A EE B8 A3 6A 1A>)
$$ ##END=
$$ 
$$ hash MD5
$$ CB 72 95 45 D3 D6 4A 4D C0 E8 BF 15 87 9C 42 EC
##$RELAX= 
##$RELAX= 
##$RELAX= 
##$RELAX= 
##$RELAX= 
##$RELAX= 
$$ Bruker specific parameters
$$ --------------------------
##$DU= <C:/Bruker/XWIN-NMR>
##$EXPNO= 1
##$NAME= <H-C>
##$PROCNO= 1
##$TYPE= <nmr>
##$USER= <yarkov2>
##$AMP= (0..31)
100 100 100 100 100 100 100 100 100 100 100 100 100 100 100 100 100 100 
100 100 100 100 100 100 100 100 100 100 100 100 100 100 
##$AQSEQ= 0
##$AQ_mod= 1
##$AUNM= <au_zg>
##$AUTOPOS= <>
##$BF1= 200.13
##$BF2= 200.13
##$BF3= 200.13
##$BF4= 200.13
##$BF5= 200.13
##$BF6= 200.13
##$BF7= 200.13
##$BF8= 200.13
##$BYTORDA= 1
##$CFDGTYP= 0
##$CFRGTYP= 5
##$CHEMSTR= <none>
##$CNST= (0..31)
1 1 145 1 1 1 1 1 1 1 1 1 1 1 1 1 1 1 1 1 1 1 1 1 1 1 1 1 1 1 1 1 
##$CPDPRG= <>
##$CPDPRG1= <>
##$CPDPRG2= <>
##$CPDPRG3= <>
##$CPDPRG4= <mlev>
##$CPDPRG5= <mlev>
##$CPDPRG6= <mlev>
##$CPDPRG7= <mlev>
##$CPDPRG8= <mlev>
##$CPDPRGB= <>
##$CPDPRGT= <>
##$D= (0..31)
0 0.7 0 0 0 0 0 0 0 0 0 0.03 0 0 0 0 0 0 0 0 0 0 0 0 0 0 0 0 0 0 0 0 
##$DATE= 1759213571
##$DBL= (0..7)
120 120 120 120 120 120 120 120 
##$DBP= (0..7)
150 150 150 150 150 150 150 150 
##$DBP07= 0
##$DBPNAM0= <>
##$DBPNAM1= <>
##$DBPNAM2= <>
##$DBPNAM3= <>
##$DBPNAM4= <>
##$DBPNAM5= <>
##$DBPNAM6= <>
##$DBPNAM7= <>
##$DBPOAL= (0..7)
0.5 0.5 0.5 0.5 0.5 0.5 0.5 0.5 
##$DBPOFFS= (0..7)
0 0 0 0 0 0 0 0 
##$DE= 6
$$ [...]
##$SUBNAM3= <"">
##$SUBNAM4= <"">
##$SUBNAM5= <"">
##$SUBNAM6= <"">
##$SUBNAM7= <"">
##$SUBNAM8= <"">
##$SUBNAM9= <"">
##$SW= 18.0517328524113
##$SWIBOX= (0..15)
0 0 2 0 0 0 0 0 0 0 0 0 0 0 0 0 
##$SW_h= 3612.71676300578
##$TD= 16384
##$TD0= 1
##$TE= 0
##$TE2= 300
##$TE3= 300
##$TEG= 300
##$TL= (0..7)
0 120 120 120 120 120 120 120 
##$TP= (0..7)
150 150 150 150 150 150 150 150 
##$TP07= 0
##$TPNAME0= <>
##$TPNAME1= <>
##$TPNAME2= <>
##$TPNAME3= <>
##$TPNAME4= <>
##$TPNAME5= <>
##$TPNAME6= <>
##$TPNAME7= <>
##$TPOAL= (0..7)
0.5 0.5 0.5 0.5 0.5 0.5 0.5 0.5 
##$TPOFFS= (0..7)
0 0 0 0 0 0 0 0 
##$TUNHIN= 0
##$TUNHOUT= 0
##$TUNXOUT= 0
##$USERA1= <user>
##$USERA2= <user>
##$USERA3= <user>
##$USERA4= <user>
##$USERA5= <user>
##$V9= 5
##$VALIST= <valist>
##$VCLIST= <CCCCCCCCCCCCCCC>
##$VD= 0
##$VDLIST= <DDDDDDDDDDDDDDD>
##$VPLIST= <PPPPPPPPPPPPPPP>
##$VTLIST= <TTTTTTTTTTTTTTT>
##$WBST= 1024
##$WBSW= 4
##$XGAIN= (0..3)
0 0 0 0 
##$XL= 0
##$YL= 0
##$YMAX_a= 262263
##$YMIN_a= -214737
##$ZGOPTNS= <>
##$ZL1= 120
##$ZL2= 120
##$ZL3= 120
##$ZL4= 120
##$ABSF1= 15.48466
##$ABSF2= -2.567189
##$ABSG= 5
##$ABSL= 3
##$ALPHA= 0
##$AQORDER= 0
##$ASSFAC= 0
##$ASSFACI= 0
##$ASSFACX= 0
##$ASSWID= 0
##$AUNMP= <proc_1d>
##$AZFE= 0.1
##$AZFW= 0.1
##$BCFW= 0
##$BC_mod= 2
##$BYTORDP= 0
##$COROFFS= 0
##$CY= -3
##$DATMOD= 1
##$DC= 0
##$DFILT= <>
##$DTYPP= 0
##$F1P= 0
##$F2P= 0
##$FCOR= 1
##$FTSIZE= 16384
##$FT_mod= 6
##$GAMMA= 0
##$GB= 0
##$INTBC= 1
##$INTSCL= 3.241238e-09
##$ISEN= 128
##$LB= 0.25
##$LEV0= 0
##$LPBIN= 0
##$MAXI= 10000
##$MC2= 0
##$MEAN= 0
##$ME_mod= 0
##$MI= 1.114404
##$NCOEF= 0
##$NC_proc= -8
##$NLEV= 6
##$NOISF1= 3.799351
##$NOISF2= 2.8
##$NSP= 0
##$NTH_PI= 0
##$NZP= 0
##$OFFSET= 15.48466
##$PC= 1
##$PHC0= -2078.854
##$PHC1= 16.19097
##$PH_mod= 1
##$PKNL= yes
##$PPARMOD= 0
##$PSCAL= 0
##$PSIGN= 0
##$REVERSE= no
##$SF= 200.130007413897
##$SI= 16384
##$SIGF1= 3
##$SIGF2= 2
##$SINO= 0.751879
##$SIOLD= 32768
##$SREGLST= <19F.Aceton>
##$SSB= 0
##$STSI= 16384
##$STSR= 0
##$SW_p= 3612.71676300578
##$SYMM= 0
##$S_DEV= 0
##$TDeff= 16384
##$TDoff= 0
##$TI= <>
##$TILT= no
##$TM1= 0
##$TM2= 0
##$TOPLEV= 0
##$USERP1= <user>
##$USERP2= <user>
##$USERP3= <user>
##$USERP4= <user>
##$USERP5= <user>
##$WDW= 1
##$XDIM= 16384
##$YMAX_p= 515039863
##$YMIN_p= -927560
$$ End of Bruker specific parameters
$$ ---------------------------------
##NTUPLES= NMR SPECTRUM
##VAR_NAME=  FREQUENCY,     SPECTRUM/REAL,   SPECTRUM/IMAG
##SYMBOL=    X,             R,               I
##VAR_TYPE=  INDEPENDENT,   DEPENDENT,       DEPENDENT
##VAR_FORM=  AFFN,          ASDF,            ASDF
##VAR_DIM=   16384,         16384,           16384
##UNITS=     HZ,            ARBITRARY UNITS, ARBITRARY UNITS
##FACTOR=    0.220516191357247, 1,           1
##FIRST=     3098.94515034512, 0,            0
##LAST=      -513.771612660663, 0,           0
##MIN=       -513.771612660663, -927560,     0
##MAX=       3098.94515034512, 515039863,    0
$$ Real data points
##PAGE= N=1
##DATA TABLE= (X++(R..R)), XYDATA
$$ [...]
6395C369158J25942O4878l3894j39442J41560m2653j516K05791j28820K3754o4942
$$ 3369158 3495100 3559978 3526084 3386642 3528202 3485549 3484033 3689824 3561004 3584758 3519816
6384C519816p1737P8549Q1232k4157k5080J63154l1460P8203r6876r6816j43630
$$ 3519816 3448079 3526628 3607860 3583703 3558623 3721777 3690317 3768520 3671644 3574828 3431198
6373C431198p602J48408J28715j61394j7589J42453J42699j26333o2090L70991
$$ 3431198 3423596 3572004 3700719 3539325 3521736 3664189 3806888 3680555 3618465 3989456
6363C989456o7001o3052J31169Q511K6908k36125k31767M6296K12291Q1979L8952
$$ 3989456 3922455 3859403 3990572 3999083 4025991 3789866 3558099 3604395 3816686 3898665 3937617
6352C937617k35291L4818j16789R7596O4551j02131J78930J56015j5355j27542
$$ 3937617 3702326 3737144 3620355 3717951 3782502 3680371 3859301 4015316 3999961 3872419
6342C872419j92051L4660J86628K54881J97459q797l94959j00473J34332j7592
$$ 3872419 3680368 3715028 3901656 4156537 4353996 4345199 3950240 3849767 3984099 3966507
6332C966507K9248J62718J65967q7663k70386k76431M4185M03432J55684k44959
$$ 3966507 3995755 4158473 4324440 4236777 3966391 3689960 3734145 4137577 4293261 4048302
6322D048302m0309O2672L5955l4777J5780j73504o165J40194J88088j08640J08207
$$ 4048302 4007993 4070665 4106620 4071843 4087623 3914119 3907954 4048148 4236236 4127596 4235803
6311D235803J01314J23683p7649n9555K37645j4503J2718J55727M04344m5707
$$ 4235803 4337117 4460800 4383151 4323596 4561241 4546738 4559456 4715183 5119527 5073820
6301E073820j22903J56957j45501j02169p274k22223k7400P9550k9388J96162
$$ 5073820 4950917 5107874 4962373 4860204 4852930 4630707 4603307 4682857 4653469 4849631
6291D849631j87018J14680Q0551k6075L2129J26177J99129j67225l4980M50800
$$ 4849631 4662613 4777293 4857844 4831769 4863898 4990075 5189204 5021979 4986999 5437799
6281E437799Q3995K5175K20872J00283J01491K05054J41931n4362N9902q9487
$$ 5437799 5521794 5546969 5767841 5868124 5969615 6174669 6316600 6262238 6322140 6232653
6271F232653k4662K9630J28947j99500k27938O6546K04953L0225O689k06931q2481
$$ 6232653 6207991 6237621 6366568 6167068 5939130 6005676 6210629 6240854 6247543 6040612 5958131
6260E958131P5478L3007J44323J38760l0858J29520J87575J79046q5444l22233
$$ 5958131 6033609 6066616 6210939 6349699 6318841 6448361 6635936 6814982 6729538 6407305
6250F407305M11092J61053K35662K37710M02985P6068L40473K75005R3211j1431
$$ 6407305 6818397 6979450 7215112 7452822 7855807 7931875 8272348 8547353 8640564 8629133
6240H629133j57940l51552j69712m2708j04682j34361j21346j77042k69361K20781
$$ 8629133 8471193 8119641 7949929 7907221 7802539 7668178 7546832 7369790 7100429 7321210
6230G321210J48115j36358J14578J5943J90754q6415j97556M19074J34539N7425
$$ 7321210 7469325 7332967 7447545 7463488 7654242 7567827 7370271 7789345 7923884 7981309
6220G981309L97779L17474J81477p5234k56340N92779M24828L50192R6152k6084
$$ 7981309 8379088 8696562 8878039 8802805 8546465 9139244 9564072 9914264 10010416 9984332
6210I984332K59206J57315L40160K97090J59713M50566L28658j50253J94315N09100
$$ 9984332 10243538 10400853 10741013 11038103 11197816 11648382 11977040 11826787 12021102 12530202
6200A2530202M92630K71159M02089R48700M83340J17810K19248M54975K49941
$$ 12530202 13022832 13293991 13696080 14644780 15128120 15245930 15465178 15920153 16170094
6191A6170094K39958K74497K53234m9475J24333J62691J82302R1332M7493R883
$$ 16170094 16410052 16684549 16937783 16888308 17012641 17175332 17357634 17448966 17496459 17506342
6181A7506342J94150K55737J5653L45814J47399J31649k51743j15976J05224n121
$$ 17506342 17700492 17956229 17971882 18317696 18465095 18596744 18345001 18229025 18334249 18329128
6171A8329128j56660m0907K78286J70407M6022m1813J62026J80943L9802l34551
$$ 18329128 18172468 18131561 18409847 18580254 18626276 18584463 18746489 18927432 18967234 18632683
6161A8632683L17179K63593J35596J21467L14105K93022Q2386q4319m0755o9609
$$ 18632683 18949862 19213455 19349051 19470518 19784623 20077645 20160031 20075712 20034957 19965348
6151A9965348o5322j33525j53305l75026n37349l39731l92228l85459J862l15977
$$ 19965348 19900026 19766501 19613196 19238170 18700821 18361090 17968862 17583403 17585265 17269288
6141A7269288n99888j83682L1934j15950l28886k38166K3804l8059J36603L89311
$$ 17269288 16669400 16485718 16517652 16401702 16072816 15834650 15858454 15820395 15956998 16346309
6131A6346309N7303K21268P4477M78359L27746L08914L76199N82655Q12211O16248
$$ 16346309 16403612 16624880 16699357 17177716 17505462 17814376 18190575 18773230 19585441 20201689
6121B0201689Q72944P26261P99291Q23278N62094L20369q5610L3809o16079k82487
$$ 20201689 21074633 21800894 22600185 23423463 23985557 24305926 24220316 24254125 23638046 23355559
6111B3355559l55831m10195K35346l98285j75781M7127M81722K89344K74610L92540
$$ 23355559 22999728 22589533 22824879 22426594 22250813 22297940 22779662 23069006 23343616 23736156
6101B3736156M59561N40671Q34209J196502J014948J160488J691358J663606J787488
$$ 23736156 24195717 24736388 25570597 26767099 27782047 28942535 30633893 32297499 34084987
6092C4084987J788235J259421J537155R44705L50142l61588n27728m09378p87554
$$ 34084987 35873222 37132643 38669798 39614503 39964645 39603057 39075329 38665951 37878397
6083C7878397r37394o61469m70089j80140J79492L03236O80758N70633P60199
$$ 37878397 36941003 36279534 35809445 35629305 35808797 36112033 36792791 37363424 38123623
6074C8123623J211406J337957J596355J572533K396465K359931L074226L616569
$$ 38123623 39335029 40672986 42269341 43841874 46238339 48598270 51672496 55289065
6066E5289065L582660M177673M311200L956385L420574K529920J008166o8188
$$ 55289065 58871725 63049398 67360598 71316983 74737557 77267477 78275643 78207455
6058G8207455q75580j646629k371126k906615k812162k436536k018973j757962
$$ 78207455 77331875 75685246 73314120 70407505 67595343 65158807 63139834 61381872
6050F1381872j279276j292031o99081k35774J1953O6792O60907Q02835J048915
$$ 61381872 60102596 58810565 58111484 57875710 57887663 57954455 58615362 59418197 60467112
6041F0467112J589660K042561K234252K706305L435083M047735M740674N657562
$$ 60467112 62056772 64099333 66333585 69039890 72474973 76522708 81263382 86920944
6033H6920944O084998O010617N843503N304914L646254K055236J20370j882260
$$ 86920944 93005942 99016559 104860062 110164976 113811230 115866466 115986836 114104576
6025A14104576l626985n143565n595319o147056n884126n152474m643997l984359
$$ 114104576 110477591 105334026 99738707 93591651 87707525 82555051 77911054 73926695
6017G3926695l122053l405593k804513k204150j812525j699123j240819j021932
$$ 73926695 70804642 67399049 64594536 62390386 60577861 58878738 57637919 56615987
6009E6615987p18155j76294J98782N5292N52987J249873J532621K037951K365593
$$ 56615987 55897832 55721538 55920320 55975612 56528599 57778472 59311093 61349044 63714637
6000F3714637K628405K434072K138054J389573M07434o33843k116252k356072
$$ 63714637 66343042 68777114 70915168 72304741 72712175 72078332 69962080 67606008
5992F7606008l229687l729952l495694l706188l164527l083500k723061k413808
$$ 67606008 64376321 60646369 57150675 53444487 50279960 47196460 44473399 42059591
5984D2059591k457641j917431j749474j520584q98441r94167j064224m68457m13865
$$ 42059591 39601950 37684519 35935045 34414461 33516020 32521853 31457629 30989172 30575307
5975C0575307j80039k77584j96021n78389k93208l32749j034769p39675p45798
$$ 30575307 30395268 30117684 29921663 29343274 29050066 28717317 27682548 26942873 26197075
5966B6197075q32317q44545j218014p53432n49264q33886j031648q27309o14055
$$ 26197075 25364758 24520213 23302199 22548767 21999503 21165617 20133969 19306660 18692605
5957A8692605j2942o10484q44759r5491j12621l62667l77895j72557l40661k57089
$$ 18692605 18679663 18069179 17224420 17128929 17016308 16653641 16275746 16103189 15762528 15505439
5947A5505439l50487l65976J3502k34671k17626j02772N416k51480j39242n7716
$$ 15505439 15154952 14788976 14802478 14567807 14350181 14247409 14252825 14001345 13862103 13804387
5937A3804387k88608J08063k21252o2569K6068k74150j31827k93784k11308L12604
$$ 13804387 13515779 13623842 13402590 13340021 13366089 13091939 12960112 12666328 12455020 12767624
5927A2767624K49062j91816M483k28247q4182O0912J75135J99357M7557J85684
$$ 12767624 13016686 12824870 12829353 12601106 12516924 12577836 12752971 12952328 12999885 13185569
5917A3185569q8004l4147n5205K24694J37594K77416J2728J95466L01496n0876
$$ 13185569 13097565 13063418 13008213 13232907 13370501 13647917 13660645 13856111 14157607 14106731
5907A4106731k16976m41617P5785K05843j88918l048J38984p7076m42136l7274
$$ 14106731 13889755 13448138 13523923 13729766 13540848 13537800 13676784 13599708 13157572 13120298
5897A3120298p5248J35812K29712j90821k70830n3760O27J01308l40943j18188
$$ 13120298 13045050 13180862 13410574 13219753 12948923 12895163 12895790 12997098 12656155 12537967
5887A2537967j89373J89009o014l32740Q3062J05098P1290j01466j9272j42379
$$ 12537967 12348594 12537603 12531589 12198849 12281911 12387009 12458299 12356833 12337561 12195182
5877A2195182M47108K04850k27457p9906J635j75564l57886K06650k69181K19117
$$ 12195182 12642290 12847140 12619683 12539777 12541412 12365848 12007962 12214612 11945431 12164548
5867A2164548K0970j06077q2578j13905o9795J23480k70575p7901j95297r1757
$$ 12164548 12185518 12079441 11996863 11882958 11813163 11936643 11666068 11588167 11392870 11301113
5857A1301113K17755l68986q7765k29402j56207n8441J94175j92269l65917k39317
$$ 11301113 11518868 11149882 11062117 10832715 10676508 10618067 10812242 10619973 10254056 10014739
5847A0014739j86008J64018j22326j4981l57106K50266K51052j80733j25361k45701
$$ 10014739 9828731 9992749 9870423 9855442 9498336 9748602 9999654 9818921 9693560 9447859
5837I447859j11408j06147L42875M7744P0874j65519l48343Q8332L4415j29709
$$ 9447859 9336451 9230304 9573179 9620923 9691797 9526278 9177935 9266267 9300682 9170973
5827I170973L09292L85701k75301j64586L99814j15222O0683m7160k43770j52723
$$ 9170973 9480265 9865966 9590665 9426079 9825893 9710671 9771354 9724194 9480424 9327701
5817I327701j67335l4910K04958l1427k67980j18347K97565j37066K46767J99426
$$ 9327701 9160366 9125456 9330414 9298987 9031007 8912660 9210225 9073159 9319926 9519352
5807I519352j37423K2544M7210j3620j0413j76092N8896j62005j32972J72848
$$ 9519352 9381929 9404473 9451683 9438063 9427650 9251558 9310454 9148449 9015477 9188325
5797I188325J52526m22053k5125k23108J1739O22566j06801k28707j8352K2937
$$ 9188325 9340851 8918798 8893673 8670565 8682304 9304870 9198069 8969362 8951010 8973947
5787H973947j08937j62092j06678m8983L0836n0171J31040K1170q2410O9592L7935
$$ 8973947 8865010 8702918 8596240 8547257 8578093 8527922 8658962 8680132 8597722 8667314 8705249
5776H705249p7839J96535M7325m0488K36571J53439J75765o5114L24497j45518
$$ 8705249 8627410 8823945 8871270 8830782 9067353 9220792 9396557 9331443 9655940 9510422
5766I510422m9438L04507j93999K3701J6331R0755k16240k50997M44674J66379
$$ 9510422 9460984 9765491 9571492 9595193 9611524 9702279 9486039 9235042 9679716 9846095
5756I846095k6130j92214L34291K33425l64021J6492K22966N2710P7989k8760
$$ 9846095 9819965 9627751 9962042 10195467 9831446 9847938 10070904 10123614 10201603 10172843
5746A0172843M81257j35171k75790Q1110P0352K7329p5954K98518j5051m9026
$$ 10172843 10654100 10518929 10243139 10324249 10394601 10421930 10345976 10644494 10629443 10580417
5736A0580417K18707L22307O0113K31393q1668k14877K13157Q3648Q7055r9655
$$ 10580417 10799124 11121431 11181544 11412937 11331269 11116392 11329549 11413197 11500252 11400597
5726A1400597J6397M05169L77003K28283K46511O1227J4909L29820K71554M04486
$$ 11400597 11416994 11822163 12199166 12427449 12673960 12735187 12750096 13079916 13351470 13755956
5716A3755956L68032K0771k445M91551J51169k2327L09668m9455P603K37479L19779
$$ 13755956 14123988 14144759 14142314 14633865 14785034 14762707 15072375 15022920 15030523 15268002 15587781
5705A5587781K26835K05217j24340l9600K56010K13682K75078J16097J05283K08605
$$ 15587781 15814616 16019833 15895493 15855893 16111903 16325585 16600663 16716760 16822043 17030648
5695A7030648J57972J35944N82502n8099k8824L55987J01091N32313M26374L37612
$$ 17030648 17188620 17324564 17907066 17848967 17820143 18176130 18277221 18809534 19235908 19573520
5685A9573520N78198M79415Q1250M83763Q686N491L99525J71143O4789J38950
$$ 19573520 20151718 20631133 20712383 21196146 21204832 21210323 21609848 21780991 21845780 21984730
5675B1984730M5319K33084k62543j57687K20729M6097l92404K29302K19278j68883
$$ 21984730 22030049 22263133 22000590 21842903 22063632 22109729 21717325 21946627 22165905 21997022
5665B1997022J27119K11333L1212L67881K18940J44634Q1742O5481M81847N96142
$$ 21997022 22124141 22335474 22366686 22734567 22953507 23098141 23179883 23245364 23727211 24323353
5655B4323353P14151N81770P69897N62668O35787R35727Q13397R35916J125226
$$ 24323353 25037504 25619274 26389171 26951839 27587626 28523353 29336750 30272666 31397892
5646C1397892J248796J467521J305882J570643J407773J616753J687621J752975
$$ 31397892 32646688 34114209 35420091 36990734 38398507 40015260 41702881 43455856
5638D3455856J677500K300345K482387K380906K925067K965145K618527K510467
$$ 43455856 45133356 47433701 49916088 52296994 55222061 58187206 60805733 63316200
5630F3316200K394086K279794K670003K825131K955393L648154M121908N201389
$$ 63316200 65710286 67990080 70660083 73485214 76440607 80088761 84210669 89412058
5622H9412058N918634O666625P438402Q762749J0023489J0616746J1430986J2225802
$$ 89412058 95330692 101997317 109435719 118198468 128221957 138838703 150269689 162495491
5614A62495491J2295091J2665388J2862102J2310364J1465066R563184P907957
$$ 162495491 174790582 187455970 200318072 212628436 224093502 233656686 241564643
5607B41564643N073449J786848j030246m147780o717670q813059j0332166j1259426
$$ 241564643 246638092 248424940 247394694 243246914 236529244 227716185 217384019 206124593
5599B06124593j1694765j1535748j1531861j1137476j0453887j0200855r275073
$$ 206124593 194429828 182894080 171362219 160224743 149770856 139570001 130294928
5592A30294928q189656p709332o991076o651727o026394n169627m549886l902030
$$ 130294928 122105272 114395940 107404864 100753137 94726743 89557116 85007230 81105200
5584H1105200l498462l236589k944127k625438k396957k458002k151186k810624
$$ 81105200 77606738 74370149 71426022 68800584 66403627 63945625 61794439 58983815
5576E8983815k676377k407273k450039k827354k783514k249698k452781j920765
$$ 58983815 56307438 53900165 51450126 48622772 45839258 43589560 41136779 39216014
5568C9216014j808058k007337j565651j416594j637883j254964j275454q58462
$$ 39216014 37407956 35400619 33834968 32418374 30780491 29525527 28250073 27391611
5560B7391611p00894q62356p98247m42170n53496o49768o69080o40489o12118
$$ 27391611 26690717 25828361 25030114 24587944 24034448 23384680 22715600 22075111 21462993
5551B1462993m39205n03399o63767m05012m85058n07789l04618j48903l17071
$$ 21462993 21023788 20520389 19856622 19451610 18966552 18458763 18154145 18005242 17688171
5542A7688171l52068k47311l57967m34556k22003m18219l17627k83237l57927
$$ 17688171 17336103 17088792 16730825 16296269 16074266 15656047 15338420 15055183 14697256
5533A4697256l4350m39748n09939k21447j72695j46194k85562j13853l6938n5158
$$ 14697256 14662906 14223158 13713219 13491772 13319077 13172883 12887321 12773468 12736530 12681372
5523A2681372k69535l30007k46602K066k10402l39554p1952j7914o0362k67578
$$ 12681372 12411837 12081830 11835228 11837294 11626892 11287338 11215386 11197472 11137110 10869532
5513A0869532J27719j26941J55146k49131O3985K83568j05300o7700J73119J53008
$$ 10869532 10997251 10870310 11025456 10776325 10840310 11123878 11018578 10950878 11123997 11277005
5503A1277005j77617j99637k94502j86973k40716j67832j22005j9295P004j90439
$$ 11277005 11099388 10899751 10605249 10418276 10177560 10009728 9887723 9868428 9875432 9684993
5493I684993k95585n7407o4769J23989O561K77112P4960K4436o8308J94722K79653
$$ 9684993 9389408 9332001 9267232 9391221 9397782 9674894 9749854 9774290 9705982 9900704 10180357
5482A0180357J63804M42521L91071M87979L68617L36104j8060k71773k45082j70466
$$ 10180357 10344161 10786682 11177753 11665732 12034349 12370453 12352393 12080620 11835538 11665072
5472A1665072l94838r51799j60725L74614l10425P5045j01413k95394j22020q0942
$$ 11665072 11270234 10318435 10157710 10532324 10221899 10296944 10195531 9900137 9778117 9697175
5462I697175K999m6900q9855K32314K75414J77290K00531L12116N65331N64274
$$ 9697175 9700174 9653274 9563419 9795733 10071147 10248437 10448968 10761084 11326415 11890689
5452A1890689P35795M74155M27473l0519p7490j58379m74374l99768l85328n50726
$$ 11890689 12626484 13100639 13528112 13497593 13420103 13261724 12787350 12387582 12002254 11451528
5442A1451528m24095l23274l77345n41402k31009L2549j54472j99805l7984j27199
$$ 11451528 11027433 10704159 10326814 9785412 9554403 9586952 9432480 9232675 9194691 9067492
5432I067492K80782J53755L43624K80565j31270J29710L50609R8143O37329L13040
$$ 9067492 9348274 9502029 9845653 10126218 9994948 10124658 10475267 10573410 11210739 11523779
5422A1523779L72383J32298l77769r9471o31951l00536m58360l89039k35053j06730
$$ 11523779 11896162 12028460 11650691 11551220 10919269 10618733 10160373 9771334 9536281 9429551
5412I429551k25243l55938k68945k55069k46858M0889L043j61433P5550J16872
$$ 9429551 9204308 8848370 8579425 8324356 8077498 8118387 8121430 7959997 8035547 8152419
5402H152419O9514J0859j53549J90574J34777n2423M05208R9946j89674J5733
$$ 8152419 8221933 8232792 8079243 8269817 8404594 8352171 8757379 8857325 8667651 8683384
5392H683384L04050l21265l72564m41962R2340N7531k74227j28872k14292Q6335
$$ 8683384 8987434 8666169 8293605 7851643 7943983 8001514 7727287 7598415 7384123 7470458
5382G470458l20163k10427n1227P2870j67140R0335J43350o9860J2384m7200l57971
$$ 7470458 7150295 6939868 6888641 6961511 6794371 6884706 7028056 6958196 6970580 6923380 6565409
5371F565409k0974O9002j17733k4293N05273q9105J20908j73657k30102j35904
$$ 6565409 6544435 6613437 6495704 6471411 6976684 6887579 7008487 6834830 6604728 6468824
5361F468824K54196K13909P5899r4458k6099J30151K9881P4911j29776j66303
$$ 6468824 6723020 6936929 7012828 6918370 6892271 7022422 7052303 7127214 6997438 6831135
5351F831135j18094J42415N8962m8821l3760l07427L1445R2693j26383j87281
$$ 6831135 6713041 6855456 6914418 6865597 6831837 6524410 6555855 6648548 6522165 6334884
5341F334884K0757N3886j52781L5689K951L52817J14970j05108l34537j84358
$$ 6334884 6355641 6409527 6256746 6292435 6295386 6648203 6763173 6658065 6323528 6139170
5331F139170J64384n1145n3639L99225K94286l78717j82094L23241O0148J97326
$$ 6139170 6303554 6252409 6198770 6597995 6892281 6513564 6331470 6654711 6714859 6912185
5321F912185J4261K5881l83316J38867J33170J96563L1294J01079J12127K10312
$$ 6912185 6926446 6952327 6569011 6707878 6841048 7037611 7068905 7169984 7282111 7492423
5311G492423J5836J48025N7349l3133l7407m4265K79957N6317M64984L279o2569
$$ 7492423 7508259 7656284 7713633 7680500 7643093 7598828 7878785 7935102 8400086 8403365 8340796
5300H340796P26m71331m8705K90202m4500N1383j1652r5975j83902k73586L58226
$$ 8340796 8341522 7870191 7821486 8111688 8067188 8118571 8106919 8010944 7827042 7553456 7911682
5289G911682J36384p9477r3752k9096J1471j66062r0731O8308L04461j33666r6430
$$ 7911682 8048066 7968589 7874837 7845741 7857212 7691150 7600419 7668727 7973188 7839522 7743092
5278G743092j74802m3340j5207k69392L46085K15424Q6490K42119R2359R4251
$$ 7743092 7568290 7524950 7509743 7240351 7586436 7801860 7888350 8130469 8222828 8317079
5268H317079j52798O4404K19505Q578r1138P7405j96933K69385j27351j6672O9546
$$ 8317079 8164281 8228685 8448190 8456768 8365630 8443035 8246102 8515487 8388136 8371464 8441010
5257H441010q6586L27069j511J5253K1200j33036M5459K3919K50481J18987p5621
$$ 8441010 8354424 8681493 8679982 8695235 8716435 8583399 8628858 8652777 8903258 9022245 8946624
5246H946624m0179j0848O9176K38004M3289p8359P6311q6798J01739R9472K78504
$$ 8946624 8906445 8895597 8964773 9202777 9246066 9167707 9244018 9157220 9258959 9358431 9636935
5235I636935J27230q3156J938k36036m55254K12373J25352K01938j26684R5033
$$ 9636935 9764165 9681009 9682947 9446911 8991657 9204030 9329382 9531320 9404636 9499669
5225I499669K24214M524L4806j95387m7734J90300K5638N5202J03878J80210n7939
$$ 9499669 9723883 9728407 9763213 9567826 9520092 9710392 9736030 9791232 9895110 10075320 10017381
5214A0017381J92423J40451l09103M6203J49366K4570j1202K47030K56342J22928
$$ 10017381 10209804 10350255 10041152 10087355 10236721 10261291 10250089 10497119 10753461 10876389
5204A0876389j04145M26008K75808o6317o7806M4842o5054M19666L16237J11853
$$ 10876389 10772244 11198252 11474060 11407743 11339937 11384779 11319725 11739391 12055628 12167481
5194A2167481L22983K35454J32959J0309J44841O6206k46212l09441k85198q000
$$ 12167481 12490464 12725918 12858877 12869186 13014027 13080233 12834021 12524580 12239382 12231382
5184A2231382J49481o6774j36147j58348p2479M1941j006N2678J1733K40848J47421
$$ 12231382 12380863 12314089 12177942 12019594 11947115 11989056 11988050 12040728 12052461 12293309 12440730
5173A2440730m5048l8494l7200m3644O5386L26696N83j99821J51177J36616j11913
$$ 12440730 12395682 12357188 12319988 12276344 12341730 12668426 12669009 12469188 12620365 12756981 12645068
5162A2645068L98612j9719j20407K24418K21453K20031L20450Q7754J69472K33490
$$ 12645068 13043680 13023961 12903554 13127972 13349425 13569456 13889906 13977660 14147132 14380622
5152A4380622L40297K03690K24307J33485M55245K41584M99212M98944Q7653P12463
$$ 14380622 14720919 14924609 15148916 15282401 15737646 15979230 16478442 16977386 17065039 17777502
5142A7777502K21980M94592M28505M37393K15906O2354J74706k52885j44647j35095
$$ 17777502 17999482 18494074 18922579 19359972 19575878 19638232 19812938 19560053 19415406 19280311
5132A9280311L91907J68915L37998L45810L33262J21650J39752M84424K58073
$$ 19280311 19672218 19841133 20179131 20524941 20858203 20979853 21119605 21604029 21862102
5123B1862102K65990K54538J95805J72612L84378M54700N70287M46770J38479
$$ 21862102 22128092 22382630 22578435 22751047 23135425 23590125 24160412 24607182 24745661
5114B4745661L63952K67078m43996l0659m58311l70556r5580O6570k81874M6490
$$ 24745661 25109613 25376691 24932695 24902036 24443725 24073169 23977589 24044159 23762285 23808775
5104B3808775q9075l23577p4706J86194K89854P134K51549n2197K24975M18402
$$ 23808775 23719700 23396123 23321417 23507611 23797465 23804599 24056148 24003951 24228926 24647328
5094B4647328j42419q498K5776J61921j42028l12880J64762J50984J40628O2899
$$ 24647328 24504909 24496411 24522187 24684108 24542080 24229200 24393962 24544946 24685574 24748473
5084B4748473L30085J40182J51132N73566L67026J82839p1107Q5299K94112J21121
$$ 24748473 25078558 25218740 25369872 25943438 26310464 26493303 26422196 26507495 26801607 26922728
5074B6922728k43110J4364N6325J22305j53773l50257m7617k65138l9748j72761
$$ 26922728 26679618 26693982 26750307 26872612 26718839 26368582 26320965 26055827 26016079 25843318
5064B5843318K5437K07421l53350k62073l9946n26233n8236j97614n88372q0149
$$ 25843318 25868755 26076176 25722826 25460753 25420807 24894574 24836338 24638724 24050352 23970203
5054B3970203j87362N1270j45279k21803J15634J56965K79423K94418J92433M01157
$$ 23970203 23782841 23834111 23688832 23467029 23582663 23739628 24019051 24313469 24505902 24907059
5044B4907059O35620N12261J73634J59867K26278M82383J82317N4588J96017J11382
$$ 24907059 25542679 26054940 26228574 26388441 26614719 27097102 27279419 27334007 27530024 27641406
5034B7641406J71384j71017j88476K78814J60315j1158k05143m8887M22582K55587
$$ 27641406 27812790 27641773 27453297 27732111 27892426 27881268 27676125 27627238 28049820 28305407
5024B8305407J64854K66938P32219O28610L40142J99207Q19183N71350N35073
$$ 28305407 28470261 28737199 29469418 30098028 30438170 30637377 31456560 32027910 32562983
5015C2562983O78391R31770P57279J097126J125585P40340R28506J448526J410789
$$ 32562983 33241374 34173144 34930423 36027549 37153134 37893474 38821980 40270506 41681295
5006D1681295J165234J049866J230437J614755J286165J275918J792130J702233
$$ 41681295 42846529 43896395 45126832 46741587 48027752 49303670 51095800 52798033
4998E2798033J883617K085199K404931K453026K717276K444328K756583L442469
$$ 52798033 54681650 56766849 59171780 61624806 64342082 66786410 69542993 72985462
4990G2985462L436971L673876L894067M167771M172607M595713M872128N061142
$$ 72985462 76422433 80096309 83990376 88158147 92330754 96926467 101798595 106859737
4982A06859737M504173L520840K984130J880366J306892J269575K57047n84887
$$ 106859737 111363910 114884750 117868880 119749246 121056138 122325713 122582760 121997873
4974A21997873k37778k62766J91696N71341P89142J156085J459712J728993J895418
$$ 121997873 121760095 121497329 121689025 122260366 123049508 124205593 125665305 127394298 129289716
4965A29289716K344357K755066L208681L440432L655272M317213N123147N759468
$$ 129289716 131634073 134389139 137597820 141038252 144693524 149010737 154133884 159893352
4957A59893352O884926P727085Q671584R186984R772333J0201093J0201022R011213
$$ 159893352 166778278 174505363 183176947 192363931 202136264 212337357 222538379 231549592
4949B31549592Q081056O659289M285295K192432N67109r90306k023380k455033
$$ 231549592 239630648 246289937 250575232 252767664 253334773 252344467 250321087 247866054
4941B47866054k596887k400737j079065p91945O9753N48408J073721J232161J285656
$$ 247866054 245269167 242868430 241789365 240997420 241067173 241615581 242689302 243921463 245207119
4932B45207119J804608J942420J437907J305627J571534J382917J543947J422524
$$ 245207119 247011727 248954147 250392054 251697681 253269215 254652132 256196079 257618603
4924B57618603K179171K690964L131837L862617M160551L462092K982417J749913
$$ 257618603 259797774 262488738 265620575 269483192 273643743 277105835 280088252 281838165
4916B81838165o03753k772023n013747o704246q606237j0016661j0241290r779238
$$ 281838165 281234412 278462389 273448642 266744396 258138159 248121498 237880208 228100970
4908B28100970r137162p634289o469624n058763l445118k170318j322298j296905
$$ 228100970 218963808 211329519 204859895 199801132 196356014 194185696 192863398 191566493
4900A91566493j731223k506121l851361n393533o627578p561303q237258q242305
$$ 191566493 189835270 187329149 183477788 178084255 171456677 163895374 155658116 147415811
4892A47415811p592205p261151o481026o056652n332265m485447m124919l411406
$$ 147415811 139823606 132562455 126081429 120024777 114692512 110207065 106082146 102670740
4884A02670740k495775k566353k155818j298234j372581j468382j444755j279733
$$ 102670740 100174965 97608612 95452794 94154560 92781979 91313597 89868842 88589109
4876H8589109j252413j378196j760606k061272j785708k004087k093631k006744
$$ 88589109 87336696 85958500 84197894 82136622 80350914 78346827 76253196 74246452
4868G4246452j817750j408215j276846j395634r29153j188565j056777j162779
$$ 74246452 72428702 71020487 69743641 68348007 67418854 66230289 65173512 64010733
4860F4010733j172024j173984j319287j460439j346754j189114j515504j392240
$$ 64010733 62838709 61664725 60345438 58884999 57538245 56349131 54833627 53441387
4852E3441387j456089j341326j065424r27256q50283r15049q36008j087439o53507
$$ 53441387 51985298 50643972 49578548 48651292 47801009 46885960 46049952 44962513 44309006
4843D4309006j002363j028849m91194n56187o99569q85401m07725m36433p79914
$$ 44309006 43306643 42277794 41786600 41230413 40530844 39645443 39237718 38801285 38021371
4834C8021371n51653m41468k53749m09204n03787o59241m48489l11899o57240
$$ 38021371 37469718 37028250 36774501 36365297 35861510 35202269 34753780 34441881 33784641
4825C3784641j85251k91152n89309m49017l03885j76166j75815l95829k03168
$$ 33784641 33599390 33308238 32718929 32269912 31966027 31789861 31614046 31218217 31015049
4816C1015049J9949j14056k21392o1852k9240j64784j4333r7840J77322K85875
$$ 31015049 31034998 30920942 30699550 30637698 30608458 30443674 30429341 30331501 30508823 30794698
4806C0794698K38705L42281q6076M480j60400J41218K40320L46938M10516O2584
$$ 30794698 31033403 31375684 31289608 31294088 31133688 31274906 31515226 31862164 32272680 32335264
4796C2335264K38521K18522J47083N51132L58545K00905p8760J27945L69411J74102
$$ 32335264 32573785 32792307 32939390 33490522 33849067 34049972 33971212 34099157 34468568 34642670
4786C4642670K16519J31198J06386J65454M53196K98314N1805K61705K65613R0660
$$ 34642670 34859189 34990387 35096773 35262227 35715423 36013737 36065542 36327247 36592860 36683520
4776C6683520L82864L30793K74715L30771J2634n3321j08573l8509J77974J19053
$$ 36683520 37066384 37397177 37671892 38002663 38015297 37961976 37853403 37814894 37992868 38111921
4766C8111921K52620j9654j80175K4389K56739J68985R4547M8530j3983o7763
$$ 38111921 38364541 38344887 38164712 38189101 38445840 38614825 38709372 38757902 38743919 38676156
4756C8676156r3917K28204L41960N439o0721k1495k02881K52573j2631J29415
$$ 38676156 38582239 38810443 39152403 39157842 39097121 39075626 38872745 39125318 39112687 39242102
4746C9242102J05334j99286k75510l26060L22871j15574k56613j4050k93796q9846
$$ 39242102 39347436 39148150 38872640 38546580 38869451 38753877 38497264 38483214 38189418 38099572
4736C8099572k20160l0252P1609k09746K39845J72943J4938L87541M7466J19355
$$ 38099572 37879412 37849160 37920769 37711023 37950868 38123811 38138749 38526290 38573756 38693111
4726C8693111N8158J13289J14808L58657L93874J48215L37532K27718Q5224J23436
$$ 38693111 38751269 38864558 38979366 39338023 39731897 39880112 40217644 40445362 40530586 40654022
4716D0654022K91105L4432J42025o2606o4236k7752J91125q9978k8566L6097K85443
$$ 40654022 40945127 40979559 41121584 41058978 40994742 40966990 41158115 41068137 41039571 41075668 41361111
4705D1361111L64975J00667L14235L03643N77702Q80962O26624O59014O69223
$$ 41361111 41726086 41826753 42140988 42444631 43022333 43903295 44529919 45188933 45858156
4696D5858156N51087R29238R91651J090475Q39026J128542J107405J127309J409130
$$ 45858156 46409243 47338481 48330132 49420607 50259633 51388175 52495580 53622889 55032019
4687E5032019J214589J373711J561591J694926K085921K052638K209155K101343
$$ 55032019 56246608 57620319 59181910 60876836 62962757 65015395 67224550 69325893
4679F9325893K364029K848670K969851K358421K872404L720151L376611M099032
$$ 69325893 71689922 74538592 77508443 79866864 82739268 86459419 89836030 93935062
4671I3935062M596414N010756N570034O173278O544030O341792O087941O871613
$$ 93935062 98531476 103542232 109112266 115285544 121829574 128171366 134259307 141130920
4663A41130920P321212P720192Q596404R620979J1804628J4198845J7107073K0564105
$$ 141130920 148452132 156172324 164768728 174389707 186194335 200393180 217500253 238064358
4655B38064358K4029726K7723426L0785182L1547010K9212968K3117499J4556358
$$ 238064358 262094084 289817510 320602692 352149702 381362670 404480169 419036527
4648D19036527N328049k842480j0382488j8119969k3267086k4255323k3328685
$$ 419036527 424364576 421522096 411139608 393019639 369752553 345497230 322168545
4641C22168545k2143265k1295314k0361891j8631502j6371548j4610944j2660036
$$ 322168545 300025280 278729966 258368075 239736573 223365025 208754081 196094045
4634A96094045j1091811j0147858q979298q552609q252858p718467p259551p289908
$$ 196094045 185002234 174854376 165875078 157322469 149069611 141351144 134091593 126801685
4626A26801685p075762o714849o186787n543061n058091m810498m066741l180025
$$ 126801685 119725923 113011074 106824287 101281226 96223135 91412637 87345896 84165871
4618H4165871k890283k571661k501194k098193k169366k453085k026847k082524
$$ 84165871 81275588 78703927 76202733 74104540 71935174 69482089 67455242 65372718
4610F5372718k455447k909978k373591j918249k049751k007565j605896j351604
$$ 65372718 62917271 60007293 57633702 55715453 53665702 51658137 50052241 48700637
4602D8700637j337592j315872j109796j014410j172165j097106j264921j027270
$$ 48700637 47363045 46047173 44937377 43922967 42750802 41653696 40388775 39361505
4594C9361505r78201q38268q53372r59811o42759n65676m45723p43494p39647
$$ 39361505 38383304 37545036 36691664 35731853 35089094 34523418 34077695 33334201 32594554
4585C2594554p85244l48979k08797m19254m82617o27372l53080j35946k68541
$$ 32594554 31809310 31460331 31251534 30832280 30349663 29722291 29369211 29233265 28964724
4576B8964724J42731j54861n26088K59296J02651k68570j2698K71836j51257l7570
$$ 28964724 29107455 28952594 28426506 28685802 28788453 28519883 28507185 28779021 28627764 28590194
4566B8590194K90955l1720J77123L83803L44054J54989O6116M34227N84878L42355
$$ 28590194 28881149 28849429 29026552 29410355 29754409 29909398 29975514 30409741 30994619 31336974
4556C1336974Q71969R27838J066941J279227J499513J977358K042254K079354
$$ 31336974 32208943 33136781 34203722 35482949 36982462 38959820 41002074 43081428
4548D3081428J853449J349681N18600M9397l33835j076011j430688j450911j388781
$$ 43081428 44934877 46284558 46803158 46852555 46518720 45442709 44012021 42561110 41172329
4539D1172329p99750m16266p85358n25132q0960k98309m1904k19704j39659J85658
$$ 41172329 40372579 39956313 39170955 38645823 38564863 38266554 38224650 38004946 37865287 38050945
4529C8050945L25419K54700M48520O11984O14722J65102K15551k05839o14004
$$ 38050945 38376364 38631064 39079584 39691568 40306290 40471392 40686943 40481104 39867100
4520C9867100n55774r39367j125850j245838j030808q87475p94057r28738q51040
$$ 39867100 39311326 38371959 37246109 36000271 34969463 34081988 33287931 32359193 31508153
4511C1508153m92888n27183o25375l56254q4489m12457k67894O2775K0807j65257
$$ 31508153 31015265 30488082 29862707 29506453 29421964 29009507 28741613 28804388 28825195 28659938
4501B8659938j41894K57299q1899L15761M6936O1313K65523l3258j20699k02525
$$ 28659938 28518044 28775343 28693444 29009205 29056141 29117454 29382977 29349719 29229020 29026495
4491B9026495j76475j38673j66393o58816q08106o98359o20508n54654k63169
$$ 29026495 28850020 28711347 28544954 27886138 27078032 26379673 25759165 25204511 24941342
4482B4941342l61717m53925m37375l50501o43659o52989m06594n91368j1871K0531
$$ 24941342 24579625 24125700 23688325 23337824 22694165 22041176 21634582 21043214 21031343 21051874
4472B1051874l79274m0741n47698j21518M3825l00868l11494n70904k86098L85877
$$ 21051874 20672600 20631859 20084161 19962643 20006468 19705600 19394106 18823202 18537104 18922981
4462A8922981k27684j77162l5302M5224R2254R7318N0116j69034L37990j26022
$$ 18922981 18695297 18518135 18482833 18528057 18620311 18717629 18767745 18598711 18936701 18810679
4452A8810679k03339K32523M24532j43138L4144m0209K70625K68855K49315J78706
$$ 18810679 18607340 18839863 19264395 19121257 19155401 19115192 19385817 19654672 19903987 20082693
4442B0082693L42305L73197P9089K10510j365L4700J54752K19720J15548n5051
$$ 20082693 20424998 20798195 20877284 21087794 21086429 21121129 21275881 21495601 21611149 21556098
4432B1556098m50956m39915r3666l90602k30920q0154k79172k35756l24236j24464
$$ 21556098 21105142 20665227 20571561 20180959 19950039 19869885 19590713 19354957 19030721 18906257
4422A8906257m93205j01504j17276l24231j46342l49609l21857R9857k34251j46706
$$ 18906257 18413052 18311548 18194272 17870041 17723699 17374090 17052233 17152090 16917839 16771133
4412A6771133j12833j60651l35k25549J89275l94917l39244j2257P6241p1629
$$ 16771133 16658300 16497649 16497314 16271765 16461040 16066123 15726879 15714622 15790863 15719234
4402A5719234M7285j67433l8892M3896p900o4628Q7853j61051O1112J89315q1774
$$ 15719234 15766519 15599086 15560194 15604090 15596190 15531562 15619415 15458364 15519476 15708791 15627017
4391A5627017O4553J10419M02067r651J39125Q8754L96414L06102J64962l63473
$$ 15627017 15691570 15801989 16204056 16194405 16333530 16422284 16818698 17124800 17289762 16926289
4381A6926289j91431K52824M75966k52866k77638m9291M6133j75899k69981M3566
$$ 16926289 16734858 16987682 17463648 17210782 16933144 16883853 16929986 16754087 16484106 16527672
4371A6527672k11736k82273o7112l9818k0314K05628N8910O0080J37409j3046
$$ 16527672 16315936 16033663 15966551 15926733 15906419 16112047 16170957 16231037 16368446 16355400
4361A6355400k14976o6893K02902L7297j95373J51370M34419k7336j07736K27842
$$ 16355400 16140424 16073531 16276433 16313730 16118357 16269727 16704146 16676810 16569074 16796916
4351A6796916L60377M94941R7479M84078K08639K73292M2184J90884J56712Q1361
$$ 16796916 17157293 17652234 17749713 18233791 18442430 18715722 18757906 18948790 19105502 19186863
4341A9186863J13010P6336M376j58954J27435J09068m22433j78257M0792N4744
$$ 19186863 19299873 19376209 19380585 19221631 19349066 19458134 19035701 18857444 18898236 18952980
4331A8952980K13594j3644l06453R0211J41520L1508l7019K43864O0610P0084
$$ 18952980 19166574 19152930 18846477 18936688 19078208 19109716 19072697 19316561 19377171 19447255
4321A9447255m8614K58600J2069k95206J92293K49901K19206k52964J79665J63134
$$ 19447255 19398641 19657241 19669310 19374104 19566397 19816298 20035504 19782540 19962205 20125339
4311B0125339J27932R1026j25987K58298P9205J54540M14341N70165K72049N6143
$$ 20125339 20253271 20344297 20218310 20476608 20555813 20710353 21124694 21694859 21966908 22023051
4301B2023051N33109K37583j76538J42791K10956P4107K84754J6080j61959P0368
$$ 22023051 22556160 22793743 22617205 22759996 22970952 23045059 23329813 23345893 23183934 23254302
4291B3254302K59281L95866L37557L0767J09975J3665M02374J08868L12333K91145
$$ 23254302 23513583 23909449 24247006 24277773 24387748 24401413 24803787 24912655 25224988 25516133
4281B5516133M23017K72319J94642K17970Q0223K26761J28270J93039M30694M72411
$$ 25516133 25939150 26211469 26406111 26624081 26704304 26931065 27059335 27252374 27683068 28155479
4271B8155479J79278K31728M24413J06027R5466L29150K80945J11916J59176L91378
$$ 28155479 28334757 28566485 28990898 29096925 29192391 29521541 29802486 29914402 30073578 30464956
4261C0464956K54472K53131K39391L83064M60554Q6275L24080K91979Q4264j59665
$$ 30464956 30719428 30972559 31211950 31595014 32055568 32141843 32465923 32757902 32842166 32682501
4251C2682501O21681L48821p0392L26102M46787K51568J87051K66044N61569K60192
$$ 32682501 33304182 33653003 33582611 33908713 34355500 34607068 34794119 35060163 35621732 35881924
4241C5881924J52944J21075M04518L81619M08406L00092Q6978L30481M40935M88692
$$ 35881924 36034868 36155943 36560461 36942080 37350486 37650578 37737556 38068037 38508972 38997664
4231C8997664L70342P22440Q23558O52991M53733Q15287R18506P52836N15577
$$ 38997664 39368006 40090446 40914004 41566995 42020728 42836015 43754521 44507357 45022934
4222D5022934J088928J354850J306991J218330J048415J286870J654725J560656
$$ 45022934 46111862 47466712 48773703 49992033 51040448 52327318 53982043 55542699
4214E5542699J933490J950600K077430J975360K113266K557765K635850K683556
$$ 55542699 57476189 59426789 61504219 63479579 65592845 68150610 70786460 73470016
4206G3470016K618632K914868K794064L414552L451127K820667L258149L603847
$$ 73470016 76088648 79003516 81797580 85212132 88663259 91483926 94742075 98345922
4198I8345922L975241L784397L799341L779602M010970M026589L952123L917745
$$ 98345922 102321163 106105560 109904901 113684503 117695473 121722062 125674185 129591930
4190A29591930M285942M139536L849072L982918L792409L441309L717966L429421
$$ 129591930 133877872 138017408 141866480 145849398 149641807 153083116 156801082 160230503
4182A60230503K942024K771709L098634K688819K307558K211206J829053J767660
$$ 160230503 163172527 165944236 169042870 171731689 174039247 176250453 178079506 179847166
4174A79847166J559735J095169L54372P6964l46978n66309p54837j105984j080257
$$ 179847166 181406901 182502070 182856442 182933406 182586428 182020119 181265282 180159298 179079041
4165A79079041j606261j707186j826323k278106j935308k149790k743037l036038
$$ 179079041 177472780 175765594 173939271 171661165 169725857 167576067 164833030 161796992
4157A61796992l394128l604458m186098m040712m103756m567095m319516m141117
$$ 161796992 158402864 154798406 150612308 146571596 142467840 137900745 133581229 129440112
4149A29440112m311747m420924m430006m538837l944034m033646m265731l922588
$$ 129440112 125128365 120707441 116277435 111738598 107794564 103760918 99495187 95572599
4141I5572599l772899m061372l766210l603190l806468l430965l626766l399912
$$ 95572599 91799700 87738328 83972118 80368928 76562460 73131495 69504729 66104817
4133F6104817k785833k930035k800812k250250k450967k514270j888690k194075
$$ 66104817 63318984 60388949 57588137 55337887 52886920 50372650 48483960 46289885
4125D6289885j697593j539101j716529j592899j211269j133466j228270j293069
$$ 46289885 44592292 43053191 41336662 39743763 38532494 37399028 36170758 34877689
4117C4877689j131452q32956p60016j062047q38681r23539m61071l26532o11221
$$ 34877689 33746237 32913281 32153265 31091218 30252537 29328998 28867927 28541395 27930174
4108B7930174o52502m53840p6621l23581m42124m66007k07791j74218m04785j32835
$$ 27930174 27277672 26823832 26747211 26423630 25981506 25515499 25307708 25133490 24728705 24595870
4098B4595870J728r5175j15590J58988J1646l72280o2275L9143K20240q0759l21066
$$ 24595870 24597598 24502423 24386833 24545821 24557467 24185187 24122912 24162055 24382295 24301536 23980470
4087B3980470p1266K09868n0075k21889o5865j01101l29223r557l3491r7009l5511
$$ 23980470 23909204 24119072 24068997 23847108 23781243 23680142 23350919 23341362 23307871 23210862 23175351
4076B3175351n56073k83342N1186p6349j36258k92165k28489j38249O1396o0508
$$ 23175351 22619278 22335936 22387122 22310773 22174515 21882350 21653861 21515612 21577008 21516500
4066B1516500m58119k95446M6287j51016J00577l35465k51404L56102J12518p3964
$$ 21516500 21058381 20762935 20809222 20658206 20758783 20423318 20171914 20528016 20640534 20566570
4056B0566570k30825l35681o0307r6220n084P6278J0332J67307n5867K3887o1875
$$ 20566570 20335745 20000064 19939757 19843537 19838453 19914731 19925063 20092370 20036503 20060390 19998515
4045A9998515J76032k04397n9258M0669J90246N2888J57519q6441j32178J28941
$$ 19998515 20174547 19970150 19910892 19951561 20141807 20194695 20352214 20265773 20133595 20262536
4035B0262536J54589J04873n9470J64044j9893K87503K11461L31752P8963L5390
$$ 20262536 20417125 20521998 20462528 20626572 20606679 20894182 21105643 21437395 21516358 21551748
4025B1551748O4456L89847L76392K78686J42233J52679K73159j33239J10019J19248
$$ 21551748 21616204 22006051 22382443 22661129 22803362 22956041 23229200 23095961 23205980 23325228
4015B3325228M98492K56400J99445J88660K78823L35629N0254R9436N8930N06729
$$ 23325228 23823720 24080120 24279565 24468225 24747048 25082677 25132931 25232367 25291297 25798026
4005B5798026K5196J39218L03787M90600J43990J57227N1355K36034R75172N07861
$$ 25798026 25823222 25962440 26266227 26756827 26900817 27058044 27109399 27345433 28320605 28828466
3995B8828466M65366N77443O40932O37399O96732P35695L96653L63293M02487
$$ 28828466 29293832 29871275 30512207 31149606 31846338 32582033 32978686 33341979 33744466
3986C3744466L98627K62253J35806k87620k23323m3846q7680N5695k60897J83861
$$ 33744466 34143093 34405346 34541152 34253532 34030209 33986363 33898683 33954378 33693481 33877342
3976C3877342J65295l02805N132l6522l89915n43583m70784l67019l71017o31991
$$ 33877342 34042637 33739832 33744964 33708442 33318527 32774944 32304160 31937141 31566124 30934133
3966C0934133o56244o70654m70890k19788j46311l03667k19321m6194k98385N5490
$$ 30934133 30277889 29607235 29136345 28916557 28770246 28466579 28247258 28201064 27902679 27958169
3956B7958169J18649J75020j98560l0271J27587L75848J52341N5495l7460K67509
$$ 27958169 28076818 28251838 28053278 28023007 28150594 28526442 28678783 28734278 28696818 28964327
3946B8964327L60474J21890O59749L75341J28550J89214J69061P46069P77527
$$ 28964327 29324801 29446691 30106440 30481781 30610331 30799545 30968606 31714675 32492202
3937C2492202N6060L42214L86794J87458M94515N53530P18747N21870L49327P73153
$$ 32492202 32548262 32890476 33277270 33464728 33959243 34512773 35231520 35753390 36102717 36875870
3927C6875870O06423M67586K17578Q03759M03558N13806P26182N08018N34287
$$ 36875870 37482293 37949879 38167457 38971216 39374774 39888580 40614762 41122780 41657067
3918D1657067J42737P75656O51859M30815L46234P18094O24509Q69547N11236
$$ 41657067 41799804 42575460 43227319 43658134 44004368 44722462 45346971 46216518 46727754
3909D6727754R39306J087323R19911J040367J023512J122210J345613J599032
$$ 46727754 47667060 48754383 49674294 50714661 51738173 52860383 54205996 55805028
3901E5805028J398347J450486J714949J734641J457425J528978J456597J320441
$$ 55805028 57203375 58653861 60368810 62103451 63560876 65089854 66546451 67866892
3893F7866892R32391J178543R35706O83831J016529P74192P05990R63233P69498
$$ 67866892 68799283 69977826 70913532 71597363 72613892 73388084 74094074 75057307 75826805
3884G5826805O93763O36138R45493Q58173J084513Q36176Q97558P29349P35793
$$ 75826805 76520568 77156706 78102199 78960372 80044885 80881061 81778619 82507968 83243761
3875H3243761J321691J061009J294159J396452J871278J912897K013327K042703
$$ 83243761 84565452 85626461 86920620 88317072 90188350 92101247 94114574 96157277
3867I6157277J827256K136170K139536J533258J369562J984471J980359J500688
$$ 96157277 97984533 100120703 102260239 103793497 105163059 107147530 109127889 110628577
3859A10628577J293370J348589J196844J318827J413507J374088J022998N02013
$$ 110628577 111921947 113270536 114467380 115786207 117199714 118573802 119596800 120098813
3851A20098813Q6824K0470n6121m19726r69182j207941j240773r62730j238641
$$ 120098813 120185637 120206107 120149986 119730260 118761078 117553137 116312364 115349634 114110993
3842A14110993r99776j066406r76179j109556j105961r87135p98967p58374o05034
$$ 114110993 113111217 112044811 111068632 109959076 108853115 107865980 107067013 106308639 105703605
3833A05703605n72407o26046l75942o83483j07026L85845M83195N48324J402033
$$ 105703605 105131198 104505152 104129210 103445727 103338701 103724546 104207741 104756065 106158098
3824A06158098J063903J356100K470055K696237K593640K847377L682627M027063
$$ 106158098 107222001 108578101 111048156 113744393 116338033 119185410 122868037 126895100
3816A26895100M012196M463297M990692N076724N312751N316829N345405N748871
$$ 126895100 130907296 135370593 140361285 145438009 150750760 156067589 161412994 167161865
3808A67161865N383196M815517N216940N350742N320976M994042M978720M767336
$$ 167161865 172545061 177360578 182577518 187928260 193249236 198243278 203221998 207989334
3800B07989334M729627M905111M035623L749194L140757K614683J960204J439735
$$ 207989334 212718961 217624072 221659695 225408889 228549646 231164329 233124533 234564268
3792B34564268J232959Q64365J068130O92666L06148K36595J91954L01004K97344
$$ 234564268 235797227 236661592 237729722 238422388 238728536 238965131 239157085 239458089 239755433
3783B39755433K36961M15873O13864N20321N04659R41780J152470J511491J865270
$$ 239755433 239992394 240408267 241022131 241542452 242047111 242988891 244141361 245652852 247518122
3774B47518122J580862K167318K018549K227397K415983K482123K568876K751214
$$ 247518122 249098984 251266302 253284851 255512248 257928231 260410354 262979230 265730444
3766B65730444K883112L100173L467053L619399L819219L592378L605746L511685
$$ 265730444 268613556 271713729 275180782 278800181 282619400 286211778 289817524 293329209
3758B93329209L856556L842545L612734L863853L848438L845118L994717M783094
$$ 293329209 297185765 301028310 304641044 308504897 312353335 316198453 320193170 324976264
3750C24976264N073637N780531O856447Q037336R619454J0822254J2422528J3728168
$$ 324976264 330049901 335830432 342686879 350724215 360343669 371165923 383588451 397316619
3742C97316619J5174715J6335059J6584124J6010645J4586500J3053578J0483285
$$ 397316619 412491334 428826393 445410517 461421162 476007662 489061240 499544525
3735D99544525P804180N023935K444207K23016j368523k740712l042719l019584
$$ 499544525 507348705 512372640 514816847 515039863 513671340 510930628 507887909 504868325
3727E04868325k867377l346517m233681n479637p028400q776822j1261166j3941971
$$ 504868325 502000948 498654431 494420750 488941113 481912713 473135891 461874725 447932754
3719D47932754j6551543j8623582j9928615k1026270k1380177k0846908k0143959
$$ 447932754 431381211 412757629 392829014 371802744 350422567 329575659 309431700
3712C09431700j9463885j7657793j6001998j4819073j2998859j1929381j0911492
$$ 309431700 289967815 272310022 256308024 241488951 228490092 216560711 205649219
3705B05649219j0023257q995435q285516p624005p237926o826025o482223o218323
$$ 205649219 195625962 186630527 178345011 170721006 163483080 156657055 150174832 143956509
3697A43956509n618886n617392n221253m988624m770464m299193m498337l946030
$$ 143956509 138337623 132720231 127498978 122510354 117739890 113440697 108942360 104996330
3689A04996330l533349l512006l631847l454532l132819k995402k899167k944663
$$ 104996330 101462981 97950975 94319128 90864596 87731777 84736375 81837208 78892545
3681G8892545l026221k664777k556905k361953k477153k238549k283563k069905
$$ 78892545 75866324 73201547 70644642 68282689 65805536 63566987 61283424 59213519
3673E9213519j959331j835112j849516j521849j694145j230350j294109j308058
$$ 59213519 57254188 55419076 53569560 52047711 50353566 49123216 47829107 46521049
3665D6521049j305420j434453j173133j278151p12875j012307j120992j030811
$$ 46521049 45215629 43781176 42608043 41329892 40617017 39604710 38483718 37452907
3657C7452907r48818q57057p81517q23596p32519p53209n31970p74654r85162
$$ 37452907 36504089 35647032 34865515 34041919 33309400 32556191 32024221 31249567 30264405
3648C0264405m05827n65168n91530p93147m86269o07854m93536n90207m98194
$$ 30264405 29858578 29293410 28701880 27908733 27422464 26814610 26321074 25730867 25232673
3639B5232673p98398o32977j83629o17452m12708M7826n21891n20793n23629m94405
$$ 25232673 24434275 23801298 23617669 23000217 22587509 22635335 22113444 21592651 21069022 20574617
3629B0574617j22486j62708m95819k55307j59944m54838k23266n30723M226q7088
$$ 20574617 20452131 20289423 19793604 19538297 19378353 18923515 18700249 18169526 18173752 18086664
3619A8086664m62343P5506m3237j96169R1544J09782n9044l00207j12863j35406
$$ 18086664 17624321 17699827 17656590 17460421 17551965 17661747 17602703 17302496 17189633 17054227
3609A7054227p3647j77201m8255k51580j68511m6579k91374p6812J82655l52966
$$ 17054227 16980580 16803379 16755124 16503544 16335033 16288454 15997080 15920268 16102923 15749957
3599A5749957q4192p8744j75405j6568j16405j39919k66460k43530J81842J00646
$$ 15749957 15665765 15587021 15411616 15395048 15278643 15138724 14872264 14628734 14810576 14911222
3589A4911222N2830J49839k96249j52854n113j0321K5821j62149k07492n7580
$$ 14911222 14964052 15113891 14817642 14664788 14659675 14649354 14675175 14513026 14305534 14247954
3579A4247954J5118n23533K71972L14071j57804J30986j71018j98834P761j24819
$$ 14247954 14263072 13739539 14011511 14325582 14167778 14298764 14127746 13928912 13936673 13811854
3569A3811854m72259j47153N4481j60331j72532q0687j11442k37199k09764k55245
$$ 13811854 13339595 13192442 13246923 13086592 12914060 12833373 12721931 12484732 12274968 12019723
3559A2019723N0856J53347J10261j8134l49992j0515M2817l54508Q2899J3508
$$ 12019723 12070579 12223926 12334187 12316053 11966061 11955546 11998363 11643855 11726754 11740262
3549A1740262R0932k51683J92361Q2839j5240R2144J01574J04250m1406j81348
$$ 11740262 11831194 11579511 11771872 11854711 11839471 11931615 12033189 12137439 12096033 11914685
3539A1914685j82670K20936j50914l4712J03746p0316J98657l3953r9408j78346
$$ 11914685 11732015 11952951 11802037 11767325 11871071 11800755 11999412 11965459 11866051 11687705
3529A1687705L11509J38837r6100o1944K20864M5045l9802J96845j6423K60732
$$ 11687705 11999214 12138051 12041951 11980007 12200871 12245916 12206114 12402959 12386536 12647268
3519A2647268L07593J02351p6028r2834M1589K3725J89777J51518M31767J0338
$$ 12647268 12954861 13057212 12981184 12888350 12929939 12953664 13143441 13294959 13726726 13737064
3509A3737064M41448L20348M70289K10624m3518P47524L38682L02359J74901L45718
$$ 13737064 14178512 14498860 14969149 15179773 15136255 15883779 16222461 16524820 16699721 17045439
3499A7045439N31764M41371L07735N29933M33033N17600M64022P46591M98377
$$ 17045439 17577203 18018574 18326309 18856242 19289275 19806875 20270897 21017488 21515865
3490B1515865N81845Q16392R52396P47418J268301O79204Q66239J134040J261916
$$ 21515865 22097710 22914102 23866498 24613916 25882217 26561421 27427660 28561700 29823616
3481B9823616J080183J277691J225862R18305R39500J191400J060979P34954N17897
$$ 29823616 30903799 32181490 33407352 34325657 35265157 36456557 37517536 38252490 38770387
3472C8770387N93600M30961J55290r3877P8860l4417m09478k36737o0780J09406
$$ 38770387 39363987 39794948 39950238 39856361 39935221 39900804 39491326 39254589 39193809 39303215
3462C9303215M42271K45657K80065k5671j06141k62700k7255j93306k0718r5872
$$ 39303215 39745486 39991143 40271208 40245537 40139396 39876696 39849441 39656135 39635417 39539545
3452C9539545j90782r1529n60159p96294n07588j162022r25508r58238r75020
$$ 39539545 39348763 39257234 38697075 37900781 37393193 36231171 35305663 34347425 33372405
3443C3372405o35458n68548o14980p51098j87961m0300o9915k09065L87746K23781
$$ 33372405 32736947 32168399 31553419 30802321 30614360 30574060 30504145 30295080 30682826 30906607
3433C0906607N38249M44200K51212L26545K47802K98906J36875R2664R9371n33537
$$ 30906607 31444856 31889056 32140268 32466813 32714615 33013521 33150396 33243060 33342431 32808894
3423C2808894r95381r78814j057442j349226j197832j244649j024444j068434
$$ 32808894 31813513 30834699 29777257 28428031 27230199 25985550 24961106 23892672
3415B3892672j191895q56172j010279p32782o86789o46013m67765m47189k04031
$$ 23892672 22700777 21844605 20834326 20101544 19414755 18768742 18300977 17853788 17649757
3406A7649757n05297m21718o3687l57804k25089q1481l81849p4774J04182J03121
$$ 17649757 17144460 16722742 16659055 16301251 16076162 15994681 15612832 15538058 15642240 15745361
3396A5745361j10105M77401K99293l49756n03061l50604n66385j37106l71359
$$ 15745361 15635256 16112657 16411950 16062194 15559133 15208529 14642144 14505038 14133679
3387A4133679n05392j97172n48206m43281o4977j91632l27158l91172o9077O6456
$$ 14133679 13628287 13431115 12882909 12439628 12374651 12183019 11855861 11464689 11395612 11462068
3377A1462068Q6752j55996j61940J73024j14981l40655n1418k05391j2668l52434
$$ 11462068 11548820 11392824 11230884 11403908 11288927 10948272 10896854 10691463 10678795 10326361
3367A0326361j08497j66543K43383k10626k08395J31335J69394K5693P6602j57243
$$ 10326361 10217864 10051321 10294704 10084078 9875683 10007018 10176412 10202105 10278707 10121464
3357A0121464k54903k8861p4712Q2742j36788J89115J25135l19337k23894J35808
$$ 10121464 9866561 9837700 9762988 9845730 9708942 9898057 10023192 9703855 9479961 9615769
3347I615769J92860N4252J0131K51715J53917k7802J52622J07388R5670J12852
$$ 9615769 9808629 9862881 9873012 10124727 10278644 10250842 10403464 10510852 10606522 10719374
3337A0719374J10740J20478K71419J90952M47634K90033J02710K22789M73032
$$ 10719374 10830114 10950592 11222011 11412963 11860597 12150630 12253340 12476129 12949161
3328A2949161J37329J73851M81197K25825O00374O54926M97556O95657O68440
$$ 12949161 13086490 13260341 13741538 13967363 14567737 15222663 15720219 16415876 17084316
3319A7084316P94412J056370J054876J052580J223167J354750J182977K247639
$$ 17084316 17878728 18935098 19989974 21042554 22265721 23620471 24803448 27051087
3311B7051087J940525K200001K627711L414235M194384N392234O618235O731853
$$ 27051087 28991612 31191613 33819324 37233559 41427943 46820177 53438412 60170265
3303F0170265P034018O155223L935816N93691j478312j903974m531513o952637
$$ 60170265 67204283 73359506 77295322 77889013 76410701 74506727 69975214 63022577
3295F3022577n880607m293201l658841k529021k414461k020895j694414r04926
$$ 63022577 57141970 52848769 49189928 46660907 44246446 42225551 40531137 39626211
3287C9626211q02073m46837J1323N38289R25288J145031J650478K431050L525739
$$ 39626211 38824138 38377301 38388624 38926913 39852201 40997232 42647710 45078760 48604499
3278D8604499M708262N601418N989790N700013M272452K129040q47267k400179
$$ 48604499 53312761 58914179 64903969 70603982 74876434 77005474 76158207 73758028
3270G3758028l522825n791427o863956n939728m832749m208121l342532l232213
$$ 73758028 70235203 64443776 57579820 51640092 46807343 42599222 39256690 36024477
3262C6024477k769628k519282k095164j885148j890086j462041q75002j000675
$$ 36024477 33254849 30735567 28640403 26755255 24865169 23403128 22528126 21527451
3254B1527451j125122q54507r75839r88272r70854p44857o72695o43137j65094
$$ 21527451 20402329 19547822 18571983 17583711 16612857 15868000 15195305 14552168 14387074
3245A4387074k51268o12828l83604k56791l00454j39131j41200l54844n21321
$$ 14387074 14135806 13522978 13139374 12882583 12582129 12442998 12301798 11946954 11425633
3236A1425633O7687n12734k91996k45293j9570j58165k1224l2106q2113j58844
$$ 11425633 11493320 10980586 10688590 10443297 10423727 10265562 10244338 10212232 10130119 9971275
3226I971275J01861K36979m31185j86270k09015J51661P8454j79015k68736L5222
$$ 9971275 10073136 10310115 9878930 9692660 9483645 9635306 9713760 9534745 9266009 9301231
3216I301231k49752k08190o5542k33222l30740L14580k77548j36299M138k91450
$$ 9301231 9051479 8843289 8777747 8544525 8213785 8528365 8250817 8114518 8118656 7827206
3206G827206j38558J83334R6282r6134n5274J27002J88898k12401J22726M55751
$$ 7827206 7688648 7871982 7968264 7872130 7816856 7943858 8132756 7920355 8043081 8498832
3196H498832j27293j66186q2741K06485J34100R597l25150R6878j20170k94580
$$ 8498832 8371539 8205353 8122612 8329097 8463197 8472794 8147644 8244522 8124352 7829772
3186G829772k19671K17251r2363L133k3229N6495M0644k23406j48239M4900k40794
$$ 7829772 7610101 7827352 7734989 7738122 7714893 7771388 7812032 7588626 7440387 7485287 7244493
3175G244493q666K23933P6804P5722K7089J0373O992K39691J57035Q9273r7447
$$ 7244493 7235827 7459760 7536564 7612286 7639375 7649748 7656740 7896431 8053466 8142739 8045292
3164H045292O9547j3005L15316o491M5811J23481M0976O0749n751P7042J27717
$$ 8045292 8114839 8101834 8417150 8410659 8456470 8579951 8620927 8681676 8675925 8752967 8880684
3153H880684J22052J09063K58120l14323j16132k23830J39387R9097J7703N5819
$$ 8880684 9002736 9111799 9369919 9055596 8939464 8715634 8855021 8954118 8971821 9027640
3143I027640j34357L06221K01405L4547Q2139M0990K30085R7744m4543J89734
$$ 9027640 8893283 9199504 9400909 9435456 9517595 9558585 9788670 9886414 9841871 10031605
3133A0031605L14714N3366j01172p8041R8809J43336k32412j23951K54958R2183
$$ 10031605 10346319 10399685 10298513 10220472 10319281 10462617 10230205 10106254 10361212 10453395
3123A0453395o9931R3538j64747q1500j63002k38364k58141J40704j01113n6392
$$ 10453395 10383464 10477002 10312255 10230755 10067753 9829389 9571248 9711952 9610839 9554447
3113I554447k9889J02301K56464K47911L05110o1588k57643Q0359L14175j38294
$$ 9554447 9524558 9626859 9883323 10131234 10436344 10374756 10117113 10197472 10511647 10373353
3103A0373353k74899Q7149j18613j89099n0585k15683J44852l2834l21120j15922
$$ 10373353 10098454 10185603 10066990 9877891 9827306 9611623 9756475 9723641 9402521 9286599
3093I286599l16064k44731Q875j93133j47329j43962j51698K31634j07346K55950
$$ 9286599 8970535 8725804 8734679 8541546 8394217 8250255 8098557 8330191 8222845 8478795
3083H478795j08072q070k56954Q6740p8808j62337o0979o6232J3050j62103n3488
$$ 8478795 8370723 8362653 8105699 8192439 8113631 7951294 7890315 7824083 7837133 7675030 7621542
3072G621542l5020k27043J5802j30306k91246k04174j0412K7183p0776J01918
$$ 7621542 7586522 7359479 7375281 7244975 6953729 6749555 6739143 6766326 6695550 6797468
3062F797468k45942R9682m4416j13535k42823k56014R9038j31097K80564K4037
$$ 6797468 6551526 6651208 6606792 6493257 6250434 5994420 6093458 5962361 6242925 6266962
3052F266962k82393k69940j79810J29026j33510J28087k07982j16186J16386K51751
$$ 6266962 5984569 5714629 5534819 5663845 5530335 5658422 5450440 5334254 5450640 5702391
3042E702391p7266l41271M22998j21896k69071O7916N194j03328k90431k76724
$$ 5702391 5625125 5283854 5706852 5584956 5315885 5383801 5388995 5285667 4995236 4718512
3032D718512j56628L08541O0536j1184q0930J51923j44644j46605Q5257m1059
$$ 4718512 4561884 4870425 4930961 4919777 4838847 4990770 4846126 4699521 4784778 4743719
3022D743719J71331k42131J63389L2584n2826j30696Q5736J04151L2779j66841
$$ 4743719 4915050 4672919 4836308 4868892 4816066 4685370 4771106 4875257 4908036 4741195
3012D741195K48162m6608k21215N1007j40228j79208r4166L6533m1694k1301k99151
$$ 4741195 4989357 4942749 4721534 4772541 4632313 4453105 4358939 4395472 4353778 4332477 4033326
3001D033326j45843J36212K59530n6635J12783N0727l3048j55343J32093k68914
$$ 4033326 3887483 4023695 4283225 4226590 4339373 4390100 4357052 4201709 4333802 4064888
2991D064888R0511j43607J07620L22292M5291l46954p1948j46089K17429j06383
$$ 4064888 4155399 4011792 4119412 4441704 4486995 4140041 4068093 3922004 4139433 4033050
2981D033050k3140J78252j17661J677k60659k67595P197n9743P302m5577L7524
$$ 4033050 4009910 4188162 4070501 4072178 3811519 3543924 3551121 3491378 3498680 3453103 3490627
2970C490627j55578q6773K22651R0237n4381k5162j68157r0924j8134K30196Q9892
$$ 3490627 3335049 3248276 3470927 3561164 3506783 3481621 3313464 3222540 3204406 3434602 3524494
2959C524494j20568j07364k15289q9342K58818K967m0647L25128M0545k3463j14823
$$ 3524494 3403926 3296562 3081273 2991931 3250749 3253716 3213069 3538197 3578742 3555279 3440456
2948C440456q0252l69079J49521k923k45142J48427P3705j71407O0909Q2747o9340
$$ 3440456 3360204 2991125 3140646 3137723 2892581 3041008 3114713 2943306 3004215 3086962 3017622
2937C017622K2311j47000p9528M39891j19001r1647k07160m4472m76517l5720
$$ 3017622 3039933 2892933 2813405 3253296 3134295 3042648 2835488 2791016 2314499 2278779
2927B278779J54146K66126K9552j67444K596J64883l41411l8083J45409l3168
$$ 2278779 2432925 2699051 2728603 2561159 2563755 2728638 2387227 2349144 2494553 2461385
2917B461385j06380j19754k7096L26109O9102l17674J03858J47013N2369k81092
$$ 2461385 2355005 2235251 2208155 2534264 2603366 2285692 2389550 2536563 2588932 2307840
2907B307840j44991j62481L20005m6939m32046J9881J77740O181L7884P4139o6261
$$ 2307840 2162849 2000368 2320373 2273434 1841388 1861269 2039009 2045190 2083074 2157213 2090952
2896B090952J10953P5010J27013m2756n6903J33043k37905k37068J84741M7461
$$ 2090952 2201905 2276915 2403928 2361172 2304269 2437312 2199407 1962339 2147080 2194541
2886B194541K22631J3379k31560Q5515k3412m0276J48705Q0960J78906k58940
$$ 2194541 2417172 2430551 2198991 2284506 2261094 2220818 2369523 2450483 2629389 2370449
2876B370449k2392k9416l41010m0476j01901n5841M1751J41650l0192J06344l6283
$$ 2370449 2348057 2318641 1977631 1937155 1835254 1779413 1821164 1962814 1932622 2038966 2002683
2865B002683K35852k38042J20142J99560k90939k86751J21330j99178P844J45668
$$ 2002683 2238535 2000493 2120635 2320195 2029256 1742505 1863835 1664657 1672501 1818169
2855A818169P8514o4260l42687j10359N06348j79161m22059j24917J79201J17436
$$ 1818169 1896683 1832423 1489736 1379377 1885725 1706564 1284505 1159588 1338789 1456225
2845A456225J02754M9384n3429j70589k6905K95305N1584m1672R8939O9344k61597
$$ 1456225 1558979 1608363 1554934 1384345 1357440 1652745 1704329 1662657 1761596 1830940 1569343
2834A569343j38445J33580K30272j08000k42174J68738K46595k04421p7773k59070
$$ 1569343 1430898 1564478 1794750 1686750 1444576 1613314 1859909 1655488 1577715 1318645
2824A318645M5995n4618K1168j2524k55406J84691J69679k21302K56906L02263
$$ 1318645 1364640 1310022 1331190 1318666 1063260 1247951 1417630 1196328 1453234 1755497
2814A755497j04440p8993J30422j37324l19320j2747K00895k5879l55796j88150
$$ 1755497 1651057 1572064 1702486 1565162 1245842 1233095 1433990 1408111 1052315 864165
2804H64165J1212J10110l7724L85720J8883P6200j84107k11583P2343j03033J02094
$$ 864165 875377 985487 947763 1333483 1352366 1428566 1244459 1032876 1105219 1002186 1104280
2793A104280n4172k69169P6237L79228J57164J57935m12132j50502J8754J69990
$$ 1104280 1050108 780939 857176 1236404 1393568 1551503 1139371 988869 1007623 1177613
2783A177613J67674l3291j63886l6485j08541l7592K07283o1087N4951k10600
$$ 1177613 1345287 1311996 1148110 1111625 1003084 965492 1172775 1111688 1166639 956039
2773I56039j47499J24532o7809m5264j12252J86849M26602J12213k43247m3629
$$ 956039 808540 933072 865263 819999 707747 894596 1321198 1433411 1190164 1146535
2763A146535m0309j23137M7731o4348O6798q536o8202L4870m02953K84361q68
$$ 1146535 1106226 983089 1030820 966472 1033270 1024734 956532 991402 588449 872810 871942
2752H71942p9260J57504K12431k40720k16876J41730N4413m71941L0546M6372
$$ 871942 792682 950186 1162617 921897 705021 846751 901164 429223 459769 506141
2742E06141K06748R9832k12863j20461K51845Q9091k86773K30624K23723k38532
$$ 506141 712889 812721 599858 479397 731242 820333 533560 764184 987907 749375
2732G49375j96969J24510j36591K57395k55356j11138L729J47798R4643M0972
$$ 749375 552406 676916 540325 797720 542364 431226 434955 582753 677396 718368
2722G18368p8834q1368p4880k5185j07496J03435j9781j9911q8838J45776K2057
$$ 718368 639534 558166 483286 458101 350605 454040 434259 414348 325510 471286 493343
2711D93343j95332J34652M4180Q2001Q075q5022J75338k566L9770l05746k21945
$$ 493343 298011 432663 476843 558844 566919 481897 657235 654669 694439 388693 166748
2700A66748M0408K00772K13409j43926l2506k4046R8547j06834k8054P0415j22316
$$ 166748 207156 407928 621337 477411 444905 420859 519406 412572 384518 454933 332617
2689C32617J37948o2634j70397j33408O679P2870n7264J30511p0792R2445J23165
$$ 332617 470565 407931 237534 104126 110805 183675 126411 256922 186130 278575 401740
2678D01740N4994J08381j50197K370Q548r8792Q3566k06537k34717r2326K66618
$$ 401740 456734 565115 414918 417288 425836 327044 410610 204073 -30644 -122970 143648
2667A43648J43318K238j38571L7747n2171J62747k11159p1084L40930j19552k5841
$$ 143648 286966 289204 150633 188380 136209 298956 87797 16713 357643 238091 212250
2656B12250n9115q1915j66223J97201J67866o1092j6883L24570k25341o8167K4922
$$ 212250 153135 71220 -95003 102198 270064 208972 192089 516659 291318 223151 248073
2645B48073R4398j57798j762N5550M325j63904p2898m5841L34611p3466m4722
$$ 248073 342471 184673 182911 238461 242786 78882 5984 -39857 294754 221288 176566
2634A76566Q0225Q4349j69768k9010R0452k1677J31011K3824j8229O1311r7781
$$ 176566 256791 341140 171372 142362 232814 211137 342148 365972 347743 409054 311273
2623C11273j48647o4647J75474K29022l45968q1564L97336l705j41724L2636l19787
$$ 311273 162626 97979 273453 502475 156507 74943 472279 468574 326850 359486 39699
2612C9699R5821k2995J043J4174J78442J61889L1710k65869L00033k0496p037
$$ 39699 135520 112525 113568 127742 306184 468073 499783 233914 533947 513451 506414
2601E06414J57057L48214j93752k13981k9516Q656J20851r1326l16037K8352J62362
$$ 506414 663471 1011685 817933 603952 574436 583092 703943 612617 296580 324932 487294
2590D87294K49177r5450j16085l31657L4819J19598J1545J53993k81916j49985
$$ 487294 736471 641021 524936 193279 228098 347696 359241 513234 231318 81333
2580H1333L13860l8371j69441L69343r5210k10165j35091J92070j15202j30832
$$ 81333 395193 356822 187381 556724 461514 251349 116258 308328 193126 62294
2570F2294J43670K06545j15638k9616j35652J96044m4901j8387J37996j9511j75229
$$ 62294 205964 412509 296871 267255 131603 327647 282746 264359 402355 382844 207615
2559B07615j53624O4049j84623K62774j83255O0794M40988J7627n4250K2320j07863
$$ 207615 53991 118040 -66583 196191 12936 73730 514718 532345 478095 500415 392552
2548C92552Q108j62388p9708p5012R235j33188o5603Q9426J97500K6210k5854
$$ 392552 400660 238272 158564 83552 92787 -40401 -106004 -16578 180922 207132 181278
2537A81278k20520r6257K76806K62670j18706j07428r8646K3530M3199M3903J72524
$$ 181278 -39242 -135499 141307 403977 285271 177843 79197 102727 145926 189829 362353
2526C62353j24921k22800K67113k29962J5884J67007K4733J30166m8197n5921
$$ 362353 237432 14632 281745 51783 67667 234674 259407 389573 341376 285455
2516B85455m1649N8555o2595J4008j85285K644P1389L31122K34683k54397m30145
$$ 285455 243806 302361 239766 253774 68489 71133 142522 473644 708327 453930 23785
2505B3785J09194K05534P9596k99381k26069O2608J84104q8111M596j3989K34326
$$ 23785 132979 338513 418109 118728 -107341 -44733 139371 51260 55856 41867 276193
2494B76193k00162p3205J6210K66334J36591j10528K25236N8755j80612j20902
$$ 276193 76031 2826 19036 285370 421961 311433 536669 595424 414812 293910
2484B93910l42611J30170J44861P6210q1693r5182Q216J45293j91669M482K44170
$$ 293910 -48701 81469 226330 302540 220847 125665 133881 279174 87505 91987 336157
2473C36157p3387p3099J92024m2529j85180K11J12137R1026j25524O9941M9098
$$ 336157 262770 189671 381695 339166 153986 154197 266334 357360 231836 301777 350875
2462C50875m9849Q6215L92440J46646k26628j65774M919k64099p6055K91149j16573
$$ 350875 301026 387241 779681 926327 699699 533925 538844 274745 198690 489839 373266
2451C73266o4611l8376j6444K99386K8145k86063o4171Q2152J76160r882l17084
$$ 373266 308655 270279 253835 553221 581366 295303 231132 313284 489444 479562 162478
2440A62478j2580J23226M13602m180k65436q1378L30826J74651j03447p0519n3093
$$ 162478 149898 273124 686726 682546 417110 335732 666558 841209 737762 667243 614150
2429F14150K3053R406J18174j99355j3458J09840n703K37091j53706K42467j81876
$$ 614150 637203 646609 764783 565428 551970 661810 656107 893198 739492 981959 800083
2418H00083q0531J12639j8729p9841q5160K78775Q7962k23768j02655K86963Q161
$$ 800083 719552 832191 813462 733621 648461 927236 1015198 791430 688775 975738 983899
2407I83899n9631R2019K26073r255r3965N4965J77685J7940l563K9167M0291O1008
$$ 983899 924268 1016287 1242360 1233105 1139140 1194105 1371790 1389730 1386167 1415334 1455625 1516633
2395A516633J96915K15494l13519N826N9508R3753L92702l9629k26771K9133J14821
$$ 1516633 1713548 1929042 1615523 1621349 1680857 1774610 2167312 2127683 1900912 1930045 2044866
2384B044866M9440J81625K86093k03125p8620J99853J11647J03970L45226L96302
$$ 2044866 2094306 2275931 2562024 2358899 2280279 2480132 2591779 2695749 3040975 3437277
2374C437277o6792j5188M28911L44203r0746J93264N20404M00744J48665K33066
$$ 3437277 3370485 3355297 3784208 4128411 4037665 4230929 4751333 5152077 5300742 5533808
2364E533808L95749j27O29266M79094N59142J08163M11911P09996N98939P12449
$$ 5533808 5929557 5929430 6558696 7037790 7596932 7705095 8117006 8827002 9425941 10138390
2354A0138390J071544R48079P21746J225413J832498J640484J535152J826483
$$ 10138390 11209934 12158013 12879759 14105172 15937670 17578154 19113306 20939789
2346B0939789J647735J859683J772920K365168K572802L276364M304751N435525
$$ 20939789 22587524 24447207 26220127 28585295 31158097 34434461 38739212 44174737
2338D4174737P011824R350317J0736232J1220639J2402263Q632486J984001m471432
$$ 44174737 51186561 60536878 71273110 82493749 94896012 103528498 105512499 101041067
2330A01041067l479281l831327j2563811j2441208q354224o915248n775518n106597
$$ 101041067 97561786 93730459 81166648 68725440 60371216 53455968 47680450 42573853
2322D2573853m595218l819551l238938k554774j971056k296713j860731j592458
$$ 42573853 37978635 34159084 30920146 28365372 26394316 24097603 22236872 20644414
2314B0644414j354532j485823j644598j189585j294578j011227j073813q90740
$$ 20644414 19289882 17804059 16159461 14969876 13675298 12664071 11590258 10699518
2306A0699518j085439o90211o12510l68965m83359n79275l86537o60881l27008
$$ 10699518 9614079 8923868 8311358 7942393 7459034 6879759 6493222 5832341 5505333
2297E505333k74641L0746k15808m08959j24714j67156M4386m06291l91559j02022
$$ 5505333 5230692 5261438 5045630 4636671 4511957 4344801 4389187 3982896 3591337 3489315
2287C489315j40005j78728j94868k52911j36286J76640k06215q2822m7747k70706
$$ 3489315 3349310 3170582 2975714 2722803 2586517 2763157 2556942 2474120 2426373 2155667
2277B155667p9748R2607K8681j14791j67019P6903m1907m64408J17776m7780o7531
$$ 2155667 2075919 2168526 2197207 2082416 1915397 1992300 1950393 1485985 1603761 1555981 1488450
2266A488450P5855o1221j7060j17946j93829j00978k520J30356N3695r7264j63882
$$ 1488450 1564305 1503084 1486024 1368078 1174249 1073271 1070751 1201107 1254802 1157538 993656
2255I93656r6565N2325J57508J58935j8404m10595l4170k52381r4885J37982J37477
$$ 993656 897091 949416 1106924 1265859 1247455 836860 802690 550309 455424 593406 730883
2244G30883J04371p6958k59417p3983J59819k07575K153Q5867L1555L239j31965
$$ 730883 835254 758296 498879 424896 584715 377140 379293 465160 496715 499954 367989
2233C67989j50273J83075k340j42201j0531L85581j37900k90243M3798K63041
$$ 367989 217716 400791 398451 256250 245719 631300 493400 203157 246955 509996
2223E09996k01415J15708o8980l3925j19498J50886m4297q8199k2630l40067K10308
$$ 509996 308581 424289 355309 321384 201886 352772 308475 220276 197646 -142421 67887
2212F7887P4240L13980k80821p1711k1331J4454m366l5836j76181o8794O3412
$$ 67887 142127 456107 175286 103575 82244 96698 92332 56496 -119685 -188479 -125067
2201a25067K39421K15578r6731j88860j21327j3141J3243K01516k55939j17716
$$ -125067 114354 329932 233201 44341 -76986 -90127 -76884 124632 -131307 -249023
2191b49023O7591J16819J35117r2292n00214L9342K92025J20388j21803j76303
$$ -249023 -181432 -64613 70504 -21788 -522002 -482660 -190635 -70247 -192050 -368353
2181c68353K04294J28891j04442P596L0622j102j59467j91033L51599K13111N0538
$$ -368353 -164059 -35168 -139610 -132014 -101392 -102494 -261961 -452994 -101395 111716 162254
2170A62254m6667j69617K8743L81002N253l69460n9561j3364P28K20004J22217
$$ 162254 115587 -54030 -25287 355715 360968 -8492 -68053 -81417 -80689 139315 261532
2159B61532l8163R3830j40918j09360Q4455j59424N0238j66469j16566k2207o0968
$$ 261532 223369 317199 176281 66921 151376 -8048 42190 -124279 -240845 -263052 -324020
2148c24020L26694q0138j74991J17009J96027k27060j08691J41003k26310j12818
$$ -324020 2674 -77464 -252455 -135446 60581 -166479 -275170 -134167 -360477 -473295
2138d73295J78310o5305o0431j32926J43520J41593l42304O0624J32768J45238
$$ -473295 -294985 -360290 -420721 -553647 -410127 -268534 -610838 -550214 -417446 -272208
2128b72208m6234j98654L00352k3517q7202K262l8592r4107J66199J79343j18737
$$ -272208 -318442 -517096 -216744 -240261 -327463 -325201 -363793 -457900 -291701 -112358 -231095
2117b31095j34140J6077j7538O0241K13108J08334L3749k07232j02490J55248
$$ -231095 -365235 -349158 -366696 -306455 -93347 14987 48736 -158496 -260986 -105738
2107a05738l4647M8909Q1192r7384J68037M9336j37661l5247O88N4041K0236K711
$$ -105738 -140385 -91476 -10284 -107668 60369 109705 -27956 -63203 -62515 -8474 11762 14473
2095A4473J2061Q7881P0665k28513j53476P4675L0579n1050p7861l3113L06668
$$ 14473 26534 114415 185080 -43433 -196909 -122234 -91655 -142705 -220566 -253679 52989
2084E2989J1431j08011m07174q4661P7400Q0351K83395O0541K2957q2332J6704
$$ 52989 64420 -43591 -450765 -535426 -458026 -377675 -94280 -33739 -10782 -93114 -76410
2073g6410k8075j01742N7430J20588J06721K13527K16658K0769P879n5109J15496
$$ -76410 -104485 -206227 -148797 -28209 78512 292039 508697 529466 537345 482236 597732
2062E97732m9285j55095M8705k59793m2948N0744J07622J2846K5290Q6385J01377
$$ 597732 548447 393352 442057 182264 139316 190060 297682 310528 335818 422203 523580
2051E23580l84277k28409K2448l9958J3195L16053j10593N598j19751j52556L4435
$$ 523580 139303 -89106 -66658 -106616 -93421 222632 112039 117637 -2114 -154670 -120235
2040a20235O5281Q0843n8563j16590r5779L3299j83507L40321k38867r3585P2363
$$ -120235 -54954 25889 -32674 -149264 -245043 -211744 -395251 -54930 -293797 -387382 -315019
2029c15019L08691J40073j37645j44781J83305m1394j05577J327m4319l0759R6984
$$ -315019 -6328 133745 -3900 -148681 34624 -6770 -112347 -111020 -155339 -186098 -89114
2018h9114J13053P1580l07975Q7993R9695j10052k92588J78607M30083j50178
$$ -89114 23939 95519 -212456 -124463 -24768 -134820 -427408 -248801 181282 31104
2008C1104o8774M6755K68835j23900j93798J75834k13898m4284M5562j55715J45670
$$ 31104 -37670 9085 277920 154020 -39778 136056 -77842 -122126 -76564 -232279 -86609
1997h6609K62310p5737l1148m862J4845P4177j09915K6075k20818O7016J03366
$$ -86609 175701 99964 68816 63954 78799 152976 43061 69136 -151682 -84666 18700
1986A8700J05345j25841J20139K7661m8847k02351J01297k4660l261K08317k26135
$$ 18700 124045 -1796 118343 146004 97157 -105194 -3897 -28557 -31818 176499 -49636
1975d9636k77033K71465K5014p2607l9715K26177o5427j31158O6368R888J42390
$$ -49636 -326669 -55204 -30190 -102797 -142512 83665 18238 -112920 -46552 -36664 105726
1964A05726j94068J04050M2215j3377P2680k05087k35200J00896J5546l7482K3115
$$ 105726 -88342 15708 57923 44546 117226 -87861 -323061 -222165 -206619 -244101 -220986
1953b20986K67741K38389m4282l93276k5013J63693K7454l6751l03490p1972J79337
$$ -220986 46755 285144 240862 -152414 -177427 -13734 13720 -23031 -326521 -398493 -219156
1942b19156K63147j35238l79726N7480j88706J43176J23156j34205k1751J15236
$$ -219156 43991 -91247 -470973 -413493 -602199 -459023 -335867 -470072 -491823 -376587
1932c76587M3585q3589Q9532q8695L08785M0705k46177j20111J93771L45421j02713
$$ -376587 -333002 -416591 -327059 -415754 -106969 -66264 -312441 -432552 -238781 106640 3927
1921C927k65543N3724p1046N4254q5453J29710J11671l5101J8613j59668L5419
$$ 3927 -261616 -207892 -278938 -224684 -310137 -180427 -68756 -103857 -85244 -244912 -209493
1910b09493P9928K10294k34321l22156k7859K5354j33577n3434j12241K33785
$$ -209493 -129565 80729 -153592 -475748 -503607 -478253 -611830 -665264 -777505 -543720
1900e43720J79462M37411J5703k15286m2379p5196L80950q9047j8119j6924J23013
$$ -543720 -364258 73153 88856 -126430 -168809 -244005 136945 47898 29779 12855 135868
1889A35868j39344j27263l55492J71137M0717n1588o1088J2674O5078r1588K69995
$$ 135868 -3476 -130739 -486231 -315094 -274377 -325965 -387053 -374379 -309301 -400889 -130894
1878a30894L11181p8526k89813j37811k94016M00493J31718Q1669o0390J85568
$$ -130894 180287 101761 -188052 -325863 -619879 -219386 -87668 -5999 -66389 119179
1868A19179l91150n2949Q9518J22156J68993j42005j91644p5564p5063p129K14151
$$ 119179 -271971 -324920 -235402 -113246 55747 -86258 -277902 -353466 -428529 -435658 -221507
1857b21507j08858L3833L03929K52350j73065M3040K07037O8817j64408j41307
$$ -221507 -330365 -296532 7397 259747 86682 129722 336759 405576 241168 99861
1847I9861j60688K55813k63810p4969J29940r7884j53500M996J48731j11895q5228
$$ 99861 -60827 194986 -68824 -143793 -13853 -111737 -265237 -260241 -111510 -223405 -308633
1836c08633j21038P3069J55481j63905j49510l899K98079m0185K60541k1448J6000
$$ -308633 -429671 -356602 -201121 -365026 -514536 -518435 -220356 -260541 0 -21448 -5448
1825e448l0309o8858J90003l61502j45300M4276K48530q5600k20502k63549L63180
$$ -5448 -35757 -104615 85388 -276114 -421414 -377138 -128608 -214208 -434710 -698259 -335079
1814c35079K42962o9523P2269j95490j7650O5134J77519J38989q8387k29803j45788
$$ -335079 -92117 -161640 -89371 -284861 -302511 -237377 -59858 79131 -9256 -239059 -384847
1803c84847J8606r6999K2784m980j6690K23434k4595K84319P063l22899J46007
$$ -384847 -366241 -463240 -440456 -445436 -462126 -238692 -263287 21032 28095 -294804 -148797
1792a48797P2029L4053m1887J25443l74605K1377L22210k2736j41087k27351M3002
$$ -148797 -76768 -42715 -84602 40841 -333764 -312387 9823 -12913 -154000 -381351 -338349
1781c38349K08513m08546r2286J22439J79595L55577j86749j35008J98973J59132
$$ -338349 -129836 -538382 -630668 -508229 -328634 26943 -159806 -294814 -95841 63291
1771F3291q7227l85792J77010J98961j4708j4394K12410j21896l16635p4993J12461
$$ 63291 -23936 -409728 -232718 -33757 -48465 -62859 149551 27655 -288980 -363973 -251512
1760b51512j29169R508K41676J10379Q9086l52563o2540K17714J99503k00544
$$ -251512 -380681 -371173 -129497 -19118 69968 -282595 -345135 -127421 72082 -128462
1750a28462k11668r1336j0992J20739M37443k45336P5932m6816m1230J26652j14081
$$ -128462 -340130 -431466 -442458 -321719 115724 -129612 -53680 -100496 -141726 -15074 -129155
1739a29155r9806R075P1514J06585J40272p0564p1595J15862J6874k27282j69682
$$ -129155 -228961 -219886 -148372 -41787 98485 27921 -43674 72188 89062 -138220 -307902
1728c07902O1895P3900n7337L9867J07266j47464q2766J42849j49506J83917j01527
$$ -307902 -246007 -172107 -229444 -189577 -82311 -229775 -312541 -169692 -319198 -135281 -236808
1717b36808l10491k26855J64281J13798L39987N9175j0009o9446r1867Q7478P7388
$$ -236808 -547299 -774154 -609873 -496075 -156088 -96913 -106922 -176368 -268235 -180757 -103369
1706a03369l05447j40250J09332R4378o1022k5609L57993L26853k72718J56698
$$ -103369 -408816 -549066 -439734 -345356 -406378 -431987 -73994 252859 -19859 136839
1696A36839n1968l15199J30677j84205p4017M791L93934r3152j11702j93484P3944
$$ 136839 84871 -230328 -99651 -283856 -357873 -353082 40852 -52300 -164002 -357486 -283542
1685b83542o6413l3699k10977J42002j2434J39321M9824J6563L9250j90252r862
$$ -283542 -349955 -383654 -594631 -452629 -465063 -325742 -275918 -259355 -220105 -410357 -420219
1674d20219J75333j64978J69790J41947q5720L9668n1955o8778m3883L5546L35649
$$ -420219 -244886 -409864 -240074 -98127 -183847 -144179 -196134 -264912 -308795 -273249 62400
1663F2400Q9882m49101l24393j8896K41253O0168R6424L07730k5044l26931l2121
$$ 62400 152282 -296819 -621212 -640108 -398855 -338687 -242263 65467 40423 -286508 -318629
1652c18629n0519j10138M9514K67985k8999n0864q8418k0421P6346J7969j42632
$$ -318629 -369148 -479286 -429772 -161787 -190786 -241650 -330068 -350489 -274143 -256174 -398806
1641c98806L0613j61242M0027L2703J0245J44338J88594k17327J70094J67860
$$ -398806 -368193 -529435 -489408 -456705 -446460 -302122 -113528 -330855 -160761 7099
1631G099m3408j0325Q5068j43623p4727R5168J76223p2583k57J36594k32524j50044
$$ 7099 -36309 -46634 38434 -105189 -179916 -84748 91475 18892 18635 155229 -77295 -227339
1619b27339q7771J88502j59635j50794k38955R9446L14471l7380j00597R7079
$$ -227339 -315110 -126608 -286243 -437037 -675992 -576546 -262075 -299455 -400052 -302973
1609c02973j5173j1043P8767K69298J05278l48956k33559K85778K03613k42396
$$ -302973 -318146 -329189 -250422 18876 124154 -224802 -458361 -172583 31030 -211366
1599b11366j11617K1617M5753J42477l4272m4042j9990J85488K14673k03505n4677
$$ -211366 -322983 -301366 -255613 -113136 -147408 -191450 -211440 -25952 188721 -14784 -69461
1588f9461J24726K00660q9241k15321j34393j0518L06715j00733J43444k45860
$$ -69461 55265 255925 166684 -48637 -183030 -193548 113167 12434 155878 -89982
1578h9982j19400Q6156k89140L9354J74656J88753n6584j36097J9680p8975L07801
$$ -89982 -209382 -123226 -412366 -373012 -198356 -9603 -66187 -202284 -182604 -261579 46222
1567D6222L6973j15922j30615K20441J97296j76696j06214j5704N179J4218P5698
$$ 46222 83195 -32727 -163342 57099 254395 77699 -28515 -44219 -39040 -24822 50876
1556E0876j92425J80797O5748j44145k09512m7621M2834q1511r6034K50890Q6569
$$ 50876 -141549 39248 104996 -39149 -248661 -296282 -253448 -334959 -430993 -180103 -93534
1545i3534j73292r5784J65916r4155J3178K65937Q060p8797O6177J61388j84341
$$ -93534 -266826 -362610 -196694 -290849 -277671 -11734 -3674 -82471 -16294 145094 -39247
1534c9247r9503p1113K32187K7252j56459L3777j47360M1609n801K5472j8744
$$ -39247 -138750 -209863 22324 49576 -106883 -73106 -220466 -178857 -184658 -159186 -177930
1523a77930j42507J78732M0159p3030L8002r8057O9058n0131L74122k2068O5295
$$ -177930 -320437 -141705 -101546 -174576 -136574 -234631 -165573 -215704 158418 136350 201645
1512B01645R6718j15634l85421j63537k43875J45024J71602J20856M435M69348
$$ 201645 298363 182729 -202692 -366229 -610104 -465080 -293478 -172622 -168187 301161
1502C01161j00826k65250j97072m8968M0162K49989J60969k02004l5841K6447
$$ 301161 200335 -64915 -261987 -310955 -270793 -20804 140165 -61839 -97680 -71233
1492g1233K21017L1545j4895j44833m2579j33810n0083O110K79250k38264J57213
$$ -71233 149784 181329 166434 21601 -20978 -154788 -204871 -198761 80489 -157775 -562
1481e62O5616q2853j4268m0098m1352k688Q6496J0924N2541R1442K3805p1034
$$ -562 65054 -17799 -32067 -72165 -113517 -116205 -29709 -18785 33756 125198 149003 77969
1469G7969j05635m3137j70124K95582J4575K8225j88299j15452J02275J64408
$$ 77969 -27666 -70803 -240927 54655 69230 97455 -90844 -206296 -104021 60387
1459F0387j9224p6767m3577J10207o0684J20412P7951j34514R2147L8527k9014
$$ 60387 41163 -35604 -79181 31026 -29658 90754 168705 34191 126338 164865 135851
1448A35851j54900k37032K24011j64838J21064J94826K8149N1165m0304k71191
$$ 135851 -19049 -256081 -32070 -196908 -75844 118982 147131 198296 157992 -113199
1438a13199j06717L25531j22640k14489J93875r5656j46643J14056P930M6867
$$ -113199 -219916 105615 -17025 -231514 -37639 -133295 -279938 -165882 -157952 -111085
1428a11085K15411l3151k04760L1687J32930n4212L7525k07212m547K1584J12425
$$ -111085 104326 71175 -133585 -101898 31032 -23180 14345 -192867 -197414 -175830 -63405
1417f3405Q5315J3780j9789p7302K31107K3828j02294J98287j31963j94433N0175
$$ -63405 21910 35690 15901 -61401 169706 193534 91240 289527 157564 -36869 13306
1406A3306j80400n4107Q3715j899Q6345p4445j23835R5671q4162M9291L3290k9772
$$ 13306 -167094 -221201 -137486 -139385 -53040 -127485 -251320 -155649 -239811 -190520 -157230 -187002
1394a87002r2189N7523k1192J72509O7303J44217k46842p9365j33695K04188m3889
$$ -187002 -279191 -221668 -242860 -70351 -3048 141169 -105673 -185038 -318733 -114545 -158434
1383a58434q5884j70516o7872j12053M01143P6615n9742J191J20291j25408Q3030
$$ -158434 -244318 -414834 -482706 -594759 -193616 -117001 -176743 -175552 -55261 -180669 -97639
1372i7639O034m8098K52855l6448k1370J0685K4907l62362j99641L54264K01970
$$ -97639 -91605 -139703 113152 76704 55334 66019 90926 -271436 -471077 -116813 85157
1361H5157P964r8480J53718m8898j41227r0786J10152J7598j17620N4607J16471
$$ 85157 93121 -5359 148359 99461 -41766 -132552 -22400 -4802 -122422 -67815 48656
1350D8656J40875m1489J4185l99263o4671K0423k485l7579K80559K66290J48041
$$ 48656 189531 148042 162227 -237036 -301707 -281284 -283769 -321348 -40789 225501 373542
1339C73542l74920j8417K93766j67020k3347M5600L308p6628l8353J1077j58734
$$ 373542 -1378 -19795 273971 106951 83604 129204 132512 55884 17531 28608 -130126
1328a30126O4094K8318o9820o9553k5701J69174j16267k33167K48605k0551Q9915
$$ -130126 -66032 -37714 -107534 -177087 -202788 -33614 -149881 -383048 -134443 -154994 -65079
1317f5079k084l2838j74639J29481N7118N1203N6127m7522l806p4089J48814j04848
$$ -65079 -67163 -100001 -274640 -145159 -88041 -36838 19289 -28233 -32039 -106128 42686 -62162
1305f2162l86178j93298L30892N1095j69151o2954K46769K79415K9069j76005
$$ -62162 -448340 -641638 -310746 -259651 -428802 -491756 -244987 34428 63497 -112508
1295a12508M2448j78166k361r183j76879J59845L40887J56349j44620k58615J75778
$$ -112508 -70060 -248226 -250587 -259770 -436649 -276804 64083 220432 75812 -182803 -7025
1284g025J58218j73497J24678k92227J31749p879l1629n1390k5899K96416p2416
$$ -7025 151193 -22304 102374 -189853 -58104 -65983 -97612 -149002 -174901 121515 49099
1273D9099l4725M1939j22742n8827J62833J11441r0118k9160K42497m0334k47693
$$ 49099 14374 56313 -66429 -125256 37577 149018 58900 29740 272237 231903 -15790
1262a5790J51805J15533j57565Q86J47386Q5041k22438k39314k7702J21319L9677
$$ -15790 136015 251548 93983 94869 242255 327296 104858 -134456 -162158 -40839 -1162
1251a162N7168L832O502k13792q2786J98298J7328j28126K03022O9911n00074
$$ -1162 56006 59838 66340 -147452 -230238 -31940 -14612 -142738 60284 130195 -369879
1240c69879J27067K19835n8776K0102J03804o0270J60485P2436k76984o081q389
$$ -369879 -242812 -22977 -81753 -61651 42153 -18117 142368 214804 -62180 -68261 -76650
1229g6650n911k6911Q660P4565M1576j85971J0740L58827o6142K18678j23020
$$ -76650 -82561 -109472 -100812 -26247 15329 -170642 -159902 198925 132783 351461 228441
1218B28441k52722j04904l8868p7423J56118J42772L1681m5483k71758L5237Q7301
$$ 228441 -24281 -129185 -168053 -245476 -89358 53414 85095 39612 -232146 -196909 -109608
1207a09608N8411n5369K85849k4415o4924j91997K5745k83983J53439J55533L1897
$$ -109608 -51197 -106566 179283 154868 89944 -102053 -76308 -360291 -206852 -51319 -19422
1196a9422P949M2108J12197K2090j54359o0762M06457j11277l24945l46548J09723
$$ -19422 -11473 30635 142832 164922 10563 -50199 356258 244981 -79964 -426512 -316789
1185c16789J60999J22359J8523Q7566R9115M2753j69965l4787p382M9120j52830
$$ -316789 -155790 -33431 -14908 72658 171773 214526 44561 9774 2392 51512 -101318
1174a01318m6678J35482j96102N3591k7528K03827O6005k08626o2503K14284K9876
$$ -101318 -147996 -12514 -208616 -155025 -182553 21274 87279 -121347 -183850 30434 60310
1163F0310Q5319j0811K75203j6649q945o7035k48290j77701J07701J46907k71124
$$ 60310 145629 134818 410021 393372 384427 317392 69102 -108599 -898 146009 -125115
1152a25115K44087j0807K15230l05231L6405J38417j5337L5716j91890L7386k9275
$$ -125115 118972 108165 323395 18164 54569 192986 177649 213365 21475 58861 29586
1141B9586r1066J00707j71694l2212N7664j25830O5072K62667k7251J07029Q3306
$$ 29586 -61480 39227 -132467 -164679 -107015 -232845 -167773 94894 67643 174672 257978
1130B57978m602j65138Q2087K5137K155j55276J0323o7994k85451J70332o0353
$$ 257978 253376 88238 170325 195462 197617 42341 52664 -15330 -300781 -130449 -190802
1119a90802J59597K18372Q0297j26555k2491N3237Q9445j28151k69610r1892J21472
$$ -190802 -31205 187167 267464 140909 118418 171655 261100 132949 -136661 -228553 -107081
1108a07081J5257K25316O962n7346l9377M170p8041J21383j02916J37578O1749
$$ -107081 -91824 133492 140454 83108 43731 47901 -30140 91243 -11673 125905 187654
1097A87654p8511q7616K7609J54992O00o8748r6074J65864R8777P6923j55027
$$ 187654 109143 21527 49136 204128 204728 135980 39906 205770 304547 381470 226443
1086B26443j67406L4250L5309j31245j71511J56032L9502l10687M1964J37058
$$ 226443 59037 93287 128596 -2649 -174160 -18128 21374 -289313 -247349 -110291
1076a10291N8476N2226O9828R2167k92751M5474n8079l4169L67285J23652l58434
$$ -110291 -51815 411 70239 162406 -130345 -84871 -142950 -177119 190166 313818 -44616
1065d4616n2565L55187P4736p7729J3182l50271j06400o4530J94851j74673q1387
$$ -44616 -97181 258006 332742 255013 268195 -82076 -188476 -253006 -58155 -232828 -314215
1054c14215J79990J42533J16451O7998K2005l68138J67819j16777R7943Q190L1472
$$ -314215 -134225 8308 124759 192757 214762 -153376 14443 -102334 -4391 3799 35271
1043C5271J16667j72552k56991J98384K25407l433l27844J93667l2704N6944J01231
$$ 35271 151938 -20614 -277605 -79221 146186 142753 -185091 8576 -24128 32816 134047
1032A34047k09060R7734r5405q1043o3002J09814K53374J89646j42994r8087P8478
$$ 134047 -75013 22721 -72684 -153727 -216729 -106915 146459 336105 193111 95024 173502
1021A73502k12422j77199K25575L89668n437j16348r6962k22908r6819K92364
$$ 173502 -38920 -216119 9456 399124 393687 277339 180377 -42531 -139350 153014
1011A53014J18665l05285j04379J42009j42556o1205J77872j65059n6164n8447
$$ 153014 271679 -33606 -137985 4024 -138532 -199737 -21865 -186924 -243088 -301535
1001c01535J80997K09327j85669k27487O8606M05946o4267j40992q4189K50603
$$ -301535 -120538 88789 -96880 -324367 -255761 150185 85918 -55074 -139263 111340
991A11340j06832j27746n0382j54942L39328J83751L06482O1967k55494j84543
$$ 111340 4508 -123238 -173620 -328562 10766 194517 500999 562966 307472 122929
981A22929n427k10377p6218K01089r7828J6433O9984J57651R6037P5783P7645
$$ 122929 117502 -92875 -169093 31996 -65832 -49399 20585 178236 274273 350056 427701
970D27701l69528o9580J34097j07959p2360M2653j96N4957j88003j6926M4244
$$ 427701 58173 -11407 122690 14731 -57629 -14976 -15172 39785 -148218 -165144 -120900
959a20900M5750J95943r2940j04371Q180l8648k16174J63379Q9159n7222J84078
$$ -120900 -75150 120793 27853 -76518 -68338 -106986 -323160 -159781 -70622 -127844 56234
948E6234j11081n5496J65655M296l4071P0618j43755n1206j7296k05216M3171
$$ 56234 -54847 -110343 55312 59608 25537 96155 -47600 -98806 -116102 -321318 -278147
937b78147J93193l8186J76057Q0293M5294J86277j25923j46883l484Q7710J8950
$$ -278147 -84954 -123140 52917 133210 178504 364781 238858 91975 88491 176201 195151
926A95151J25121J78537j04093l66495j37071J40194N2403m12J94971o3021q0078
$$ 195151 320272 498809 394716 28221 -108850 31344 83747 83335 278306 215285 135207
915A35207q3101Q822Q8023j38838j01272Q4928j10290R1406k5329j98171p1061
$$ 135207 52106 60928 148951 10113 -91159 -6231 -116521 -25115 -50444 -248615 -319676
904c19676J23674J03176M5702J42895J7994J7363n9639k03647K1809L00907J3407
$$ -319676 -196002 -92826 -47124 95771 113765 131128 71489 -132158 -110349 190558 203965
893B03965j81665M3040R4348k16745q0119j56535K80557K80031o4074j21131J80630
$$ 203965 22300 65340 159688 -57057 -137176 -293711 -13154 266877 202803 81672 262302
882B62302J74089N2534j14243q0747K9690j33271k57054M5072J13648J52890P9042
$$ 262302 436391 488925 374682 293935 323625 190354 -66700 -21628 92020 244910 323952
871C23952l3850j47937q5841N9137j70438J26671J41269j31916k9434J85713q163
$$ 323952 290102 142165 56324 115461 -54977 71694 212963 81047 51613 237326 229163
860B29163k56548l988J36693j68860q1174L22669j57656n6076K32153j79444p7335
$$ 229163 -27385 -31373 105320 -63540 -144714 177955 20299 -35777 196376 16932 -60403
849f0403O5005L721j15647J5570K4922k74449Q613K05237K55413J11806k30494
$$ -60403 4602 8323 -107324 -91754 -66832 -341281 -332668 -127431 127982 239788 9294
838I294j50912K25747j86433k2960m6660K5336O5065N6136J79986j76439m4343
$$ 9294 -141618 84129 -102304 -125264 -171924 -146588 -81523 -25387 154599 -21840 -66183
827f6183P9761r2206j81431P7496J84787k5161k16818O2078K07937L67372L1942
$$ -66183 13578 -78628 -260059 -182563 2224 -22937 -239755 -177677 30260 397632 429574
816D29574j07421k86710J1496J41286J12370j15444j10581j71958O0432L6945
$$ 429574 322153 35443 46939 188225 300595 185151 74570 -97388 -36956 -11
806a1q5062R9142o755K36682j48232K5917J53520m1249r1403k90921Q1271K279
$$ -11 -85073 14069 7314 243996 95764 121681 275201 233952 142549 -148372 -67101 -64822
794f4822Q7756j51376j55889K89671j39556p7032J3627R2843K49801l56171L2405
$$ -64822 22934 -128442 -284331 5340 -134216 -211248 -197621 -104778 145023 -211148 -178743
783a78743O8209J06360K01379J80907j44987r6055J07941j47934j48434J73279
$$ -178743 -110534 -4174 197205 378112 233125 137070 245011 97077 -51357 121922
773A21922R5626J843j38848j88227K16090K92794j7795o64251j07723L4935L8963
$$ 121922 217548 219391 80543 -107684 108406 401200 383405 -280846 -388569 -353634 -314671
$$ [...]
##END NTUPLES=NMR SPECTRUM
##END=
