##TITLE=1H_DE-80H_X3
 200.13MHz, d2o
 8 sc
 
 19ns.26.2.2025
##JCAMPDX= 6.0         $$ Bruker NMR JCAMP-DX V2.0
##DATA TYPE= NMR SPECTRUM
##DATA CLASS= NTUPLES
##ORIGIN= UXNMR, Bruker Analytische Messtechnik GmbH
##OWNER= pz
$$ XWIN-NMR		Version 3.5
$$ Mon Sep 29 13:36:02 2025 Russian Standard Time (UT+4h)  Yarkov@DPX200
##.OBSERVE FREQUENCY= 200.1313
##.OBSERVE NUCLEUS= ^1H
##.ACQUISITION MODE= SIMULTANEOUS
##.ACQUISITION SCHEME= undefined
##.AVERAGES= 8
##.DIGITISER RES= 18
##SPECTROMETER/DATA SYSTEM= spect
##.PULSE SEQUENCE= zg30
##.SOLVENT NAME= CDCl3
##.SHIFT REFERENCE= (INTERNAL, CDCl3, 0, 15.499)
##AUDIT TRAIL= $$ (NUMBER, WHEN, WHO, WHERE, WHAT)
$$ ##TITLE= Audit trail, XWIN-NMR		Version 3.5
$$ ##JCAMPDX= 5.01
$$ ##ORIGIN= Bruker BioSpin GmbH
$$ ##OWNER= Yarkov
$$ C:/Bruker/XWIN-NMR/data/yarkov2/nmr/H-C/1/pdata/1/auditp.txt
$$ ##AUDIT TRAIL=  $$ (NUMBER, WHEN, WHO, WHERE, WHAT)
(   1,<2025-09-29 13:35:16.42 +0400>,<Yarkov>,<DPX200>,
      <created by zg, POWCHK disabled, PULCHK disabled
       configuration hash MD5:
       00 E9 B6 7A A2 85 ED C7 34 08 36 98 17 FE 4E 26
       data hash MD5: 16K
       1F 14 0C A5 D8 06 77 99 95 87 51 AF 3E B4 32 E8>)
(   2,<2025-09-29 13:35:23.84 +0400>,<Yarkov>,<DPX200>,
      <Start of raw data processing
       efp BC_mod = 2 LB = 0.25 FT_mod = 6 PKNL = 1 PHC0 = -2078.854 PHC1 = 16.19097 SI = 16K 
       data hash MD5: 16K
       F3 7B A3 46 42 B8 7E 3C CD 2B CA EA B0 32 B1 BD>)
(   3,<2025-09-29 13:35:28.71 +0400>,<Yarkov>,<DPX200>,
      <abs ABSG = 5 
       data hash MD5: 16K
       15 4B FE 68 39 43 C1 D5 C3 63 52 F1 93 8D 28 2D>)
$$ ##END=
$$ 
$$ hash MD5
$$ 82 E5 6E 25 5E F5 3A E9 9F 94 2F 9F B5 D3 AD B1
##$RELAX= 
##$RELAX= 
##$RELAX= 
##$RELAX= 
##$RELAX= 
##$RELAX= 
$$ Bruker specific parameters
$$ --------------------------
##$DU= <C:/Bruker/XWIN-NMR>
##$EXPNO= 1
##$NAME= <H-C>
##$PROCNO= 1
##$TYPE= <nmr>
##$USER= <yarkov2>
##$AMP= (0..31)
100 100 100 100 100 100 100 100 100 100 100 100 100 100 100 100 100 100 
100 100 100 100 100 100 100 100 100 100 100 100 100 100 
##$AQSEQ= 0
##$AQ_mod= 1
##$AUNM= <au_zg>
##$AUTOPOS= <>
##$BF1= 200.13
##$BF2= 200.13
##$BF3= 200.13
##$BF4= 200.13
##$BF5= 200.13
##$BF6= 200.13
##$BF7= 200.13
##$BF8= 200.13
##$BYTORDA= 1
##$CFDGTYP= 0
##$CFRGTYP= 5
##$CHEMSTR= <none>
##$CNST= (0..31)
1 1 145 1 1 1 1 1 1 1 1 1 1 1 1 1 1 1 1 1 1 1 1 1 1 1 1 1 1 1 1 1 
##$CPDPRG= <>
##$CPDPRG1= <>
##$CPDPRG2= <>
##$CPDPRG3= <>
##$CPDPRG4= <mlev>
##$CPDPRG5= <mlev>
##$CPDPRG6= <mlev>
##$CPDPRG7= <mlev>
##$CPDPRG8= <mlev>
##$CPDPRGB= <>
##$CPDPRGT= <>
##$D= (0..31)
0 0.7 0 0 0 0 0 0 0 0 0 0.03 0 0 0 0 0 0 0 0 0 0 0 0 0 0 0 0 0 0 0 0 
##$DATE= 1759138515
##$DBL= (0..7)
120 120 120 120 120 120 120 120 
##$DBP= (0..7)
150 150 150 150 150 150 150 150 
##$DBP07= 0
##$DBPNAM0= <>
##$DBPNAM1= <>
##$DBPNAM2= <>
##$DBPNAM3= <>
##$DBPNAM4= <>
##$DBPNAM5= <>
##$DBPNAM6= <>
##$DBPNAM7= <>
##$DBPOAL= (0..7)
0.5 0.5 0.5 0.5 0.5 0.5 0.5 0.5 
##$DBPOFFS= (0..7)
0 0 0 0 0 0 0 0 
##$DE= 6
$$ [...]
##$SUBNAM3= <"">
##$SUBNAM4= <"">
##$SUBNAM5= <"">
##$SUBNAM6= <"">
##$SUBNAM7= <"">
##$SUBNAM8= <"">
##$SUBNAM9= <"">
##$SW= 18.0517328524113
##$SWIBOX= (0..15)
0 0 2 0 0 0 0 0 0 0 0 0 0 0 0 0 
##$SW_h= 3612.71676300578
##$TD= 16384
##$TD0= 1
##$TE= 0
##$TE2= 300
##$TE3= 300
##$TEG= 300
##$TL= (0..7)
0 120 120 120 120 120 120 120 
##$TP= (0..7)
150 150 150 150 150 150 150 150 
##$TP07= 0
##$TPNAME0= <>
##$TPNAME1= <>
##$TPNAME2= <>
##$TPNAME3= <>
##$TPNAME4= <>
##$TPNAME5= <>
##$TPNAME6= <>
##$TPNAME7= <>
##$TPOAL= (0..7)
0.5 0.5 0.5 0.5 0.5 0.5 0.5 0.5 
##$TPOFFS= (0..7)
0 0 0 0 0 0 0 0 
##$TUNHIN= 0
##$TUNHOUT= 0
##$TUNXOUT= 0
##$USERA1= <user>
##$USERA2= <user>
##$USERA3= <user>
##$USERA4= <user>
##$USERA5= <user>
##$V9= 5
##$VALIST= <valist>
##$VCLIST= <CCCCCCCCCCCCCCC>
##$VD= 0
##$VDLIST= <DDDDDDDDDDDDDDD>
##$VPLIST= <PPPPPPPPPPPPPPP>
##$VTLIST= <TTTTTTTTTTTTTTT>
##$WBST= 1024
##$WBSW= 4
##$XGAIN= (0..3)
0 0 0 0 
##$XL= 0
##$YL= 0
##$YMAX_a= 408400
##$YMIN_a= -371760
##$ZGOPTNS= <>
##$ZL1= 120
##$ZL2= 120
##$ZL3= 120
##$ZL4= 120
##$ABSF1= 15.48356
##$ABSF2= -2.56829
##$ABSG= 5
##$ABSL= 3
##$ALPHA= 0
##$AQORDER= 0
##$ASSFAC= 0
##$ASSFACI= 0
##$ASSFACX= 0
##$ASSWID= 0
##$AUNMP= <proc_1d>
##$AZFE= 0.1
##$AZFW= 0.1
##$BCFW= 0
##$BC_mod= 2
##$BYTORDP= 0
##$COROFFS= 0
##$CY= -3
##$DATMOD= 1
##$DC= 0
##$DFILT= <>
##$DTYPP= 0
##$F1P= 0
##$F2P= 0
##$FCOR= 1
##$FTSIZE= 16384
##$FT_mod= 6
##$GAMMA= 0
##$GB= 0
##$INTBC= 1
##$INTSCL= 3.241238e-09
##$ISEN= 128
##$LB= 0.25
##$LEV0= 0
##$LPBIN= 0
##$MAXI= 10000
##$MC2= 0
##$MEAN= 0
##$ME_mod= 0
##$MI= 1.114404
##$NCOEF= 0
##$NC_proc= -7
##$NLEV= 6
##$NOISF1= 3.799351
##$NOISF2= 2.8
##$NSP= 0
##$NTH_PI= 0
##$NZP= 0
##$OFFSET= 15.49899
##$PC= 1
##$PHC0= -2078.854
##$PHC1= 16.19097
##$PH_mod= 1
##$PKNL= yes
##$PPARMOD= 0
##$PSCAL= 0
##$PSIGN= 0
##$REVERSE= no
##$SF= 200.130004546353
##$SI= 16384
##$SIGF1= 3
##$SIGF2= 2
##$SINO= 0.751879
##$SIOLD= 32768
##$SREGLST= <19F.Aceton>
##$SSB= 0
##$STSI= 16384
##$STSR= 0
##$SW_p= 3612.71676300578
##$SYMM= 0
##$S_DEV= 0
##$TDeff= 16384
##$TDoff= 0
##$TI= <>
##$TILT= no
##$TM1= 0
##$TM2= 0
##$TOPLEV= 0
##$USERP1= <user>
##$USERP2= <user>
##$USERP3= <user>
##$USERP4= <user>
##$USERP5= <user>
##$WDW= 1
##$XDIM= 16384
##$YMAX_p= 516117396
##$YMIN_p= -398616
$$ End of Bruker specific parameters
$$ ---------------------------------
##NTUPLES= NMR SPECTRUM
##VAR_NAME=  FREQUENCY,     SPECTRUM/REAL,   SPECTRUM/IMAG
##SYMBOL=    X,             R,               I
##VAR_TYPE=  INDEPENDENT,   DEPENDENT,       DEPENDENT
##VAR_FORM=  AFFN,          ASDF,            ASDF
##VAR_DIM=   16384,         16384,           16384
##UNITS=     HZ,            ARBITRARY UNITS, ARBITRARY UNITS
##FACTOR=    0.220516191357247, 1,           1
##FIRST=     3101.81295095132, 0,            0
##LAST=      -510.903812054458, 0,           0
##MIN=       -510.903812054458, -398616,     0
##MAX=       3101.81295095132, 516117396,    0
$$ Real data points
##PAGE= N=1
##DATA TABLE= (X++(R..R)), XYDATA
$$ [...]
6551A752109L818J32379J27776J4144J47078K69025K7484k5580K57335J63700
$$ 1752109 1755927 1888306 2016082 2030226 2177304 2446329 2473813 2448233 2705568 2869268
6541B869268J78915K81777J38171K32649J52970m6789j5775p2458p5029j04290
$$ 2869268 3048183 3329960 3468131 3700780 3853750 3806961 3791186 3718728 3643699 3539409
6531C539409q7905l0864l6817l224P2820k1233R3065J22214J80034J08441J16059
$$ 3539409 3451504 3420640 3383823 3380599 3453419 3432186 3525251 3647465 3827499 3935940 4051999
6520D051999J58925o4687n5129l8138l5653l6311k72895k10459j55034l18129
$$ 4051999 4210924 4146237 4091108 4052970 4017317 3981006 3708111 3497652 3342618 3024489
6510C024489r5943M7989j58798J9911k15685j1849o2964P849j81554j2902m9094
$$ 3024489 2928546 2976535 2817737 2837648 2621963 2610114 2547150 2554999 2373445 2360543 2311449
6499B311449K2736Q2702j57465P0498o0127M8745l6947p5793J05408J57872R7603
$$ 2311449 2334185 2416887 2259422 2329920 2269793 2318538 2281591 2205798 2311206 2469078 2566681
6488B566681M9329o2267L3385o3108m2324o202k00180k17018L7318J13931j52113
$$ 2566681 2616010 2553743 2587128 2524020 2481696 2475494 2275314 2058296 2095614 2209545 2057432
6477B057432j32275n3003p7358R4550M8171N5537q4450j03760k9015K5334o9319
$$ 2057432 1925157 1872154 1794796 1889346 1937517 1993054 1908604 1804844 1775829 1801163 1731844
6466A731844N3073j0442N7713Q4699j60020j16781N4934K6105J07630L2579N072
$$ 1731844 1784917 1774475 1832188 1916887 1756867 1640086 1695020 1721125 1828755 1861334 1866406
6455A866406q7123k9144J3489M2497r5684M742j11714n1771O2483P6473L9160
$$ 1866406 1779283 1750139 1763628 1806125 1710441 1715183 1603469 1551698 1614181 1690654 1729814
6444A729814j81101j33558R9146m5299p5756K0949J34033J03792k55206j569K6506
$$ 1729814 1548713 1415155 1514301 1469002 1393246 1414195 1548228 1652020 1396814 1395245 1421751
6433A421751J8512J04663r4689n6419R7730J4085j34937j25545P8491J02838o2942
$$ 1421751 1440263 1544926 1450237 1393818 1491548 1505633 1370696 1245151 1323642 1426480 1363538
6422A363538j09002r4687N9694O1652J36481J395j1978l1230o8633P9724J0969
$$ 1363538 1254536 1159849 1219543 1281195 1417676 1419071 1407093 1375863 1307230 1386954 1397923
6411A397923q9304P6492N1155Q320n8480L0364L0538j04324l8812M697l4634j9808
$$ 1397923 1308619 1385111 1436266 1444586 1386106 1416470 1447008 1342684 1303872 1308569 1273935 1254127
6399A254127n1475O5696O0902K4517j9641m4653k6615n6713k6486j0136O8337
$$ 1254127 1202652 1268348 1329250 1353767 1334126 1289473 1262858 1206145 1179659 1169523 1237860
6388A237860l927r072J780j3175r9328O6198Q718J0719K2323Q2339j40032R8798
$$ 1237860 1233933 1224861 1226641 1213466 1114138 1180336 1189054 1199773 1222096 1304435 1164403 1263201
6376A263201R7145l5369j24537j1366R2321J49576n2422N3614j13308q0641O7670
$$ 1263201 1360346 1324977 1200440 1189074 1281395 1430971 1378549 1432163 1318855 1238214 1305884
6365A305884P5398m6903K7004K0051m9322R6775N7556n5266M8968N8366L9417
$$ 1305884 1381282 1334379 1361383 1381434 1332112 1428887 1486443 1431177 1480145 1538511 1577928
6354A577928n2370J08665j1966j40234m1531L6814J9298m3661l1429n1387J14020
$$ 1577928 1525558 1634223 1622257 1482023 1440492 1477306 1496604 1452943 1421514 1370127 1484147
6343A484147l7110Q013n7609R2365J7869m2363M218j77941L6175J88012o2579
$$ 1484147 1447037 1455050 1397441 1489806 1507675 1465312 1469530 1291589 1327764 1515776 1453197
6332A453197j29084O1799K4884n4642J04346J12740O3881R5297q7299l7497N1210
$$ 1453197 1324113 1385912 1410796 1356154 1460500 1573240 1637121 1732418 1645119 1607622 1658832
6321A658832k0893L4870P1701n1354n1143K2618j12554M3470k4152L8941j37205
$$ 1658832 1637939 1672809 1744510 1693156 1642013 1664631 1552077 1595547 1571395 1610336 1473131
6310A473131j32711m4841Q9063j00187P8966N9581k3276N1805M9962J7103Q2304
$$ 1473131 1340420 1295579 1384642 1284455 1363421 1423002 1399726 1451531 1501493 1518596 1600900
6299A600900m5381K2867j26876j29295j2709J84142L7654l1664Q4812O1300J8251
$$ 1600900 1555519 1578386 1451510 1322215 1309506 1493648 1531302 1499638 1584450 1645750 1664001
6288A664001j2705J52063m293j25276r5578J08957J6957O6864r2186P3494j37530
$$ 1664001 1651296 1803359 1799066 1673790 1578212 1687169 1704126 1770990 1678804 1752298 1614768
6277A614768l361P6149m0883m9673o6782K81028l3195J7230J61184K9856k6846
$$ 1614768 1611407 1687556 1646673 1597000 1530218 1811246 1778051 1795281 1956465 1986321 1959475
6266A959475L6377k3867L6556J5771k194J64122R105j58295n582J04082L8598
$$ 1959475 1995852 1971985 2008541 2024312 2022118 2186240 2195345 2037050 2031468 2135550 2174148
6255B174148j28390M3488J11579o1011J07508m4295N6729K2704J8320o3161Q5905
$$ 2174148 2045758 2089246 2200825 2139814 2247322 2203027 2259756 2282460 2300780 2237619 2323524
6244B323524J70153M2903O5791R0116J25406R4793K4608m0536P1050Q2124q741
$$ 2323524 2493677 2536580 2602371 2692487 2817893 2912686 2937294 2896758 2967808 3049932 3041191
6233C041191O252o9990k05520N0652J40570o8486j22978R0718J20299m5238J7343
$$ 3041191 3047443 2977453 2771933 2822585 2963155 2894669 2771691 2862409 2982708 2937470 2954813
6222B954813q9304K659J7521M0424q3636r8860k0950j6408n1669k0553K7481J06740
$$ 2954813 2865509 2868168 2885689 2926113 2842477 2743617 2722667 2706259 2654590 2634037 2661518 2768258
6210B768258K5587M7952J29475J5107j23405J15606K6549n3765J8396J00221M3932
$$ 2768258 2793845 2841797 2971272 2986379 2862974 2978580 3005129 2951364 2969760 3069981 3113913
6199C113913P2967M8492k7493Q2073j1778J97023J66279L6633J22807o5605J11151
$$ 3113913 3186880 3235372 3207879 3289952 3278174 3475197 3641476 3678109 3800916 3735311 3846462
6188C846462R0572q3576J41636P5328J05439J72053J53936o2457Q5718R2785M3197
$$ 3846462 3937034 3853458 3995094 4070422 4175861 4347914 4501850 4439393 4525111 4617896 4661093
6177D661093J57979J71381R6825J10451p8226J97115K07005L1626M5466P7591
$$ 4661093 4819072 4990453 5087278 5197729 5119503 5316618 5523623 5555249 5600715 5678306
6167E678306L5022j35L2146l5163J1823Q5661J39983O8164k2097L9185K5159k9220
$$ 5678306 5713328 5713193 5745339 5710176 5721999 5807660 5947643 6015807 5993710 6032895 6058054 6028834
6155F028834J22377M2159j19557J44955o3184J13408Q475J39355J17038J2580
$$ 6028834 6151211 6193370 6073813 6218768 6155584 6268992 6277467 6416822 6533860 6546440
6145F546440Q5947j80425O6318K17224L8631O8602J28443L244J4644j6213O2838
$$ 6546440 6632387 6451962 6518280 6735504 6774135 6842737 6971180 6974424 6989068 6972855 7035693
6134G035693j12471o3880K3771j26736n4505J5932r6619l6445N274L9045k1613
$$ 7035693 6923222 6859342 6883113 6756377 6701872 6717804 6621185 6584740 6590014 6629059 6607446
6123F607446K4500M1125j47027N2691J26627l6311N6683J34013J39605J2845L4975
$$ 6607446 6631946 6673071 6526044 6578735 6705362 6669051 6725734 6859747 6999352 7012197 7047172
6112G047172J57811K4181P0307M4340Q3478J2483J10874L00180L9075Q7717R645
$$ 7047172 7204983 7229164 7299471 7343811 7427289 7439772 7550646 7850826 7889901 7977618 7987263
6101G987263J88568K1721j1775K5298p4855L7138j15810L0176Q8254Q6124P5862
$$ 7987263 8175831 8197552 8185777 8211075 8136220 8173358 8057548 8087724 8175978 8262102 8337964
6090H337964q1082R7599J51479K00107J52819J10499L66150K20766J42335K94800
$$ 8337964 8256882 8354481 8505960 8706067 8858886 8969385 9335535 9556301 9698636 9993436
6080I993436M29718N19486K69791M06548M14064L89780N06574M39802L43672J26951
$$ 9993436 10423154 10942640 11212431 11618979 12033043 12422823 12929397 13369199 13712871 13839822
6070A3839822q2905K06976J99251J92519L10438K96777K38190L35596N12932N12968
$$ 13839822 13756917 13963893 14163144 14355663 14666101 14962878 15201068 15536664 16049596 16562564
6060A6562564N58716P68137R54762J088778J099098J269175J307509J481903J617982
$$ 16562564 17121280 17889417 18844179 19932957 21032055 22301230 23608739 25090642 26708624
6051B6708624J768099K068615K146324K206530K150067J864066J355911R80223
$$ 26708624 28476723 30545338 32691662 34898192 37048259 38912325 40268236 41248459
6043D1248459K67326k37866n51264r31600j281622j235734j120764q98005o92231
$$ 41248459 41515785 41277919 40726655 39795055 38513433 37277699 36156935 35258930 34566699
6034C4566699n59326l70171j1942J53056L11805M17803P25974R34797J009818
$$ 34566699 34007373 33637202 33625260 33778316 34090121 34507924 35233898 36168695 37178513
6025C7178513J318520J361060J694923J857418K113568K396512K816619L042986
$$ 37178513 38497033 39858093 41553016 43410434 45524002 47920514 50737133 53780119
6017E3780119L082412L168862L111003K600386J996454J095960Q0222j073618
$$ 53780119 56862531 60031393 63142396 65742782 67739236 68835196 68915418 67841800
6009F7841800k132997k818449l289008l365297l325596k925988k776581k403172
$$ 67841800 65708803 62890354 59601346 56236049 52910453 49984465 47207884 44804712
6001D4804712k089249j775445j345521j331735r63497p40225p40536n05773m47369
$$ 44804712 42715463 40940018 39594497 38262762 37299265 36559040 35818504 35312731 34865362
5992C4865362j87803j27906N7567L30867N24413P12889R04726R60682J177178
$$ 34865362 34677559 34549653 34607220 34938087 35462500 36175389 37080115 38040797 39217975
5983C9217975J170636J093696O22792J92053n45951r09565j576785j989074k125290
$$ 39217975 40388611 41482307 42105099 42297152 41751201 40841636 39264851 37275777 35150487
5974C5150487k213626k171795j945554j753397j664340j537180j481933j189503
$$ 35150487 32936861 30765066 28819512 27066115 25401775 23864595 22382662 21193159
5966B1193159j156810r10915p15636o91139n48727n08387m73586m15562m32333
$$ 21193159 20036349 19125434 18409798 17718659 17169932 16661545 16187959 15772397 15340064
5957A5340064l84936n21929l57130l17331n20991l91456m90320j96438l74116
$$ 15340064 14955128 14433199 14076069 13758738 13237747 12846291 12355971 12159533 11785417
5948A1785417m43900k44902m55677l45477k65162k30191k08894k45822k19294
$$ 11785417 11341517 11096615 10640938 10295461 10030299 9800108 9591214 9345392 9126098
5939I126098n5516j68622m2983l18597j06846j8362j34064o1911k03253j90984
$$ 9126098 9070582 8901960 8858977 8540380 8433534 8415172 8281108 8219197 8015944 7824960
5929G824960n622Q98M5789m8983r3358K5637p9962j75242j60590l9056J4958k86038
$$ 7824960 7819338 7820236 7866025 7817042 7723684 7749321 7669359 7494117 7333527 7294471 7309429 7023391
5917G023391N6568j1490j88023r8262k7089n0540p5664k7373j06930J3616J10392
$$ 7023391 7079959 7068469 6880446 6782184 6755095 6704555 6628891 6601518 6494588 6508204 6618596
5906F618596O310o706j69362j9025m601M2629P165O5003O5097L1526q126m5548
$$ 6618596 6624906 6618200 6448838 6429813 6425212 6467841 6475006 6540009 6605106 6636632 6628506 6582958
5894F582958j46344P9308p4733j80578p6051N0889j9935o337J8183m7115n0517
$$ 6582958 6436614 6515922 6441189 6260611 6184560 6235449 6215514 6209177 6227360 6180245 6129728
5883F129728j56661n4004J35312M4476j33418k3830p8788K5877o546j18949l4021
$$ 6129728 5973067 5919063 6054375 6098851 5965433 5941603 5862815 5888692 5882146 5763197 5729176
5872E729176Q729j47878J39228N6365j21924j39341J5984r7638n168k8788J19440
$$ 5729176 5737905 5590027 5729255 5785620 5663696 5524355 5540339 5442701 5437533 5408745 5528185
5861E528185O3797R0317j15079l3800q7571j6389N8387j38516r6067N6934k2683
$$ 5528185 5591982 5682299 5567220 5533420 5445849 5429460 5487847 5349331 5253264 5310198 5287515
5850E287515r8007o4369r0900M2215K9213J1498j74716r3913j20125O5485p2419
$$ 5287515 5189508 5125139 5034239 5076454 5105667 5117165 4942449 4848536 4728411 4793896 4721477
5839D721477j27850J0708P1822J1347q878N3640l2953q2042j01860j27237q4922
$$ 4721477 4593627 4604335 4676157 4687504 4678626 4732266 4699313 4617271 4515411 4388174 4303252
5828D303252L9399n9951J11476J14026j83311j771j0803P6912K7253k30261Q8681
$$ 4303252 4342651 4282700 4394176 4508202 4324891 4323120 4312317 4389229 4416482 4186221 4274902
5817D274902n0038L6534L2687l216o2649M8909o0150J78106o3976R6958K7528
$$ 4274902 4224864 4261398 4294085 4290869 4228220 4277129 4216979 4395085 4331109 4428067 4455595
5806D455595J0782O4467j912Q5233j9752O4172K6654l5495p686J02744j6101P1108
$$ 4455595 4466377 4530844 4528932 4614165 4594413 4658585 4685239 4649744 4642058 4744802 4728701 4799809
5794D799809R7487n857q8362L4403j15276q4960L4218J32560O2708q1720J2978
$$ 4799809 4897296 4891439 4803077 4837480 4722204 4637244 4671462 4804022 4866730 4785010 4797988
5783D797988o7804o7237J64250M450q948o2013M2812j07608m8148R9786m3718
$$ 4797988 4730184 4662947 4827197 4831647 4822699 4760686 4803498 4695890 4647742 4747528 4703810
5772D703810m7381J28397O2593O2680k3720P70Q5368J0353M4403R0523R2481O0798
$$ 4703810 4656429 4784826 4847419 4910099 4886379 4887149 4972517 4982870 5027273 5117796 5210277 5271075
5760E271075O0249K34083K05685J36195J69729J03560L3306P0420P8806J3089
$$ 5271075 5331324 5565407 5771092 5907287 6077016 6180576 6213882 6284302 6363108 6376197
5750F376197Q8681J4535j79621l9747M3527m0464j49653N8112k2408N2524P3891
$$ 6376197 6464878 6479413 6299792 6260045 6303572 6263108 6113455 6171567 6149159 6201683 6275574
5739F275574J65194R1587J43055J02931K48142J86800J46473J76042K14627J42189
$$ 6275574 6440768 6532355 6675410 6778341 7026483 7213283 7359756 7535798 7750425 7892614
5729G892614J38795J44997o5844N140p956j33285k78258q5425j64545q3408k94849
$$ 7892614 8031409 8176406 8110562 8115702 8107746 7974461 7696203 7610778 7446233 7362825 7067976
5718G067976q3649K3212p6506m1726Q4023L643q4159L2988r3345J31422J00838
$$ 7067976 6984327 7007539 6931033 6889307 6973330 6976973 6892814 6925802 6832457 6963879 7064717
5707G064717O9664N1990M4253Q4638P4378J5739o1260n6489j97801j7303j72286
$$ 7064717 7134381 7186371 7230624 7315262 7389640 7405379 7344119 7287630 7089829 7072526 6900240
5696F900240k9932j43919q3495j1921j24630r1848N1852q5965J24562L0293j37167
$$ 6900240 6870308 6726389 6642894 6630973 6506343 6414495 6466347 6380382 6504944 6535237 6398070
5685F398070m6148J25958J84252M6706O3846Q6090J09152J08868L9577L1406l4344
$$ 6398070 6351922 6477880 6662132 6708838 6772684 6858774 6967926 7076794 7116371 7147777 7113433
5674G113433J13369O2776o9628L0796J49032R7448O9245L2393J45132Q1838m7451
$$ 7113433 7226802 7289578 7219950 7250746 7399778 7497226 7566471 7598864 7743996 7825834 7778383
5663G778383J26908p80n6106l4103J7179O5526K36394Q9868K32987k1948K59337
$$ 7778383 7905291 7904511 7848405 7814302 7831481 7897007 8133401 8223269 8456256 8434308 8693645
5652H693645K49960K50416J62384J98481L01925J63905J96326J37647J8835L6654
$$ 8693645 8943605 9194021 9356405 9554886 9856811 10020716 10217042 10354689 10373524 10410178
5642A0410178K35630L5616J40428J55587J31912L34713K99113L40570L36235L52697
$$ 10410178 10645808 10681424 10821852 10977439 11109351 11444064 11743177 12083747 12419982 12772679
5632A2772679L75002N31666N14949M31163M15093M70469O16627P53717P95784
$$ 12772679 13147681 13679347 14194296 14625459 15040552 15511021 16127648 16881365 17677149
5623A7677149Q03028R96705J050145J041711J200117J340830J240521J460883
$$ 17677149 18480177 19476882 20527027 21568738 22768855 24109685 25350206 26811089
5615B6811089J494251J447501J508680J651579J760464J888912K201206K568175
$$ 26811089 28305340 29752841 31261521 32913100 34673564 36562476 38763682 41331857
5607D1331857K736620L094847L510421M051673M337820M759319N239547N846188
$$ 41331857 44068477 47163324 50673745 54725418 59063238 63822557 69062104 74908292
5599G4908292O006510N989238O014282O128634N668885N100676M382556L318198
$$ 74908292 80914802 86904040 92918322 99046956 104715841 109816517 114199073 117517271
5591A17517271K015716O48410o99669k151950l270138m180065m621187n038322
$$ 117517271 119532987 120181397 119481728 117329778 114059640 109879575 105258388 100220066
5583A00220066n289475n465323n209280n122268m822507m647920m253774l699962
$$ 100220066 94930591 89465268 84255988 79133720 74311213 69663293 65409519 61709557
5575F1709557l323112k942191k824774k466798k220729j960567j613622j655371
$$ 61709557 58386445 55444254 52619480 50152682 47931953 45971386 44357764 42702393
5567D2702393j323994j273962j215578j140260j088981j132361j009085r27738
$$ 42702393 41378399 40104437 38888859 37748599 36659618 35527257 34518172 33590434
5559C3590434j149374j312374j140361j145427j082180j087533j107378j100652
$$ 33590434 32441060 31128686 29988325 28842898 27760718 26673185 25565807 24465155
5551B4465155j067497j039962r30945q73315q28908p81857q00342o17528o69915
$$ 24465155 23397658 22357696 21426751 20553436 19724528 18942671 18142329 17524801 16854886
5542A6854886p47168o20971m57647m99015n97632l95853n25735m53964l17083
$$ 16854886 16107718 15486747 15029100 14530085 13932453 13536600 13010865 12556901 12239818
5533A2239818k49607l52360m72755j61064l08406j41023l02862l06835j05544
$$ 12239818 11990211 11637851 11165096 11004032 10695626 10554603 10251741 9944906 9839362
5524I839362k59772k87813k76322k55876j81506k22205o2304j64901j81773k52276
$$ 9839362 9579590 9291777 9015455 8759579 8578073 8355868 8293564 8128663 7946890 7694614
5514G694614j85110j83331j14731J1066k12058k31813q5429j95296q4781n611
$$ 7694614 7509504 7326173 7211442 7222508 7010450 6778637 6693208 6497912 6413131 6407520
5504F407520j05041k20729o178p6086j82158L8424K2562j78689j98341j17827
$$ 6407520 6302479 6081750 6075572 5999486 5817328 5855752 5878314 5699625 5501284 5383457
5494E383457J13278P7062r9918k9381j00157r4724l5807O0954j32049j05542J26413
$$ 5383457 5496735 5573797 5473879 5444498 5344341 5249617 5213810 5274764 5142715 5037173 5163586
5483E163586j6303j35769j51151j009r983k6936J7733o5990Q5452p0555K852j96350
$$ 5163586 5147283 5011514 4860363 4859354 4849371 4822435 4840168 4774178 4859630 4789075 4791927 4595577
5471D595577J2078J72275r4144J68518J53962J33718J4803q9053j37001K6108
$$ 4595577 4607655 4779930 4685786 4854304 5008266 5141984 5156787 5067734 4930733 4956841
5461D956841K2112M8290j2011j32452L6207l0480r4610j53499j51483p2339k8329
$$ 4956841 4978953 5027243 5015232 4882780 4918987 4888507 4793897 4640398 4488915 4416576 4388247
5450D388247n7946j26630j20965P1165N7773Q8999Q8278j09120n9738J60752m0412
$$ 4388247 4330301 4203671 4082706 4153871 4211644 4300643 4388921 4279801 4220063 4380815 4340403
5439D340403J57708J35274j4265L2178k7212M4761K22066J79041l3593j33328
$$ 4340403 4498111 4633385 4619120 4651298 4624086 4668847 4890913 5069954 5036361 4903033
5429D903033j18828k5000k0810j25778j26293L9804n7025m8Q258n1399J34813
$$ 4903033 4784205 4759205 4738395 4612617 4486324 4526128 4469103 4469055 4477313 4425914 4560727
5418D560727J24309q3687J40993K06572n6859p034J68351K01356J45658O8575
$$ 4560727 4685036 4601349 4742342 4948914 4892055 4885021 5053372 5254728 5400386 5468961
5408E468961K53180L32331K34385K67770R3379J53205M88462M90131K47852L53791
$$ 5468961 5722141 6054472 6288857 6556627 6650006 6803211 7291673 7781804 8029656 8383447
5398H383447O91818O29310N96130O86311L64218l4229k84671p16027r75713o67443
$$ 8383447 9075265 9704575 10300705 10987016 11351234 11317005 11032334 10316307 9340594 8673151
5388H673151o96860m97737n21591l01322k78173l68688j43467k67370j63202r0279
$$ 8673151 7976291 7478554 6956963 6655641 6377468 6008780 5865313 5597943 5434741 5344462
5378E344462j69403m5827o3336j59995j43158j31075n8237j66688m5726q1356
$$ 5344462 5175059 5129232 5065896 4905901 4762743 4631668 4573431 4406743 4361017 4279661
5368D279661j32670j62733N6095j42922k40026L387J21620j69453j16939J5752
$$ 4279661 4146991 3984258 4040353 3897431 3657405 3660792 3782412 3612959 3496020 3511772
5358C511772k3783J3028Q5644p3672r1351Q8189m9623Q4185j06940l5549m8532
$$ 3511772 3487989 3501017 3586661 3512989 3421638 3509827 3460204 3544389 3437449 3401900 3353368
5347C353368n8114j086k156J9326J00427J2000j29816o114K554J4183j15620J1332
$$ 3353368 3295254 3294168 3292012 3311338 3411765 3423765 3293949 3287835 3290389 3304572 3188952 3200284
5335C200284r5121j3030J22568j21816J6681l2010J37088K7634j72433O4933J3599
$$ 3200284 3105163 3092133 3214701 3092885 3109566 3077556 3214644 3242278 3069845 3134778 3148377
5324C148377O536M4989q2337K1291Q1291k2465Q1907n229r3040l3025j06859M2721
$$ 3148377 3154913 3199902 3117565 3138856 3220147 3197682 3279589 3274360 3181320 3148295 3041436 3084157
5312C084157J12875N2371L0343M6448R0553M0264L8788J74282k6782p6930J08176
$$ 3084157 3197032 3249403 3279746 3326194 3416747 3457011 3495799 3670081 3643299 3566369 3674545
5301C674545P0040l7715l0812J36245j59495K190P3959N8462P1022k5706q966
$$ 3674545 3744585 3706870 3676058 3812303 3652808 3654998 3728957 3787419 3858441 3832735 3823769
5290C823769N7409o3819J34995j4997P6613o7964j70828K6468K4311J0235r664
$$ 3823769 3881178 3817359 3952354 3937357 4013970 3946006 3775178 3801646 3825957 3836192 3826528
5279C826528m300l0435l4877k3253L9437j02838O1239N685l2063p8150p4061m8037
$$ 3826528 3822228 3791793 3756916 3733663 3773100 3670262 3731501 3737186 3705123 3626973 3552912 3504875
5267C504875J28766L8200j9775J00211P6066j04899M0916j27871j03156K3651
$$ 3504875 3633641 3671841 3652066 3752277 3828343 3723444 3764360 3636489 3533333 3556984
5257C556984J61728P061j3670n0784n2341K76526k1749r8945N8738J97331K4296
$$ 3556984 3718712 3725773 3712103 3661319 3608978 3885504 3863755 3764810 3823548 4020879 4045175
5246D045175r8637Q9245M2834q498l6340J12994J04577q303l8012J1828j08916
$$ 4045175 3946538 4035783 4078617 4070119 4033779 4146773 4251350 4243047 4205035 4216863 4107947
5235D107947n4161J18705Q8495R7543k4529J1781O0598L7347j4027M8325K04193
$$ 4107947 4053786 4172491 4260986 4358529 4334000 4345781 4406379 4443726 4429699 4478024 4682217
5224D682217j3267J27411O9992J10871J36291J52159J80744r1769J03737J26777
$$ 4682217 4668950 4796361 4866353 4977224 5113515 5265674 5446418 5354649 5458386 5585163
5214E585163Q0083P1217j48508o8676J35621m2940j07693j81349k911J9853m957
$$ 5585163 5665246 5736463 5587955 5519279 5654900 5611960 5504267 5322918 5320007 5339860 5334903
5203E334903j32436j73684J3319q1243j17419O3944J1398J32097J61783p0065
$$ 5334903 5202467 5028783 5042102 4960859 4843440 4907384 4918782 5050879 5212662 5142597
5193E142597j97321J33819J96610k726K03149P1320m3186l8696M6625l0073K8978
$$ 5142597 4945276 5079095 5275705 5272979 5476128 5547448 5504262 5465566 5512191 5482118 5511096
5182E511096J72526J07373J39435j569p858P3326K22346Q7097J23863P8548K5082
$$ 5511096 5683622 5790995 5930430 5928861 5921003 5994329 6216675 6303772 6427635 6506183 6531265
5171F531265N1186L0042q3680r2305j38648n124q4624j7137q2111q8431k4832
$$ 6531265 6582451 6612493 6528813 6436508 6297860 6292736 6208112 6190975 6108864 6020433 5995601
5160E995601L7875n372o9735K2080Q8498M6194k55557P3446Q7179q5001l7467
$$ 5995601 6033476 6028104 5958369 5980449 6068947 6115141 5859584 5933030 6020209 5935208 5897741
5149E897741j1875O9853N0188J09319K70818N7244L454N3632n5338L2377J27132
$$ 5897741 5885866 5955719 6005907 6115226 6386044 6443288 6446742 6500374 6445036 6477413 6604545
5138F604545K21999K27319Q2116O4827J6834P4379o020J46326K14725n0414J23101
$$ 6604545 6826544 7053863 7135979 7200806 7217640 7292019 7285999 7432325 7647050 7596636 7719737
5127G719737J13105m9095K24281R9741J6963m1344l5996J02857q610k18179m8885
$$ 7719737 7832842 7783747 8008028 8107769 8124732 8083388 8047392 8150249 8141639 7923460 7874575
5116G874575O3678L3546J44734j2564O8073K47596J04244K08927J20738J44012
$$ 7874575 7938253 7971799 8116533 8103969 8172042 8419638 8523882 8732809 8853547 8997559
5106H997559J23156J60768K08309O8000J00643K79896P9740j3070q0542j40702
$$ 8997559 9120715 9281483 9489792 9557792 9658435 9938331 10018071 10005001 9924459 9783757
5096I783757j03542L1961m5107o672q267j60953q7686o270J13414O3540M7683
$$ 9783757 9680215 9712176 9667069 9660397 9652130 9491177 9403491 9397221 9510635 9574175 9621858
5085I621858Q2163R2343J39412j36185j55030J69158J75192L0734l5225j21297
$$ 9621858 9704021 9796364 9935776 9799591 9644561 9813719 9988911 10019645 9984420 9863123
5075I863123j29975L4707J87675m7078n7905P738j51570J41045J23922J7183j6133
$$ 9863123 9733148 9767855 9955530 9908452 9850547 9858285 9706715 9847760 9971682 9988865 9972732
5064I972732J40841K61714m5411j89611M7477p0772K77799k3902j01308J10041
$$ 9972732 10113573 10375287 10329876 10140265 10187742 10116970 10394769 10370867 10269559 10379600
5054A0379600p4969L185j19602J5695j10638M6406J40789m8513j57192j05709
$$ 10379600 10304631 10307816 10188214 10203909 10093271 10139677 10280466 10231953 10074761 9969052
5044I969052J43851j23204J53925q1458p1410Q8864J2268o041J43793K2153p8150
$$ 9969052 10112903 9989699 10143624 10062166 9990756 10079620 10091888 10085847 10229640 10251793 10173643
5033A0173643M3766O8788J90326J87258R4448J64735J58687O4461P5947P0384
$$ 10173643 10217409 10286197 10476523 10663781 10758229 10922964 11081651 11146112 11222059 11292443
5023A1292443K05458k0658Q7939J64787K14900Q7510J04010J46622l0014Q470
$$ 11292443 11497901 11477243 11565182 11729969 11944869 12032379 12136389 12283011 12252997 12261467
5013A2261467K63826J65909J41592K18298K88456J50410K60853K13507J29264
$$ 12261467 12525293 12691202 12832794 13051092 13339548 13489958 13750811 13964318 14093582
5004A4093582J78262L61377K93968R1044L45591M84575L57335M09282M15835M00770
$$ 14093582 14271844 14633221 14927189 15018233 15363824 15848399 16205734 16615016 17030851 17431621
4994A7431621M80460N40278N51983M57728N27926N09396N42312N50102P54017
$$ 17431621 17912081 18452359 19004342 19462070 19989996 20499392 21041704 21591806 22345823
4985B2345823Q11006Q33878R35241R77531J034452J146283J007262J402426J470465
$$ 22345823 23156829 23990707 24925948 25903479 26937931 28084214 29091476 30493902 31964367
4976C1964367J696651J726334J601936J841151K088966K313250K604702K763852
$$ 31964367 33661018 35387352 36989288 38830439 40919405 43232655 45837357 48601209
4968D8601209K888329K857115K948995K712517K103490J763773J293384P06436
$$ 48601209 51489538 54346653 57295648 60008165 62111655 63875428 65168812 65875248
4960F5875248J76893k72026l23418m46065m62459r8767r4969J65707M20117N59705
$$ 65875248 66052141 65780115 65456697 65010632 64548173 64449406 64354437 64520144 64940261 65499966
4950F5499966Q28567J179572J263015J511983J888612K177934K523795K856459
$$ 65499966 66328533 67508105 68771120 70283103 72171715 74349649 76873444 79729903
4942G9729903L193572L472165M010501M701555N040011N416574N728531N831018
$$ 79729903 82923475 86395640 90406141 95107696 100147707 105564281 111292812 117123830
4934A17123830N826219N406378M764184L539113K122380R91803k80205j160747
$$ 117123830 122950049 128356427 133120611 136659724 138782104 139773907 139493702 138332955
4926A38332955j757119j894984j690044j354479o66035k20372M1224N27272O69373
$$ 138332955 136575836 134680852 132990808 131636329 130970294 130749922 130791146 131318418 131987791
4917A31987791J070752J197579J172784J060905Q65202Q34322R19209Q71840J039275
$$ 131987791 133058543 134256122 135428906 136489811 137355013 138189335 139108544 139980384 141019659
4908A41019659J179296J575105J789204J999451K048357K102674J798034J001474
$$ 141019659 142198955 143774060 145563264 147562715 149611072 151713746 153511780 154513254
4900A54513254k4138j069372k231717l563778m555383n193215n441080n177305
$$ 154513254 154489116 153419744 151188027 147624249 143068866 137875651 132434571 127257266
4892A27257266m760252m106641l435771k625093j809179j254328q73209p83726
$$ 127257266 122497014 118390373 114954602 112329509 110520330 109266002 108392793 107609067
4884A07609067j004712j633206k182573k952914l532250m186548m143181m004426
$$ 107609067 106604355 104971149 102788576 99835662 96303412 92116864 87973683 83969257
4876H3969257l764505l255655k952147k552520k036018j809380j512722j171344
$$ 83969257 80204752 76949097 73996950 71444430 69408412 67599032 66086310 64914966
4868F4914966q33227q28873p14818o94159q68271r21659r27308j112155j208906
$$ 64914966 64081739 63252866 62538048 61843889 60975618 60053959 59126651 58014496 56805590
4859E6805590j145429j358792j310770j361220j405278j339675j226809r94198
$$ 56805590 55660161 54301369 52990599 51629379 50224101 48884426 47657617 46663419
4851D6663419p23676o39362n45688n50517l25728l17116k62757l67513k83813
$$ 46663419 45939743 45300381 44754693 44204176 43878448 43561332 43298575 42931062 42647249
4842D2647249j84812m70768l96088l95794j49210l56395k78349k40288l08494
$$ 42647249 42462437 41991669 41595581 41199787 41050577 40694182 40415833 40175545 39867051
4833C9867051m52899m58215n44845q18300p03480o70601p49491r08359r46863
$$ 39867051 39414152 38955937 38411092 37592792 36889312 36218711 35469220 34560861 33613998
4824C3613998r83457q21719r56481j022310q97861r78429p49643p03200p43157
$$ 33613998 32630541 31808822 30852341 29830031 28932170 27953741 27204098 26500898 25757741
4815B5757741o18084n97384o97950m25036m25311o61664n10485l66577k24246
$$ 25757741 25139657 24542273 23844323 23419287 22993976 22332312 21821827 21455250 21231004
4806B1231004l05792m08432k53912k90181k00793l11327p8864j88964q7189k75562
$$ 21231004 20925212 20516780 20262868 19972687 19771894 19460567 19381703 19192739 19105550 18829988
4796A8829988j12480p4796m8624k0533j36018j2237K807J36101l4204J2087O7442
$$ 18829988 18717508 18642712 18594088 18573555 18437537 18425300 18428107 18564208 18530004 18542091 18609533
4785A8609533R0569K10078J97621j25414q2033k92684j93514j89498j02608o8327
$$ 18609533 18700102 18910180 19107801 18982387 18900354 18607670 18414156 18224658 18122050 18053723
4775A8053723j23140j43675k39317j58368J51833q6964j83712q715Q236j4195
$$ 18053723 17930583 17786908 17547591 17389223 17541056 17454092 17270380 17261665 17269901 17255706
4765A7255706J41779J3318n4927J0662n6276k2426q4414r5622r8221L5380J5862
$$ 17255706 17397485 17410803 17355876 17366538 17310262 17287836 17203422 17107800 17009579 17044959 17060821
4754A7060821j38137j57534l9787j09514Q0661P9819n4955r0403m2908J57619
$$ 17060821 16922684 16765150 16725363 16615849 16696510 16776329 16721374 16630971 16588063 16745682
4744A6745682O4466l6611O2571p9994k6479Q2002O1296K0396n0708L7003J20133
$$ 16745682 16810148 16773537 16836108 16756114 16729635 16811637 16872933 16893329 16842621 16879624 16999757
4733A6999757O0190o6946n6758R515K1710J0808J4600P555J0523K1873k9450j369
$$ 16999757 17059947 16993001 16936243 16945758 16967468 16978276 16992876 17000431 17010954 17032827 17003377 17002008
4721A7002008K695o3303j4214j15100j9325R045N3038L7617r1499J70754j3372
$$ 17002008 17004703 16941400 16927186 16812086 16792761 16801806 16854844 16892461 16800962 16971716 16958344
4710A6958344j62155J26083J19698J31619J66373J79883N3784R6670J16722J97971
$$ 16958344 16796189 16922272 17041970 17173589 17339962 17519845 17573629 17670299 17787021 17984992
4700A7984992J49500K30118J1113J49156P4503J03742M9230N9452K36187K98655
$$ 17984992 18134492 18364610 18375723 18524879 18599382 18703124 18752354 18811806 19047993 19346648
4690A9346648J01360J43058L51617K18494L65624J19674L79568M50176L70206
$$ 19346648 19448008 19591066 19942683 20161177 20526801 20646475 21026043 21476219 21846425
4681B1846425N60574M74789M05634M19630N01907N55972N76179N16126O01593
$$ 21846425 22406999 22881788 23287422 23707052 24208959 24764931 25341110 25857236 26458829
4672B6458829P16412O86166P43348P63041Q22203Q64561R32466Q91629J049758
$$ 26458829 27175241 27861407 28604755 29367796 30189999 31054560 31987026 32878655 33928413
4663C3928413Q99491R47672J165030J346449J361325J484289J661101J857031
$$ 33928413 34827904 35775576 36940606 38287055 39648380 41132669 42793770 44650801
4655D4650801K115488K330798K689466L022620L354019L534945L931082M171351
$$ 44650801 46766289 49097087 51786553 54809173 58163192 61698137 65629219 69800570
4647F9800570M311413M608568N201375N711039O522584P650498Q871696J0568367
$$ 69800570 74111983 78720551 83921926 89632965 96155549 103806047 112677743 123246110
4639A23246110J2531772J4017081J5137727J5569372J5170893J3455261R606059
$$ 123246110 135777882 149794963 164932690 180502062 195672955 209128216 218734275
4632B18734275L999340j337750o071591j0462920j3300837j3790180j2936664
$$ 218734275 222733615 221395865 215324274 204861354 191560517 177770337 164833673
4625A64833673j1860772j0616813r738398q442028p279043o233021n266093m286893
$$ 164833673 152972901 142356088 132617690 124175662 116896619 110663598 105397505 101110612
4617A01110612l434351k939405k622228k248194k394566k747049l147078l477889
$$ 101110612 97676261 94736856 92114628 89866434 87471868 84724819 81577741 78099852
4609G8099852m038867l940557l812819l466238k924908k823973k679757k503450
$$ 78099852 74060985 70120428 66307609 62841371 59916463 57092490 54412733 51909283
4601E1909283k277808j955913j841690j674716j577419j520111j316246j267597
$$ 51909283 49631475 47675562 45833872 44159156 42581737 41061626 39745380 38477783
4593C8477783j257071j236675j223615j124884j103329j086385r96797o91722
$$ 38477783 37220712 35984037 34760422 33635538 32532209 31445824 30449027 29757305
4585B9757305p86495p43059o48117p19643p31663o29612n24997n48210m85221
$$ 29757305 28970810 28227751 27579634 26859991 26128328 25498716 24973719 24425509 23940288
4576B3940288m68173k66851k33252m16218l31517l06849j6869j42580k67382j99249
$$ 23940288 23472115 23205264 22972012 22555794 22224277 21917428 21900559 21757979 21490597 21291348
4566B1291348l10587k68471j50673k28506k02528Q6404j90372q2596j40537k45917
$$ 21291348 20980761 20712290 20561617 20333111 20130583 20216987 20026615 19944019 19803482 19557565
4556A9557565k78716q4767j12366j45371j25664q5563j35790R3716N0357j33950
$$ 19557565 19278849 19194082 19081716 18936345 18810681 18725118 18589328 18683044 18733401 18599451
4546A8599451k20921o5071m8007r0397q5412j00909J87315R7840l7000N5094K25413
$$ 18599451 18378530 18313459 18265452 18175055 18089643 17988734 18176049 18273889 18236889 18291983 18517396
4535A8517396K44658L29102N75194M04369K95727K19521K76696Q8420m494l8600
$$ 18517396 18762054 19091156 19666350 20070719 20366446 20585967 20862663 20951083 20946589 20907989
4525B0907989k3890P3659J98256K39054L29060J95688L24455M04219J90445K34546
$$ 20907989 20884099 20957758 21156014 21395068 21724128 21919816 22244271 22648490 22838935 23073481
4515B3073481J38966J49572K95917J98193K65811K27998Q2900J11220o9996j35301
$$ 23073481 23212447 23362019 23657936 23856129 24121940 24349938 24432838 24544058 24474062 24338761
4505B4338761j40774j51345j81487k90986k64280k21525j28406k81080j4480J5570
$$ 24338761 24197987 24046642 23865155 23574169 23309889 23088364 22959958 22678878 22664398 22679968
4495B2679968l9371l432N7272J30151K99093L42380M36530M93381O92066N57421
$$ 22679968 22640597 22637165 22694437 22824588 23123681 23466061 23902591 24395972 25088038 25645459
4485B5645459N79608O37056K13312n6925k68668o55140r16665q69305j099262
$$ 25645459 26225067 26862123 27075435 27018510 26749842 26094702 25178037 24308732 23209470
4476B3209470q14885q82465p96703o62599n54094o52007n21660m35009m19988
$$ 23209470 22394585 21512120 20715417 20052818 19498724 18846717 18325057 17890048 17470060
4467A7470060l74018m70782m02037k57240k37841j26600l54491k96322j54608
$$ 17470060 17096042 16625260 16223223 15965983 15728142 15601542 15247051 14950729 14796121
4458A4796121k72502k54415j6407j80938l68242p3191R8702K1953R729j43451
$$ 14796121 14523619 14269204 14252797 14071859 13703617 13630426 13729128 13751081 13760810 13617359
4448A3617359n8750j64656j19720m7416J4097k3969j03853J0613J0591k90190
$$ 13617359 13558609 13393953 13274233 13226817 13240914 13216945 13113092 13123705 13134296 12844106
4438A2844106j17442p3956J785L640m6864j51949J16967N504k6844J29584j01231
$$ 12844106 12726664 12652708 12654493 12658133 12611269 12459320 12576287 12581791 12554947 12684531 12583300
4427A2583300j40685J24500L9662n8306J24325j54003j678j987J06599j13353
$$ 12583300 12442615 12567115 12606777 12548471 12672796 12518793 12517115 12515128 12621727 12508374
4417A2508374j52746L6867n1906j13111l6575p8857J4701O2086o0257P1574J43161
$$ 12508374 12355628 12392495 12340589 12227478 12190903 12112046 12126747 12188833 12128576 12200150 12343311
4406A2343311n1250J25357P4628N4514m2906l8824j46781k5781K20331p1677k96516
$$ 12343311 12292061 12417418 12492046 12546560 12503654 12464830 12318049 12292268 12512599 12440922 12144406
4395A2144406N5375J10339P7425P2869O9445j6919J73187k8048k4826L0955j68844
$$ 12144406 12199781 12310120 12387545 12460414 12529859 12512940 12686127 12658079 12633253 12664208 12495364
4384A2495364j33542n6670p0510j30568O8886j08109O2661r1706M0860Q6005R7133
$$ 12495364 12361822 12305152 12234642 12104074 12172960 12064851 12127512 12035806 12076666 12162671 12259804
4373A2259804K6107k2210K28832J37131J24688J39804Q6494J7372l0177R9112
$$ 12259804 12285911 12263701 12492533 12629664 12754352 12894156 12980650 12998022 12967845 13066957
4363A3066957J18099J1337J5394K04194K26612K5939O4696K88345J61335J81181
$$ 13066957 13185056 13196393 13211787 13415981 13642593 13668532 13733228 14021573 14182908 14364089
4353A4364089K91691L8704P0993K13024P8910j1304J1878k05719o1562j13114
$$ 14364089 14655780 14694484 14765477 14978501 15057411 15046107 15057985 14852266 14790704 14677590
4343A4677590k03570j58617j73961k72803j05495k83372j01227r0165k02980p5489
$$ 14677590 14474020 14315403 14141442 13868639 13763144 13479772 13378545 13288380 13085400 13009911
4333A3009911k16351j07829J8970r2171j48908j20731j82316k67918j80061M6351
$$ 13009911 12793560 12685731 12704701 12612530 12463622 12342891 12160575 11892657 11712596 11758947
4323A1758947j14767j79259j65480k22386j00630M6158p1334q3679r7619m6608
$$ 11758947 11644180 11464921 11299441 11077055 10976425 11022583 10951249 10867570 10769951 10723343
4313A0723343O4394p6348p3694Q6446Q814n0876j5835j94771k8514J29904P399
$$ 10723343 10787737 10711389 10637695 10724141 10732955 10682079 10666244 10471473 10442959 10572863 10580262
4302A0580262l7759j04175J05815l6846r9481K6436J65470k3458J19575K5759
$$ 10580262 10542503 10438328 10544143 10507297 10407816 10434252 10599722 10576264 10695839 10721598
4292A0721598Q8871J4524R836J0896Q0010O3391J00254O0891L7541J25269Q1050
$$ 10721598 10810469 10824993 10834829 10845725 10925735 10989126 11089380 11150271 11187812 11313081 11394131
4281A1394131O8441J23396J83271L9380o9240P5375K1000P7397R8637O2280J30254
$$ 11394131 11462572 11585968 11769239 11808619 11739379 11814754 11835754 11913151 12011788 12074068 12204322
4270A2204322r845J60457J42704N9800r032J35739J29178J5099J70056J63734
$$ 12204322 12194477 12354934 12497638 12557438 12548406 12684145 12813323 12828422 12998478 13162212
4260A3162212L4599K28318N9929J46509J68320J13837R9261K53892K32320K38973
$$ 13162212 13196811 13425129 13485058 13631567 13799887 13913724 14012985 14266877 14499197 14738170
4250A4738170J34676J40466J17503K06089K08603K13755J42609J79076K59119
$$ 14738170 14872846 15013312 15130815 15336904 15545507 15759262 15901871 16080947 16340066
4241A6340066L61617J73671J3653L66947K57253J49697M09582L83234M03589L16387
$$ 16340066 16701683 16875354 16889007 17255954 17513207 17662904 18072486 18455720 18859309 19175696
4231A9175696L15569M28802M23730M68391N02946L85383O39267O87931P17162
$$ 19175696 19491265 19920067 20343797 20812188 21315134 21700517 22339784 23027715 23744877
4222B3744877O31122P21022Q13359Q34312Q68448R11817J067207J214079J244188
$$ 23744877 24375999 25097021 25910380 26744692 27613140 28524957 29592164 30806243 32050431
4213C2050431J415973J470984J411409J554696J748109J945708K008115K089428
$$ 32050431 33466404 34937388 36348797 37903493 39651602 41597310 43605425 45694853
4205D5694853K146015K446696K510916K581326K692760L026305K853105L077350
$$ 45694853 47840868 50287564 52798480 55379806 58072566 61098871 63951976 67029326
4197F7029326L232902L418749L340110L624897L731169L868342M013230M098180
$$ 67029326 70262228 73680977 77021087 80645984 84377153 88245495 92258725 96356905
4189I6356905M213724M379922M453977M391500M350018M308099M218233M273713
$$ 96356905 100570629 104950551 109404528 113796028 118146046 122454145 126672378 130946091
4181A30946091M040917M072963M179693M001150L886465L815386L828210L574718
$$ 130946091 134987008 139059971 143239664 147240814 151127279 154942665 158770875 162345593
4173A62345593L480871L329817L010435K648530K445029K000769J692357J410852
$$ 162345593 165826464 169156281 172166716 174815246 177260275 179261044 180953401 182364253
4165A82364253J031829P47985O28417M88241K42733j50935l78590o96349j093774
$$ 182364253 183396082 184144067 184772484 185260725 185503458 185352523 184973933 184277584 183183810
4156A83183810j426561j840996k193485k503092k828003l045626l000082l261263
$$ 183183810 181757249 179916253 177722768 175219676 172391673 169346047 166345965 163084702
4148A63084702l487217l381819l458080l756996l881078l856410l943197m142983
$$ 163084702 159597485 156215666 152757586 149000590 145119512 141263102 137319905 133176922
4140A33176922m149976m317317m304005m475427m456279m485959m333706m227700
$$ 133176922 129026946 124709629 120405624 115930197 111473918 106987959 102654253 98426553
4132I8426553m109479l878832l818008l693819l722849l540347l313593l298597
$$ 98426553 94317074 90438242 86620234 82926415 79203566 75663219 72349626 69051029
4124F9051029l154929k975269k918884k738044k669375k362500k206757k344745
$$ 69051029 65896100 62920831 60001947 57263903 54594528 52232028 50025271 47680526
4116D7680526k172193j918299j851024j595320j678610j642733j268513j283928
$$ 47680526 45508333 43590034 41739010 40143690 38465080 36822347 35553834 34269906
4108C4269906j252028j096604j127089r79130q34430o62003p54495p07312p00399
$$ 34269906 33017878 31921274 30794185 29815055 28980625 28318622 27564127 26856815 26156416
4099B6156416o63457o00238m21040m49255l61136m67604l99502l63097l10326
$$ 26156416 25492959 24892721 24471681 24022426 23661290 23193686 22794184 22431087 22120761
4090B2120761l28578r7749k11645k99541l27371k73766k18800r5290j06616k92100
$$ 22120761 21792183 21694434 21482789 21183248 20855877 20582111 20363311 20268021 20161405 19869305
4080A9869305n7021j07920j42768l32037j70214j14908j53292j19808k73874p0502
$$ 19869305 19812284 19704364 19561596 19229559 19059345 18944437 18791145 18671337 18397463 18326961
4070A8326961j48155k94432j86135k3675j07786k22574j97921j17944j47804j98315
$$ 18326961 18178806 17884374 17698239 17674564 17566778 17344204 17146283 17028339 16880535 16682220
4060A6682220k06120j85855j99104M0375l3267j57306j02823j20856j35066j54441
$$ 16682220 16476100 16290245 16091141 16131516 16098249 15940943 15838120 15717264 15582198 15427757
4050A5427757m9621o6726k602K1287l3954j51084J0035M441K2655q6186M3301
$$ 15427757 15378136 15311410 15308808 15330095 15296141 15145057 15155092 15159533 15182188 15096002 15139303
4039A5139303J5941l2196M909K1837q5117l8078m5961K11556J0633p1802m8960
$$ 15139303 15155244 15123048 15127957 15149794 15064677 15026599 14980638 15192194 15202827 15131025 15082065
4028A5082065l5587K1461o6484p3986o437J03894m6183r5221p969l6369R3934
$$ 15082065 15046478 15067939 15001455 14927469 14921032 15024926 14978743 14883522 14875553 14839184 14933118
4017A4933118l2855k2971K4398o9143j3124J1066m4208N2786L0488J4907j7885
$$ 14933118 14900263 14877292 14901690 14832547 14819423 14830489 14786281 14839067 14869555 14884462 14866577
4006A4866577K04105Q8451j26225J50959J84336j07011l9024K08169k8861L6195
$$ 14866577 15070682 15159133 15032908 15183867 15368203 15261192 15222168 15430337 15401476 15437671
3996A5437671K03893m7384j208R7528O5060Q9833j6298K1656J44128J46254l5389
$$ 15437671 15641564 15594180 15592972 15690500 15755560 15845393 15829095 15850751 15994879 16141133 16105744
3985A6105744O5443J13838J06330Q3473O7452P5023J40581L1264P5805R1176J53412
$$ 16105744 16171187 16285025 16391355 16474828 16542280 16617303 16757884 16789148 16864953 16956129 17109541
3974A7109541j8809J72867K31675J58420L5696j1203O4942P013p9313j80638j0571
$$ 17109541 17090732 17263599 17495274 17653694 17689390 17678187 17743129 17750142 17670829 17490191 17479620
3963A7479620k4090K5797k9745r765n6149r982Q2462J23011j41337j95333N9175
$$ 17479620 17455530 17481327 17451582 17441817 17385668 17375686 17458148 17581159 17439822 17244489 17303664
3952A7303664p4731L6585n7183L1773P6910p592K3152M8655J23830K3623J96302
$$ 17303664 17228933 17265518 17208335 17240108 17317018 17309426 17332578 17381233 17505063 17528686 17724988
3941A7724988K28236J05507J32016O3720K33819K28084K54714K04353K99197K95445
$$ 17724988 17953224 18058731 18190747 18254467 18488286 18716370 18971084 19175437 19474634 19770079
3931A9770079J71718K47925K99132L11771M33702J59935K46483M25873K65948
$$ 19770079 19941797 20189722 20488854 20800625 21234327 21394262 21640745 22066618 22332566
3922B2332566K65746L54326L09477L47303L15614K82057J50816L07203M64671
$$ 22332566 22598312 22952638 23262115 23609418 23925032 24207089 24357905 24665108 25129779
3913B5129779K47619K47382J79355J98309K59795K26792K18350K63226J11306
$$ 25129779 25377398 25624780 25804135 26002444 26262239 26489031 26707381 26970607 27081913
3904B7081913J62117N670J74831J76301K76398J84745O5347J94958J34587R7755
$$ 27081913 27244030 27249700 27424531 27600832 27877230 28061975 28127322 28322280 28456867 28554622
3894B8554622K95684K83443R9220J61707L13517O58963M08199L39693M88154M75204
$$ 28554622 28850306 29133749 29232969 29394676 29708193 30367156 30775355 31115048 31603202 32078406
3884C2078406N44776N28719N39024M48168P68054P36821O61415N76676N75237
$$ 32078406 32623182 33151901 33690925 34139093 34907147 35643968 36305383 36882059 37457296
3875C7457296O85926O16821P97318R12534Q78879R05141J027648J110721J118252
$$ 37457296 38143222 38760043 39557361 40469895 41348774 42253915 43281563 44392284 45510536
3866D5510536J309480J477971J465730J560550J448959J497461J512346J450597
$$ 45510536 46820016 48297987 49763717 51324267 52773226 54270687 55783033 57233630
3858E7233630J736642J638430J782080J717973J750284J808233J918608J896502
$$ 57233630 58970272 60608702 62390782 64108755 65859039 67667272 69585880 71482382
3850G1482382J780041J790597J751476J630417J409617J504754J329906J164939
$$ 71482382 73262423 75053020 76804496 78434913 79844530 81349284 82679190 83844129
3842H3844129J149813R91499Q49844O37449O40240M79210M64730K57675L35827
$$ 83844129 84993942 85985441 86835285 87472734 88112974 88592184 89056914 89314589 89650416
3833H9650416K99692L6355N2088J48785P6002q1216P1856J45560L92179M58166
$$ 89650416 89950108 89986463 90038551 90187336 90263338 90182122 90253978 90399538 90791717 91249883
3823I1249883N23536O97961R03110J183524J481418J558231J910725K190792K615123
$$ 91249883 91773419 92471380 93374490 94558014 96039432 97597663 99508388 101699180 104314303
3814A04314303K829461L260025L646711L997519M376354M860689N208567N582280
$$ 104314303 107143764 110403789 114050500 118048019 122424373 127285062 132493629 138075909
3806A38075909N820893O061070O452156O830046O942681P294096P390628P599584
$$ 138075909 143896802 149957872 156410028 163240074 170182755 177476851 184867479 192467063
3798A92467063P939204P963505Q031741Q137339Q335106Q292776P907852P864359
$$ 192467063 200406267 208369772 216401513 224538852 232873958 241166734 249074586 256938945
3790B56938945P688220P390077P092408O817451O652850O231833N869097N636239
$$ 256938945 264627165 272017242 279109650 285927101 292579951 298811784 304680881 310317120
3782C10317120N222739M487891M052762L692578L226945K578919K219581K121168
$$ 310317120 315539859 320027750 324080512 327773090 331000035 333578954 335798535 337919703
3774C37919703J832181J701807J628858J657274J602329J653331J867174J849904
$$ 337919703 339751884 341453691 343082549 344739823 346342152 347995483 349862657 351712561
3766C51712561K071095K377915K618160K915264L431843M144158N021328N824751
$$ 351712561 353783656 356161571 358779731 361694995 365126838 369270996 374292324 380117075
3758C80117075O953390Q013906R317484J0928169J2168613J3146941J3604974
$$ 380117075 387070465 395084371 404401855 415330024 427498637 440645578 454250552
3751D54250552J3607883J2849448J1374121R403364P084337M514740K458136N74815
$$ 454250552 467858435 480707883 492082004 501485368 508569705 513084445 515542581 516117396
3743E16117396n50054j299108j768148j548471j352455j156141j322157j920562
$$ 516117396 515567342 514268234 512500086 510951615 509599160 508443019 507120862 505200300
3735E05200300k913251m187496n944796p347215q478998r384356r651870q909728
$$ 505200300 502287049 498099553 492154757 484807542 476328544 466944188 457292318 448382590
3727D48382590q169071o657034n145875m020441k578320j622586j429783j689563
$$ 448382590 440213519 433556485 428410610 424390169 421811849 420189263 418759480 417069917
3719D17069917k244312k683648l408599m274671m891378n081361m938337n047118
$$ 417069917 414825605 412141957 408733358 404458687 399567309 394485948 389547611 384500493
3711C84500493m961235m605808m908607n309959n776871o743898q020651r250605
$$ 384500493 379539258 374933450 370024843 364714884 358938013 352194115 344173464 334922859
3703C34922859j0767435j1932162j2891068j3508142j3768856j3753236j3282062
$$ 334922859 324155424 312223262 299332194 285824052 272055196 258301960 245019898
3696B45019898j2510953j1732553j0961013j0109825r236460q397173p732931
$$ 245019898 232508945 220776392 209815379 199705554 190469094 182071921 174338990
3689A74338990p256171o669778o144121n875286n533614n037966m768810m677439
$$ 174338990 167082819 160413041 154268920 148393634 142860020 137822054 133053244 128375805
3681A28375805m362754m224804l892638l789546l644385l438551l226797l193946
$$ 128375805 124013051 119788247 115895609 112106063 108461678 105023127 101796330 98602384
3673I8602384k920960k685488k504527k625429k465393k410641k462748k368223
$$ 98602384 95681424 92995936 90491409 87865980 85400587 82989946 80527198 78158975
3665G8158975k274616k135229k002181j913469j922515j822684j761562j680036
$$ 78158975 75884359 73749130 71746949 69833480 67910965 66088281 64326719 62646683
3657F2646683j468140j602520j391548j247574j343563j219315j153263j102645
$$ 62646683 61178543 59576023 58184475 56936901 55593338 54374023 53220760 52118115
3649E2118115j214074r56102r21833q65936q93086j004262q86793o82252p85496
$$ 52118115 50904041 49947939 49026106 48160170 47267084 46262822 45376029 44693777 43908281
3640D3908281p06332n62203o25704o86551n49538n98696o36416n59056n98651
$$ 43908281 43201949 42639746 42014042 41327491 40777953 40179257 39542841 38983785 38385134
3631C8385134l08737m98195n16125k96834l78166n42122m11714m53074m29713
$$ 38385134 38076397 37578202 37062077 36765243 36387077 35844955 35433241 34980167 34550454
3622C4550454m07337m19047l41880m03636n19186l12672l96700n10337l11045
$$ 34550454 34143117 33724070 33382190 32978554 32459368 32146696 31749996 31239659 30928614
3613C0928614j48122m49599l52451l13153l46985k73392m39252k36100k88146
$$ 30928614 30780492 30330893 29978442 29665289 29318304 29044912 28605660 28369560 28081414
3604B8081414m83911k57746k21524l42799k97584l00520l00565l35933k83653
$$ 28081414 27597503 27339757 27118233 26775434 26477850 26177330 25876765 25540832 25257179
3595B5257179k84644l01035k34372l71016k10444j10229j88388j32979l66863
$$ 25257179 24972535 24671500 24437128 24066112 23855668 23745439 23557051 23424072 23057209
3586B3057209l33150l75462l85427k26665j26937j60372k50157j11173k56829
$$ 23057209 22724059 22348597 21963170 21736505 21609568 21449196 21199039 21087866 20831037
3577B0831037j73003k70301k44338p9605j37693k19096k93317j56489j47542r4808
$$ 20831037 20658034 20387733 20143395 20063790 19926097 19707001 19413684 19257195 19109653 19014845
3567A9014845q8731j83628k89523j03871j52089r1816j47678j01203j32870k37139
$$ 19014845 18926114 18742486 18452963 18349092 18197003 18105187 17957509 17856306 17723436 17486297
3557A7486297k37932q9344k106k08890j66213q6189j29833k93410j60671r1560
$$ 17486297 17248365 17159021 17156915 16948025 16781812 16695623 16565790 16272380 16111709 16020149
3547A6020149j80118l1819j10896j97394k18784j58858o2360J26432j40371j26478
$$ 16020149 15840031 15808212 15697316 15499922 15281138 15122280 15059920 15186352 15045981 14919503
3537A4919503j83278j14640j12075q678j46148j39916j2619j80162r19O166j91471
$$ 14919503 14736225 14621585 14509510 14500832 14354684 14214768 14202149 14021987 14021068 14027234 13835763
3526A3835763j8773k2806j62761n2283P739j2967o6455l6480p9612r2827Q2126
$$ 13835763 13816990 13794184 13631423 13579140 13586879 13573912 13507457 13470977 13391365 13298538 13380664
3515A3380664J53333n1886O5751j22700j05993k7701O4599n6876o9920N8396J21513
$$ 13380664 13533997 13482111 13547862 13425162 13319169 13291468 13356067 13299191 13229271 13287667 13409180
3504A3409180K1173m5048k2357o274J93391m2344M7096O308J63528L1536j35549
$$ 13409180 13430353 13385305 13362948 13356674 13550065 13507721 13554817 13561125 13724653 13756189 13620640
3493A3620640R9786J22052O1092P0973J55690J57693J21032J32224J49733K26244
$$ 13620640 13720426 13842478 13903570 13974543 14130233 14287926 14408958 14541182 14690915 14917159
3483A4917159L21887J75392K24410L60606L54926L02520K62050L09789L97343
$$ 14917159 15239046 15414438 15638848 15999454 16354380 16656900 16918950 17228739 17626082
3474A7626082L52515M60914M27214L40928M11156L92081L35003L87190L35247
$$ 17626082 17978597 18439511 18866725 19207653 19618809 20010890 20345893 20733083 21068330
3465B1068330N12519L79889L27038K36509Q3725J54234J94377J8855K453l6013
$$ 21068330 21580849 21960738 22287776 22524285 22608010 22762244 22956621 22975476 22977929 22941916
3455B2941916k11089l43109k53874k95414l32496k88547l68685l99057k03304
$$ 22941916 22730827 22387718 22133844 21838430 21505934 21217387 20848702 20449645 20246341
3446B0246341j92951k68166j43485k48824j86385r2460k46543j55973j31662j00906
$$ 20246341 20053390 19785224 19641739 19392915 19206530 19114070 18867527 18711554 18579892 18478986
3436A8478986k48698l14598l15591l05162l70706l31875k78093m91326k13846
$$ 18478986 18230288 17915690 17600099 17294937 16924231 16592356 16314263 15822937 15609091
3427A5609091j73695l28345k08581k23942j86697j24386j46506q2083O3741K4507
$$ 15609091 15435396 15107051 14898470 14674528 14487831 14363445 14216939 14134856 14198597 14223104
3417A4223104K5968p7282l1847J01112M5248l0958L6856O1497J56993K91076M8627
$$ 14223104 14249072 14171790 14139943 14241055 14286303 14255345 14292201 14353698 14510691 14801767 14850394
3406A4850394r8119q5040q3931j96585k61973k84533l14685m01344m45982n28674
$$ 14850394 14752275 14667235 14583304 14386719 14124746 13840213 13525528 13124184 12678202 12149528
3396A2149528m11841n66810l77250l57675k62890k20367k09130l17015j41833
$$ 12149528 11737687 11170877 10793627 10435952 10173062 9952695 9743565 9426550 9284717
3387I284717j5035r5583r2042q0373q7574J5734R702J12613J80112M5688m1649
$$ 9284717 9269682 9174099 9082057 9001684 8914110 8929844 8939546 9052159 9232271 9277959 9236310
3376I236310M3788L29006K31694j23513j30780k70850k78280l02878n66295l88839
$$ 9236310 9280098 9609104 9840798 9717285 9586505 9315655 9037375 8734497 8168202 7779363
3366G779363k38075j94736k14684j83744j53187k04237o9844K9698k03164k15387
$$ 7779363 7541288 7346552 7131868 6948124 6794937 6590700 6520856 6550554 6347390 6132003
3356F132003j00583q1178j33392p9393k11721j3765j18060j7748p6949p7435q8060
$$ 6132003 6031420 5950242 5816850 5737457 5525736 5511971 5393911 5376163 5299214 5221779 5133719
3345E133719j45089P7061k9176J16522L0713k89220m1083L794k1560N9361r9219
$$ 5133719 4988630 5065691 5036515 5153037 5183750 4894530 4853447 4857241 4835681 4895042 4795823
3334D795823p0414q444N3505p5245q4755M133O8405l9919r8424L1224K5189N2418
$$ 4795823 4725409 4716965 4770470 4695225 4610470 4614603 4683008 4643089 4544665 4575889 4601078 4653496
3322D653496L3920j19479o5607K1610J81192j01939m9295J10830j02717O5622
$$ 4653496 4687416 4567937 4502330 4523940 4705132 4603193 4553898 4664728 4562011 4627633
3312D627633J00860J48724R2030j45069J69570j6582P0486J96881M1073J97230
$$ 4627633 4728493 4877217 4969247 4824178 4993748 4977166 5047652 5244533 5285606 5482836
3302E482836Q1304L447J83022M01371J75039J33018K53315L71000M15428M98155
$$ 5482836 5564140 5567587 5750609 6151980 6327019 6460037 6713352 7084352 7499780 7997935
3292G997935N68128P19224R07931R38028J032508J030363J035883P99117K15176
$$ 7997935 8566063 9285287 10193218 11131246 12163754 13194117 14230000 15029117 15244293
3283A5244293j61215m41485q58865j046174q83906p73859p27279m02028m17356
$$ 15244293 15083078 14641593 13782728 12736554 11852648 11078789 10351510 9949482 9532126
3274I532126l51983j48468k93974j14915j01205O2140J53909K03734K18281K89309
$$ 9532126 9180143 9031675 8737701 8622786 8521581 8583721 8737630 8941364 9159645 9448954
3264I448954L21310O47145P20021Q33160Q62225R25203Q51448M14718j17404l61780
$$ 9448954 9770264 10417409 11137430 11970590 12832815 13758018 14609466 15024184 14906780 14545000
3254A4545000n63292j143679j252966r73580q79263o79282m08769n62932n58879
$$ 14545000 13981708 12838029 11585063 10611483 9732220 9052938 8644169 8081237 7522358
3245G522358l99759n25111k93466j91320k01783j94930k07152j70245j66724k28295
$$ 7522358 7122599 6597488 6304022 6112702 5910919 5715989 5508837 5338592 5171868 4943573
3235D943573k21409p6746k72660k19470o1539N6140j60840q5466o7156P1331J18301
$$ 4943573 4722164 4645418 4372758 4153288 4091749 4147889 3987049 3901583 3834427 3905758 4024059
3224D024059j60303j68485M9718n8086j54238j64679j71876o3805J26017J02403
$$ 4024059 3863756 3695271 3744989 3686903 3532665 3367986 3196110 3132305 3258322 3360725
3214C360725j0266j89279j38396L1235N7272m7591j06240J05412m249k27326m3122
$$ 3360725 3350459 3161180 3022784 3054019 3111291 3063700 2957460 3062872 3058623 2831297 2788175
3203B788175J02642j36669p5516n2738k11068Q9800J83625m6643j42932P968j5512
$$ 2788175 2890817 2754148 2678632 2625894 2414826 2504626 2688251 2641608 2498676 2506644 2491132
3192B491132n5710l019N017J24825k35211p5761Q6760m2995l3838N7667N2188
$$ 2491132 2435422 2432403 2437420 2562245 2327034 2251273 2338033 2295038 2261200 2318867 2371055
3181B371055n5464M6424n3298j6238l7206K3092N145J0955J4292p2869j38192
$$ 2371055 2315591 2362015 2308717 2292479 2255273 2278365 2283510 2294465 2308757 2235888 2097696
3170B097696Q0529N5589J17879L9675l7970j45399k37525J7991J04357j457o3835
$$ 2097696 2178225 2233814 2351693 2391368 2353398 2207999 1970474 1988465 2092822 2091365 2027530
3159B027530J15548J36698m6008o1660j21521k2438l4350J18944Q8887q7632M3043
$$ 2027530 2143078 2279776 2233768 2172108 2050587 2028149 1993799 2112743 2201630 2113998 2157041
3148B157041m2659M9698M2124L1220J31561J6243L2450J1868k2306j0462L2379
$$ 2157041 2114382 2164080 2206204 2237424 2368985 2385228 2417678 2429546 2407240 2396778 2429157
3137B429157M9449n8455o9870n7973P5026p0191L3410Q9894J2879P1474j9470
$$ 2429157 2478606 2420151 2350281 2292308 2367334 2297143 2330553 2420447 2433326 2504800 2485330
3126B485330m8756J12561Q1265r7898o2602J01657O0953N4025J51881M7218M3274
$$ 2485330 2436574 2549135 2630400 2532502 2469900 2571557 2632510 2686535 2838416 2885634 2928908
3115B928908J54660q3871m3598j13781p7696R1803l2328o3521j05160l6438k9597
$$ 2928908 3083568 2999697 2956099 2842318 2764622 2856425 2824097 2760576 2655416 2618978 2589381
3104B589381j3753L5991J4981R3476j4258p4386m8927K05032K1459p0316j2802
$$ 2589381 2575628 2611619 2626600 2720076 2705818 2631432 2582505 2787537 2808996 2738680 2725878
3093B725878p7123M7077m7221N5080P4018k1781k3049o5613o3996j60606R0866
$$ 2725878 2648755 2695832 2648611 2703691 2777709 2755928 2732879 2667266 2603270 2442664 2533530
3082B533530j43034L4078O2089j11751M3391n5692j76792M9115n2678o5014N0867
$$ 2533530 2390496 2424574 2486663 2374912 2418303 2362611 2185819 2234934 2182256 2117242 2168109
3071B168109n5882K9362J04631J6313J7241k5714p2079o2830m9213r2562j16434
$$ 2168109 2112227 2141589 2246220 2262533 2279774 2254060 2181981 2119151 2069938 1977376 1860942
3060A860942K0260l9668O8677l9072j03981r8843m1354p6216m3985j12231n5204
$$ 1860942 1881202 1841534 1910211 1871139 1767158 1668315 1626961 1550745 1506760 1394529 1339325
3049A339325L0877J41753m3278j67711k5419M2842K1666m3135n1053j33716q2217
$$ 1339325 1370202 1511955 1468677 1300966 1275547 1318389 1340055 1296920 1245867 1112151 1029934
3038A029934O0141P04o7777N3611J7511n5076m383q5533n0127R9809K9848O85
$$ 1029934 1090075 1090779 1023002 1076613 1094124 1039048 1034665 949132 899005 998814 1028662 1029347
3026A029347n1210m991q8689o0253K249m1664L9807j2539J5496r1509M088j9608
$$ 1029347 978137 973146 884457 824204 826453 784789 824596 812057 827553 736044 740132 720524
3014G20524J08481k512k1295j20025K2933K9702m4075r975J09737l0052j01810
$$ 720524 829005 826493 805198 685173 708106 737808 693733 683758 793495 763443 661633
3003F61633o3289R890J13769j350K3610p2020p776Q6923R4561j55469j1386O123
$$ 661633 598344 608234 722003 720653 744263 672243 664467 751390 845951 690482 679096 685219
2991F85219j0745j17318l0993J80596n2919K952n8975P6293r0679k5934j4785
$$ 685219 674474 557156 526163 706759 653840 656792 597817 674110 583431 557497 542712
2980E42712q6703J06575J49850m5257n2958N4497n7779J0140j15065Q4958O6792
$$ 542712 456009 562584 712434 667177 614219 668716 610937 621077 506012 590970 657762
2969F57762r334n0281j5773N3745j56308j13275O0025O3256J8561n046n704K9678
$$ 657762 648428 598147 582374 636119 479811 366536 426561 489817 508378 503332 497628 527306
2957E27306m4529M4983j56276q44L3577r690k4982O88L6088m7306N4713L9112
$$ 527306 482777 527760 371484 370640 404217 394527 369545 370233 406321 359015 413728 452840
2945D52840M8149k4678J2210j08531p8618N6402K6134r4558J3926O0664m3527
$$ 452840 500989 476311 488521 379990 301372 357774 383908 289350 303276 363940 320413
2934C20413J14430j540n7604K8492j29888n2120p6523O4320R2810J9892k989J40091
$$ 320413 434843 433303 375699 404191 274303 222183 145660 209980 302790 322682 319693 459784
2922D59784O8874l6060p3488L8994j02795o9741Q4027j2169l2565Q2861K9132
$$ 459784 528658 492598 419110 458104 355309 285568 369595 357426 324861 407722 436854
2911D36854p0306j42928R7J8783k7272q1900J65118L0408N7574L9216j51109j16794
$$ 436854 366548 223620 223717 242500 215228 133328 298446 328854 386428 425644 274535 157741
2899A57741J42817l1000m5503J2417L4164J40725L2447j67606l3593j5132q6387
$$ 157741 300558 269558 224055 236472 270636 411361 443808 276202 242609 227477 141090
2888A41090J51711q4863j2531Q4623N1251j33951J66754j76468r7906J13311L1945
$$ 141090 292801 207938 195407 280030 331281 197330 364084 187616 89710 203021 234966
2877B34966p9925j5497J05234j04791K4371K04862m6292j4079N2694L5508j27189
$$ 234966 155041 139544 244778 139987 164358 369220 322928 308849 361543 397051 269862
2866B69862j3702L3256r7614J294p045m8433p2034M2533L690k1736R0586k0725
$$ 269862 256160 289416 191802 193096 186051 137618 65584 108117 111807 90071 180657 159932
2854A59932J32116O3406j55319r9307P916J07229m5461m3550k7980J09256o1908
$$ 159932 292048 355454 200135 100828 108744 215973 170512 126962 98982 208238 146330
2843A46330K7993k3589R471o834J17315n0479j5804N278Q375O9773k21289m7850
$$ 146330 174323 150734 160205 153371 270686 220207 204403 209681 218056 287829 66540 18690
2831A8690k3705J07950K6199R7129q543l0129N6245M4645n6662o7792K5132m4814
$$ 18690 -5015 102935 129134 226263 217720 187591 243836 288481 231819 164027 189159 144345
2819A44345l7925J04041R6637p703o0068p9134l4556O9893K320n4940M674J3795
$$ 144345 106420 210461 307098 299395 239327 160193 125637 195530 197850 142910 147584 161379
2807A61379p8436m2066n8899J02378K062q4040J45859q2077m7669M9945M6953
$$ 161379 82943 40877 -18022 84356 86418 2378 148237 66160 18491 68436 115389
2796A15389P4811p535m6499j9125O2614n3945j26542R842n056P9636M8952j07845
$$ 115389 190200 182665 136166 117041 179655 125710 -832 9010 3954 83590 132542 24697
2784B4697J19004N0675k9163k8041j3222m1780J02428J4373R836m1266n6907J45550
$$ 24697 143701 194376 165213 137172 123950 82170 184598 198971 208807 167541 110634 256184
2772B56184R5624p7041L3463j7265n8944l7993m0874j14888k5829J30779o0285
$$ 256184 351808 274767 308230 290965 232021 194028 153154 38266 12437 143216 82931
2761H2931l3757p3489P5090R0628k8560o5701L997L1981O3216j13488m0665L049
$$ 82931 49174 -24315 50775 141403 112843 47142 51139 83120 146336 32848 -7817 -4768
2749d768o364R6547J28605p48p466j47142J2367J3479j6553R4484j01878j08481
$$ -4768 -11132 85415 214020 213272 205806 58664 71031 84510 67957 162441 60563 -47918
2737d7918O3931o571j5143M8105j1627n3735j20303J56540R1654j21700p6592
$$ -47918 16013 9442 -5701 42404 30777 -22958 -143261 13279 104933 -16767 -93359
2726i3359P003J08009J62901j2740j40697o7113P2775j4622J4763P7405J12924
$$ -93359 -86356 21653 184554 171814 31117 -35996 36779 22157 36920 114325 227249
2715B27249j8963n8805n6023j99977J17124j9956k8783m8611q2267J77229k4712
$$ 227249 208286 149481 93458 -106519 10605 -9351 -38134 -86745 -169012 8217 -16495
2704a6495o6662J27484M9463M861M274K7347M4431j82634m8786L9673M3309r003
$$ -16495 -83157 44327 93790 98651 102925 130272 174703 -7931 -56717 -17044 26265 17262
2692A7262m4791P7236n3136r3727R9587O6566M2878k6373p3050L8355l4936P1451
$$ 17262 -27529 49707 -3429 -97156 2431 68997 111875 85502 12452 50807 15871 87322
2680H7322K5706M2111K8335L6740j48703L4235L8594j29397P0162J20156q9304
$$ 87322 113028 155139 183474 220214 71511 105746 144340 14943 85105 205261 115957
2669A15957j30213L1044m1554J3817N2130O3825J3934p2753q4990K5927q7901
$$ 115957 -14256 16788 -24766 -10949 41181 105006 118940 46187 -38803 -12876 -100777
2658a00777o7341N0357O6206J44334k1361j17338N7379p9220o5287J24063m0465
$$ -100777 -168118 -117761 -51555 92779 71418 -45920 11459 -67761 -133048 -8985 -49450
2647d9450J9905J17200m4711j01653j7854l171j8107P2973j3390m4321o6805J6894
$$ -49450 -29545 87655 42944 -58709 -76563 -79734 -97841 -24868 -38258 -82579 -149384 -132490
2635a32490J4610M2607N7523L0123J3825j8112O174j47514J02230M9618l4555
$$ -132490 -117880 -75273 -17750 12373 26198 8086 14260 -133254 -31024 18594 -15961
2624a5961N588j69266j06294R4254J51739l9558O4605J19876p4075M6832k8136
$$ -15961 -10373 -179639 -285933 -191679 -39940 -79498 -14893 104983 30908 77740 49604
2613D9604J9554n7145J14235K1574l4744j97575m1536l2257n3754J59242Q5102
$$ 49604 69158 12013 126248 147822 113078 -84497 -126033 -158290 -212044 -52802 32300
2602C2300j16273k4237J09633J12229M659j67968J45809N3792J3902L913j6996
$$ 32300 -83973 -108210 1423 113652 118311 -49657 96152 149944 163846 167759 150763
2591A50763k8871J31915m9489O5309L5341J84085r8448j99671J27663R965M9552
$$ 150763 121892 253807 204318 269627 304968 489053 390605 190934 318597 328562 378114
2580C78114k3172j02044m3900P990l1968J8021O8548j25114p7213J0815l8010
$$ 378114 354942 252898 208998 216988 185020 203041 271589 146475 69262 80077 42067
2569D2067L1713J36077j56550k8075K5623M2270M9133Q2701L898p4000j02445
$$ 42067 73780 209857 53307 25232 50855 93125 142258 224959 228857 154857 52412
2558E2412j5542L1400J9135p0438m64K0084L3968O8196q2378r4333M4795J26358
$$ 52412 36870 68270 87405 16967 16503 36587 70555 138751 56373 -37960 6835 133193
2546A33193k0386j94252N2018O0685j16050J59554l5979r9983m582K69388l6081
$$ 133193 112807 -81445 -29427 31258 -84792 74762 38783 -61200 -65782 203606 167525
2535A67525j06671l4326j9084O1493q9508m1406Q0414K7324l2264R9993p672J7033
$$ 167525 60854 26528 7444 68937 -20571 -61977 18437 45761 13497 113490 105818 122851
2523A22851k1354j59757k5186Q3923M1824n7977J35768K4223j30070k0955Q5021
$$ 122851 101497 -58260 -83446 477 42301 -15676 120092 144315 14245 -6710 78311
2512G8311r93k7951o1508j18438N4938R1770j04448J4792J08930j02063J488Q3534
$$ 78311 77318 49367 -12141 -130579 -75641 16129 -88319 -73527 35403 -66660 -65172 18362
2500A8362J46597l5384o118J3610j01209J35445q4458k8128k1957N519j7087J26310
$$ 18362 164959 129575 123457 137067 35858 171303 86845 58717 36760 42279 25192 151502
2488A51502Q7348j02407j9099J14888j22702q809Q0770p8124J44097L7744j80082
$$ 151502 238850 136443 117344 232232 109530 100721 181491 103367 247464 285208 105126
2477A05126l2979O4988n5529O1181l7595p6019K6951Q7841n5272Q971o1732p4623
$$ 105126 72147 137135 81606 142787 105192 29173 56124 143965 88693 97664 35932 -38691
2465c8691j7144R9603P4704j01411j031J57717m103p5864L0368j7056K150k8672
$$ -38691 -55835 43768 118472 17061 16030 173747 169644 93780 124148 107092 109242 80570
2453H0570O4757N6409m284p3644j6063j19801r000K05900j6493j01732j01108
$$ 80570 145327 201736 197452 123808 107745 -12056 -21056 184844 168351 66619 -34489
2442c4489P2211J8179M8096J84495j89389o5659N1691J8602M156L8579n3286J29692
$$ -34489 37722 55901 103997 288492 99103 33444 85135 103737 107893 146472 93186 222878
2430B22878k291j00579O8125n077J3833m0797k2473K2156P1042M4540l3754r5071
$$ 222878 220587 120008 188133 183056 196889 156092 133619 155775 226817 271357 237603 142532
2418A42532J10078k0834q8208O3390J33545j5873j09755N9454O4181J22682l384
$$ 142532 252610 231776 143568 206958 340503 324630 214875 274329 338510 461192 457808
2407D57808l7963m9014j55041o840R5949L6947m2485R0270n2374j04625o6258
$$ 457808 419845 370831 215790 208950 304899 341846 299361 389631 337257 232632 166374
2396A66374J72695o5428j13391J52123n0400M2886N6203K2566o46j1134K8185
$$ 166374 339069 273641 160250 312373 261973 304859 361062 383628 382982 371848 400033
2385D00033P8861J6996J0155J5758P0074Q8303j5118L5019J78323n5875m1536
$$ 400033 478894 495890 506045 521803 591877 680180 665062 700081 878404 822529 780993
2374G80993K5800J4362N7400N1435J22745O735K8056N4777J33864M0079p758M5517
$$ 780993 806793 821155 878555 929990 1052735 1059470 1087526 1142303 1276167 1316246 1308488 1354005
2362A354005N0742j4928N4455J30266K16913J98547l2137M0652R0442K06430J98275
$$ 1354005 1404747 1389819 1444274 1574540 1791453 1990000 1957863 1998515 2088957 2295387 2493662
2351B493662K1188J34411L32594L44461R7272J09419L07714L13248K40144K60276
$$ 2493662 2514850 2649261 2981855 3326316 3423588 3533007 3840721 4153969 4394113 4654389
2341D654389M30448L83970M49061O58514P09454O49100P73657R00459R10977R96712
$$ 4654389 5084837 5468807 5917868 6576382 7285836 7934936 8708593 9609052 10520029 11516741
2331A1516741Q46260J047690J136992J309857J610808K165243K800405L834523
$$ 11516741 12363001 13410691 14547683 15857540 17468348 19633591 22433996 26268519
2323B6268519M536180M884975M593307N348983N161057K133531j152113k136208
$$ 26268519 30804699 35689674 40282981 45631964 50793021 52926552 51774439 49638231
2315D9638231k307605n177411o034348m483264l718885l008354k587052k311383
$$ 49638231 47330626 42153215 36118867 31635603 27916718 24908364 22321312 20009929
2307B0009929k012175j706123j339429j170795j047742r41607p19846p90353o77485
$$ 20009929 17997754 16291631 14952202 13781407 12733665 11792058 11072212 10281859 9604374
2298I604374o28664p52718p06432o36602n75873n52850m76853m38360m41280k51278
$$ 9604374 8975710 8222992 7516560 6879958 6304085 5751235 5274382 4836022 4394742 4143464
2288D143464j91968k35569K6509k28581l45584j20449k5706j58499j33648j39390
$$ 4143464 3951496 3715927 3742436 3513855 3168271 3047822 3022116 2863617 2729969 2590579
2278B590579j92305o0636j06458j04345j24892q0668k09974N289j78175K5635
$$ 2590579 2398274 2337638 2231180 2126835 2001943 1921275 1711301 1716590 1538415 1564050
2268A564050j67258q8955M9613j21963P7604l487q0053P2589p9957k25977J3686
$$ 1564050 1396792 1307837 1357450 1235487 1313091 1309604 1229551 1302140 1222183 996206 1009892
2257A009892P6092m949q6951j05045m367n823q7980R3564J7828p7173r9404l7369
$$ 1009892 1085984 1081035 994084 889039 884672 878849 790869 884433 902261 825088 725684 688315
2245F88315n0836J9438J76288o4769O076J346n9357j06319O8772m827q3689l4482
$$ 688315 637479 656917 833205 768436 774512 775858 716501 610182 678954 674127 590438 555956
2233E55956J43641o9695p8851R6288k67021N8917O5262q3053O3594j35009L4213
$$ 555956 699597 629902 551051 647339 380318 439235 504497 421444 485038 350029 384242
2222C84242M9442p6986m5010P1749p9848q2971R1143o6539O4127P498l3807J19566
$$ 384242 433684 356698 311688 383437 303589 220618 311761 245222 309349 316847 283040 402606
2210D02606J24199o6580j53483m3154j7735k5393J2821j25919N3123Q7932k49
$$ 402606 526805 460225 306742 263588 245853 220460 233281 107362 160485 248417 248168
2199B48168m6009l4022l546l8179o5411O2343K0825J35739P1458j50892L1279
$$ 248168 202159 168137 164591 126412 61001 123344 144169 279908 351366 200474 231753
2188B31753q9339R3005j9080j25566o2900J10349J8273j54626J04986j0183O2590
$$ 231753 142414 235419 216339 90773 27873 138222 156495 1869 106855 96672 159262
2177A59262m856k361K2117o6998n2167J8431M0145J5514k5156l1938L9547M0502
$$ 159262 154406 152045 174162 107164 54997 73428 113573 129087 103931 71993 111540 152042
2165A52042O9115j3890j45031J81211J5114n7577p8625q4479j1887R3469Q2295
$$ 152042 221157 207267 62236 243447 258561 200984 122359 37880 25993 119462 201757
2154B01757p4860R0578M3937j31823J13096l8958j48571J7563j52419o6565Q8633
$$ 201757 126897 217475 261412 129589 242685 203727 55156 72719 -79700 -146265 -57632
2143e7632l0400n391N2760m1245P9179o117n043K3153j36209M9374o562J1466
$$ -57632 -88032 -93423 -40663 -81908 -2729 -8846 -13889 9264 -126945 -77571 -84133 -72667
2131g2667J49504R1485j851j26900r29q1686l4600K549j0736M6751K9894J15187
$$ -72667 76837 168322 166471 39571 38642 -43044 -77644 -75095 -85831 -39080 -9186 106001
2119A06001n6042m2881j3669k4361O6184o2471O9730k1446j0022p8011n6957N8513
$$ 106001 49959 7078 -6591 -30952 35232 -27239 42491 21045 11023 -66988 -123945 -65432
2107f5432J85478N2639j5305N0644j44746k6672J27052L5758j18458m2387q5618
$$ -65432 120046 172685 157380 208024 63278 36606 163658 199416 80958 38571 -47047
2096d7047m1860l2575J65270R2536r4242q0801O3865r521K0422P4803r516J9133
$$ -47047 -88907 -121482 43788 136324 42082 -38719 25146 15625 36047 110850 101334 120467
2084A20467j24950j2211m8341Q894J33895k847n8753j36759K8397R1801m3236
$$ 120467 -4483 -16694 -65035 -56141 77754 74907 16154 -120605 -92208 -407 -43643
2073d3643J54656M0324o1614Q1288j4842j78520K9806O8499q6959J80490k8971
$$ -43643 111013 151337 89723 171011 156169 -22351 7455 75954 -11005 169485 140514
2062A40514N0031p0222j64308Q208Q1490J36407j22993J3558L3458p2305O6569
$$ 140514 190545 120323 -43985 -35777 45713 182120 59127 72685 106143 33838 100407
2051A00407j4403J77595m8115L1948N1334j52357k4185M8249o2368K4523J39297
$$ 100407 86004 263599 215484 247432 298766 146409 122224 170473 108105 132628 271925
2040B71925m8090L0700n2509k5932r0644M8557m7300J7141j27299l0200J19180
$$ 271925 223835 254535 202026 176094 85450 134007 86707 103848 -23451 -53651 65529
2029F5529Q3314p7303N3306j08183q6234k6775J39879N6278m0580J09041j5580
$$ 65529 148843 71540 124846 16663 -69571 -96346 43533 99811 59231 168272 152692
2018A52692k06128M490j2165P0068Q8978n463m7407k2300k3136j8689p9204N6812
$$ 152692 -53436 -48946 -61111 8957 97935 92472 45065 22765 -371 -19060 -98264 -41452
2006d1452k8331J8967R3469m3736n7628R2637j186p4997J19681m5896r2675k1376
$$ -41452 -69783 -50816 42653 -1083 -58711 33926 32740 -42257 77424 31528 -61147 -82523
1994h2523N0198p1680R6513M5524J26117j39219q7418j9442j5253P7281L3165
$$ -82523 -32325 -104005 -7492 38032 164149 24930 -62488 -81930 -97183 -19902 13263
1983A3263m3579m4090k4367r2167R034J32306j364J7623j54018O3151r2999M0494
$$ 13263 -30316 -74406 -98773 -190940 -181906 -49600 -50964 -33341 -187359 -124208 -217207 -176713
1971a76713J21570J5795j7439J9791N1648P081l5444p895p6640R0238O9336l4481
$$ -176713 -55143 -39348 -56787 -36996 14652 21733 -13711 -21606 -98246 -8008 61328 26847
1959B6847J1434p764j7995j45719J02410K9219q0833l5386M7863n8499m394M9099
$$ 26847 38281 30517 12522 -133197 -30787 -1568 -82401 -117787 -69924 -128423 -132817 -83718
1947h3718l3840p6088K514K53667L1786q3342P383j83790l957R0888r310m7377
$$ -83718 -117558 -193646 -191132 62535 94321 10979 18362 -165428 -169385 -78497 -87807 -135184
1935a35184J0590l3776M1973K8910L1548j22004r191j05915R8676J93963j4119
$$ -135184 -124594 -158370 -116397 -87487 -55939 -177943 -187134 -293049 -194373 -410 -14529
1924a4529J1444q8777m1812J01299L1558L022L7715j64244J53687M4877j8180
$$ -14529 -3085 -91862 -133674 -32375 -817 2205 39920 -124324 29363 74240 56060
1913E6060p0568r5460k9740J38911J3959j2670Q391O8374j72754j0879J49931
$$ 56060 -14508 -109968 -139708 -797 13162 492 8883 77257 -95497 -106376 43555
1902D3555j1560m4480j46635J57618j7744j88709J11460L8320o9451K4777M6722
$$ 43555 31995 -12485 -159120 -1502 -19246 -207955 -96495 -58175 -127626 -102849 -56127
1891e6127J1877n4642J13262N7800n4160l7424l8041Q2563o3609M523m634j64440
$$ -56127 -44250 -98892 14370 72170 18010 -19414 -57455 25108 -38501 -33978 -38612 -203052
1879b03052J08810J729j3592K0290J38961O8366m6647l1699r8224k9939l5530
$$ -203052 -94242 -92513 -106105 -85815 53146 121512 74865 43166 -55058 -84997 -120527
1868a20527M4897j5657r5619K8421k883k3973L5859M5018q3496o8704M5398Q4233
$$ -120527 -75630 -91287 -186906 -158485 -161368 -185341 -149482 -104464 -187960 -256664 -211266 -127033
1856a27033Q6814r4494k8946J79759q3865q2597r7712Q1459Q3911R0218K8506
$$ -127033 -40219 -134713 -163659 16100 -67765 -150362 -248074 -166615 -82704 7514 36020
1845C6020p3903j5410m2741p3633Q6213L626o7490J37277n9793K4136J22704J4898
$$ 36020 -37883 -53293 -96034 -169667 -83454 -79828 -147318 -10041 -69834 -45698 77006 91904
1833I1904n2378R2745j31894j81183J54865k1199p0011J39678Q9973j75840p4747
$$ 91904 39526 132271 377 -180806 -25941 -47140 -117151 22527 112500 -63340 -138087
1822a38087J01262l9848O1345k3113m6369O5336j12884p028L1553l9431m0332
$$ -138087 -36825 -76673 -15328 -38441 -84810 -19474 -132358 -139386 -107833 -147264 -187596
1811a87596R9779R8581n1110J33310J00802j54979k9937j17337R6085P6554j30513
$$ -187596 -87817 10764 -40346 92964 193766 38787 8850 -108487 -12402 64152 -66361
1800f6361o5847j8520Q1678J2486O0159r2629J55310j4254m4055M6754p2161N0246
$$ -66361 -132208 -150728 -69050 -56564 3595 -89034 66276 52022 7967 54721 -17440 32806
1788C2806l1695j07794K8603P985L8230j637N7212k1409j15084N8233n1927R1039
$$ 32806 1111 -106683 -78080 -70095 -31865 -33502 23710 2301 -112783 -54550 -106477 -15438
1776a5438L0178k2120L2075L3081q7253o3627R2062q8220L8126R6078o6939l9561
$$ -15438 14740 -7380 24695 57776 -29477 -93104 -1042 -89262 -51136 44942 -21997 -61558
1764f1558l8717n1579J24565J74156k8186J21360j04111k60070k153P509O2822
$$ -61558 -100275 -151854 -27289 146867 118681 240041 135930 -124140 -126293 -118784 -55962
1753e5962P4203j212j54289l938J08116l6261P220k55m6182J28122J22064n6770
$$ -55962 18241 17029 -137260 -141198 -33082 -69343 -62123 -62378 -108560 19562 141626 84856
1741H4856q318j69917N9446l9103O7684p8941j9237N460p2477J38177m7502m2067
$$ 84856 76538 -93379 -33933 -73036 -5352 -84293 -103530 -98070 -170547 -32370 -79872 -121939
1729a21939L6251J08989N0802J6458m1939k69919M588J04893J24401j22603n5573
$$ -121939 -85688 23301 74103 90561 48622 -221297 -216709 -111816 12585 -110018 -165591
1718a65591J81792j07604k7020r476L7588L2841N8926J9825l1999R1032j7029
$$ -165591 16201 -91403 -118423 -127899 -90311 -57470 1456 21281 -10718 80314 63285
1707F3285j84446L8217l7385M0291M3618K2564r7331p6170m7942J79629p3361
$$ 63285 -121161 -82944 -120329 -80038 -36420 -13856 -111187 -187357 -235299 -55670 -129031
1696a29031j14182J20192P5645p7253L8551j05465N5008J00214m8043Q3815p9901
$$ -129031 -243213 -123021 -47376 -124629 -86078 -191543 -136535 -36321 -84364 -549 -80450
1685h0450j01203k8157K4408J84918J66258j1729k04186O063L5713k8009k3638
$$ -80450 -181653 -209810 -185402 -484 165774 154045 -50141 -44078 -8365 -36374 -60012
1674f0012M3828q4774j0448P1127N2953N8512l500k2213M522j37494K0460L8547
$$ -60012 -16184 -100958 -111406 -40279 12674 71186 67686 45473 49995 -87499 -67039 -28492
1662b8492o7209M0270l6687L975j22207J36118N6992K7118m8847p2533Q5576O1173
$$ -28492 -95701 -55431 -92118 -88143 -210350 -74232 -17240 9878 -38969 -111502 -25926 35247
1650C5247k0335p3028l8012R7712J3379j24553j07283O8843J60304j45645p7232
$$ 35247 14912 -58116 -96128 1584 14963 -109590 -216873 -148030 12274 -133371 -210603
1639b10603J740P4530J09000q6638q728P7724j0863M1336J48471j89046P9285
$$ -210603 -208863 -134333 -25333 -111971 -120699 -42975 -53838 -12502 135969 -53077 26208
1628B6208k5254j20815O6934K5924m1804J18300p3447k2041L1918m7976k0034
$$ 26208 954 -119861 -52927 -27003 -68807 49493 -23954 -45995 -14077 -62053 -82087
1617h2087Q5953j57911K9226R748n2225n2617K4245L0332l576J7631J25166R9766
$$ -82087 3866 -154045 -124819 -115071 -167296 -219913 -195668 -165336 -168912 -151281 -26115 73651
1605G3651n4674L3351k4403j40788j8200N2395R6986J14496L9065k21290k50424
$$ 73651 18977 52328 27925 -112863 -131063 -78668 18318 132814 171879 -49411 -299835
1594b99835J35520P7719J42593r9205o9050J8064j26774N8097J50112j03366J18776
$$ -299835 -164315 -86596 55997 -43208 -112258 -94194 -220968 -162871 -12759 -116125 2651
1583B651N6855r827j42609p5585k5485P6925N4364Q818j5511n7428N1209J1697
$$ 2651 59506 49679 -92930 -168515 -194000 -117075 -62711 -53893 -69404 -126832 -75623 -63926
1571f3926q693r6771N887K7968P2585N6320Q3028j84840n2261K2493K4096J19842
$$ -63926 -72619 -169390 -163503 -135535 -62950 -6630 76398 -108442 -160703 -138210 -114114 5728
1559E728Q5530j3578k5291J11798j37559j53993q239P9811P9323N9837J5067k4233
$$ 5728 91258 77680 52389 164187 26628 -127365 -135604 -55793 23530 83367 98434 74201
1547G4201k3663n5931o4074r7002J6559J06114q1960J12304J9263m6581L0874
$$ 74201 50538 -5393 -69467 -166469 -149910 -43796 -125756 -13452 5811 -40770 -9896
1536i896j9591j3229j6320N9974K4208j8769o2878O1783O3495q3631O4003j33721
$$ -9896 -29487 -42716 -59036 938 25146 6377 -56501 5282 68777 -14854 49149 -84572
1524h4572k0385M4930M79J0594L7181r754o8586k5460M6344p1058Q1406J16193
$$ -84572 -104957 -60027 -59548 -48954 -11773 -21527 -90113 -115573 -69229 -140287 -58881 57312
1512E7312K515n4071q9869O9668p9562J14937q0684j75395J03552J03296L3161
$$ 57312 59827 5756 -84113 -14445 -94007 20930 -59754 -235149 -131597 -28301 4860
1501D860o4187K6763p7862m6297n5019R981J57192o360n8067o3524M5052Q1526
$$ 4860 -59327 -32564 -110426 -156723 -211742 -201761 -44569 -50929 -108996 -172520 -127468 -45942
1489d5942r7918M1579J69087j7115j05657K0670k6972j56642q5553o3632P0976
$$ -45942 -143860 -102281 66806 49691 -55966 -35296 -62268 -218910 -304463 -368095 -297119
1478b97119P9495J24536J3832m3548o6905N2732P6179L6991Q6760r0107J07169
$$ -297119 -217624 -93088 -79256 -122804 -189709 -136977 -60798 -23807 62953 -27154 80015
1467H0015k2440l6059K1282p3741r414L9320P3155j61052K6623N4998q383j30380
$$ 80015 57575 21516 42798 -30943 -40357 -1037 72118 -88934 -62311 -7313 -15696 -146076
1455a46076J2999O7634o9297M1473n3134o4746N9339J2875Q1205P0530j36682
$$ -146076 -133077 -65443 -134740 -93267 -146401 -211147 -151808 -138933 -57728 12802 -123880
1444a23880n7022N0616R8433N3509L3640m7479r822j01842m7188R2032o416O9142
$$ -123880 -180902 -130286 -31853 21656 55296 7817 -2005 -103847 -151035 -59003 -65419 3723
1432C723j33709P0993N6386j08299J04628K3830n0148l1719p132M3709o7951j9860
$$ 3723 -129986 -58993 -2607 -110906 -6278 17552 -32596 -64315 -71447 -27738 -95689 -115549
1420a15549J27777k9409J5064L5123m3861J00458J67235k08769k23692o426r984
$$ -115549 12228 -17181 -2117 33006 -10855 89603 256838 48069 -175623 -182049 -192033
1409a92033Q7538P3861j0054l2704M0877Q1480K0772r1974m3983j21J1459K7626
$$ -192033 -104495 -30634 -40688 -73392 -32515 48965 69737 -22237 -66220 -66341 -54882 -27256
1397b7256L0912O3530n4541J5509L1035R8875k9425q1715p3905k7886K4230j28234
$$ -27256 3656 67186 12645 28154 59189 158064 128639 46924 -26981 -54867 -30637 -158871
1385a58871N8212J7757l828j11254L4511L00271R616m4372Q667j34764Q7175r0801
$$ -158871 -100659 -82902 -86730 -197984 -163473 136798 146414 102042 110709 -24055 63120 -27681
1373b7681q6919M7172J19770P6022q2643j69296L097J10490j23395k5273J66549
$$ -27681 -114600 -67428 52342 128364 45721 -123575 -120478 -9988 -133383 -158656 7893
1362G893N8162P408j03351K2085K4138q051n0579K8567r1817k3352J34943j36505
$$ 7893 66055 73463 -29888 -7803 16335 8284 -42295 -13728 -105545 -128897 6046 -130459
1350a30459N1299m3862K999Q5103l2482r245J3771J27893j7616q7204L6592L2300
$$ -130459 -79160 -123022 -120023 -34920 -67402 -76647 -62876 65017 47401 -39803 -3211 29089
1338B9089J32149r6645N5833p187j23366r5465j4079l5197k695n2445J09439L2484
$$ 29089 161238 64593 120426 113239 -10127 -105592 -119671 -154868 -157563 -210008 -100569 -68085
1326f8085Q1429M5460O711n4681o945j28495n8313N4613q9403Q2734N9010O0560
$$ -68085 13344 58804 65515 10834 3889 -124606 -182919 -128306 -217709 -134975 -75965 -15405
1314a5405j01009l9720J14439P3197N1329j01309M8368j04828R2548N1417p8122
$$ -15405 -116414 -156134 -41695 31502 82831 -18478 29890 -74938 17610 69027 -9095
1303i095N4452K9129p52l2232J62797r2911q0494j20608J23230K020n9922q4529
$$ -9095 45357 74486 73734 41502 204299 111388 30894 -89714 33516 35536 -24386 -108915
1291a08915o9533J28466k1469j1507N5058l2499j54582J5523J46733P3228J6787
$$ -108915 -178448 -49982 -71451 -82958 -27900 -60399 -214981 -199458 -52725 20503 37290
1280C7290m7571l0801o9433J32083o8386q3000J5686J01214R4095o2686n7469
$$ 37290 -10281 -41082 -110515 21568 -46818 -129818 -114132 -12918 81177 18491 -38978
1269c8978n9109M1710l0834N0629J27284r1582j1570j29800k4614P3156l0046
$$ -38978 -98087 -56377 -87211 -36582 90702 -880 -12450 -142250 -166864 -93708 -123754
1258a23754N400J45287j11279r4488Q88L1919k880J85301p9145l2793P0412m6713
$$ -123754 -118354 26933 -84346 -178834 -177946 -146027 -148907 36394 -42751 -75544 -5132 -51845
1246e1845K7983p2189J28009n242L2666n5979r6157J8362J9862K9521m0615q4394
$$ -51845 -23862 -96051 31958 26716 59382 3403 -92754 -74392 -54530 -25009 -65624 -150018
1234a50018P054J17019J03917k2877j08594l5931L0470j50216N4696O5965K9559
$$ -150018 -142964 -25945 77972 55095 -53499 -89430 -58960 -209176 -154480 -88515 -58956
1223e8956J00860O01p9556J45655j62462n2997R3203J2800j4288O0883r177o9846
$$ -58956 41904 42505 -37051 108604 -53858 -106855 -13652 -852 -15140 45743 36566 -33280
1211c3280r9266P8753J55872q6502k9905L9922q8505j47432J28770K60496j73042
$$ -33280 -132546 -53793 102079 15577 -14328 25594 -62911 -210343 -81573 178923 5881
1200E881r3765O3076k9154J3133Q862j7813J25454J4742k6631q2447j9260O0567
$$ 5881 -87884 -24808 -53962 -40829 -31967 -49780 75674 90416 63785 -18662 -37922 22645
1188B2645R337q3485j264m8533k6521N9329j3745J02166n8171O621K9070O8653
$$ 22645 31982 -51503 -52767 -101300 -127821 -68492 -82237 19929 -38242 -31621 -2551 66102
1176F6102q3135r3312l0778J22150Q6272l7862j21785M4151j9801n3311J7613
$$ 66102 -17033 -110345 -141123 -18973 67299 29437 -92348 -48197 -67998 -121309 -103696
1165a03696J32884J3552R4024p1825k9612J10253J3457p8818j03157j8468J4362
$$ -103696 29188 42740 136764 64939 35327 145580 159037 80219 -22938 -41406 -27044
1154b7044M0708l2918k3160K3459J43969J3962r3490j10338N3261r5046J34247
$$ -27044 13664 -19254 -42414 -18955 125014 138976 45486 -64852 -11591 -106637 27610
1143B7610J5951P9670L04j76341J27124m4959j4887j951l1202r2190L4721J40820
$$ 27610 43561 123231 123535 -52806 74318 29359 14472 12521 -18681 -110871 -76150 64670
1131F4670K7611o0508q2655k2305J10152O92n6132r4775K229m3638N5015O5357
$$ 64670 92281 31773 -50882 -73187 36965 37657 -18475 -113250 -111021 -154659 -99644 -34287
1119c4287R793j60540J13153k0676J6047J34014L8413O2705k06575r4563J02637
$$ -34287 -24494 -185034 -71881 -92557 -76510 57504 95917 158622 -47953 -142516 -39879
1108c9879N4877l1416Q1798n2335o8075j7451l1209J65608k1842j64581J25655
$$ -39879 14998 -16418 65380 13045 -55030 -72481 -103690 61918 40076 -124505 1150
1097A150j32687N0417K9722j2316J37805K4149j37882o0399J4675L181N20N3593
$$ 1150 -131537 -81120 -51398 -63714 74091 98240 -39642 -100041 -85366 -82185 -81665 -28072
1085b8072P9714o9319m5279q7677Q5605L6780q2662R1749J65581j28423k9306
$$ -28072 51642 -17677 -62956 -150633 -65028 -28248 -110910 -19161 146420 17997 -11309
1074a1309K1610j22282R0702P0918Q2887p3020p7241j07797N8283R5371N7767
$$ -11309 10301 -111981 -21279 49639 132526 59506 -17735 -125532 -67249 28122 85889
1063H5889j6182P0045p8470k8981j3162j86073n6884O8848j4984R0029J1243j26082
$$ 85889 69707 139752 61282 32301 19139 -166934 -223818 -154970 -169954 -79925 -68682 -194764
1051a94764J42892J9351O2550p155k6049J67545P85j32900l3715O2387n0890Q2056
$$ -194764 -51872 -32521 30029 22874 -3175 164370 165155 32255 -1460 60927 10037 92093
1039I2093J9727j53783K6867N5541q3692N4569r075R227P0225l3015P3052n6883
$$ 92093 111820 -41963 -15096 40445 -43247 11322 2247 11474 81699 48684 121736 64853
1027F4853Q1482q5651m5346k2314N652k1257R6946m2586o3703r1716J19041K5598
$$ 64853 146335 60684 15338 -6976 -1324 -22581 74365 31779 -31924 -123640 -4599 20999
1015B0999j0464M7756k4676p9486n567O2553k21622J98777L0825M077j58325j3431
$$ 20999 10535 58291 33615 -45871 -51438 11115 -210507 -11730 19095 23172 -135153 -148584
1003a48584P1123M2759k3192n7594n2646J46715J98439m6595m3506o9012J02797
$$ -148584 -77461 -34702 -57894 -115488 -168134 -21419 177020 130425 86919 17907 120704
992A20704p1466m6375M8319j66627j9883J46215n261q1683m6435K1797k2930J2950
$$ 120704 49238 2863 51182 -115445 -135328 10887 5626 -76057 -122492 -100695 -123625 -110675
980a10675J13014L93J3245O9477l7468M6733J212M0216j45578m725K1520q6200
$$ -110675 2339 2732 15977 85454 47986 94719 95931 136147 -9431 -14156 7364 -78836
968g8836L4202j22893M4101J27004J08059M2616n2287N2781k7613j50294j18031
$$ -78836 -44634 -167527 -123426 3578 111637 154253 101966 154747 127134 -23160 -141191
957a41191Q2704N9603k4205k1330j9629M5978o0886r781J36264J10967j4798J1441
$$ -141191 -58487 1116 -23089 -44419 -64048 -18070 -78956 -88737 47527 158494 143696 155137
945A55137j48132l7218L4373n9126m336N1633K8015J0270M5405n4082m2046J54818
$$ 155137 7005 -30213 4160 -54966 -59302 -7669 20346 30616 76021 21939 -20107 134711
933A34711M4048j75843j6975j0319J34035r1371K1207j3609p7854o8211O1657
$$ 134711 178759 2916 -14059 -24378 109657 18286 39493 25884 -51970 -120181 -58524
922e8524J81504j1255j176j99500P4471J28447p4126j22358O3452J24698r2115
$$ -58524 122980 111725 110549 -88951 -14480 113967 39841 -82517 -19065 105633 13518
911A3518L4691j27490p7666J04872r0753R9353L5531N0974J61842n8084J8705
$$ 13518 48209 -79281 -156947 -52075 -142828 -43475 -7944 43030 204872 146788 165493
900A65493J12585k17219n98J72834q5645q5049L6698L235N018n5883o9342N478
$$ 165493 278078 60859 60261 233095 147450 62401 99099 102334 107352 51469 -17873 -12395
888a2395O6285L3742l2269L8080o4476j2740n2587n3843J08454l0206j11743P5644
$$ -12395 53890 87632 55363 93443 28967 16227 -36360 -90203 18251 -11955 -123698 -48054
876d8054J02185j31796j04356J25650j01551J7821J5169m0088J48142J28213J29988
$$ -48054 54131 -77665 -182021 -56371 -157922 -140101 -124932 -165020 -16878 111335 241323
865B41323k4191m5193j01741Q6995m4519p9928l4384k08745l6465J24413R7320
$$ 241323 217132 171939 70198 157193 112674 32746 -1638 -210383 -246848 -122435 -25115
854b5115L4141r1536q829J518n6260L0411J40173m7047K1944P9106l1780Q9552
$$ -25115 9026 -82510 -91339 -89821 -146081 -115670 24503 -22544 -600 78506 46726 136278
842A36278k6864l5640j53705l6355M1217j5009J6299P8681P0403l7047M5657l4770
$$ 136278 109414 73774 -79931 -116286 -75069 -90078 -73779 4902 75305 38258 83915 49145
830D9145j64986K8603Q7978J729p2323Q0142K82J380O6360j7605o7435J4262P3744
$$ 49145 -115841 -87238 740 2469 -69854 10288 10570 11950 78310 60705 -6730 7532 81276
817H1276r4399Q1951l4325n2307Q6234K7951J7910j33450J0821N9399N2543l553
$$ 81276 -13123 68828 34503 -17804 68430 96381 114291 -19159 -8338 51061 103604 100051
805A00051k9879m7142K6592J10504j04365j15419O8860l4927m5454m7831l8689
$$ 100051 70172 23030 49622 160126 55761 -59658 9202 -25725 -71179 -119010 -157699
794a57699J48325J10729k3399N8752j01166j05507J26503o4383m7286J66394m1958
$$ -157699 -9374 101355 77956 136708 35542 -69965 56538 -7845 -55131 111263 69305
783F9305n6286P4057k9433q337j25906Q6690M7306p5314J4578K4657P0160j3102
$$ 69305 13019 87076 57643 49306 -76600 10090 57396 -17918 -3340 21317 91477 78375
771G8375n5946o2414J8205O880r323j0047J210J52887M7090o5167j07149J06205
$$ 78375 22429 -39985 -21780 -14900 -24223 -34270 -33060 119827 166917 101750 -5399 100806
759A00806P642l073r1681k3305R2325m586O2499K504k8906m7926J4908k5189N0203
$$ 100806 108448 105375 13694 -9611 82714 78128 140627 143131 114225 66299 81207 56018 106221
746A06221r7184j08431R9294j14192K8319N5469j03424J403n0728P4753L6241
$$ 106221 9037 -99394 -100 -114292 -85973 -30504 -133928 -132525 -183253 -108500 -72259
735g2259n344O0427O3728O8632j4717J065m5925n959k5917j54159N4476k7727
$$ -72259 -77603 -17176 46552 115184 100467 101532 55607 49648 23731 -130428 -75952 -103679
723a03679R337K0027n2383N5821J09166Q6194n0204j49397J18303K9184j8923
$$ -103679 -94342 -74315 -126698 -70877 38289 124483 74279 -75118 43185 72369 53446
712E3446L0975M1714Q8535r7748j55228M1581l610P087P2409o7845K6292m8231
$$ 53446 84421 126135 214670 116922 -38306 3275 -335 6752 79161 11316 37608 -10623
700a0623o9191M8790J6128N1354o0391l7180O0346j35814n200q5305O1713L9209
$$ -10623 -79814 -31024 -14896 36458 -23933 -61113 -767 -136581 -141781 -227086 -165373 -126164
688a26164J34566m676j08949J8609R6453O2490p5812N6500j36447j2905O6912
$$ -126164 8402 3726 -105223 -86614 9839 72329 -3483 53017 -83430 -96335 -29423
677b9423m4156l3907m014J53904o9147K1420m5156J35058L3977l8732p101p2851
$$ -29423 -73579 -107486 -111500 42404 -26743 -5323 -50479 84579 118556 79824 72723 -128
665a28l0559R0625P8280n8166P9653r0255q7121P6120O3741k8389j4003j7686
$$ -128 -30687 59938 138218 80052 159705 69450 -17671 58449 122190 93801 79798 62112
653F2112J14473j294n9789J296q5829n4963m0613o2205j8607K8570J77359n2869
$$ 62112 176585 175291 115502 116798 30969 -23994 -64607 -126812 -145419 -116849 60510 7641
641G641k022k9121o1625l5583J48368r300l506M91q6811k8562J81346N1415k650
$$ 7641 5619 -23502 -85127 -120710 27658 18358 14852 15343 -71468 -100030 81316 132731 130081
628A30081Q1620j18721K9731Q5670j83390m559J29245n1297j0800n0726J49705
$$ 130081 211701 92980 122711 208381 24991 20432 149677 98380 87580 36854 186559
617A86559L3493K5275p8717j20664L4580n9192q7264j08285J9519O1197n791j568
$$ 186559 220052 245327 166610 45946 80526 21334 -65930 -174215 -154696 -93499 -99290 -100858
605a00858N2012J3688Q3666n8337K0461J09671N1344J9440r0747o8046o7294m3405
$$ -100858 -48846 -35158 48508 -9829 10632 120303 171647 191087 100340 32294 -35000 -78405
$$ [...]
##END NTUPLES=NMR SPECTRUM
##END=
