##TITLE=1H_DE-80H_X3
 200.13MHz, d2o
 8 sc
 
 19ns.26.2.2025
##JCAMPDX= 6.0         $$ Bruker NMR JCAMP-DX V2.0
##DATA TYPE= NMR SPECTRUM
##DATA CLASS= NTUPLES
##ORIGIN= UXNMR, Bruker Analytische Messtechnik GmbH
##OWNER= pz
$$ XWIN-NMR		Version 3.5
$$ Mon Oct 27 11:27:40 2025 Russian Standard Time (UT+4h)  Yarkov@DPX200
##.OBSERVE FREQUENCY= 200.1313
##.OBSERVE NUCLEUS= ^1H
##.ACQUISITION MODE= SIMULTANEOUS
##.ACQUISITION SCHEME= undefined
##.AVERAGES= 8
##.DIGITISER RES= 18
##SPECTROMETER/DATA SYSTEM= spect
##.PULSE SEQUENCE= zg30
##.SOLVENT NAME= CDCl3
##.SHIFT REFERENCE= (INTERNAL, CDCl3, 0, 15.4836)
##AUDIT TRAIL= $$ (NUMBER, WHEN, WHO, WHERE, WHAT)
$$ ##TITLE= Audit trail, XWIN-NMR		Version 3.5
$$ ##JCAMPDX= 5.01
$$ ##ORIGIN= Bruker BioSpin GmbH
$$ ##OWNER= Yarkov
$$ C:/Bruker/XWIN-NMR/data/yarkov2/nmr/H-C/1/pdata/1/auditp.txt
$$ ##AUDIT TRAIL=  $$ (NUMBER, WHEN, WHO, WHERE, WHAT)
(   1,<2025-10-27 11:26:27.37 +0400>,<Yarkov>,<DPX200>,
      <created by zg, POWCHK disabled, PULCHK disabled
       configuration hash MD5:
       00 E9 B6 7A A2 85 ED C7 34 08 36 98 17 FE 4E 26
       data hash MD5: 16K
       B3 69 27 9F 45 39 ED 6B 59 5D 76 30 9D 47 72 59>)
(   2,<2025-10-27 11:26:33.07 +0400>,<Yarkov>,<DPX200>,
      <Start of raw data processing
       efp BC_mod = 2 LB = 0.25 FT_mod = 6 PKNL = 1 PHC0 = -4587.661 PHC1 = 9.02191 SI = 16K 
       data hash MD5: 16K
       A5 61 6F 60 20 4D 90 F0 1E F8 9B E5 7E F7 E5 66>)
(   3,<2025-10-27 11:26:43.73 +0400>,<Yarkov>,<DPX200>,
      <abs ABSG = 5 
       data hash MD5: 16K
       54 00 4E C8 D0 D2 E3 0C F7 3F 80 A7 D0 C1 12 3D>)
(   4,<2025-10-27 11:27:04.81 +0400>,<Yarkov>,<DPX200>,
      <pk PHC0 = 5.261888 PHC1 = 3.000003 
       data hash MD5: 16K
       17 73 84 CC AE D5 53 38 BE 03 94 52 55 45 3D B9>)
$$ ##END=
$$ 
$$ hash MD5
$$ A9 2A 38 42 E4 7B A6 85 EA 2D FE DE 6C 10 E1 A1
##$RELAX= 
##$RELAX= 
##$RELAX= 
##$RELAX= 
##$RELAX= 
##$RELAX= 
$$ Bruker specific parameters
$$ --------------------------
##$DU= <C:/Bruker/XWIN-NMR>
##$EXPNO= 1
##$NAME= <H-C>
##$PROCNO= 1
##$TYPE= <nmr>
##$USER= <yarkov2>
##$AMP= (0..31)
100 100 100 100 100 100 100 100 100 100 100 100 100 100 100 100 100 100 
100 100 100 100 100 100 100 100 100 100 100 100 100 100 
##$AQSEQ= 0
##$AQ_mod= 1
##$AUNM= <au_zg>
##$AUTOPOS= <>
##$BF1= 200.13
##$BF2= 200.13
##$BF3= 200.13
##$BF4= 200.13
##$BF5= 200.13
##$BF6= 200.13
##$BF7= 200.13
##$BF8= 200.13
##$BYTORDA= 1
##$CFDGTYP= 0
##$CFRGTYP= 5
##$CHEMSTR= <none>
##$CNST= (0..31)
1 1 145 1 1 1 1 1 1 1 1 1 1 1 1 1 1 1 1 1 1 1 1 1 1 1 1 1 1 1 1 1 
##$CPDPRG= <>
##$CPDPRG1= <>
##$CPDPRG2= <>
##$CPDPRG3= <>
##$CPDPRG4= <mlev>
##$CPDPRG5= <mlev>
##$CPDPRG6= <mlev>
##$CPDPRG7= <mlev>
##$CPDPRG8= <mlev>
##$CPDPRGB= <>
##$CPDPRGT= <>
##$D= (0..31)
0 0.7 0 0 0 0 0 0 0 0 0 0.03 0 0 0 0 0 0 0 0 0 0 0 0 0 0 0 0 0 0 0 0 
##$DATE= 1761549986
##$DBL= (0..7)
120 120 120 120 120 120 120 120 
##$DBP= (0..7)
150 150 150 150 150 150 150 150 
##$DBP07= 0
##$DBPNAM0= <>
##$DBPNAM1= <>
$$ [...]
##$SUBNAM3= <"">
##$SUBNAM4= <"">
##$SUBNAM5= <"">
##$SUBNAM6= <"">
##$SUBNAM7= <"">
##$SUBNAM8= <"">
##$SUBNAM9= <"">
##$SW= 18.0517328524113
##$SWIBOX= (0..15)
0 0 2 0 0 0 0 0 0 0 0 0 0 0 0 0 
##$SW_h= 3612.71676300578
##$TD= 16384
##$TD0= 1
##$TE= 0
##$TE2= 300
##$TE3= 300
##$TEG= 300
##$TL= (0..7)
0 120 120 120 120 120 120 120 
##$TP= (0..7)
150 150 150 150 150 150 150 150 
##$TP07= 0
##$TPNAME0= <>
##$TPNAME1= <>
##$TPNAME2= <>
##$TPNAME3= <>
##$TPNAME4= <>
##$TPNAME5= <>
##$TPNAME6= <>
##$TPNAME7= <>
##$TPOAL= (0..7)
0.5 0.5 0.5 0.5 0.5 0.5 0.5 0.5 
##$TPOFFS= (0..7)
0 0 0 0 0 0 0 0 
##$TUNHIN= 0
##$TUNHOUT= 0
##$TUNXOUT= 0
##$USERA1= <user>
##$USERA2= <user>
##$USERA3= <user>
##$USERA4= <user>
##$USERA5= <user>
##$V9= 5
##$VALIST= <valist>
##$VCLIST= <CCCCCCCCCCCCCCC>
##$VD= 0
##$VDLIST= <DDDDDDDDDDDDDDD>
##$VPLIST= <PPPPPPPPPPPPPPP>
##$VTLIST= <TTTTTTTTTTTTTTT>
##$WBST= 1024
##$WBSW= 4
##$XGAIN= (0..3)
0 0 0 0 
##$XL= 0
##$YL= 0
##$YMAX_a= 89533
##$YMIN_a= -70025
##$ZGOPTNS= <>
##$ZL1= 120
##$ZL2= 120
##$ZL3= 120
##$ZL4= 120
##$ABSF1= 15.48356
##$ABSF2= -2.56829
##$ABSG= 5
##$ABSL= 3
##$ALPHA= 0
##$AQORDER= 0
##$ASSFAC= 0
##$ASSFACI= 0
##$ASSFACX= 0
##$ASSWID= 0
##$AUNMP= <proc_1d>
##$AZFE= 0.1
##$AZFW= 0.1
##$BCFW= 0
##$BC_mod= 2
##$BYTORDP= 0
##$COROFFS= 0
##$CY= -3
##$DATMOD= 1
##$DC= 0
##$DFILT= <>
##$DTYPP= 0
##$F1P= 0
##$F2P= 0
##$FCOR= 1
##$FTSIZE= 16384
##$FT_mod= 6
##$GAMMA= 0
##$GB= 0
##$INTBC= 1
##$INTSCL= 3.241238e-09
##$ISEN= 128
##$LB= 0.25
##$LEV0= 0
##$LPBIN= 0
##$MAXI= 10000
##$MC2= 0
##$MEAN= 0
##$ME_mod= 0
##$MI= 1.114404
##$NCOEF= 0
##$NC_proc= -8
##$NLEV= 6
##$NOISF1= 3.799351
##$NOISF2= 2.8
##$NSP= 0
##$NTH_PI= 0
##$NZP= 0
##$OFFSET= 15.48356
##$PC= 1
##$PHC0= -4582.399
##$PHC1= 12.02191
##$PH_mod= 1
##$PKNL= yes
##$PPARMOD= 0
##$PSCAL= 0
##$PSIGN= 0
##$REVERSE= no
##$SF= 200.130007633997
##$SI= 16384
##$SIGF1= 3
##$SIGF2= 2
##$SINO= 0.751879
##$SIOLD= 32768
##$SREGLST= <19F.Aceton>
##$SSB= 0
##$STSI= 16384
##$STSR= 0
##$SW_p= 3612.71676300578
##$SYMM= 0
##$S_DEV= 0
##$TDeff= 16384
##$TDoff= 0
##$TI= <>
##$TILT= no
##$TM1= 0
##$TM2= 0
##$TOPLEV= 0
##$USERP1= <user>
##$USERP2= <user>
##$USERP3= <user>
##$USERP4= <user>
##$USERP5= <user>
##$WDW= 1
##$XDIM= 16384
##$YMAX_p= 276406767
##$YMIN_p= -1074237
$$ End of Bruker specific parameters
$$ ---------------------------------
##NTUPLES= NMR SPECTRUM
##VAR_NAME=  FREQUENCY,     SPECTRUM/REAL,   SPECTRUM/IMAG
##SYMBOL=    X,             R,               I
##VAR_TYPE=  INDEPENDENT,   DEPENDENT,       DEPENDENT
##VAR_FORM=  AFFN,          ASDF,            ASDF
##VAR_DIM=   16384,         16384,           16384
##UNITS=     HZ,            ARBITRARY UNITS, ARBITRARY UNITS
##FACTOR=    0.220516191357247, 1,           1
##FIRST=     3098.72490264244, 0,            0
##LAST=      -513.991860363338, 0,           0
##MIN=       -513.991860363338, -1074237,    0
##MAX=       3098.72490264244, 276406767,    0
$$ Real data points
##PAGE= N=1
##DATA TABLE= (X++(R..R)), XYDATA
$$ [...]
$$ plain form
7625 -453638 -484670 -524303 -428785 -354068 -275973 -357796 -342031 -165450 -180946 -314057 -285500
7614 -285500 -260206 -433779 -220981 -135766 -130351 -71919 4255 45922 158365 103068 14704
7603 14704 -57493 -80247 -25111 119917 40691 43293 48678 63094 166339 84584 117516 16283
7591 16283 30443 23815 41854 148941 90217 -68770 -12653 60375 145997 140758 179194 135020
7579 135020 216696 229506 286940 245119 308318 517885 533880 466931 540694 499942 447218
7568 447218 601477 543508 503950 446088 477496 429881 493281 570494 448416 466050 306484
7557 306484 289932 370807 377974 280975 285797 219081 93245 181295 76864 147898 58964 134064
7545 134064 -4750 49693 262496 208114 296177 244885 281599 305530 305378 126414 74854
$$ packed form
7625d53638l1032l9633R5518P4717P8095q1823J5765J76581j5496j33111K8557
7614b85500K5294j73573K12798Q5215N415N8432P6174M1667J12443n5297q8364
7603A4704p2197k2754N5136J45028p9226K602N385J4416J03245q1755L2932j01233
7591A6283J4160o628J8039J07087n8724j58987N6117P3028Q5622n239L8436m4174
7579A35020Q1676J2810N7434m1821O3199K09567J5995o6949P3763m0752n2724
7568D47218J54259n7969l9558n7862L1408m7615O3400P7213j22078J7634j59566
7557C06484j6552Q0875P167r6999M822o6716j25836Q8050j04431P1034q8934P5100
7545A34064j38814N4443K12803n4382Q8063n1292L6714K3931j52j78964n1560
$$ plain form
7534 74854 147118 50052 15027 78557 31454 -59127 -26683 -52927 -104539 -170994 -255345 -269027
7522 -269027 -200836 -282784 -229191 -221397 -123858 -100877 -200777 -323247 -430044 -295148 -242010
7511 -242010 -66877 -84845 -80287 -107232 -213635 -249638 -345233 -355785 -312465 -183058 -197851
7500 -197851 -166110 -280586 -408071 -386388 -306806 -343953 -458742 -377871 -323791 -350437 -357773
7489 -357773 -374357 -314061 -324035 -482671 -428090 -316705 -336596 -404830 -319567 -303505 -405190
7478 -405190 -372782 -415760 -353690 -289721 -228734 -278273 -454244 -335233 -424660 -492812 -516599
7467 -516599 -574334 -579779 -401809 -253558 -287683 -409991 -432344 -364115 -423230 -458754 -488180
7456 -488180 -462824 -601550 -467048 -586745 -491149 -424139 -536854 -556722 -585060 -418191 -440451
$$ packed form
7534G4854P2264r7066l5025O3530m7103r0581L2444k6244n1612o6455q4351j3682
7522b69027O8191q1948N3593P794R7539K2981r9900j22470j06797J34896N3138
7511b42010J75133j7968M558k6945j06403l6003r5595j0552M3320J29407j4793
7500a97851L1741j14476j27485K1683P9582l7147j14789Q0871N4080k6646p336
7489c57773j6584O0296r974j58636N4581J11385j9891o8234Q5263J6062j01685
7478d05190L2408m2978O2070O3969O0987m9539j75971J19011q9427o8152k3787
7467e16599n7735n445J77970J48251l4125j22308k2353O8229n9115l5524k9426
7456d88180K5356j38726J34502j19697R5596O7010j12715j9868k8338J66869k2260
$$ plain form
7445 -440451 -393146 -390394 -424574 -430301 -481150 -565793 -577487 -487324 -444152 -480037 -552726 -459655
7433 -459655 -562297 -585811 -555060 -538937 -521342 -606195 -596474 -626941 -573452 -385480 -364676
7422 -364676 -402956 -409282 -468444 -496328 -496846 -425033 -363407 -318259 -386212 -324804 -313595 -484652
7410 -484652 -490222 -458256 -431286 -550272 -527239 -418379 -314269 -297572 -384381 -394128 -318744
7399 -318744 -233047 -182825 -167885 -173818 51244 190847 333685 294903 563450 669405 674104
7388 674104 614639 539251 407900 238351 118402 88630 31691 -155187 -33308 -31325 -230389
7377 -230389 -293563 -329088 -265349 -205248 -232877 -323760 -235571 -256739 -336156 -288158 -398973
7366 -398973 -498118 -374465 -279121 -333981 -437818 -244524 -235582 -270493 -270555 -307657 -228745 -266841
$$ packed form
7445d40451M7305K752l4180n727n0849q4643j1694R0163M3172l5885p2689R3071
7433d59655j02642k3514L0751J6123J7595q4853R721l0467N3489J87972K0804
7422c64676l8280o326n9162k7884n18P1813O1626M5148o7953O1408J1209j71057
7410d84652n570L1966K6970j18986K3033J08860J04110J6697q6809r747P5384
7399c18744Q5697N0222J4940n933K25062J39603J42838l8782K68547J05955M699
7388F74104n9465p5388j31351j69549j19949k9772n6939j86878J21879J983j99064
7377b30389o3174l5525O3739O0101k7629r0883Q8189k1168p9417M7998j10815
7366c98973r9145J23653R5344n4860j03837J93294Q942l4911o2l7102P8912l8096
$$ plain form
7354 -266841 -370327 -467670 -437650 -547244 -394227 -345434 -434850 -337503 -350885 -299146 -204243
7343 -204243 -420301 -288634 -198850 -185977 -239373 -248712 -269768 -356180 -293495 -267052 -310564
7332 -310564 -265987 -255410 -383439 -280013 -226334 -204881 -146028 -104707 -200086 -107835 53985
7321 53985 -28589 -176643 -339554 -454749 -363934 -217590 -90634 -170291 -236159 -103795 -65462
7310 -65462 -56114 -90710 -41261 -68691 -64186 6094 -94913 -149937 -46117 -133876 -111129 -56522
7298 -56522 43233 -80364 -104613 2025 83368 -105552 24668 199635 190997 165120 22952
7287 22952 -28938 -55845 -103458 16972 94155 -19308 51440 143951 -9131 -31354 180232
7276 180232 207984 -1574 97054 241157 244875 268827 344442 315850 216599 350401 363164
$$ packed form
7354b66841j03486r7343L0020j09594J53017M8793q9416R7347j3382N1739R4903
7343b04243k16058J31667Q9784J2873n3396r339k1056q6412O2685K6443m3512
7332c10564M4577J0577j28029J03426N3679K1453N8853M1321r5379R2251J61820
7321E3985q2574j48054j62911j15195R0815J46344J26956p9657o5868J32364L8333
7310f5462R348l4596M9449k7430M505P0280j01007n5024J03820q7759K2747N4607
7298e6522R9755j23597k4249J06638Q1343j88920J30220J74967q638k5877j42168
7287B2952n1890k6907m7613J20430P7183j13463P0748R2511j53082k2223K11586
7276A80232K7752k09558R8628J44103L718K3952P5615k8592r9251J33802J2763
$$ plain form
7265 363164 375887 426650 559005 562593 511841 535479 684251 637660 737402 718408 629058
7254 629058 736138 754673 862263 919830 985493 1070386 1138645 1224007 1192912 1468266 1575242
7243 1575242 1634084 1793806 1980535 2017498 2270399 2410633 2548103 2736143 2847395 3025378
7233 3025378 3304514 3521192 3809116 3747269 3953347 4266722 4444481 4845753 5166152 5486468
7223 5486468 5784279 6246556 6679557 7200329 7726902 8309271 8853878 9467437 10067622 10902743
7213 10902743 11574804 12045360 12565866 13009633 13465615 13700803 13921627 14141737 14222719 14179384
7203 14179384 14078772 13938463 13584036 13205420 12767629 12316212 11936952 11304760 10627047
7194 10627047 10174581 9563775 8942436 8425023 7983741 7471617 6991873 6407420 6101506
$$ packed form
7265C63164J2723N0763J32355L588n0752K3638J48772m6591R9742j8994q9350
7254F29058J07080J8535J07590N7567O5663Q4893O8259Q5362l1095K75354J06976
7243A575242N8842J59722J86729L6963K52901J40234J37470J88040J11252J77983
7233C025378K79136K16678K87924o1847K06078L13375J77759M01272L20399L20316
7223E486468K97811M62277M33001N20772N26573N82369N44607O13559O00185Q35121
7213A0902743O72061M70556N20506M43767M55982K35188K20824K20110Q0982m3335
7203A4179384j00612j40309l54427l78616m37791m51417l79260o32192o77713
7194A0627047m52466o10806o21339n17413m41282n12124m79744n84453l05914
$$ plain form
7185 6101506 5825869 5377129 5063189 4714423 4390485 4096270 3751331 3454328 3339145 3189473
7175 3189473 3019877 2688819 2537297 2356305 2130628 2005083 1891594 1795256 1538767 1449801
7165 1449801 1440208 1372567 1226381 1273603 1094195 1240857 1185789 1036055 871843 765543
7155 765543 833234 868446 823312 688779 670609 625248 562949 619983 607226 553012 612002
7144 612002 430903 331229 314230 385392 376929 271200 340652 288224 343779 261506 42871
7133 42871 46005 81513 167474 160245 194848 241926 275068 296589 282515 124103 108464 53612
7121 53612 50117 98294 43829 -34217 -32961 84562 183579 115540 118822 70193 138406 83153
7109 83153 72927 146912 276279 301132 272050 426107 616999 766865 830710 1010453 943850
$$ packed form
7185F101506k75637m48740l13940l48766l23938k94215l44939k97003j15183j49672
7175C189473j69596l31058j51522j80992k25677j25545j13489r6338k56489q8966
7165A449801r593o7641j46186M7222j79408J46662n5068j49734j64212j06300
7155G65543O7691L5212m5134j34533j8170m5361o2299N7034j2757n4214N8990
7144F12002j81099r9674j6999P1162q463j05729O9452n2428N5555q2273k18635
7133D2871L134L5508Q5961p229L4603M7078L3142K1521j4074j58412j5639n4852
7121E3612l495M8177n4465p8046J256J17523R9017o8039L282m8629O8213n5253
7109H3153j0226P3985J29367K4853k9082J54057J90892J49866O3845J79743o6603
$$ plain form
7098 943850 983991 1047986 1182955 1172581 1160091 1305952 1384972 1245207 1088001 965091 743432
7087 743432 616739 453821 416214 425046 313062 213177 269920 143543 23798 8586 4781
7076 4781 -17337 62716 -37135 -124477 -90249 -199812 -365928 -272316 -215406 -335566 -279587
7065 -279587 -243667 -309047 -112581 -128868 -74218 -49024 -119690 -411505 -458028 -308608 -165797
7054 -165797 -154487 -258522 -88698 -126184 -131216 -395361 -371992 -316177 -332897 -383945 -429025
7043 -429025 -393347 -366912 -428018 -366942 -320965 -354489 -412500 -516914 -374774 -426130 -438939
7032 -438939 -373795 -413481 -395425 -276143 -338490 -385644 -190240 -263143 -323534 -333302 -452178
7021 -452178 -353011 -200971 -376419 -392557 -355448 -259709 -280219 -290166 -128500 -194848 -167574
$$ packed form
7098I43850M0141O3995J34969j0374j2490J45861P9020j39765j57206j22910k21659
7087G43432j26693j62918l7607Q832j11984r9885N6743j26377j19745j5212l805
7076D781k2118Q0053r9851q7342L4228j09563j66116R3612N6910j20160N5979
7065b79587L5920o5380J96466j6287N4650K5194p0666k91815m6523J49420J42811
7054a65797J1310j04035J69824l7486n032k64145K3369N5815j6720n1048m5080
7043d29025L5678K6435o1106O1076M5977l3524n8011j04414J42140n1356j2809
7032d38939O5144l9686J8056J19282o2347m7154J95404p2903o0391r768j18876
7021d52178R9167J52040j75448j6138L7109R5739k0510r947J61666o6348K7274
$$ plain form
7010 -167574 -105345 -199888 -241172 -289771 -299084 -219647 -271471 -315754 -345478 -392774 -438976 -419484
6998 -419484 -501743 -405070 -284372 -383435 -528035 -571710 -548399 -582195 -494418 -417000 -511932
6987 -511932 -618496 -531053 -370246 -283694 -176066 -151431 -265379 -271587 -330968 -324839 -374275
6976 -374275 -340394 -315211 -193408 -158753 -203863 -202142 -231765 -351153 -474240 -520042 -446047
6965 -446047 -495176 -541007 -592405 -522344 -484993 -507154 -380548 -461085 -502910 -441396 -474014
6954 -474014 -483887 -569758 -515453 -435035 -506607 -552407 -440579 -427625 -446871 -488030 -471683 -484169
6942 -484169 -530280 -475286 -627413 -546399 -539765 -566849 -580898 -542880 -456967 -514365 -530981 -477736
6930 -477736 -376190 -437856 -464333 -400104 -443379 -398438 -334672 -396966 -491868 -359537 -305725
$$ packed form
7010a67574O2229r4543m1284m8599r313P9437n1824m4283k9724m7296m6202J9492
6998d19484q2259R6673J20698r9063j44600m3675K3311l3796Q7777P7418r4932
6987e11932j06564Q7443J60807Q6552J07628K4635j13948o208n9381O129m9436
6976c74275L3881K5183J21803L4655m5110J721k9623j19388j23087m5802P3995
6965d46047m9129m5831n1398P0061L7351k2161J26606q0537m1825O1514l2618
6954d74014r873q5871N4305Q0418p1572m5800J11828J2954j9246m1159J6347j2486
6942d84169m6111N4994j52127Q1014O634k7084j4049L8018Q5913n7398j6616N3245
6930d77736J01546o1666k6477O4229m3275M4941O3766o2294r4902J32331N3812
$$ plain form
6919 -305725 -224877 -260189 -326776 -524353 -405490 -298608 -369801 -412897 -399994 -287438 -210841
6908 -210841 -305265 -212852 -154590 -363001 -320584 -270867 -349948 -393686 -404849 -439800 -589167
6897 -589167 -676369 -602645 -535930 -503162 -452825 -428080 -359705 -415696 -387163 -317999 -419077
6886 -419077 -334699 -394344 -294602 -228479 -306354 -348161 -528806 -448504 -427698 -463981 -438620
6875 -438620 -351437 -338844 -383954 -413255 -531738 -511849 -441619 -473450 -393131 -353097 -309457
6864 -309457 -361344 -452480 -469986 -403614 -560515 -654775 -620538 -728179 -642541 -615467 -620392
6853 -620392 -622584 -534053 -515886 -489441 -623152 -714377 -603570 -663262 -700210 -730798 -706307
6842 -706307 -575307 -545608 -561980 -578463 -510976 -555284 -511614 -618031 -694505 -561363 -426753
$$ packed form
6919c05725Q0848l5312o6587j97577J18863J06882p1193m3096J2903J12556P6597
6908b10841r4424R2413N8262k08411M2417M9717p9081m3738j1163l4951j49367
6897e89167q7202P3724O6715L2768N0337K4745O8375n5991K8533O9164j01078
6886d19077Q4378n9645R9742O6123p7875m1807j80645Q0302K0806l6283K5361
6875d38620Q7183J2593m5110k9301j18483J9889P0230l1831Q0319M0034M3640
6864c09457n1887r1136j7506O6372j56901r4260L4237j07641Q5638K7074m925
6853f20392k192Q8531J8167K6445j33711r1225J10807n9692l6948l0588K4491
6842g06307J31000K9699j6372j6483O7487m4308M3670j06417p6474J33142J34610
$$ plain form
6831 -426753 -415017 -624768 -741219 -676231 -623533 -653672 -640948 -576686 -679195 -731696 -563365
6820 -563365 -671083 -770184 -757111 -725165 -658448 -767075 -774699 -744449 -720595 -740921 -652778
6809 -652778 -624746 -504409 -610227 -719783 -813715 -834144 -869354 -889614 -887966 -946995 -908947
6798 -908947 -820677 -813285 -816326 -807960 -722963 -708551 -731588 -711741 -721037 -660080 -825096 -796997
6786 -796997 -604489 -715504 -705587 -576643 -691559 -594537 -516710 -505167 -647034 -491039 -461027
6775 -461027 -519868 -598293 -584792 -570672 -637007 -609173 -658307 -804649 -827326 -782171 -653540
6764 -653540 -638448 -696342 -623042 -762814 -674891 -656760 -648694 -705190 -617229 -721334 -808335
6753 -808335 -822487 -875388 -835230 -763366 -620849 -696736 -769517 -703274 -674622 -622484 -561657
$$ packed form
6831d26753J1736k09751j16451O4988N2698l0139J2724O4262j02509n2501J68331
6820e63365j07718r9101J3073L1946O6717j08627p624L0250K3854k0326Q8143
6809f52778K8032J20337j05818j09556r3932k0429l5210k0260J648n9029L8048
6798i08947Q8270P392l041Q366Q4997J4412k3037J9847r296O0957j65016K8099
6786g96997J92508j11015R917J28944j14916R7022P7827J1543j41867J55995L0012
6775d61027n8841p8425J3501J4120o6335K7834m9134j46342k2677M5155J28631
6764f53540J5092n7894P3300j39772Q7923J8131Q066n6496Q7961j04105q7001
6753h08335j4152n2901M0158P1864J42517p5887p2781O6243K8652N2138O0827
$$ plain form
6742 -561657 -710380 -675885 -612213 -555963 -408890 -311094 -212463 -265475 -231710 -203469 -229025
6731 -229025 -202609 -317331 -211813 -120206 -236748 -212172 -138561 -79303 -51894 -108804 -88064
6720 -88064 -36782 39729 2975 -23226 60510 32381 -52129 21018 11048 24095 -12459 31020
6708 31020 108828 154918 207176 283523 146413 104520 44741 -124929 -198873 -170418 -122605
6697 -122605 -60317 -61340 -59928 37640 -21491 -143090 -137872 -174845 -298930 -272362 -301525 -322847
6685 -322847 -249859 -370283 -416897 -381176 -526726 -547146 -533655 -473353 -375002 -300119 -320111
6674 -320111 -263127 -255508 -288081 -180747 -45946 -123224 -142763 -88152 -20024 -155916 -208255
6663 -208255 -251251 -143918 -178891 -328776 -329416 -313377 -356929 -356863 -317113 -285513 -255636 -282400
$$ packed form
6742e61657j48723L4495O3672N6250J47073R7796R8631n3012L3765K8241k5556
6731b29025K6416j14722J05518R1607j16542K4576P3611N9258K7409n6910K0740
6720h8064N1282P6511l6754k6201Q3736k8129q4510P3147r970J3047l6554M3479
6708C1020P7808M6090N2258P6347j37110m1893n9779j69670p3944K8455M7813
6697a22605O2288j023J412R7568n9131j21599N218l6973j24085K6568k9163k1322
6685c22847P2988j20424m6614L5721j45550k0420J3491O0302R8351P4883j9992
6674c20111N6984P619l2573J07334J34801p7278j9539N4611O8128j35892n2339
6663b08255m2996J07333l4973j49885o40J6039m3552O6L9750L1600K9877k6764
$$ plain form
6651 -282400 -292768 -193543 -133029 -78945 -208546 -276174 -303464 -366578 -367739 -266219 -154600
6640 -154600 -95947 -154002 -313024 -379576 -398767 -320420 -329554 -399132 -405118 -318111 -333478 -200168
6628 -200168 -215592 -196569 -309049 -289920 -210285 -102260 -153799 -275356 -179523 -137269 -323524
6617 -323524 -220215 -209128 -273416 -245806 -230861 -166837 -283667 -430136 -252488 -218596 -242722
6606 -242722 -205640 -145254 -244675 -296409 -195531 -82883 -8035 -29009 -134799 -269150 -179480
6595 -179480 -89331 -21222 -42126 -101657 -60544 30891 -178146 -91741 58345 61218 7591
6584 7591 139214 251134 223215 211580 280583 270072 355522 428667 560242 672467 643099
6573 643099 619256 562672 525762 515813 488786 550353 573920 612011 516431 673914 864573
$$ packed form
6651b82400j0368R9225O0514N4084j29601o7628k7290o3114j161J01520J11619
6640a54600N8653n8055j59022o6552j9191P8347r134o9578n986Q7007j5367J33310
6628b00168j5424J9023j12480J9129P9635J08025n1539j21557R5833M2254j86255
6617c23524J03309J1087o4288K7610J4945O4024j16830j46469J77648L3892k4126
6606b42722L7082O0386r9421n1734J00878J12648P4848k0974j05790j34351Q9670
6595a79480R0149O8109k0904n9531M1113R1435k09037Q6405J50086K873n3627
6584G591J31623J11920k7919j1635O9003j0511Q5450P3145J31575J12225k9368
6573F43099k3843n6584l6910r949k7027O1567K3567L8091r5580J57483J90659
$$ plain form
6562 864573 873116 1108025 1091862 1186069 1459941 1701091 2004361 2443978 2807040 3138400
6552 3138400 3647036 4330921 4711268 4992921 5370903 5487588 5346542 4818775 4473404 4135348
6542 4135348 3751714 3327911 2919841 2756588 2481455 2442638 2417246 2319421 2417393 2487556
6532 2487556 2576854 2578473 2452776 2363313 2168733 1959935 1755591 1612755 1637810 1336274
6522 1336274 1085204 1041281 928625 980032 857878 843581 862126 891040 856646 752819 765252
6511 765252 595713 503181 506278 457264 520568 513495 584118 566458 463667 519229 416269
6500 416269 512777 611901 660709 583568 574532 623058 459934 435063 440897 305280 358938 388825
6488 388825 394877 401389 528296 622724 573407 627474 529698 543825 572802 589313 587144 604219
$$ packed form
6562H64573Q543K34909j6163R4207K73872K41150L03270M39617L63062L31360
6552C138400N08636O83885L80347K81653L77982J16685j41046n27767l45371l38056
6542D135348l83634m23803m08070j63253k75133l8817k5392r7825R7972P0163
6532B487556Q9298J619j25697q9463j94580k08798k04344j42836K5055l01536
6522A336274k51070m3923j12656N1407j22154j4297J8545K8914l4394j03827J2433
6511G65252j69539r2532L097m9014O3304p073P0623j7660j02791N5562j02960
6500D16269R6508R9124M8808p7141r036M8526j63124k4871N834j35617N3658K9887
6488C88825O052O512J26907R4428m9317N4067r7776J4127K8977J6511k169J7075
$$ plain form
6476 604219 570864 760245 800611 723935 676586 648649 729252 832408 923067 971017 948297
6465 948297 1104028 1143667 931601 982235 1019009 1080560 1137934 1250501 1291922 1318232 1328843
6454 1328843 1218906 1445845 1511040 1636949 1872930 1794350 1726754 1871544 1953752 1964858
6444 1964858 1984448 1945528 2040664 2121712 2208513 2293476 2443661 2442041 2529984 2624019 2591531
6433 2591531 2585542 2558677 2569173 2552146 2769793 2881812 2803121 2761040 2766136 2827637 2864314
6422 2864314 2998648 3225300 3295118 3333430 3254237 3478749 3708937 3578015 3713555 3992556
6412 3992556 4362894 4499223 4588146 4648065 4534097 4528670 4540888 4592553 4544019 4652069 4860196
6401 4860196 5035112 5034822 4973912 5159688 5442097 5756251 5971411 6026570 6194710 6518498
$$ packed form
6476F04219l3355J89381M0366p6676m7349k7937Q0603J03156R0659M7950k2720
6465I48297J55731L9639k12066N0634L6774O1551N7374J12567M1421K6310J0611
6454A328843j09937K26939O5195J25909K35981p8580o7596J44790Q2208J1106
6444A964858J9590l8920R5136Q1048Q6801Q4963J50185j620Q7943R4035l2488
6433B591531n989k6865J0496j7027K17647J12019p8691m2081N096O1501L6677
6422B864314J34334K26652O9818L8312p9193K24512K30188j30922J35540K79001
6412C992556L70338J36329Q8923N9919j13968n427J2218N1665m8534J08050K08127
6401D860196J74916k90o0910J85776K82409L14154K15160N5159J68140L23788
$$ plain form
6391 6518498 6733808 6918650 7185003 7376862 7662439 8193987 8823975 9674081 11047322
6382 11047322 12662692 14668116 17290453 19954620 23105273 26871338 31176621 36547608
6374 36547608 43176507 50078163 53653190 50328191 43525068 37918465 33839517 30875989
6366 30875989 28865495 27327149 26444138 25883771 25710857 25482364 24850982 24266317 23839093
6357 23839093 23816147 24170432 24512909 25178980 25856263 26400778 26650192 26611897 26332264 26029048
6347 26029048 26032765 26380418 26813056 27402382 28092711 28348852 28659740 29092426 29707257 31179702
6337 31179702 33167619 35575831 38679490 42246710 46526802 51214605 56136649 60380670
6329 60380670 62892503 62768232 59958579 55174796 50334370 46166024 43228062 41067982
$$ packed form
6391F518498K15310J84842K66353J91859K85577N31548O29988Q50106J373241
6382A1047322J615370K005424K622337K664167L150653L766065M305283N370987
6374C6547608O628899O901656L575027l324999o803123n606603m078948k963528
6366C0875989k010494j538346q83011n60367j72914k28493o31382n84665m27224
6357B3839093k2946L54285L42477O66071O77283N44515K49414l8295k79633l03216
6347B6029048L717L47653M32638N89326O90329K56141L10888M32686O14831J472445
6337C1179702J987917K408212L103659L567220M280092M687803M922044M244021
6329F0380670K511833j24271k809653m783783m840426m168346k937962k160080
$$ plain form
6321 41067982 39855136 39514874 39975746 41467264 43630847 46576721 50298633 54736819
6313 54736819 59743149 64509929 67971000 69931485 70559699 70073243 67995497 64074455
6305 64074455 58806470 53259902 48376839 44006413 40505699 37517548 35496970 33966083
6297 33966083 32968622 32590463 32423981 32837845 33781420 35113763 36734748 38886670 41580803
6288 41580803 44846604 48627039 52990318 57623983 61880748 65014842 66709533 66750635
6280 66750635 65626542 63383284 59971942 55423407 50820290 46633429 43259092 40762832
6272 40762832 39368746 38792940 38903563 39722058 41294895 43372327 46149678 49586657 53384429
6263 53384429 56855120 59092797 59157802 56892347 53024033 48385954 43861191 39900464
$$ packed form
6321D1067982j212846l40262M60872J491518K163583K945874L721912M438186
6313E4736819N006330M766780L461071J960485O28214m86456k077746l921042
6305F4074455n267985n546568m883063m370426l500714k988151k020578j530887
6297C3966083r97461l78159j66482M13864R43575J332343J620985K151922K694133
6288D1580803L265801L780435M363279M633665M256765L134094J694691M1102
6280F6750635j124093k243258l411342m548535m603117m186861l374337k496260
6272D0762832j394086n75806J10623Q18495J572837K077432K777351L436979L797772
6263E3384429L470691K237677O5005k265455l868314m638079m524763l960727
$$ plain form
6255 39900464 36554476 33871115 31802624 30235675 29156338 28531122 28222257 27865814 27280858
6246 27280858 26380878 25564781 24670790 24040676 23426215 22955311 22705948 22366887 21597340
6237 21597340 20673798 19606859 18566344 17702502 17059991 16670127 16434150 16168313 15860475
6228 15860475 15411607 14720470 13672007 12568631 11470501 10505203 9689770 8996376 8487183
6219 8487183 7925752 7546064 7198316 6800057 6400153 6103919 5827106 5643044 5494039 5358054
6209 5358054 5210250 5200000 5027698 4735525 4566606 4698836 4621486 4536851 4441313 4401342
6199 4401342 4318082 4273436 4330311 4391528 4356958 4293695 4392379 4467026 4298905 4355738 4433842
6188 4433842 4384717 4435406 4495577 4398524 4195143 4204342 4076528 4089594 4147824 4108856 3980039
$$ packed form
6255C9900464l345988k683361k068491j566949j079337o25216l08865l56443n84956
6246B7280858q99980q16097q93991o30114o14461m70904k49363l39061p69547
6237B1597340r23542j066939j040515q63842o42511l89864k35977k65837l07838
6228A5860475m48868o91137j048463j103376j098130r65298q15433o93394n09193
6219H487183n61431l79688l47748l98259l99904k96234k76813j84062j49005j35985
6209E358054j47804j0250j72302k92173j68919J32230p7350q4635r5538l9971
6199D401342q3260m4646N6875O1217l4570o3263R8684P4647j68121N6833P8104
6188D433842m9125N0689O0171r7053k03381R199j27814J3066N8230l8968j28817
$$ plain form
6177 3980039 4034120 3981939 3963300 3955022 4005422 4027589 4042506 4024032 3922865 3793700 3783846
6166 3783846 3784564 3817665 3898826 3753308 3650328 3667815 3679184 3647778 3602976 3563475 3695407
6155 3695407 3637744 3482560 3466454 3511964 3535087 3473630 3476960 3514045 3548474 3590295 3290505
6144 3290505 3185514 3141556 2909615 2876445 2668386 2578359 2574604 2780907 2719519 2523020 2557996
6133 2557996 2352028 2344553 2198279 2162322 2287255 2222500 2160017 1961161 2013922 1896930 1821139
6122 1821139 1775739 1762660 1788014 1712021 1789110 1834978 1780405 1704316 1737016 1859724 1912944
6111 1912944 1856459 1875901 1806159 1524136 1568428 1726057 1762185 1696232 1625876 1581423 1594807
6100 1594807 1641428 1606473 1481230 1444866 1409529 1430373 1485584 1508410 1506755 1484774 1615969
$$ packed form
6177C980039N4081n2181j8639q278N0400K2167J4917j8474j01167j29165r854
6166C783846P18L3101Q1161j45518j02980J7487J1369l1406m4802l9501J31932
6155C695407n7663j55184j6106M5510K3123o1457L330L7085L4429M1821k99790
6144C290505j04991m3958k31941l3170k08059r0027l755K06303o1388j96499L4976
6133B557996k05968p475j46274l5957J24933o4755o2483j98856N2761j16992p5791
6122A821139m5400j3079K5354p5993P7089M5868n4573p6089L2700J22708N3220
6111A912944n6485J9442o9742k82023M4292J57629L6128o5953p0356m4453J3384
6100A594807M6621l4955j25243l6364l5337K0844N5211K2826j655k1981J31195
$$ plain form
6089 1615969 1648304 1600213 1617688 1599884 1638139 1747565 1519290 1551191 1668699 1676434 1589513
6078 1589513 1476612 1483428 1558631 1448165 1444653 1605557 1680443 1640266 1546554 1464043 1636076
6067 1636076 1750970 1768143 1918377 1911738 1967917 1942458 2022746 2000843 2146295 2280957 2299951
6056 2299951 2318215 2346884 2392272 2281572 2405297 2380732 2342686 2354485 2258092 2234725 2291106
6045 2291106 2113058 2085103 2208558 2155512 2143850 2116959 1895977 1887438 2046465 2062239 1957813
6034 1957813 1968488 2154282 2256014 2350323 2325282 2281751 2225257 2244327 2356086 2356779 2296642
6023 2296642 2277865 2398050 2475610 2435102 2365202 2285316 2202164 2234043 2315099 2486025 2601172
6012 2601172 2605391 2674821 2604064 2550303 2725697 2722897 2579215 2516918 2485847 2396877 2362254
$$ packed form
6089A615969L2335m8091J7475j7804L8255J09426k28275L1901J17508P735q6921
6078A589513j12901O816P5203j10466l512J60904P4886m0177r3712q2511J72033
6067A636076J14894J7173J50234o639N6179k5459Q0288k1903J45452J34662J8994
6056B299951J8264K8669M5388j10700J23725k4565l8046J1799r6393k3367N6381
6045B291106j78048k7955J23455n3046j1662k6891k20982q539J59027J5774j04426
6034A957813J0675J85794J01732R4309k5041m3531n6494J9070J11759O93o0137
6023B296642j8777J20185P7560m0508o9900p9886q3152L1879Q1056J70926J15147
6012B601172M219O9430p0757n3761J75394k800j43682o2297l1071q8970l4623
$$ plain form
6001 2362254 2375814 2347649 2226325 2134025 2069303 2028753 2134179 2119483 2101328 2147975 2157298
5990 2157298 2304615 2370731 2427916 2589682 2522508 2686075 2837964 2797867 2894431 2832142 2885621
5979 2885621 2889891 2881894 2802422 2707667 3028105 3239930 3099377 3133082 3301819 3817692 4137998
5968 4137998 4250069 4536773 4808609 5196567 5619439 6065655 6118992 6200499 6097230 5730772
5958 5730772 5400930 5033259 4595189 4343278 4069175 3820864 3634620 3582817 3525924 3512283
5948 3512283 3507210 3405067 3151583 3059895 3037227 2971569 3021203 2955536 2934635 2940562 2890468
5937 2890468 2636660 2595929 2507433 2576298 2537538 2355388 2406505 2332697 2372788 2330074 2254886
5926 2254886 2249289 2272244 2372571 2482613 2444620 2499546 2422085 2494517 2613367 2575579 2513899
$$ packed form
6001B362254J3560k8165j21324r2300o4722m0550J05426j4696j8155M6647R323
5990B157298J47317O6116N7185J61766o7174J63567J51889m0097R6564o2289N3479
5979B885621M270p997p9472r4755L20438K11825j40553L3705J68737N15873L20306
5968D137998J12071K86704K71836L87958M22872M46216N3337Q1507j03269l66458
5958E730772l29842l67671m38070k51911k74103k48311j86244n1803n6893j3641
5948C512283n073j02143k53484r1688k2668o5658M9634o5667k0901N927n0094
5937B890468k53808m0731q8496O8865l8760j82150N1117p3808M0091m2714p5188
5926B254886n597K2955J00327J10042l7993N4926p7461P2432J18850l7788o1680
$$ plain form
5915 2513899 2383496 2370752 2416625 2469864 2396995 2289893 2400974 2557114 2725151 2793031
5905 2793031 2886369 2960089 3083416 3130775 3262392 3361291 3296799 3198028 3268190 3352028 3318636
5894 3318636 3375012 3440335 3598891 3629498 3691216 3649492 3825458 3829272 3874081 3793686 3759515
5883 3759515 3749385 3607424 3510072 3533119 3389364 3320532 3238343 3288107 3222935 3129299 3299791
5872 3299791 3156725 3212748 3293990 3372170 3244961 3090413 2993642 2804638 2629205 2649094
5862 2649094 2669412 2681578 2703502 2755103 2777140 2744623 2753901 2858429 2903811 2963090 2947996
5851 2947996 2903398 2899746 2916460 2896227 2819401 2804233 2632876 2418978 2461637 2503632 2434930
5840 2434930 2338404 2339250 2426655 2364308 2418008 2541131 2704007 2766004 2845300 2946787 3151439
$$ packed form
5915B513899j30403j2744M5873N3239p2869j07102J11081J56140J68037O7880
5905B793031R3338P3720J23327M7359J31617R8899o4492r8771P0162Q3838l3392
5894C318636N6376O5323J58556L0607O1718m1724J75966L814M4809q0395l4171
5883C759515j0130j41961r7352K3047j43755o8832q2189M9764o5172r3636J70492
5872C299791j43066N6023Q1242P8180j27209j54548r6771j89004j75433J9889
5862B649094K0318J2166K1924N1601K2037l2517R278J04528M5382N9279j5094
5851B947996m4598l652J6714k0233p6826j5168j71357k13898M2659M1995o8702
5840B434930r6526Q46Q7405o2347N3700J23123J62876O1997P9296J01487K04652
$$ plain form
5829 3151439 3352490 3525477 3531561 3453550 3714022 3954337 4127172 4350409 4495142 4581433
5819 4581433 4611184 4502541 4421754 4376584 4286338 4213886 4385166 4166155 3891707 3863521 3740874
5808 3740874 3658955 3555758 3402570 3398184 3414397 3369809 3310661 3248597 3180821 3006541 2894690
5797 2894690 2692903 2602193 2504640 2318537 2297322 2390979 2473167 2355533 2323260 2357135 2365608
5786 2365608 2514377 2529035 2559541 2560620 2663599 2544754 2624516 2692589 2828119 2913820 2951841
5775 2951841 2852078 2856856 2757100 2780492 2787093 2649105 2678805 2740595 2795635 2750800 2821145 2750577
5763 2750577 2764473 2824589 2886775 2924393 2940194 3110932 3225095 3362994 3301702 3269413 3120857
5752 3120857 2866617 2859491 2711269 2596586 2474177 2376672 2384237 2261361 2099353 2097138 2076721
$$ packed form
5829C151439K01051J72987O084p8011K60472K40315J72835K23237J44733Q6291
5819D581433K9751j08643q0787m5170r0246p2452J71280k19011k74448k8186j22647
5808C740874q1919j03197j53188m386J6213m4588n9148o2064o7776j74280j11851
5797B894690k01787r0710r7553j86103k1215R3657Q2188j17634l2273L3875Q473
5786B365608J48769J4658L0506J079J02979j18845P9762O8073J35530Q5701L8021
5775B951841r9763M778r9756K3392O601j37988K9700O1790N5040m4835P0345p0568
5763B750577J3896O0116O2186L7618J5801J70738J14163J37899o1292l2289j48556
5752C120857k54240p126j48222j14683j22409r7505P565j22876j62008k215k0417
$$ plain form
5741 2076721 2048728 2013029 1983271 2067777 2054296 2060899 2150318 2092081 2110276 2209862 2312743
5730 2312743 2296252 2316516 2430436 2538254 2492969 2525360 2560997 2617831 2565371 2709624 2769672
5719 2769672 3024131 3177548 3199771 3297481 3454889 3645219 3906329 4167183 4502453 4783414
5709 4783414 4911711 4860185 4819784 4786814 4789332 4771871 4660983 4617334 4693599 4678117 4809556
5698 4809556 4866014 4962548 4892788 4850969 4906161 4893513 5005872 5073918 5239826 5422187 5575845
5687 5575845 5789884 6100232 6404743 6754990 7270339 7704660 8292599 9005069 9717515 10354337
5677 10354337 10421027 10011226 9283546 8770043 8424762 8212399 7929214 7536483 7328778 7273034
5667 7273034 7195707 7100923 6980167 6941871 6996793 7047640 7109948 7136909 7194704 7461644 7693855
$$ packed form
5741B076721k7993l5699k9758Q4506j3481O603Q9419n8237J8195R9586J02881
5730B312743j6491K0264J13920J07818m5285L2391L5637N6834n2460J44253O0048
5719B769672K54459J53417K2223R7710J57408J90330K61110K60854L35270K80961
5709D783414J28297n1526m0401l2970K518j7461j10888m3649P6265j5482J31439
5698D809556N6458R6534o9760m1819N5192j2648J12359O8046J65908J82361J53658
5687E575845K14039L10348L04511L50247N15349M34321N87939P12470P12446O36822
5677A0354337O6690m09801p27680n13503l45281k12363k83185l92731k07705n5744
5667G273034p7327r4784j20756l8296N4922N0847O2308K6961N7795K66940K32211
$$ plain form
5656 7693855 7835386 7931419 8288959 8756508 9151142 9577540 10181630 10751602 11438558 12213901
5646 12213901 12671741 12731124 12252177 11652730 11276511 10886703 10503679 10398909 10349782 10192570
5636 10192570 10221921 10292734 10373764 10541525 10591760 10737169 11081253 11165320 11380918 11602529
5626 11602529 11891851 12206852 12624390 13088452 13370031 13765140 14176261 14653495 15221902
5617 15221902 15876472 16566750 17248988 17821955 18278851 18798226 19071796 19414026 19983979
5608 19983979 20705318 21470890 22439070 23401832 24663169 25962465 27602790 29533609 31825216
5599 31825216 34770302 38183506 42232588 47001702 52263856 58284149 64893865 72043914
5591 72043914 79528736 87082618 94436352 100941330 106092893 109883271 112029857 112152651
$$ packed form
5656G693855J41531R6033L57540M67549L94634M26398O04090N69972O86956P75343
5646A2213901M57840N9383m78947n99447l76219l89808l83024j04770m9127j57212
5636A0192570K9351P0813Q1030J67761N0235J45409L44084Q4067K15598K21611
5626A1602529K89322L15001M17538M64062K81579L95109M11121M77234N68407
5617A5221902O54570O90278O82238N72967M56896N19375K73570L42230N69953
5608A9983979P21339P65572R68180R62762J261337J299296J640325J930819K291607
5599C1825216K945086L413204M049082M769114N262154O020293O609716P150049
5591G2043914P484822P553882P353734O504978N151563L790378K146586J22794
$$ plain form
5583 112152651 110210350 106302549 101332925 95914093 90346240 84499972 78432884 72041339
5575 72041339 65794838 59683313 53822716 48610705 44186588 40231193 36667082 33439609
5567 33439609 30621209 28020691 25838027 23908630 22116164 20559367 19082369 17749869
5559 17749869 16474644 15498592 14687471 13857849 13058898 12358292 11951659 11488263 11161992
5550 11161992 10874056 10590487 10227565 9961212 9586354 9211106 8828364 8537510 8350118
5541 8350118 8028478 7703818 7309658 7179016 6902716 6699228 6553308 6549275 6450998 6411529
5531 6411529 6289915 5809195 5626583 5440372 5328146 5308172 5251497 4971988 4687853 4603680
5521 4603680 4503944 4311716 4151627 3999128 3916543 3861263 3692543 3618532 3674588 3518528
$$ packed form
5583A12152651j942301l907801m969624n418832n567853n846268o067088o391545
5575G2041339o246501o111525n860597n212011m424117l955395l564111l227473
5567C3439609k818400k600518k182664j929397j792466j556797j476998j332500
5559A7749869j275225r76052q11121q29622p98951p00606m06633m63396l26271
5550A1161992k87936k83569l62922k66353l74858l75248l82742k90854j87392
5541H350118l21640l24660l94160j30642k76300k03488j45920m033r8277l9469
5531F411529j21614m80720j82612j86211j12226j9974n6675k79509k84135q4173
5521D603680r9736j92228j60089j52499q2585n5280j68720p4011N6056j56060
$$ plain form
5511 3518528 3568593 3660997 3625832 3496867 3514267 3710141 3690502 3666344 3727418 3483218 3554774
5500 3554774 3769220 3667425 3575174 3782703 3806545 3739703 3732082 3755705 3933745 4012130 3971980
5489 3971980 3949149 3970735 3907922 3856137 3759870 3620972 3482894 3450624 3425504 3359164 3234934
5478 3234934 3121473 3058656 3039162 3023181 2950165 2951805 2876718 2810110 2806845 2739925 2705266 2763474
5466 2763474 2718049 2582470 2589398 2570710 2552258 2431350 2353087 2309903 2252204 2182857 2268285
5455 2268285 2249973 2286974 2311732 2374628 2408603 2372607 2560000 2660313 2540018 2684624 2714096
5444 2714096 2800272 3170259 3360609 3509506 3799914 3963828 4426143 4873569 5165711 5623108
5434 5623108 5900134 6118787 5932751 5484116 5091986 4731716 4519645 4159352 3936433 3881849
$$ packed form
5511C518528N0065R2404l5165j28965J7400J95874j9639k4158O1074k44200P1556
5500C554774K14446j01795r2251K07529K3842o6842p621K3623J78040P8385m0150
5489C971980k2831K1586o2813n1785r6267j38898j38078l2270k5120o6340j24230
5478C234934j13461o2817j9494j5981p3016J640p5087o6608l265o6920l4659N8208
5466B763474m5425j35579O928j8688j8452j20908p8263m3184n7699o9347Q5428
5455B268285j8312L7001K4758O2896L3975l5996J87393J00313j20295J44606K9472
5444B714096Q6176L69987J90350J48897K90408J63914M62315M47426K92142M57397
5434E623108K77026K18653j86036m48635l92130l60270k12071l60293k22919n4584
$$ plain form
5424 3881849 3647827 3451917 3482077 3616567 3463511 3412301 3389643 3539439 3548507 3518240 3651245
5413 3651245 3663125 3546669 3413369 3397887 3461529 3537374 3429029 3452730 3374355 3291739 3063341
5402 3063341 3087033 2977267 2927933 2857327 2764406 2724061 2596477 2535187 2494073 2404581 2316429
5391 2316429 2375686 2343633 2231028 2157644 2221958 2204074 2031014 1881249 1928990 2044912 2112535
5380 2112535 2070031 2133286 2190811 2176699 2162866 2257938 2162813 2105787 2093793 2128474 2057257
5369 2057257 2199092 2135216 2142439 2211588 2184014 2071667 2031251 2070658 1906149 1920620 1940847
5358 1940847 1959468 1925901 1933650 1939394 1894642 1730002 1721765 1792706 1815356 1677933 1702586 1594287
5346 1594287 1523313 1521781 1447421 1411059 1466144 1463920 1549601 1581347 1506987 1371033 1371568 1352711
$$ packed form
5424C881849k34022j95910L0160J34490j53056n1210k2658J49796R068l0267J33005
5413C651245J1880j16456j33300j5482O3642P5845j08345K3701p8375q2616k28398
5402C063341K3692j09766m9334p0606r2921m0345j27584o1290m1114q9492q8152
5391B316429N9257l2053j12605p3384O4314j7884j73060j49765M7741J15922O7623
5380B112535m2504O3255N7525j4112j3833R5072r5125n7026j1994L4681p1217
5369B057257J41835o3876P223O9149k7574j12347m0416L9407j64509J4471K0227
5358A940847J8621l3567P749N744m4752j64640q237P0941K2650j37423K4653j08299
5346A594287p0974j532p4360l6362N5085k224Q5681L1746p4360j35954N35j8857
$$ plain form
5334 1352711 1213380 1246325 1271633 1241885 1243596 1378331 1325469 1277850 1390799 1374057 1443612
5323 1443612 1431531 1332742 1300643 1462808 1460402 1365517 1385046 1390974 1420072 1350246 1416080 1494243
5311 1494243 1528682 1561915 1634926 1609005 1553071 1563931 1578519 1452506 1561977 1575925 1686110
5300 1686110 1738994 1808374 1671374 1592749 1621833 1617265 1644421 1651984 1649152 1650070 1726283 1713600
5288 1713600 1796245 1832464 1831839 1878354 1997932 2039672 2047225 2101513 2044892 2013680 2086678 2231403
5276 2231403 2179890 2288392 2474580 2409415 2505818 2443610 2530130 2645829 2562690 2587197 2623563
5265 2623563 2624013 2764757 3098364 3206925 3441803 3648486 3888276 4289059 4731219 5206153
5255 5206153 5824352 6580917 7028483 7439064 7744224 7532366 7072210 6486641 5994877 5444153
$$ packed form
5334A352711j39331L2945K5308k9748J711J34735n2862m7619J12949j6742O9555
5323A443612j2081r8789l2099J62165k406r4885J9529N928K9098o9826O5834P8163
5311A494243L4439L3233P3011k5921n5934J0860J4588j26013J09471J3948J10185
5300A686110N2884O9380j37000p8625K9084m568K7156P563k832R18P6213j2683
5288A713600Q2645L6219o25M6515J19578M1740P553N4288n6621l1212P2998J44725
5276B231403n1513J08502J86188o5165R6403o2208Q6520J15699q3139K4507L6366
5265B623563M50J40744L33607J08561K34878K06683K39790M00783M42160M74934
5255E206153O18199P56565M47566M10581L05160k11858m60156n85569m91764n50724
$$ plain form
5245 5444153 5075513 4665631 4381184 4200796 3977043 3791217 3725965 3602389 3510538 3509899
5235 3509899 3480256 3358657 3319214 3349947 3429282 3471270 3396680 3450865 3520007 3560571 3673336
5224 3673336 3953701 3881266 4009533 4241601 4315648 4333979 4453627 4790639 5002644 5222949
5214 5222949 5648329 5918851 6385004 6887021 7406697 7846175 8354213 8530907 8674480 8943946
5204 8943946 9027487 8841391 8868162 8747118 8639991 8850028 9187986 9521738 9977919 10491659
5194 10491659 11001351 11201117 11307804 11264938 11006091 10601580 10323451 9770180 9319312 9127470
5184 9127470 8742460 8536372 8303708 8247584 8291212 8278666 8146116 8321246 8395887 8504147
5174 8504147 8732383 8981102 9548243 10169902 10478667 10948697 11434326 12117597 12580311 12936486
$$ packed form
5245E444153l68640m09882k84447j80388k23753j85826o5252j23576r1851o39
5235C509899k9643j21599l9443L0733P9335M1988p4590N4185O9142M0564J12765
5224C673336K80365p2435J28267K32068P4047J8331J19648L37012K12005K20305
5214E222949M25380K70522M66153N02017N19676M39478N08038J76694J43573K69466
5204H943946Q3541j86096K6771j21044j07127K10037L37958L33752M56181N13740
5194A0491659N09692J99766J06687m2866k58847m04511k78129n53271m50868j91842
5184I127470l85010k06088k32664n6124M3628j2546j32550J75130P4641J08260
5174H504147K28236K48719N67141O21659L08765M70030M85629O83271M62714L56175
$$ plain form
5164 12936486 13347818 13875756 14552895 15170877 15846157 16625274 17330828 18202547 19035204
5155 19035204 19540771 19891665 19944704 19505821 18954222 18200271 17383794 16592154 15668908 15010420
5145 15010420 14502312 14187038 13866301 13880692 14046635 14282241 14805861 15595707 16531505 17822902
5135 17822902 19506049 21861079 24839047 28430093 32460517 36714280 40958775 45131730
5127 45131730 49396027 54825918 61533990 70134281 79101222 83275185 77283953 65267908
5119 65267908 55128683 47638835 42138465 37386108 33854269 31125353 28994306 26866848
5111 26866848 24417748 22222326 20521099 19039090 17797947 16663852 15679532 14817011
5103 14817011 14020878 13489190 12884351 12141263 11496817 11024069 10469555 10033209 9905657
$$ packed form
5164A2936486M11332N27938O77139O17982O75280P79117P05554Q71719Q32657
5155A9035204N05567L50894N3039m38883n51599p53951q16477p91640r23246o58488
5145A5010420n08108l15274l20737J4391J65943K35606N23620P89846R35798J291397
5135A7822902J683147K355030K977968L591046M030424M253763M244495M172955
5127D5131730M264297N429891O708072Q600291Q966941M173963n991232j2016045
5119F5267908j0139225p489848n500370m752357l531839k728916k131047k127458
5111B6866848k449100k195422j701227j482009j241143j134095r84320q62521
5103A4817011p96133n31688o04839p43088o44446m72748n54514m36346j27552
$$ plain form
5094 9905657 9743676 9654639 9501669 9241989 9098871 8945780 8941645 8803927 8580117 8431409
5084 8431409 8176073 7933933 7696030 7655532 7494242 7380880 7286212 7263646 7270717 7308350 7345324
5073 7345324 7276919 7410671 7401034 7331059 7299050 7354516 7462684 7322589 7226151 7175603 7214598
5062 7214598 7213083 7004950 6977213 7089164 7276881 7193455 7212909 7355074 7475135 7438142 7252872
5051 7252872 7403975 7520926 7382737 7367696 7445116 7329538 7281010 7338777 7304033 7422884
5041 7422884 7435683 7605039 7743552 7766387 7791924 7817188 7877887 7827950 7942937 8087314 8146436
5030 8146436 8363168 8624289 8655028 8828488 8947113 9054845 9129935 9393297 9687855 9949070
5020 9949070 10000008 9927680 9743105 9660224 9547551 9535908 9502864 9395104 9438444 9624924 9760019
$$ packed form
5094I905657j61981q9037j52970k59680j43118j53091m135j37718k23810j48708
5084H431409k55336k42140k37903m0498j61290j13362r4668k2566P071L7633L6974
5073G345324o8405J33752r637o9975l2009N5466J08168j40095r6438n0548L8995
5062G214598j515k08133k7737J11951J87717q3426J9454J42165J20061l6993j85270
5051G252872J51103J16951j38189j5041P7420j15578m8528N7767l4744J18851
5041G422884J2799J69356J38513K2835K5537K5264O0699m9937J14987J44377N9122
5030H146436K16732K61121L0739J73460J18625J07732P5090K63362K94558K61215
5020I949070N0938p2328j84575q2881j12673j1643l3044j07760M3340J86480J35095
$$ plain form
5009 9760019 9986138 10190348 10503043 10711397 11038919 11524400 11856698 12361140 12542524 12820230
4999 12820230 13128512 13290992 13478498 13613732 13794485 13927220 13858307 13798225 13846174 13951689
4989 13951689 14049890 14170094 14160298 14154061 14306033 14650452 14876463 15297930 15783503 16267805
4979 16267805 16572943 17026197 17328577 17635958 17974983 18385213 18713192 18870429 19215116
4970 19215116 19620875 19835779 20282240 20703997 20939218 21179370 21626713 22062760 22387348
4961 22387348 22806006 23378241 23757733 24136905 24604227 24950423 25257074 25681723 26126067
4952 26126067 26417835 26673767 26988822 27545936 28079368 28626371 29219006 29870473 30624779
4943 30624779 31487011 32616889 33878023 35188889 36648998 38118539 39742151 41718291
$$ packed form
5009I760019K26119K04210L12695K08354L27522M85481L32298N04442J81384K77706
4999A2820230L08282J62480J87506J35234J80753J32735o8913o0082M7949J05515
4989A3951689R8201J20204r796o237J51972L44419K26011M21467M85573M84302
4979A6267805L05138M53254L02380L07381L39025M10230L27979J57237L44687
4970A9215116M05759K14904M46461M21757K35221K40152M47343M36047L24588
4961B2387348M18658N72235L79492L79172M67322L46196L06651M24649M44344
4952B6126067K91768K55932L15055N57114N33432N47003N92635O51467P54306
4943C0624779Q62232J129878J261134J310866J460109J469541J623612J976140
$$ plain form
4935 41718291 43729820 46053257 48552311 51491387 54563025 57889471 61540981 65758590
4927 65758590 70547868 76027025 82353623 89400705 97116074 105351215 114139493 123233247
4919 123233247 132727195 142507529 152385088 162092180 170896909 178162868 183035759 184751387
4911 184751387 183588743 179931741 174234342 167164088 159800210 152628192 146142874 140065291
4903 140065291 134035936 127517459 120364282 112547780 104931592 97597084 90971671 84734371
4895 84734371 79118756 73861328 69075022 64553754 60244558 56214347 52359125 48863212
4887 48863212 45918561 43191789 40813500 39014692 37391815 35738097 34469210 33367328
4879 33367328 32169295 31004671 29781785 28627207 27620065 26534111 25664496 24714620
$$ packed form
4935D1718291K011529K323437K499054K939076L071638L326446L651510M217609
4927F5758590M789278N479157O326598P047082P715369Q235141Q788278R093754
4919A23233247R493948R780334R877559R707092Q804729P265959M872891J715628
4911A84751387j162644l657002n697399p070254p363878p172018o485318o077583
4903A40065291o029355o518477p153177p816502p616188p334508o625413o237300
4895H4734371n615615n257428m786306m521268m309196m030211l855222l495913
4887D8863212k944651k726772k378289j798808j622877j653718j268887j101882
4879C3367328j198033j164624j222886j154578j007142j085954q69615r49876
$$ plain form
4871 24714620 23839258 23224864 22726037 22281136 21924130 21901627 22016993 22210839 22537935 22932876
4861 22932876 23628403 24413057 25432267 26767152 28122602 29418688 30539378 31820271
4853 31820271 32810961 33431418 33618576 33476952 32719324 31538384 30207281 28820300 27216854
4844 27216854 25752927 24348490 22983172 21860146 20965652 20232348 19588136 19022414 18552581
4835 18552581 18178088 17860348 17569746 17143500 16740013 16501437 16143690 15792440 15565569
4826 15565569 15288645 14883199 14590165 14361113 14185401 13888294 13711567 13587912 13383907
4817 13383907 13085112 12937600 12764112 12707604 12665296 12629569 12739230 12814066 12832439 12921330
4807 12921330 12879784 13032860 13176582 13141955 13373245 13347746 13340503 13534708 13565663 13717157
$$ packed form
4871B4714620q75362o14394m98827m44901l57006k2503J15366J93846L27096L94941
4861B2932876O95527P84654J019210J334885J355450J296086J120690J280893
4853C1820271R90690O20457J87158j41624p57628j180940j331103j386981j603446
4844B7216854j463927j404437j365318j123026q94494p33304o44212n65722m69833
4835A8552581l74493l17740k90602m26246m03487k38576l57747l51250k26871
4826A5565569k76924m05446k93034k29052j75712k97107j76727j23655k04005
4817A3383907k98795j47512j73488n6508m2308l5727J09661P4836J8373Q8891
4807A2921330m1546J53076J43722l4627K31290k5499p243J94205L0955J51494
$$ plain form
4797 13717157 13721766 13827184 13857561 13861744 14003376 14212314 14259553 14352115 14533486 14806973 15086223
4786 15086223 15256247 15482437 15956431 16275571 16456894 16977422 17361009 17557588 17471983 17141217
4776 17141217 16944229 16745413 16643049 16632600 16724437 16726574 16603026 16550847 16465992 16348744
4766 16348744 16288256 16242223 16197444 16391726 16664692 16808201 17002647 17418072 17793176 18140386
4756 18140386 18403206 18721729 18856601 19029997 19326385 19593881 19889607 20252315 20533877
4747 20533877 20562964 20474258 20598213 20661947 20817098 21065292 21211054 21335117 21645024 22022431
4737 22022431 22343128 22552811 22999835 23406059 23721078 24063341 24571039 25123788 25754851
4728 25754851 26401927 27246223 27989220 28767359 29737092 31039994 32567345 34758511 38364432
$$ packed form
4797A3717157M609J05418L0377M183J41632K08938M7239R2562J81371K73487K79250
4786A5086223J70024K26190M73994L19140J81323N20528L83587J96579q5605l30766
4776A7141217j96988j98816j02364j0449R1837K137j23548n2179q4855j17248
4766A6348744o0488m6033m4779J94282K72966J43509J94446M15425L75104L47210
4756A8140386K62820L18523J34872J73396K96388K67496K95726L62708K81562
4747B0533877K9087q8706J23955O3734J55151K48194J45762J24063L09907L77407
4737B2022431L20697K09683M47024M06224L15019L42263N07698N52749O31063
4728B5754851O47076Q44296P42997P78139R69733J302902J527351K191166L605921
$$ plain form
4719 38364432 43792707 50902393 59977642 70776720 83861840 99024745 116308598 136023699
4711 136023699 159868026 188139001 222069727 256689874 276406767 263352761 225573060
4704 225573060 189598240 161736306 140038370 122120025 107447177 95704924 86369336
4697 86369336 78627828 72738008 67806954 63623107 60100398 56942638 54316722 52112252
4689 52112252 50068099 48036151 45997500 44378864 43091701 41923975 40877986 40435556
4681 40435556 40687693 41517754 42887060 44732238 46632649 48143232 48781103 48379103 47449360
4672 47449360 46368266 45366263 44730252 44353190 44292370 44594532 45315329 46501655 47912849
4663 47912849 49718221 51876148 54711198 57930689 60972834 63279507 64577095 64843511
$$ packed form
4719C8364432N428275P109686R075249J0799078J3085120J5162905J7283853J9715101
4711A36023699K3844327K8270975L3930726L4620147J9716893j3054006l7779701
4704B25573060l5974820k7861934k1697936j7918345j4672848j1742253r335588
4697H6369336p741508n889820m931054m183847l522709l157760k625916k204470
4689E2112252k044153k031948k038651j618636j287163j167726j045989m42430
4681D0435556K52137Q30061J369306J845178J900411J510583O37871m02000r29743
4672D7449360j081094j002003o36011l77062o0820L02162P20797J186326J411194
4663D7912849J805372K157927K835050L219491L042145K306673J297588K66416
$$ plain form
4655 64843511 64307130 63656463 63626015 64631373 67009772 70993223 76528241 83741470 92826110
4646 92826110 103564230 116338083 130833431 147455049 166428714 187741936 210608211
4639 210608211 232329883 246721170 246594924 230844423 207210637 183569518 162870904
4632 162870904 145381648 130691144 118545491 108602674 100627107 94070975 88890105 84635895
4624 84635895 81037527 77537125 74298792 71358002 69030369 67342286 66027473 65133543
4616 65133543 64202944 63052855 61131401 58520478 55728122 53086734 50804454 49197194
4608 49197194 47936978 46952535 46002550 44789932 43584819 42199776 40563403 38970830
4600 38970830 37418362 35901386 34377169 33068119 31821041 30800963 29857109 29108931
$$ packed form
4655F4843511n36381o50667l0448J005358K378399L983451N535018P213229R084640
4646I2826110J0738120J2773853J4495348J6621618J8973665K1313222K2866275
4639B10608211K1721672J4391287j26246j5750501k3633786k3641119k0698614
4632A62870904j7489256j4690504j2145653r942817p975567o556132n180870m254210
4624H4635895l598368l500402l238333k940790k327633j688083j314813q93930
4616F5133543r30599j150089j921454k610923k792356k641388k282280j607260
4608D9197194j260216r84443r49985j212618j205113j385043j636373j592573
4600C8970830j552468j516976j524217j309050j247078j020078r43854p48178
$$ plain form
4592 29108931 28593344 27975293 27546660 27215300 26955780 26767263 26889469 27362618 27783928
4583 27783928 28263390 28740213 29033710 29420711 29650623 29755249 29471930 28956366 28522867
4574 28522867 28164851 27756982 27606924 27851364 28361251 28911969 29616454 30203638 30993658
4565 30993658 31873405 32908738 34270696 35551805 36892659 37956772 38759276 39162487 38909777
4556 38909777 37762398 35619930 33073617 30838577 29054719 27628750 26461775 25735848
4548 25735848 25057124 24499122 24178862 23822381 23640341 23638386 23693799 23916586 24300169 24819924
4538 24819924 25532256 26150200 26709357 27530259 28415028 29086895 29987555 31013722 32204473
4529 32204473 33534076 34888350 36180546 37056108 37709042 38504669 39315287 40317040 41311821
$$ packed form
4592B9108931n15587o18051m28633l31360k59520j88517J22206M73149M21310
4583B7783928M79462M76823K93497L87001K29912J04626k83319n15564m33499
4574B8522867l58016m07869j50058K44440N09887N50718P04485N87184P90020
4565C0993658Q79747J035333J361958J281109J340854J064113Q02504M03211k52710
4556C8909777j147379k142468k546313k235040j783858j425969j166975p25927
4548B5735848o78724n58002l20260l56481j82040j955N5413K22787L83583N19755
4538B4819924P12332O17944N59157Q20902Q84769O71867R00660J026167J190751
4529C2204473J329603J354274J292196Q75562O52934P95627Q10618J001753R94781
$$ plain form
4520 41311821 42101288 42904313 43275199 43513977 43263045 42889522 42449283 42284358 42738506
4511 42738506 43972081 46247812 49793221 54449148 60368013 67518936 76161102 86046759
4503 86046759 97252087 109719206 123418282 137830648 150913854 158585342 155458006
4496 155458006 141551520 123379193 106985568 93037412 81361524 71690262 63695666
4489 63695666 57106699 51782415 47377045 43621312 40361531 37497941 34946661 32759060
4481 32759060 30813238 28975031 27118581 25410767 23764761 22238159 20895376 19590762
4473 19590762 18298126 17468560 16869369 16558550 16188405 16123970 16120813 16299077 16583230 16896781
4463 16896781 17453021 18138446 18780494 19502926 20414688 21250376 21786357 21633825 20991440
$$ packed form
4520D1311821P89467Q03025L70886K38778k50932l73523m40239j64925M54148
4511D2738506J233575K275731L545409M655927N918865P150923Q642166R885657
4503H6046759J1205328J2467119J3699076J4412366J3083206P671488l127336
4496A55458006j3906486j8172327j6393625j3948156j1675888r671262p994596
4489F3695666o588967n324284m405370l755733l259781k863590k551280k187601
4481C2759060j945822j838207j856450j707814j646006j526602j342783j304614
4473A9590762j292636q29566n99191l10819l70145o4435l157J78264K84153L13551
4463A6896781N56240O85425O42048P22432R11762Q35688N35981j52532o42385
$$ plain form
4454 20991440 20185207 19488864 18609557 17986215 17359001 17133856 17054849 17106984 17326202 17840154
4444 17840154 18529947 18951706 19100603 18810091 17994075 17025393 16059444 15235582 14545393
4435 14545393 13860830 13152097 12684824 12191854 11805558 11681255 11457764 11352694 11377978 11528702
4425 11528702 11521017 11541848 11790237 12020414 12138561 12490275 12816659 13237862 13645859 13661516
4415 13661516 13551554 13194167 12732788 12393264 12159200 11969176 11803905 11711291 11721405 11813794
4405 11813794 12054930 12311977 12536473 12761252 12750368 12456759 11983010 11493356 10966197 10560453
4395 10560453 10300666 9853435 9683465 9696839 9638803 9679135 9585642 9342420 9072573 8909867
4385 8909867 8608081 8562988 8523165 8337316 8358789 8326492 8239671 8158918 8141309 8088481 8097374
$$ packed form
4454B0991440q06233o96343q79307o23342o27214k25145p9007N2135K19218N13952
4444A7840154O89793M21759J48897k90512q16016r68682r65949q23862o90189
4435A4545393o84563p08733m67273m92970l86296j24303k23491j05070K5284J50724
4425A1528702p685K0831K48389K30177J18147L51714L26384M21203M07997J5657
4415A3661516j09962l57387m61379l39524k34064j90024j65271r2614J0114R2389
4405A1813794K41136K57047K24496K24779j0884k93609m73749m89654n27159m05744
4395A0560453k59787m47231j69970J3374n8036M0332r3493k43222k69847j62706
4385H909867l01786m5093l9823j85849K1473l2297q6821q0753j7609n2828Q893
$$ plain form
4374 8097374 7870366 7807051 7745146 7643103 7547576 7530732 7539549 7420045 7296790 7423463 7514517
4363 7514517 7592613 7803266 7817836 8020217 8182326 8303124 8296020 8251311 8025361 7836092
4353 7836092 7645911 7589774 7289293 6901817 6725926 6680261 6422390 6373359 6387766 6300113
4343 6300113 6426154 6329231 6370636 6338195 6316079 6369920 6458730 6546356 6702290 6818398 6790184
4332 6790184 6501803 6463682 6310969 6119120 5880387 5786412 5771526 5676485 5547412 5531273
4322 5531273 5425384 5249896 5254397 5162119 5063753 5196135 5092592 4957819 5001167 5074558 5001202
4311 5001202 4974734 5039086 4820786 4912536 4954939 5006463 4997118 5162256 5032301 4867022 4842589
4300 4842589 4909924 4914166 4938456 4986875 5168654 5172487 5168882 5160067 5162736 5308983 5282373 5232606
$$ packed form
4374H097374k27008o3315o1905j02043r5527j6844Q817j19504j23255J26673R1054
4363G514517P8096K10653J4570K02381J62109J20798p104m4709k25950j89269
4353G836092j90181n6137l00481l87476j75891m5665k57871m9031J4407q7653
4343F300113J26041r6923M1405l2441k2116N3841Q8810Q7626J55934J16108k8214
4332F790184k88381l8121j52713j91849k38733r3975j4886r5041j29073j6139
4322E531273j05889j75488M501r2278r8366J32382j03543j34773M3348P3391p3356
4311E001202k6468O4352k18300R1750M2403N1524r345J65138j29955j65279k4433
4300D842589O7335M242K4290M8419J81779L833l605q815K669J46247k6610m9767
$$ plain form
4288 5232606 5087205 4944221 5090655 5160033 5133844 5074582 5158208 5088360 4899350 4786515
4278 4786515 4757557 4890825 4796618 4712205 4698559 4632174 4468298 4493832 4421019 4490994 4589793
4267 4589793 4521295 4407812 4464560 4519246 4441455 4450689 4430068 4329665 4432436 4378340 4409654
4256 4409654 4525289 4632391 4747107 4684529 4702888 4759571 4606281 4784363 4892883 4904923
4246 4904923 5010608 4961230 4864344 4894223 4994075 5087748 4994798 5005892 5027676 4828722 4742623
4235 4742623 4865411 4958595 4984316 5120593 5125002 5161915 5176836 5418065 5631862 5723598 5959317
4224 5959317 6233229 6338782 6474967 6551616 6683215 6734822 6698189 6768217 6644049 6444582
4214 6444582 6210982 6142292 6036510 5757482 5657667 5486966 5546743 5343080 5209577 5351236
$$ packed form
4288E232606j45401j42984J46434O9378k6189n9262Q3626o9848j89010j12835
4278D786515k8958J33268r4207q4413j3646o6385j63876K5534p2813O9975R8799
4267D589793o8498j13483N6748N4686p7791R234k0621j00403J02771n4096L1314
4256D409654J15635J07102J14716o2578J8359N6683j53290J78082J08520J2040
4246D904923J05685m9378r6886K9879R9852R3673r2950J1094K1784j98954q6099
4235D742623J22788R3184K5721J36277M409L6913J4921K41229K13797R1736K35719
4224E959317K73912J05553J36185P6649J31599N1607l6633P0028j24168j99467
4214F444582k33600o8690j05782k79028r9815j70701N9777k03663j33503J41659
$$ plain form
4204 5351236 5443915 5537436 5426523 5408882 5302025 5344786 5474508 5489749 5698019 5898023
4194 5898023 6113937 6309419 6395089 6521530 6735936 7009224 7201205 7453207 7872974 8262536
4184 8262536 8513861 8639645 8737873 8756614 8753017 8567678 8379017 8164538 7868585 7607190
4174 7607190 7420837 7513279 7480048 7531706 7549175 7915633 8332974 8650451 9407852 10278087
4164 10278087 11054400 11654422 12376863 12998619 13465686 13787065 13945097 13672587 13228174
4155 13228174 12795247 12305932 11606668 10849347 10076755 9468822 8980408 8642243 8495038
4146 8495038 8294311 8358358 8272874 8389671 8485601 8810575 9030783 9102169 9433120 9481346
4136 9481346 9399129 9444690 9515125 9416998 9279037 9109416 9233728 9231900 9231579 9603845 9931890
$$ packed form
4204E351236R2679R3521j10913j7641j06857M2761J29722J5241K08270K00004
4194E898023K15914J95482Q5670J26441K14406K73288J91981K52002M19767L89562
4184H262536K51325J25784R8228J8741l597j85339j88661k14479k95953k61395
4174G607190j86353R2442l3231N1658J7469L66458M17341L17477P57401Q70235
4164A0278087P76313O00022P22441O21756M67067L21379J58032k72510m44413
4155A3228174m32927m89315o99264p57321p72592o07933m88414l38165j47205
4146H495038k00727O4047q5484J16797R5930L24974K20208P1386L30951M8226
4136I481346q2217M5561P0435r8127j37961j69621J24312j828l21L72266L28045
$$ plain form
4125 9931890 10213665 10306386 10416297 10358341 10252054 10253575 10141227 9879864 9433098 9260613
4115 9260613 8935591 8563761 8399208 8161251 7919180 7755553 7729278 7475881 7429596 7542524
4105 7542524 7647492 7641260 7898583 8254958 8281435 8352705 8332787 8077532 7941940 7756742
4095 7756742 7411183 6989104 6582808 6285105 6007915 5731718 5457396 5276112 5278610 5065433
4085 5065433 5061714 5062500 5064835 5115452 5240666 5332683 5262318 5399351 5404151 5391274 5463316 5617411
4073 5617411 5659259 5802552 6094813 6124009 6306431 6377249 6392516 6522311 6400942 6303814
4063 6303814 6082623 6015008 5742505 5550211 5333543 5012979 4812237 4584102 4343090 4162111
4053 4162111 4151116 3985874 3887910 3799129 3742188 3679857 3621390 3667212 3543352 3433568 3433014
$$ packed form
4125I931890K81775R2721J09911n7956j06287J521j12348k61363m46766j72485
4115I260613l25022l71830j64553k37957k42071j63627k6275k53397m6285J12928
4105G542524J04968o232K57323L56375K6477P1270j9918k55255j35592j85198
4095G756742l45559m22079m06296k97703k77190k76197k74322j81284K498k13177
4085E065433l719P86K335N0617J25214R2017p0365J37033M800j2877P2042J54095
4073E617411M1848J43293K92261K9196J82422P0818J5267J29795j21369r7128
4063F303814k21191o7615k72503j92294k16668l20564k00742k28135k41012j80979
4053D162111j0995j65242r7964q8781n6941o2331n8467M5822j23860j09784n54
$$ plain form
4042 3433014 3384012 3322769 3435849 3386754 3331846 3344530 3382999 3197223 3165278 3129475 3137609
4031 3137609 3006531 2981205 2930775 2980880 3094423 3085977 2999487 3030523 2983180 2844475 3032341
4020 3032341 3043260 2791479 2773999 2786016 2673797 2823644 2855695 2939736 2837902 2815856 3036068
4009 3036068 2982019 2857961 2842479 2745228 2652881 2744373 2873862 2809981 2830456 2894715 3002747
3998 3002747 2994214 2909235 2910875 2762688 2817191 2934855 2896782 2845498 2834583 2762522 2611685
3987 2611685 2650286 2669698 2516332 2600820 2644823 2683326 2712302 2761401 2650816 2481391 2581598
3976 2581598 2531551 2560765 2537637 2668302 2688191 2762282 2740111 2612822 2431618 2548474 2563819
3965 2563819 2540092 2438787 2356019 2486215 2512078 2615850 2552480 2448573 2392450 2395939 2488123
$$ packed form
4042C433014m9002o1243J13080m9095n4908J2684L8469j85776l1945l5803Q134
4031C137609j31078k5326n0430N0105J13543q446q6490L1036m7343j38705J87866
4020C032341J0919k51781j7480J2017j12219J49847L2051Q4041j01834k2046K20212
4009C036068n4049j24058j5482r7251r2347R1492J29489o3881K0475O4259J08032
3998C002747q533q4979J640j48187N4503J17664l8073n1284j0915p2061j50837
3987B611685L8601J9412j53366Q4488M4003L8503K8976M9099j10585j69425J00207
3976B581598n0047K9214k3128J30665J9889P4091k2171j27289j81204J16856J5345
3965B563819k3727j01305q2768J30196K5863J03772o3370j03907n6123L489R2184
$$ plain form
3954 2488123 2568919 2473277 2421940 2463017 2484252 2495985 2363022 2315668 2329187 2198614 2149814
3943 2149814 2426286 2515360 2389213 2286557 2386492 2363874 2259129 2326830 2367442 2382268 2389214
3932 2389214 2286867 2308474 2230941 2182388 2281923 2226258 2215145 2354631 2300817 2203858 2375864
3921 2375864 2336871 2277068 2320265 2446381 2418850 2481805 2459437 2655507 2664098 2485982 2425341
3910 2425341 2490830 2585346 2493965 2407278 2411276 2538125 2638226 2655180 2606880 2599852 2620534
3899 2620534 2410327 2386067 2428752 2469247 2557796 2559677 2573439 2632459 2589366 2496335 2598234
3888 2598234 2664646 2640886 2678547 2850615 2849169 2719222 2684881 2694704 2652037 2821497 2819970
3877 2819970 2882907 2835358 2816755 2835935 2798324 2983861 2960011 2829694 2671439 2742251 2834068
$$ packed form
3954B488123Q0796r5642n1337M1077K1235J1733j32963m7354J3519j30573m8800
3943B149814K76472Q9074j26147j02656R9935k2618j04745O7701M0612J4826O946
3932B389214j02347K1607p7533m8553R9535n5665j1113J39486n3814r6959J72006
3921B375864l8993n9803M3197J26116k7531O2955k2368J96070Q591j78116o0641
3910B425341O5489R4516r1381q6687L998J26849J00101J6954m8300p028K0682
3899B620534k10207k4260M2685M0495Q8549J881J3762N9020m3093r3031J01899
3888B598234O6412k3760L7661J72068j446j29947l4341R823m2667J69460j527
3877B819970O2937m7549j8603J9180l7611J85537k3850j30317j58255P0812R1817
$$ plain form
3866 2834068 2860498 2839092 2684114 2678968 2771842 2654754 2603165 2551726 2532665 2688661 2632972
3855 2632972 2528175 2647339 2761114 2679172 2782892 2838743 2609084 2637710 2853947 2737619
3845 2737619 2686321 2868979 2848638 2770040 2623316 2595808 2686995 2731840 2675690 2630113 2623000
3834 2623000 2582110 2599513 2549534 2472661 2544602 2508797 2438180 2353537 2416164 2396864 2349354
3823 2349354 2449070 2455577 2396782 2305462 2378003 2474483 2415085 2338513 2356650 2376812 2419842 2422884
3811 2422884 2469069 2529725 2562221 2527757 2446640 2524858 2548362 2597933 2521599 2474134 2504361
3800 2504361 2383879 2487700 2465571 2375110 2346754 2319591 2366125 2315657 2303254 2216628 2096561
3789 2096561 2051007 2218275 2258304 2283370 2296375 2267747 2468640 2483757 2517217 2514186 2534911
$$ packed form
3866B834068K6430k1406j54978n146R2874j17088n1589n1439j9061J55996n5689
3855B632972j04797J19164J13775q1942J03720N5851k29659K8626K16237j16328
3845B737619n1298J82658k0341p8598j46724k7508R1187M4845n6150m5577p113
3834B623000m0890J7403m9979p6873P1941l5805p0617q4643O2627j9300m7510
3823B349354R9716O507n8795r1320P2541R6480n9398p6572J8137K0162M3030L042
3811B422884M6185O0656L2496l4464q1117P8218K3504M9571p6334m7465L0227
3800B504361j20482J03821k2129r0461k8356k7163M6534n0468j2403q6626j20067
3789B096561m5554J67268M0029K5066J3005k8628K00893J5117L3460l031K0725
$$ plain form
3778 2534911 2523864 2449816 2357551 2486252 2558764 2566296 2593824 2518312 2478685 2508521 2460991
3767 2460991 2330604 2347379 2449522 2513321 2454005 2354365 2332632 2378871 2267884 2321188 2524593
3756 2524593 2483057 2466680 2396750 2278308 2370035 2418217 2322194 2288978 2370964 2460317 2526964
3745 2526964 2392409 2392970 2435917 2403237 2421395 2330244 2379958 2461303 2618911 2473391 2357022
3734 2357022 2299605 2169188 2177065 2205550 2399200 2345677 2254834 2179962 2153505 2154904 2169471
3723 2169471 2229840 2129877 2131809 2127633 2073371 2068524 2166074 2011648 1899362 2045939 2132522
3712 2132522 2159753 2118549 2229966 2319577 2198376 2162413 2043568 2109071 2023578 2024179 2011121
3701 2011121 2023093 2052758 1949498 1984641 1951750 1901800 1811790 1812867 1806420 1887792 1794315 1751380
$$ packed form
3778B534911j1047p4048r2265J28701P2512P532K7528p5512l9627K9836m7530
3767B460991j30387J6775J02143O3799n9316r9640k1733M6239j10987N3304K03405
3756B524593m1536j6377o9930j18442R1727M8182r6023l3216Q1986Q9353O6647
3745B526964j34555N61M2947l2680J8158r1151M9714Q1345J57608j45520j16369
3734B357022n7417j30417P877K8485J93650n3523r0843p4872k6457J399J4567
3723B169471O0369r9963J932m176n4262m847R7550j54426j12286J46577Q6583
3712B132522K7231m1204J11417Q9611j21201l5963j18845O5503q5493O01j3058
3701B011121J1972K9665j03260L5143l2891m9950r0010J077o447Q1372r3477m2935
$$ plain form
3689 1751380 1857543 1766883 1690779 1737802 1806796 1818009 1691817 1782313 1887279 1937030 1884719
3678 1884719 1913267 1854966 1849809 1807022 1898369 1913604 1660221 1657553 1753118 1871367 1804456
3667 1804456 1665433 1655498 1617162 1677960 1721526 1785665 1894244 1896818 1784974 1759155 1807924
3656 1807924 1847172 1743928 1784972 1786938 1719136 1719482 1656081 1695302 1607240 1675772 1747236 1672372
3644 1672372 1732028 1513177 1479301 1704205 1784915 1819543 1722201 1739026 1762040 1678149 1659339
3633 1659339 1741702 1798856 1909774 1782543 1798849 1823240 1818814 1892002 1948887 1907391 1859390
3622 1859390 1788450 1744064 1789268 1777533 1791195 1771070 1767665 1642455 1812136 1935866 1907704
3611 1907704 1776046 1778607 1942442 1847302 1688906 1673787 1739413 1698564 1769680 1768258 1761130
$$ packed form
3689A751380J06163r0660p6104M7023O8994J1213j26192R0496J04966M9751n2311
3678A884719K8548n8301n157m2787R1347J5235k53383k668R5565J18249o6911
3667A804456j39023r935l8336O0798M3566O4139J08579K574j11844k5819M8769
3656A807924L9248j03244M1044J966o7802L46o3401L9221q8062O8532P1464p4864
3644A672372N9656k18851l3876K24904Q0710L4628r7342J6825K3014q3891j8810
3633A659339Q2363N7154J10918j27231J6306K4391m426P3188N6885m1496m8001
3622A859390p0940m4386M5204j1735J3662k0125l405j25210J69681J23730k8162
3611A907704j31658K561J63835r5140j58396j5119O5626m0849P1116j422p128
$$ plain form
3600 1761130 1755964 1731263 1745217 1694209 1636404 1792967 1825020 1966341 2011759 1929489 1877281
3589 1877281 1793029 1911270 1941346 1859162 1784708 1848882 1868646 1863360 1812862 1855139 1901608
3578 1901608 1863023 1947343 1977593 1895013 1700756 1781899 1995925 1982790 1992481 1878906 1935588
3567 1935588 1930358 2045330 2105252 2029922 2068033 2034718 2065349 1919243 1909466 1941103 1911224
3556 1911224 2019297 2052150 2064484 2034260 2004671 2141544 2027286 1958783 1975885 2069377 2188754
3545 2188754 1978475 1887353 1971673 2060017 2113534 2177543 2317025 2242854 2106867 2111367 2142975
3534 2142975 2249597 2286399 2267428 2208841 2186648 2195168 2097094 2212586 2276652 2253616 2280713
3523 2280713 2342042 2345793 2408995 2411114 2323282 2288711 2377564 2443488 2431567 2488059 2501900 2476638
$$ packed form
3600A761130n166k4701J3954n1008n7805J56563L2053J41321M5418q2270n2208
3589A877281q4252J18241L0076q2184p4454O4174J9764n286n0498M2277M6469
3578A901608l8585Q4320L0250q2580j94257Q1143K14026j3135R691j13575N6682
3567A935588n230J14972N9922p5330L8111l3315L0631j46106r777L1637k9879
3556A911224J08073L2853J2334l0224k9589J36873j14258o8503J7102R3492J19377
3545B188754k10279r1122Q4320Q8344N3517O4009J39482p4171j35987M500L1608
3534B142975J06622L6802j8971n8587k2193Q520r8074J15492O4066k3036K7097
3523B280713O1329L751O3202K119q7832l4571Q8853O5924j1921N6492J3841k5262
$$ plain form
3511 2476638 2622115 2601528 2617165 2761172 2727285 2694839 2754404 2775773 2900664 3097877 3200503
3500 3200503 3233319 3120107 3233605 3296598 3211310 3151772 3181733 3121265 3122693 3235273 3263702
3489 3263702 3206464 3147458 3191493 3279211 3390814 3583802 3666570 3649004 3723994 3708880 3841015
3478 3841015 3943309 4021579 4200512 4223594 4461286 4671337 4830872 5141075 5335756 5601108
3468 5601108 6117353 6455027 6743928 7262602 7743214 8137945 8600635 8933388 9374544 9957175
3458 9957175 10552131 10697773 10058200 9001042 8224194 7524820 7094179 6718314 6378122
3449 6378122 6121030 5830733 5531629 5463318 5266163 5092233 5019853 4819029 4791989 4797395
3439 4797395 4800127 4936190 5019682 5165338 5368619 5671236 6236257 6889183 7449440 8125338
$$ packed form
3511B476638J45477k0587J5637J44007l3887l2446N9565K1369J24891J97213J02626
3500C200503L2816j13212J13498O2993q5288n9538K9961o0468J428J12580K8429
3489C263702n7238n9006M4035Q7718J11603J92988Q2768j7566P4990j5114J32135
3478C841015J02294P8270J78933K3082K37692K10051J59535L10203J94681K65352
3468E601108N16245L37674K88901N18674M80612L94731M62690L32753M41156N82631
3458I957175N94956J45642o39573j057158p76848o99374m30641l75865l40192
3449F378122k57092k90297k99104o8311j97155j73930p2380k00824k7040N406
3439D797395K732J36063Q3492J45656K03281L02617N65021O52926N60257O75898
$$ plain form
3429 8125338 9002587 9976124 11283620 12428524 12607731 11522755 10222893 8940228 7896562
3420 7896562 7132969 6613381 6175042 5656031 5201565 4978680 4745937 4745451 4508537 4262130
3410 4262130 4266088 4128951 3956173 3860478 3787379 3724573 3903077 4245091 4207090 4235974 4445804
3399 4445804 4804898 5253646 5601302 6096017 6669447 6991085 7170942 6636431 5891881 5365880
3389 5365880 4884439 4571065 4238234 3930063 3706961 3502800 3504251 3346607 3149907 2938688
3379 2938688 2719275 2757274 2771008 2781833 2573269 2686786 2619004 2549647 2354334 2303234 2461884
3368 2461884 2500951 2314176 2276722 2314232 2257487 2282947 2155751 2167406 2223714 2255953 2194818
3357 2194818 2195493 2259897 2259774 2075181 2122613 2171797 2121695 2189723 2189258 2081437 1919625 1944389
$$ packed form
3429H125338Q77249R73537J307496J144904J79207j084976j299862j282665j043666
3420G896562p63593n19588m38339n19011m54466k22885k32743m86k36914k46407
3410D262130L958j37137j72778r5695p3099o2806J78504L42014l8001K8884K09830
3399D445804L59094M48748L47656M94715N73430L21638J79857n34511p44550n26001
3389E365880m81441l13374l32831l08171k23102k04161J451j57644j96700k11219
3379B938688k19413L7999J3734J0825k08564J13517o7782o9357j95313n1100J58650
3368B461884L9067j86775l7454L7510n6745K5460j27196J1655N6308L2239o1135
3357B194818O75O4404j23j84593M7432M9184n0102O8028m65j07821j61812K4764
$$ plain form
3345 1944389 2103491 1988200 1924848 1923514 1960636 2014978 2041700 2157273 1906894 1862783 1882984
3334 1882984 1842079 1932355 1909448 1873811 1818042 1739476 1718360 1700027 1905149 1889306 2016639
3323 2016639 2162774 2078507 1984586 1924751 1963006 2005238 2051176 1975076 1969873 1879106 1818549
3312 1818549 1935537 1951154 1994041 1955649 1826523 1768533 1803655 1849243 1809479 1778462 1771213
3301 1771213 1774162 1870499 1828742 1827268 1788313 1864807 1758975 1771822 1866509 1853857 1703886
3290 1703886 1579470 1558483 1618841 1817974 1845879 1852990 1671891 1745922 1806369 1870818 1866707
3279 1866707 1890997 1924709 1771123 1716838 1737667 1704352 1762537 1720504 1631819 1635673 1679908
3268 1679908 1705431 1728724 1633479 1679445 1801261 1801046 1740931 1698220 1627964 1532485 1513710 1630433
$$ packed form
3345A944389J59102j15291o3352j334L7122N4342K6722J15573k50379m4111K0201
3334A882984m0905R0276k2907l5637n5769p8566k1116j8333K05122j5843J27333
3323B016639J46135q4267r3921n9835L8255M2232M5938p6100n203r0767o0557
3312A818549J16988J5617M2887l8392j29126n7990L5122M5588l9764l1017p249
3301A771213K949R6337m1757j474l8955P6494j05832J2847R4687j2652j49971
3290A703886j24416k0987O0358J99133K7905P111j81099P4031O0447O4449m111
3279A866707K4290L3712j53586n4285K0829l3315N8185m2033q8685L854M4235
3268A679908K5523K3293r5245M5966J21816k15o0115m2711p0256r5479j8775J16723
$$ plain form
3256 1630433 1691288 1773823 1780997 1872249 1632264 1574362 1837694 1710639 1601615 1637943 1626444
3245 1626444 1624495 1725233 1719739 1641217 1463034 1508337 1520163 1479901 1482720 1527461 1461367 1368677
3233 1368677 1340102 1382859 1403286 1331658 1389180 1314985 1335433 1345407 1341891 1408527 1460647 1444965
3221 1444965 1447035 1384381 1294578 1512975 1581371 1461686 1328692 1354734 1377614 1336014 1281912
3210 1281912 1320554 1405747 1386465 1354933 1440763 1388735 1320589 1409335 1394162 1529757 1694489
3199 1694489 1643186 1546506 1517530 1447934 1561300 1536122 1473895 1503800 1438487 1517158 1581013
3188 1581013 1587870 1595093 1796919 1621370 1506249 1436648 1498921 1626995 1545879 1483975 1445975
3177 1445975 1476416 1562968 1582589 1562208 1615742 1649851 1626870 1617318 1712840 1740408 1794444 1656886
$$ packed form
3256A630433O0855Q2535P174R1252k39985n7902K63332j27055j09024L6328j1499
3245A626444j949J00738n494p8522j78183M5303J1826m0262K819M4741o6094r2690
3233A368677k8575M2757K0427p1628N7522p4195K0448R974l516O6636N2120j5682
3221A444965K070o2654q9803K18397O8396j19685j32994K6042K2880m1600n4102
3210A281912L8642Q5193j9282l1532Q5830n2028o8146Q8746j5173J35595J64732
3199A694489n1303r6680k8976o9596J13366k5178o2227K9905o5313P8671O3855
3188A581013O857P223K01826j75549j15121o9601O2273J28074q1116o1904l8000
3177A445975L0441Q6552J9621k0381N3534L4109k2981r552R5522K7568N4036j37558
$$ plain form
3165 1656886 1543520 1653462 1719502 1757745 1770121 1692653 1743299 1783364 1684047 1696488 1732508
3154 1732508 1622053 1759560 1911065 1949622 1921957 1852633 1872885 1911748 2007058 1995472 1966873
3143 1966873 2030107 1898214 1980486 1904667 1926450 1966660 1927478 1870558 2049251 2062857 2030073
3132 2030073 2124186 2081850 2162300 2194971 2278245 2240870 2403894 2514947 2594174 2652632 2622291
3121 2622291 2572683 2652420 2648317 2548254 2426762 2369980 2289686 2388748 2473345 2468682 2448696
3110 2448696 2354282 2434317 2529660 2473031 2446708 2384068 2378196 2467387 2511514 2600954 2635687 2607458
3098 2607458 2637751 2657363 2635122 2639096 2652812 2673811 2702493 2689458 2643846 2542703 2448087
3087 2448087 2482620 2466350 2277126 2313269 2313169 2331515 2345042 2340923 2353993 2281749 2281072 2295032
$$ packed form
3165A656886j13366J09942O6040L8243J2376p7468N0646M0065r9317J2441L6020
3154A732508j10455J37507J51505L8557k7665o9324K0252L8863R5310j1586k8599
3143A966873O3234j31893Q2272p5819K1783M0210l9182n6920J78693J3606l2784
3132B030073R4113m2336Q0450L2671Q3274l7375J63024J11053P9227N8458l0341
3121B622291m9608P9737m103j00063j21492n6782q0294R9062Q4597m663j9986
3110B448696r4414Q0035R5343n6629k6323o2640n872Q9191M4127Q9440L4733k8229
3098B607458L0293J9612k2241L974J3716K0999K8682j3035m5612j01143r4616
3087B448087L4533j6270j89224L6143j00J8346J3527m119J3070p2244o77J3960
$$ plain form
3075 2295032 2237966 2361277 2252241 2017029 2121514 2045113 1951836 1983431 2059628 1888556
3065 1888556 1835458 1837643 1901461 1882690 1910085 1886159 1808343 1748320 1766227 1624365 1622026 1555645
3053 1555645 1568040 1552451 1573678 1682791 1565459 1621224 1659577 1627329 1502210 1545466 1588709
3042 1588709 1463394 1377006 1385406 1312211 1365695 1348258 1358264 1400712 1278002 1187700 1302667
3031 1302667 1271989 1181486 1243964 1249132 1236570 1199583 1301454 1347314 1315958 1423861 1337326
3020 1337326 1219900 1175610 1200654 1168061 1274450 1315791 1231986 1263178 1166350 1154931 1268598
3009 1268598 1342272 1211082 1157112 1125253 1129996 1146634 1105848 1254720 1113963 1187324 1246584
2998 1246584 1106178 1026524 1061660 1091636 1116256 1043388 1046559 1007308 1002045 1274061 1148048
$$ packed form
3075B295032n7066J23311j09036k35212J04485p6401r3277L1595P6197j71072
3065A888556n3098K185O3818j8771K7395k3926p7816o0023J7907j41862k339o6381
3053A555645J2395j5589K1227J09113j17332N5765L8353l2248j25119M3256M3243
3042A588709j25315q6388Q400p3195N3484j7437J0006M2448j22710r0302J14967
3031A302667l0678r0503O2478N168j2562l6987J01871M5860l1356J07903q6535
3020A337326j17426m4290K5044l2593J06389M1341q3805L1192r6828j1419J13667
3009A268598P3674j31190n3970l1859M743J6638m0786J48872j40757P3361N9260
2998A246584j40406p9654L5136K9976K4620p2868L171l9251n263K72016j26013
$$ plain form
2987 1148048 1049585 1082469 1185377 1230629 1231861 1121683 1066447 991052 1008990 1062678 992468
2976 992468 979697 1029396 966468 1047019 1113619 1054011 1131632 1078923 1140961 1106720 1089835 1142355
2964 1142355 1081773 924176 984090 1016267 1068676 1004268 1094676 1066621 999563 1230686 1261353
2953 1261353 1213082 1120051 1152243 1169338 1169705 1051645 934021 848879 891435 1005190 1029294
2942 1029294 1059890 1055638 1114733 1209179 1233533 1248171 1132242 1081908 991075 1054919 1132458
2931 1132458 960286 943806 962055 1100918 1119545 1108844 1007025 1058234 972590 971756 984902
2920 984902 1025570 1055718 982003 1052033 985084 931515 815951 807597 916064 914754 892905 983089
2908 983089 870790 947333 1011475 916431 914700 1024889 939302 1031221 1152803 1063997 1055388
$$ packed form
2987A148048r8463L2884J02908M5252J232j10178n5236p5395J7938N3688p0210
2976I92468j2771M9699o2928Q0551O6600n9608P7621n2709O2038l4241j6885N2520
2964A142355o0582j57597N9914L2177N2409o4408R0408k8055o7058K31123L0667
2953A261353m8271r3031L2192J7095L67j18060j17624q5142M2556J13755K4104
2942A029294L0596m252N9095R4446K4354J4638j15929n0334r0833O3844P7539
2931A132458j72172j6480J8249J38863J8627j0701j01819N1209q5644q34J3146
2920I84902M0668L0148p3715P0030o6949n3569j15564q354J08467j310k1849R0184
2908I83089j12299P6543O4142r5044j731J10189q5587R1919J21582q8806q609
$$ plain form
2897 1055388 1104977 1051644 1104821 985154 940984 926818 963369 924897 900484 1022091 1008881
2886 1008881 870335 903346 858166 914905 943100 838938 807928 922390 1027013 953467 983909
2875 983909 1077239 996744 985628 1098990 1055596 1060664 1170933 1131680 878502 863612 839546
2864 839546 994630 1013715 999758 1010071 890380 882354 928457 974964 1033156 990035 1040090
2853 1040090 1014440 1007336 1010894 904823 836282 851593 858349 890080 1014013 946963 875744 905322
2841 905322 902511 859382 925131 979599 961963 819152 796098 882952 875174 922028 989568 975702
2829 975702 848182 908649 930084 944034 1042396 1095677 906145 935052 987282 1030615 1094320
2818 1094320 952025 984695 878274 887224 922241 816849 790910 816326 842427 920058 839774
$$ packed form
2897A055388M9589n3333N3177j19667m4170j4166L6551l8472k4413J21607j3210
2886A008881j38546L3011m5180N6739K8195j04162l1010J14462J04623p3546L0442
2875I83909R3330q0495j1116J13362m3394N068J10269l9253k53178j4890k4066
2864H39546J55084J9085j3957J0313j19691q026M6103M6507N8192m3121N0055
2853A040090k5650p104L558j06071o8541J5311O756L1731J23933o7050p1219K9578
2841I05322k811m3129O5749N4468j7636j42811k3054Q6854p778M6854O7540j3866
2829I75702j27520O0467K1435J3950R8362N3281j89532K8907N2230M3333O3705
2818A094320j42295L2670j06421Q950L5017j05392k5939K5416K6101P7631q0284
$$ plain form
2807 839774 804272 927953 921898 880760 689104 827383 853737 899102 942324 974038 949545
2796 949545 990201 1006321 886256 923942 851620 915131 922652 828037 830003 882372 1007767 931863
2784 931863 939533 778971 897061 867100 800675 833680 847255 800921 699211 784721 879511
2773 879511 916101 749735 804586 921488 922545 806499 779668 870450 854220 816503 810118
2762 810118 787308 893849 940538 948372 966375 942668 1016290 1030441 884958 860214 850839 788918
2750 788918 792071 770853 792286 908080 889494 951999 872537 958638 831890 928627 921301 825342
2738 825342 797614 745620 839282 863582 829807 758336 965516 1074437 1073436 1074684 1027470 991781
2726 991781 880607 833530 859602 909201 834053 720094 577867 786617 866318 892535 844918
$$ packed form
2807H39774l5502J23681o055m1138j91656J38279K6354M5365M3222L1714k4493
2796I49545M0656J6120j20065L7686p2322O3511P521r4615J966N2369J25395p5904
2784I31863P670j60562J18090k9961o6425L3005J3575m6334j01710Q5510R4790
2773H79511L6590j66366N4851J16902J057j16046k6831R0782j6230l7717o385
2762H10118k2810J06541M6689P834J8003k3707P3622J4151j45483k4744r375o1921
2750G88918L153k1218K1433J15794j8586O2505p9462Q6101j26748R6737p326r5959
2738H25342k7728n1994R3662K4300l3775p1471K07180J08921j001J248m7214l5689
2726I91781j11174m7077K6072M9599p5148j13959j42227K08750P9701K6217m7617
$$ plain form
2715 844918 858288 760203 878028 839137 846465 974162 878525 772579 675060 694022 681775
2704 681775 750816 744872 777387 825937 724009 787833 949893 886697 971476 900827 903349 858232
2692 858232 943766 910973 910155 900572 877859 770845 765213 800402 879447 886213 1014711 918135
2680 918135 828685 818902 671818 863986 1011438 1111832 961704 813972 738873 818384 834558
2669 834558 837845 952938 1017345 846036 824347 839043 783638 711580 871914 874346 734778
2658 734778 837724 867486 919562 904471 855387 841204 829051 795283 841864 871040 878344 945153
2646 945153 800651 790405 838388 755119 908206 766908 818389 835073 786216 747230 802364
2635 802364 843388 713965 833696 860267 784630 853073 819194 878531 729862 718813 799843
$$ packed form
2715H44918J3370r8085J17825l8891P328J27697r5637j05946r7519J8962j2247
2704F81775O9041n944L2515M8550j01928O3824J62060o3196Q4779p0649K522m5117
2692H58232Q5534l2793q18r583k2713j07014n632L5189P9045O766J28498r6576
2680I18135q9450r783j47084J92168J47452J00394j50128j47732p5099P9511J6174
2669H34558L287J15093O4407j71309k1689J4696n5405p2058J60334K432j39568
2658G34778J02946K9762N2076j5091m9084j4183j2153l3768M6581K9176P304O6809
2646I45153j44502j0246M7983q3269J53087j41298N1481J6684m8857l8986N5134
2635H02364M1024j29423J19731K6571p5637O8443l3879N9337j48669j1049Q1030
$$ plain form
2624 799843 645401 679476 832400 772259 813287 793528 792406 670872 760043 855252 802131
2613 802131 963437 869485 832458 798186 826134 906503 845307 714934 672615 828143 838392
2602 838392 760294 809770 816465 859288 975035 975800 921889 861208 872972 1081549 1128429 1128257
2590 1128257 1232341 1308491 1241261 1085960 877888 889655 937724 936658 891589 976471 975781
2579 975781 847657 1027469 1030714 1028288 1047658 1098172 1059586 926394 805386 868497 1008496
2568 1008496 777730 887071 933276 812984 791364 754259 683937 689139 673258 747530 788984
2557 788984 675355 784490 886360 829542 784947 915279 972667 956954 970543 960505 950096
2546 950096 876144 875968 914881 898774 889569 922151 888629 826462 756122 797482 766084 781058
$$ packed form
2624G99843j54442L4075J52924o0141M1028j9759j122j21534Q9171R5209n3121
2613H02131J61306r3952l7027l4272K7948Q0369o1196j30373m2319J55528J0249
2602H38392p8098M9476O695M2823J15747P65n3911o0681J1764K08577M6880j72
2590A128257J04084P6150o7230j55301k08072J1767M8069j066m5069Q4882o90
2579I75781j28124J79812L245k426J9370N0514l8586j33192j21008O3111J39999
2568A008496k30766J09341M6205j20292k1620l7105p0322N202j5881P4272M1454
2557G88984j13629J09135J01870n6818m4595J30332N7388j5713J3589j0038j0409
2546I50096p3952j76L8913j6107r205L2582l3522o2167p0340M1360l1398J4974
$$ plain form
2534 781058 864265 960154 911729 825936 758481 822679 845561 918588 1038779 981674 830625
2523 830625 904017 1001169 950906 927407 926738 824194 845759 847046 789155 895424 967463 1057269
2511 1057269 959398 909262 863691 905309 980307 915614 973671 958518 964117 949288 877538 882967
2499 882967 802468 907204 951501 808135 753367 895463 914983 912073 991000 944363 1041092
2488 1041092 935769 904930 1044682 911134 878297 820017 927310 1016161 1111337 1025600 1073369
2477 1073369 994428 935682 1064814 1147143 1083166 1005683 1024434 1050569 973122 902242 1019473
2466 1019473 973746 966224 916702 962737 1062276 1049790 1078655 1090001 1008022 943423 922367 1106081
2454 1106081 1071386 1054419 984765 1001146 1165111 1255222 1235165 1108536 1009086 956821 1094803
$$ packed form
2534G81058Q3207R5889m8425q5793o7455O4198K2882P3027J20191n7105j51049
2523H30625P3392R7152n0263k3499o69j02544K1565J287n7891J06269P2039Q9806
2511A057269r7871n0136m5571M1618P4998o4693N8057j5153N599j4829p1750N429
2499H82967q0499J04736M4297j43366n4768J42096J9520k910P8927m6637R6729
2488A041092j05323l0839J39752j33548l2837n8280J07293Q8851R5176q5737M7769
2477A073369p8941n8746J29132Q2329o3977p7483J8751K6135p7447p0880J17231
2466A019473m5727p522m9522M6035R9539j2486K8865J1346q1979o4599k1056J83714
2454A106081l4695j6967o9654J6381J63965R0111k0057j26629r9450n2265J37982
$$ plain form
2443 1094803 1262746 1216350 1141896 1100884 1134807 1176173 1170093 1287555 1292429 1358273 1144699
2432 1144699 1184469 1148645 1127512 1189421 1174667 1200288 1197194 1193959 1287137 1469384 1342394
2421 1342394 1376151 1377384 1424925 1429216 1413131 1352898 1528366 1531608 1390332 1380793 1468046 1593608
2409 1593608 1551928 1526839 1504409 1444844 1495331 1650409 1583515 1439703 1418482 1459648 1537805
2398 1537805 1600985 1570141 1512720 1580906 1779493 1677289 1683973 1834562 1888436 1922498 1861872
2387 1861872 1835919 1910762 1937825 2019613 1929956 1845914 1946996 1960488 2193964 2129523 2155996
2376 2155996 2081640 2096558 2176181 2316154 2442911 2373381 2378076 2305148 2393060 2707864 2901803
2365 2901803 2800644 2803673 2744828 2910056 3079450 3152617 3152569 3315160 3500177 3463845 3513380
$$ packed form
2443A094803J67943m6396p4454m1012L3923M1366o080J17462M874O5844k13574
2432A144699L9770l5824k1133O1909j4754K5621l094l235R3178J82247j26990
2421A342394L3757J233M7541M291j6085o0233J75468L242j41276r539Q7253J25562
2409A593608m1680k5089k2430n9565N0487J55078o6894j43812k1221M1166P8157
2398A537805O3180l0844n7421O8186J98587j02204O684J50589N3874L4062o0626
2387A861872k5953P4843K7063Q1788q9657q4042J01082J3492K33476o4441K6473
2376B155996p4356J4918P9623J39973J26757o9530M695p2928Q7912L14804J93939
2365B901803j01159L029n8845J65228J69394P3167m8J62591J85017l6332M9535
$$ plain form
2354 3513380 3597725 3670540 3875660 3956288 4020333 3928685 4166389 4452740 4645322 4889434
2344 4889434 5039474 5344525 5612383 5958369 6475433 6974811 7567935 8052252 8524587 9293969
2334 9293969 10696571 12744843 15301299 18540158 22211887 26316763 31174359 36949764
2326 36949764 44002744 52598248 62818199 72194573 74982372 66380514 53978985 44821315
2318 44821315 37849067 32261053 27508811 23788312 20837843 18550641 16462562 15007525
2310 15007525 13925322 13103194 12386952 11594489 10683787 9825483 8863277 7966256 7192127
2301 7192127 6467163 5746370 5131789 4396112 3995637 3631036 3441528 3280426 3232975 3031024
2291 3031024 2716560 2653373 2699507 2642420 2535561 2474592 2355372 2266070 2207818 2108259 2081565
$$ packed form
2354C513380Q4345P2815K05120Q0628O4045r1648K37704K86351J92582K44112
2344D889434J50040L05051K67858L45986N17064M99378N93124M84317M72335P69382
2334I293969J402602K048272K556456L238859L671729M104876M857596N775405
2326C6949764P052980Q595504J0219951R376374K787799q601858j2401529r157670
2318D4821315o972248n588014m752242l720499k950469k287202k088079j455037
2310A5007525j082203q22128p16242p92463r10702q58304r62206q97021p74129
2301G192127p24964p20793o14581p35677m00475l64601j89508j61102m7451k01951
2291C031024l14464o3187M6134n7087j06859o0969j19220q9302n8252r9559k6694
$$ plain form
2280 2081565 2039244 1879913 1965484 1921058 1824141 1921260 1854291 1774469 1740788 1658762 1493915
2269 1493915 1613444 1662044 1736231 1899585 1741275 1530586 1508581 1491408 1406878 1480904 1430113
2258 1430113 1437492 1518618 1526559 1439747 1347029 1419409 1362376 1409808 1366699 1380239 1456995 1547595
2246 1547595 1421091 1400015 1666763 1568997 1459107 1403756 1433676 1453355 1379297 1285032 1253128
2235 1253128 1258219 1241663 1195340 1250952 1217450 1244127 1201791 1298169 1171557 1281354 1199386
2224 1199386 1207977 1298732 1391733 1244019 1167994 1267470 1376007 1284475 1347503 1221860 1110809
2213 1110809 1102743 1193128 1279986 1255697 1222499 1137633 1269016 1187412 1218841 1228780 1122401
2202 1122401 1125440 1233663 1278522 1137402 1065975 1163905 1229185 1230903 1128578 1122719 1022102
$$ packed form
2280B081565m2321j59331Q5571m4426r6917R7119o6969p9822l3681q2026j64847
2269A493915J19529M8600P4187J63354j58310k10689k2005j7173q4530P4026n0791
2258A430113P379Q1126P941q6812r2718P2380n7033M7432m3109J3540P6756R0600
2246A547595j26504k1076K66748r7766j09890n5351K9920J9679p4058r4265l1904
2235A253128N091j6556m6323N5612l3502K6677m2336R6378j26612J09797q1968
2224A199386Q591R0755R3001j47714p6025R9476J08537r1532O3028j25643j11051
2213A110809q066R0385Q6858k4289l3198q4866J31383q1604L1429R939j06379
2202A122401L039J08223M4859j41120p1427R7930O5280J718j02325n859j00617
$$ plain form
2191 1022102 1068027 1097297 1032029 969478 972456 950188 1053063 1017223 994579 991040 1047694 1051416
2179 1051416 1097340 1086367 1076145 1067865 965360 954365 997318 1064616 1070838 1017304 1047279 1057196
2167 1057196 1112523 1242597 1198291 1221328 1210359 1161868 1245878 1129683 1072372 1009042 1009568
2156 1009568 1006608 1009830 1041065 1005160 1034154 1042647 1070667 1015986 936485 834067 830921 926784
2144 926784 963353 1004767 938292 968783 847621 809150 923074 1053033 1054147 957797 957507 840690
2132 840690 914272 1074306 1073613 1124988 1012631 1070607 1116904 1086476 1128022 1140719 1153004 1132965
2120 1132965 1092992 1026192 1122710 1024857 1037571 926184 1040910 1040780 1069141 1123648 953178
2109 953178 938089 958146 1093391 1158153 963246 1037349 1065229 1039402 1092967 1225671 1137618
$$ packed form
2191A022102M5925K9270o5268o2551K978k2268J02875l5840k2644l539N6654L722
2179A051416M5924j0973j0222q280j02505j0995M2953O7298O222n3534K9975R917
2167A057196N5327J30074m4306K3037j0969m8491Q4010j16195n7311o3330N26
2156A009568k960L222L1235l5905K8994Q493K8020n4681p9501j02418l146R5863
2144I26784L6569M1414o6475L0491j21162l8471J13924J29959J114r6350k90j16817
2132H40690P3582J60034o93N1375j12357N7976M6297l0428M1546J2697J2285k0039
2120A132965l9973o6800R6518r7853J2714j11387J14726j30K8361N4507j70470
2109I53178j5089K0057J35245O4762j94907P4103K7880k5827N3565J32704q8053
$$ plain form
2098 1137618 1154177 1070228 971902 1128435 929209 829306 895313 817913 732469 794734 837429
2087 837429 756428 864935 980947 1053701 1078402 1018930 974809 935727 1045989 976429 1024169
2076 1024169 1008328 960130 974773 959550 1053553 1186482 1012163 1003591 991829 948732 1044720
2065 1044720 899148 970569 995663 999667 1104202 1058899 967759 986523 1176314 1216899 1327127
2054 1327127 1335820 1309072 1262614 1204237 1053840 1104778 1150082 1120493 1145861 1111237 1074851
2043 1074851 1137415 1164917 1159624 1164821 1071214 1077680 1232984 1075383 853374 909465 802326
2032 802326 983800 1029423 939542 867991 1017085 1010440 868485 916486 906470 857897 937778
2021 937778 1074339 911946 920331 908075 852672 868293 938205 964293 942270 893420 894339 855848
$$ packed form
2098A137618J6559q3949r8326J56533j99226r9903O6007p7400q5444O2265M2695
2087H37429q1001J08507J16012P2754K4701n9472m4121l9082J10262o9560M7740
2076A024169j5841m8198J4643j5223R4003J32929j74319q572j1762m3097R5988
2065A044720j45572P1421K5094M004J04535m5303r1140J8764J89791M0585J10228
2054A327127Q693k6748m6458n8377j50397N0938M5304k9589K5368l4624l6386
2043A074851O2564K7502n293N197r3607O466J55304j57601k22009N6091j07139
2032H02326J81474M5623q9881p1551J49094o645j41955M8001j0016m8573P9881
2021I37778J36561j62393Q385j2256n5403J5621O9912K6088k2023m8850R19l8491
$$ plain form
2009 855848 889510 842365 941404 1020178 898190 927410 846507 854832 913802 952642 853517 930157
1997 930157 866926 803654 840022 968817 989005 909466 832239 789373 990541 1013249 1027491
1986 1027491 927933 866177 1006105 969786 876084 977864 1147271 991785 926694 891068 863576
1975 863576 868875 886883 921382 862435 930684 869264 763613 702019 731575 754623 783586 879829
1963 879829 777036 681531 706513 787039 777761 936572 943575 824278 897967 829565 846689
1952 846689 899576 824586 787509 981611 984938 810478 799421 847721 879564 833351 709803
1941 709803 767336 802471 778574 866522 845096 805066 716317 700150 820518 825315 792995 748167
1929 748167 863845 907118 852018 791002 746631 699946 770090 769518 906790 993779 983636 819439
$$ packed form
2009H55848L3662m7145R9039P8774j21988K9220q0903Q325N8970L8840r9125P6640
1997I30157o3231o3272L6368J28795K0188p9539p7227m2866K01168K2708J4242
1986A027491r9558o1756J39928l6319r3702J01780J69407j55486o5091l5626k7492
1975H63576N299J8008L4499n8947O8249o1420j05651o1594K9556K3048K8963R6243
1963H79829j02793r5505K4982Q0526r278J58811P003j19297P3689o8402J7124
1952H46689N2887p4990l7077J94102L327j74460j1057M8300L1843m6213j23548
1941G09803N7533L5135k3897Q7948k1426m0030q8749j6167J20368M797l2320m4828
1929G48167J15678M3273n5100o1016m4371m6685P0144n72J37272Q6989j0143j64197
$$ plain form
1917 819439 746423 852939 976230 920509 834970 800289 774881 835158 819251 821792 851915
1906 851915 985215 982621 1011969 873595 830177 861713 1002455 969290 923943 852172 798397
1895 798397 666770 887797 1034684 872710 850736 990439 981249 835702 718981 766041
1885 766041 826568 780393 803061 813534 800846 806988 845066 827034 755484 824531 890637 840779
1873 840779 792248 781834 769969 806348 880315 801721 853413 835175 880890 922953 907226 721221
1861 721221 654820 630842 598735 741573 805383 837311 822797 713734 736089 935229 886375
1850 886375 692357 779579 977538 896837 800203 718543 760464 849478 811224 847130 783621
1839 783621 833558 899682 859472 873080 956391 901261 864394 773792 758154 731436 754436 904287
$$ packed form
1917H19439p3016J06516J23291n5721q5539l4681k5408O0277j5907K541L0123
1906H51915J33300k594K9348j38374m3418L1536J40742l3165m5347p1771n3775
1895G98397j31627K21027J46887j61974k1974J39703r190j45547j16721M7060
1885G66041O0527m6175K2668J0473j2688O142L8078j8032p1550O9047O6106m9858
1873H40779m8531j0414j1865L6379P3967p8594N1692j8238M5715M2063j5727j86005
1861G21221o6401k3978l2107J42838O3810L1928j4514j09063K2355J99140m8854
1850H86375j94018Q7222J97959q0701r6634q1660M1921Q9014l8254L5906o3509
1839G83621M9937O6124m0210J3608Q3311n5130l6867r0602j5638k6718K3000J49851
$$ plain form
1827 904287 922745 828060 848568 759019 783889 832410 908578 916317 797958 830330 861850 805403
1815 805403 867543 743899 738330 947829 1037812 875586 719796 810180 864561 643965 667703
1804 667703 722609 693134 597593 603966 623526 751583 847488 765763 922081 677651 811303
1793 811303 910156 901469 953240 930868 862654 904824 751606 621271 741072 764423 744746
1782 744746 834556 823174 843951 827151 796226 776813 732253 738920 827958 963630 840492
1771 840492 832597 746717 730574 739042 867514 852580 672210 812485 762935 783618 785877 873394
1759 873394 824881 848733 808123 701496 800781 729239 734899 841514 799859 842067 732199
1748 732199 631468 749275 866801 834896 928470 996868 925775 899541 900782 1029013 872839
$$ packed form
1827I04287J8458r4685K0508q9549K4870M8521P6168P739j18359L2372L1520n6447
1815H05403O2140j23644n569K09499Q9983j62226j55790R0384N4381k20596K3738
1804F67703N4906k9475r5541O373J9560J28057R5905q1725J56318k44430J33652
1793H11303R8853q687N1771k2372o8214M2170j53218j30335J19801K3351j9677
1782G44746Q9810j1382K0777j6800l0925j9413m4560O667Q9038J35672j23138
1771H40492p895q5880j6143Q468J28472j4934j80370J40275m9550K0683K259Q7517
1759H73394m8513K3852m0610j06627R9285p1542N660J06615m1655M2208j09868
1748G32199j00731J17807J17526l1905R3574O8398p1093k6234J241J28231j56174
$$ plain form
1737 872839 878606 907261 909918 818524 766269 812542 769020 830307 879536 729890 788377 766423
1725 766423 729478 701017 639411 797538 717577 720159 758670 756743 713976 837172 853878 766275
1713 766275 830103 746708 765555 891292 1014090 988475 797698 666135 724960 750265 728364
1702 728364 707353 714453 769185 827564 895302 825035 827340 848545 740407 656427 759533 923056
1690 923056 856751 822871 783274 857528 858146 854729 795353 790563 785398 724270 608658 572807
1678 572807 618002 609741 689056 666590 760828 771513 694510 668636 863483 715821 822102
$$ packed form
1737H72839N767K8655K657r1394n2255M6273m3522O1287M9229j49646N8487k1954
1725G66423l6945k8461o1606J58127p9961K582L8511j927m2767J23196J6706q7603
1713G66275O3828q3395J8847J25737J22798k5615j90777j31563N8825K5305k1901
1702G28364k1011P100N4732N8379O7738p0267K305K1205j08138q3980J03106J63523
1690I23056o6305l3880l9597P4254O18l417n9376m790n165o1128j15612l5851
1678E72807M5195q261P9315k2466R4238J0685p7003k5874J94847j47662J06281
$$ [...]
##END NTUPLES=NMR SPECTRUM
##END=
