##TITLE=1H_DE-80H_X3
 200.13MHz, d2o
 8 sc
 
 19ns.26.2.2025
##JCAMPDX= 6.0         $$ Bruker NMR JCAMP-DX V2.0
##DATA TYPE= NMR SPECTRUM
##DATA CLASS= NTUPLES
##ORIGIN= UXNMR, Bruker Analytische Messtechnik GmbH
##OWNER= pz
$$ XWIN-NMR		Version 3.5
$$ Wed Oct 22 10:13:34 2025 Russian Standard Time (UT+4h)  Yarkov@DPX200
##.OBSERVE FREQUENCY= 200.1313
##.OBSERVE NUCLEUS= ^1H
##.ACQUISITION MODE= SIMULTANEOUS
##.ACQUISITION SCHEME= undefined
##.AVERAGES= 8
##.DIGITISER RES= 18
##SPECTROMETER/DATA SYSTEM= spect
##.PULSE SEQUENCE= zg30
##.SOLVENT NAME= CDCl3
##.SHIFT REFERENCE= (INTERNAL, CDCl3, 0, 15.4836)
##AUDIT TRAIL= $$ (NUMBER, WHEN, WHO, WHERE, WHAT)
$$ ##TITLE= Audit trail, XWIN-NMR		Version 3.5
$$ ##JCAMPDX= 5.01
$$ ##ORIGIN= Bruker BioSpin GmbH
$$ ##OWNER= Yarkov
$$ C:/Bruker/XWIN-NMR/data/yarkov2/nmr/H-C/1/pdata/1/auditp.txt
$$ ##AUDIT TRAIL=  $$ (NUMBER, WHEN, WHO, WHERE, WHAT)
(   1,<2025-10-22 10:12:41.31 +0400>,<Yarkov>,<DPX200>,
      <created by zg, POWCHK disabled, PULCHK disabled
       configuration hash MD5:
       00 E9 B6 7A A2 85 ED C7 34 08 36 98 17 FE 4E 26
       data hash MD5: 16K
       AC 57 AC 77 C8 1E 9E 15 9A B4 1C 3C AC 8B 68 93>)
(   2,<2025-10-22 10:12:46.93 +0400>,<Yarkov>,<DPX200>,
      <Start of raw data processing
       efp BC_mod = 2 LB = 0.25 FT_mod = 6 PKNL = 1 PHC0 = -4432.144 PHC1 = 3.42191 SI = 16K 
       data hash MD5: 16K
       4A EB CF 65 D2 B0 FA E9 77 AF 16 D0 14 3B 37 09>)
$$ ##END=
$$ 
$$ hash MD5
$$ C4 D6 96 CD 17 73 D0 4A 05 E4 59 CD B9 69 87 97
##$RELAX= 
##$RELAX= 
##$RELAX= 
##$RELAX= 
##$RELAX= 
##$RELAX= 
$$ Bruker specific parameters
$$ --------------------------
##$DU= <C:/Bruker/XWIN-NMR>
##$EXPNO= 1
##$NAME= <H-C>
##$PROCNO= 1
##$TYPE= <nmr>
##$USER= <yarkov2>
##$AMP= (0..31)
100 100 100 100 100 100 100 100 100 100 100 100 100 100 100 100 100 100 
100 100 100 100 100 100 100 100 100 100 100 100 100 100 
##$AQSEQ= 0
##$AQ_mod= 1
##$AUNM= <au_zg>
##$AUTOPOS= <>
##$BF1= 200.13
##$BF2= 200.13
##$BF3= 200.13
##$BF4= 200.13
##$BF5= 200.13
##$BF6= 200.13
##$BF7= 200.13
##$BF8= 200.13
##$BYTORDA= 1
##$CFDGTYP= 0
##$CFRGTYP= 5
##$CHEMSTR= <none>
##$CNST= (0..31)
1 1 145 1 1 1 1 1 1 1 1 1 1 1 1 1 1 1 1 1 1 1 1 1 1 1 1 1 1 1 1 1 
##$CPDPRG= <>
##$CPDPRG1= <>
##$CPDPRG2= <>
##$CPDPRG3= <>
##$CPDPRG4= <mlev>
##$CPDPRG5= <mlev>
##$CPDPRG6= <mlev>
##$CPDPRG7= <mlev>
##$CPDPRG8= <mlev>
##$CPDPRGB= <>
##$CPDPRGT= <>
##$D= (0..31)
0 0.7 0 0 0 0 0 0 0 0 0 0.03 0 0 0 0 0 0 0 0 0 0 0 0 0 0 0 0 0 0 0 0 
##$DATE= 1761113560
##$DBL= (0..7)
120 120 120 120 120 120 120 120 
##$DBP= (0..7)
150 150 150 150 150 150 150 150 
##$DBP07= 0
##$DBPNAM0= <>
##$DBPNAM1= <>
##$DBPNAM2= <>
##$DBPNAM3= <>
##$DBPNAM4= <>
##$DBPNAM5= <>
##$DBPNAM6= <>
##$DBPNAM7= <>
##$DBPOAL= (0..7)
0.5 0.5 0.5 0.5 0.5 0.5 0.5 0.5 
##$DBPOFFS= (0..7)
0 0 0 0 0 0 0 0 
##$DE= 6
##$DECBNUC= <off>
##$DECIM= 32
##$DECNUC= <off>
##$DECSTAT= 4
##$DIGMOD= 1
##$DIGTYP= 9
##$DL= (0..7)
0 120 120 120 120 120 120 120 
##$DP= (0..7)
$$ [...]
##$SUBNAM2= <"">
##$SUBNAM3= <"">
##$SUBNAM4= <"">
##$SUBNAM5= <"">
##$SUBNAM6= <"">
##$SUBNAM7= <"">
##$SUBNAM8= <"">
##$SUBNAM9= <"">
##$SW= 18.0517328524113
##$SWIBOX= (0..15)
0 0 2 0 0 0 0 0 0 0 0 0 0 0 0 0 
##$SW_h= 3612.71676300578
##$TD= 16384
##$TD0= 1
##$TE= 0
##$TE2= 300
##$TE3= 300
##$TEG= 300
##$TL= (0..7)
0 120 120 120 120 120 120 120 
##$TP= (0..7)
150 150 150 150 150 150 150 150 
##$TP07= 0
##$TPNAME0= <>
##$TPNAME1= <>
##$TPNAME2= <>
##$TPNAME3= <>
##$TPNAME4= <>
##$TPNAME5= <>
##$TPNAME6= <>
##$TPNAME7= <>
##$TPOAL= (0..7)
0.5 0.5 0.5 0.5 0.5 0.5 0.5 0.5 
##$TPOFFS= (0..7)
0 0 0 0 0 0 0 0 
##$TUNHIN= 0
##$TUNHOUT= 0
##$TUNXOUT= 0
##$USERA1= <user>
##$USERA2= <user>
##$USERA3= <user>
##$USERA4= <user>
##$USERA5= <user>
##$V9= 5
##$VALIST= <valist>
##$VCLIST= <CCCCCCCCCCCCCCC>
##$VD= 0
##$VDLIST= <DDDDDDDDDDDDDDD>
##$VPLIST= <PPPPPPPPPPPPPPP>
##$VTLIST= <TTTTTTTTTTTTTTT>
##$WBST= 1024
##$WBSW= 4
##$XGAIN= (0..3)
0 0 0 0 
##$XL= 0
##$YL= 0
##$YMAX_a= 156676
##$YMIN_a= -267365
##$ZGOPTNS= <>
##$ZL1= 120
##$ZL2= 120
##$ZL3= 120
##$ZL4= 120
##$ABSF1= 0
##$ABSF2= 0
##$ABSG= 0
##$ABSL= 0
##$ALPHA= 0
##$AQORDER= 0
##$ASSFAC= 0
##$ASSFACI= 0
##$ASSFACX= 0
##$ASSWID= 0
##$AUNMP= <proc_1d>
##$AZFE= 0.1
##$AZFW= 0.1
##$BCFW= 0
##$BC_mod= 2
##$BYTORDP= 0
##$COROFFS= 0
##$CY= -3
##$DATMOD= 1
##$DC= 0
##$DFILT= <>
##$DTYPP= 0
##$F1P= 0
##$F2P= 0
##$FCOR= 1
##$FTSIZE= 16384
##$FT_mod= 6
##$GAMMA= 0
##$GB= 0
##$INTBC= 1
##$INTSCL= 3.241238e-09
##$ISEN= 128
##$LB= 0.25
##$LEV0= 0
##$LPBIN= 0
##$MAXI= 10000
##$MC2= 0
##$MEAN= 0
##$ME_mod= 0
##$MI= 1.114404
##$NCOEF= 0
##$NC_proc= -7
##$NLEV= 6
##$NOISF1= 3.799351
##$NOISF2= 2.8
##$NSP= 0
##$NTH_PI= 0
##$NZP= 0
##$OFFSET= 15.48356
##$PC= 1
##$PHC0= -4432.144
##$PHC1= 3.42191
##$PH_mod= 1
##$PKNL= yes
##$PPARMOD= 0
##$PSCAL= 0
##$PSIGN= 0
##$REVERSE= no
##$SF= 200.130007634065
##$SI= 16384
##$SIGF1= 3
##$SIGF2= 2
##$SINO= 0.751879
##$SIOLD= 32768
##$SREGLST= <19F.Aceton>
##$SSB= 0
##$STSI= 16384
##$STSR= 0
##$SW_p= 3612.71676300578
##$SYMM= 0
##$S_DEV= 0
##$TDeff= 16384
##$TDoff= 0
##$TI= <>
##$TILT= no
##$TM1= 0
##$TM2= 0
##$TOPLEV= 0
##$USERP1= <user>
##$USERP2= <user>
##$USERP3= <user>
##$USERP4= <user>
##$USERP5= <user>
##$WDW= 1
##$XDIM= 16384
##$YMAX_p= 393963181
##$YMIN_p= -1002375
$$ End of Bruker specific parameters
$$ ---------------------------------
##NTUPLES= NMR SPECTRUM
##VAR_NAME=  FREQUENCY,     SPECTRUM/REAL,   SPECTRUM/IMAG
##SYMBOL=    X,             R,               I
##VAR_TYPE=  INDEPENDENT,   DEPENDENT,       DEPENDENT
##VAR_FORM=  AFFN,          ASDF,            ASDF
##VAR_DIM=   16384,         16384,           16384
##UNITS=     HZ,            ARBITRARY UNITS, ARBITRARY UNITS
##FACTOR=    0.220516191357247, 1,           1
##FIRST=     3098.72490264349, 0,            0
##LAST=      -513.991860362285, 0,           0
##MIN=       -513.991860362285, -1002375,    0
##MAX=       3098.72490264349, 393963181,    0
$$ Real data points
##PAGE= N=1
##DATA TABLE= (X++(R..R)), XYDATA
$$ [...]
8045G42219K35353j96887p6062n7360J88053M903l2584l1185l4166j91076K22163
8034G73371J19124k44956M0947k2392L158k8645j26152k9425J37383n9381J58415
8023G21447K795M6443R5024l65524J21338K67888P4196l01816N4573J2598l4946
8012F94016R1257k02103R5635m7566Q0895P4734j33693J06564k07788K67869Q1016
8001I00836p1536j74259m753P6449M0081O8944j91492K14193q1567P0113J16652
7990I63661j52060l0327J38450k02862m0021J73843L8945j62778l1403J00644
7980G96092J20509j63815r6332K4471j8989Q9622r6597K1059J82764K116J26479
7969I87379J42297j40031l20834O7204K16570l9476m0323j70555j42514K760K62442
$$ plain form
8045 742219 977572 780685 704623 647263 835316 840219 807635 776450 742284 551208 773371
8034 773371 892495 647539 688486 666094 669252 640607 514455 485030 622413 563032 721447
8023 721447 724242 770685 865709 500185 621523 889411 963607 661791 716364 728962 694016
8012 694016 785273 583170 678805 631239 712134 786868 653175 759739 551951 819820 900836
8001 900836 829300 655041 650288 726737 766818 835762 644270 858463 776896 847009 963661
7990 963661 811601 781274 919724 716862 676841 850684 889629 726851 695448 796092
7980 796092 916601 752786 656454 680925 661936 751558 654961 676020 858784 860900 987379
7969 987379 1129676 989645 668811 736015 952585 913109 872786 702231 559717 562477 824919
7958H24919j59051R7353J42416l0109N7362N3796j77567k31987J12277J82309
7948H71718j1149j54186m3837r0209J11189Q6892j00168j9570m2190L1526L1477
7937F71493J46373n0016j73902l3983J15348R6984k43562j31992P7633Q5m2799
7926D31662R7816k8145j72968Q6600K01150K4519K332L9558K05375J44699k61970
7915G70628k86044k7008J14873j4185K4284k9139M6894k0338j64923J07723M1296
7904E64061J47274p5674l5637j6092M1773j30479o6252J04716k0113N2740L6239
7893F02556J4954K19122O2064q3992k31092J10631m5880N4139j60289O9199J43268
7882G54680R1931L667R1097J12346k71157j32369J27439J01278J7196J0230m6841
$$ plain form
7958 824919 665868 763221 905637 875528 932890 986686 809119 577132 689409 871718
7948 871718 860569 706383 662546 572337 683526 770418 670250 650680 608490 640016 671493
7937 671493 817866 767850 593948 559965 675313 772297 528735 396743 474376 474461 431662
7926 431662 529478 501333 328365 414965 616115 640634 642966 682524 887899 1032598 770628
7915 770628 484584 457576 572449 558264 582548 553409 600303 579965 415042 522765 564061
7904 564061 711335 635661 600024 583932 625705 495226 428974 533690 513577 566317 602556
7893 602556 617510 836632 898696 814704 583612 694243 648363 702502 542213 611412 754680
7882 754680 846611 850278 941375 1053721 782564 650195 777634 878912 896108 906338 859497
7871H59497k6614j58500R3740P0083J61306o0286o2631j35798r833O8866j15950
7860F83880k8171l7412N4682N7590L6707l9509L9364n7407J38905J5164L4601
7849H98394n8185k25180Q5151N4454K06038j29834k85278n5847J30511J11550
7839G31774n8605P7603J12831M3363P7099j3832Q1823j40160j7598q2893J61146
7828I72551m1659r1407m0247O5587o3243Q881J10915M2524j46564l1p9618J9126
7816G56815k5465J02759L19083k01051m13355p9908L3140L998j09553L12411K01206
7805I00080L5844k9338j68980M797M0699k3581m1113P5454Q5706N5486j56984
7794G78070J56427P9251J47668J08170j44173M8882J50123j13677r6869N9669
$$ plain form
7871 859497 832883 674383 768123 838206 999512 939226 876595 740797 730964 799830 683880
7860 683880 655709 618297 672979 730569 767276 727767 767131 709724 848629 863793 898394
7849 898394 840209 615029 700180 754634 960672 830838 545560 489713 620224 731774
7839 731774 673169 750772 863603 906966 984065 970233 1052056 911896 894298 811405 972551
7828 972551 930892 839485 799238 864825 801582 810463 921378 963902 817338 817307 737689 756815
7816 756815 731350 834109 1153192 952141 538786 458878 492018 496016 386463 698874 900080
7805 900080 935924 906586 737606 742403 783102 759521 718408 793862 879568 935054 778070
7794 778070 934497 1013748 1161416 1269586 1125413 1174295 1324418 1210741 1113872 1173541
7784A173541j11375k05082J6145J97424j36390j39975k26294j03233J33563J03206
7774G01530J91750p5039o5541R5112k6984n3566n7250K11674J07813j31608M6038
7763I43929m5074j26556N4048O0777O0504N777k20879J48893L09702j29908j05054
7752I56159K42934J49276n8747n8728j00298j12320J25581j98176J52798J39064
7742A237543J5604j58971Q8274j51761J63759Q9301M5192J6075j18207J67675
7732A394484k6969m9244j775K9259K05983L2828k159n4401j89668r3270J423J73311
7720A419802J96645o5094J64139k67653N3297j15337j96676K96149J25838l01521
7710A309589j27309J50573J94121j36893j78341N3799p0421Q1921o3569P4891
$$ plain form
7784 1173541 1062166 857084 873229 1070653 934263 794288 567994 464761 598324 701530
7774 701530 893280 818241 752700 847812 820828 767262 710012 921686 1029499 897891 943929
7763 943929 898855 772299 826347 887124 947628 953405 732526 881419 1191121 1061213 956159
7752 956159 1199093 1348369 1289622 1230894 1130596 1018276 1143857 945681 1098479 1237543
7742 1237543 1253147 1094176 1182450 1030689 1194448 1283749 1328941 1345016 1226809 1394484
7732 1394484 1367515 1318271 1316496 1345755 1551738 1584566 1582407 1528006 1338338 1245068 1246491 1419802
7720 1419802 1616447 1551353 1715492 1447839 1501136 1385799 1189123 1485272 1611110 1309589
7710 1309589 1182280 1332853 1526974 1390081 1211740 1265539 1195118 1277039 1213470 1288361
7700A288361M7799l1927j68390O6082N6196Q2349M7922K048j21215J11083R8940
7689A479248l6357j13087p2322l6273K8684j13218j0129j41377r3613L8579K60471
7678A190606L0688j37406k12683k14897N561J33027n0932J64847J82994l0419
7668A061386j06692Q2663j14481m4140q7371j65013R9544L7103j04384p6152o3838
7657E18625R0316N8416M7367K1379J7834L6609j301P4071r068q2529j05337n5160
7645F11222k7095P4374J8785K6241j1984p9511N1887K47214M324m1800K32299
7634A105956q563j03592k23012j3449M411r3818K28017J50006k09766Q5084j7615
7623I03659j93882J08173M9165J20238k91749j8124Q4066J10799m2107l1116p5783
$$ plain form
7700 1288361 1336160 1304233 1135843 1201925 1258121 1340470 1388392 1390440 1269225 1380308 1479248
7689 1479248 1442891 1329804 1257482 1221209 1249893 1136675 1126546 985169 891556 930135 1190606
7678 1190606 1221294 1083888 871205 656308 661869 794896 743964 908811 1091805 1061386
7668 1061386 954694 1037357 922876 878736 791365 626352 725896 762999 658615 582463 518625
7657 518625 608941 667357 714724 736103 753937 790546 789245 863316 854248 771719 666382 611222
7645 611222 584127 658501 677286 703527 691543 612032 663919 911133 915457 873657 1105956
7634 1105956 1097393 993801 770789 757340 761751 667933 895950 1045956 836190 921274 903659
7623 903659 709777 817950 867115 987353 695604 677480 761546 872345 830238 799122 723339
7612G23339J03979N9347J41940m867q0377l2212J20173J24857j58867Q1442J44495
7601A223249o6213L0021M2467l3465R8088k7409J2022k0105j73790K51059R79
7590A336903k19066L16199m1686j48247M4039m2274J2354M1162j34831J37434
7580A301987m3386K3642J85332K9286j781L1238j1073l3151P0400j72445J36708
7569A516757J48567j75441j36583J99986l4799o2358J5383p4688P8365R3602J73320
7558A742111l71279j6969K9867n4451L4945j39672K17055k5394j50665L2375J31791
7547A429714N0824k29880J91154j9904j21767K2069k09277p6371R0611K51368
7537A378541p3119l3526l9811r5202J85507J54679l8699k81740k5306K5908J96026
$$ plain form
7612 723339 827318 886665 1028605 1023738 943361 911149 1031322 1156179 997312 1078754 1223249
7601 1223249 1157036 1187057 1229524 1196059 1294147 1266738 1278760 1258655 1084865 1335924 1336903
7590 1336903 1117837 1434036 1392350 1244103 1288142 1245868 1258222 1299384 1164553 1301987
7580 1301987 1258601 1282243 1467575 1496861 1495080 1526318 1515245 1482094 1552494 1380049 1516757
7569 1516757 1665324 1489883 1353300 1553286 1518487 1456129 1471512 1396824 1475189 1568791 1742111
7558 1742111 1370832 1353863 1383730 1329279 1364224 1224552 1441607 1416213 1265548 1297923 1429714
7547 1429714 1480538 1250658 1441812 1421908 1300141 1322210 1112933 1036562 1127173 1378541
7537 1378541 1305422 1271896 1232085 1136883 1322390 1477069 1438370 1156630 1131324 1157232 1353258
7526A353258p8382j24548R0027l34468K70800J03381n0235L6254j02922l0431
7516A132734J67537L4777p1265l993j01885j67581J69007L8407j92998N3741p4065
7505I84416M7917O5264j62951J6933J53265j9744o7375n0137K2390J95280J7337
7494A202595j69629K50336N4435k3261k8948r4293K3149m8242m9662j00001K294
7483A018773Q9474R9691l46481L0157K56927m2175R3185m9154o7337J26216j32897
7472A076379k33115n1244P696J06232N6127R4373o5139r4393N7134J09268k1548
7461A041770k45047M3863K22788j31944M5550N2018J09202m5013j09363J1575
7451I95399k2616m6933R3763J7795m789j25266l8992J62125n2099M7860K750O951
$$ plain form
7526 1353258 1274876 1150328 1240355 905887 1176687 1280068 1229833 1266087 1163165 1132734
7516 1132734 1300271 1335048 1263783 1259790 1157905 990324 1159331 1197738 1004740 1058481 984416
7505 984416 1032333 1097597 934646 951579 1104844 1085100 1017725 967588 989978 1185258 1202595
7494 1202595 1032966 1283302 1337737 1314476 1285528 1191235 1214384 1166142 1116480 1016479 1018773
7483 1018773 1108247 1207938 861457 891614 1148541 1106366 1199551 1150397 1083060 1209276 1076379
7472 1076379 843264 792020 799716 905948 962075 1056448 991309 896916 954050 1063318 1041770
7461 1041770 796723 840586 1063374 931430 976980 1028998 1138200 1093187 983824 995399
7451 995399 972783 925850 1019613 1037408 1032619 907353 868361 1030486 978387 1026247 1028997 1035948
7439A035948J52888k30310q7621J16597q4593j5049J30867R2811p4385Q1215l13305
7428H05063o9731J00395j38239k8735J60599Q2680n7966j934M1152l8902l4206
7417H20176O7363L41724j5071j95788n9056J77142Q9731p8147L123P581q0216
7406A078562M0773j7432L6009r5189N1922K81894j53082J92763R3944m6544j01147
7395A362473M0734K81078J25657n5595J08281m3283j55101N9593K52558k35267
7385A741128j6576k49828J22489j15863R184J2938r0402n5436k39075l3369J59505
7374A244695j66501k3128J61182k02732O4626J00043R961k13049K9928R5867J58774
7363A259666j15422J15668p242j13287M5329j35139j20835J54534J02579N3885
$$ plain form
7439 1035948 1188836 958526 870905 987502 902909 887860 1018727 1111538 1037153 1118368 805063
7428 805063 735332 835727 697488 668753 829352 912032 854066 852132 893284 854382 820176
7417 820176 887539 1229263 1214192 1018404 959348 1136490 1226221 1148074 1151197 1158778 1078562
7406 1078562 1119335 1101903 1137912 1042723 1094645 1376539 1223457 1416220 1510164 1463620 1362473
7395 1362473 1403207 1684285 1809942 1754347 1862628 1819345 1664244 1723837 1976395 1741128
7385 1741128 1724552 1474724 1597213 1481350 1490534 1503472 1413070 1357634 1118559 1085190 1244695
7374 1244695 1078194 1055066 1216248 1013516 1078142 1178185 1188146 975097 1005025 1100892 1259666
7363 1259666 1144244 1259912 1252670 1139383 1184712 1049573 928738 1083272 1185851 1239736
7353A239736j54694N7173J2304j08838N6130r3515J9638j7177P9910J02925j01657
7342A091935J77821J24349K2779k70483k5060j66575N9663N338k7286j20760k49941
7331F21780L53312J07913j14068M6225J097R9270J46114Q4774J65273r4589Q681
7320A425782M2805k53643r6917j61228r8823m5390K64480L6080J0892k9374j38872
7309I55792J1722J08979K30802j58657K1486J10183k14781j01218J47586J57375
7299A269269N6855O5867j45398j01373N4723n0078j21737J14339J6462m7531J23092
7288A234490l19375J67226K64987j18978M6798K73745j32729O2314N8176l060
7278A533594j38600q3538K05615j8720R861O3272k01391q791p6923J24812j96908
$$ plain form
7353 1239736 1085042 1142215 1154519 1045681 1101811 1008296 1027934 1010757 1090667 1193592 1091935
7342 1091935 1269756 1394105 1416884 1146401 1121341 954766 1014429 1019767 992481 871721 621780
7331 621780 975092 1083005 968937 1015162 1016259 1115529 1261643 1346417 1511690 1417101 1425782
7320 1425782 1468587 1214944 1118027 956799 857976 812586 1077066 1113146 1124038 1094664 955792
7309 955792 967514 1076493 1307295 1148638 1170124 1280307 1065526 964308 1111894 1269269
7299 1269269 1326124 1391991 1246593 1145220 1199943 1149865 1028128 1142467 1158929 1111398 1234490
7288 1234490 915115 1082341 1347328 1228350 1275148 1548893 1416164 1478478 1536654 1533594
7278 1533594 1394994 1311456 1517071 1498351 1508212 1571484 1370093 1361302 1284379 1409191 1212283
7267A212283k10867K1258L1528J81678K6394k07586j49012K94288k6332J38712
7257A312344M4608L5549p4985k1013L09374j32725N320N3597K58108N5881k06113
7246A639945n7551Q9902p9950K17529Q1595j98739J0775J51033J56537J68986
7236B180062k01568k75595J63484L14121K5746k17391q7863J54648K64866j18270
7226B202240p7591n1560K4880Q0693R3372o0201J96631k9714j69794j38376K34371
7215B304951K4934r0813J22461J14071Q5129J84293O9752r4684J48652J58324
7205C027070P0130q7305J57324K17300J24138k926K73473O1073j64629K64776
7195C940424K61490J24303L30192l4948L3358N78917Q4283P204J51610K42870
$$ plain form
7267 1212283 1001416 1022674 1054202 1235880 1262274 1054688 905676 1199964 1173632 1312344
7257 1312344 1356952 1392501 1317516 1296503 1605877 1473152 1478472 1532069 1790177 1846058 1639945
7246 1639945 1582394 1672296 1592346 1809875 1891470 1692731 1703506 1854539 2011076 2180062
7236 2180062 1978494 1702899 1866383 2180504 2206250 1988859 1900996 2055644 2320510 2202240
7226 2202240 2124649 2073089 2097969 2178662 2272034 2211833 2408464 2378750 2208956 2070580 2304951
7215 2304951 2329885 2239072 2361533 2475604 2560733 2745026 2814778 2720094 2868746 3027070
7205 3027070 3097200 3009895 3167219 3384519 3508657 3505731 3779204 3840277 3675648 3940424
7195 3940424 4201914 4326217 4656409 4621461 4654819 5233736 5318019 5325223 5476833 5719703
7185E719703N8383J85410K84144N59264M45862K58551K93111L11975K65038M45877
7175H827318K93895P09888N04904K95650L41359L88007O05050N47650N83384M05962
7165A3503067K37942L81645N61409L53520L72986R0805K55832J72114m8690J5434
7155A5896064j3116k70947k6522l85881m37448n08052l53399m84040o72704o92200
7145A2051755m59180l82403n07005m54375k25250k23177n08826o65500l81922
7136H244117l45802l50205l31714k54486l7174k21922m04643l58373L4453p398
7126E966853l85796j36331n6824j79897R70q2356j63482k96112l28700K276R6832
7115D437433r3526k1270P1368q6547j13543j1173L4720k03964j6077J63201k6106
$$ plain form
7185 5719703 5778086 5963496 6247640 6806904 7252766 7511317 7804428 8116403 8381441 8827318
7175 8827318 9121213 9831101 10336005 10631655 10973014 11361021 11966071 12513721 13097105 13503067
7165 13503067 13741009 14122654 14684063 15037583 15410569 15501374 15757206 15929320 15880630 15896064
7155 15896064 15882948 15612001 15585479 15199598 14762150 14254098 13900699 13416659 12743955 12051755
7145 12051755 11592575 11210172 10703167 10248792 10023542 9800365 9291539 8626039 8244117
7136 8244117 7898315 7548110 7216396 6961910 6924736 6702814 6298171 5939798 5974251 5966853
7126 5966853 5581057 5444726 5387902 5208005 5208975 5126619 4963137 4667025 4338325 4340601 4437433
7115 4437433 4343907 4322637 4394005 4307458 4193915 4182742 4217462 4013498 3997421 4160622 4134516
7104D134516N36n7992q7447r4862J63122k55241O6912J91096l08874l20835N8599
7093C489530j41266N2218o4925j40354j57444k8016j5820k18732j01786p4458
7083B598947P3291Q0967j70431k0653k21777j42283j13347N1984K4733j33667
7073B027764J27063K1608k4156k26821J46686o6522q6791J27584K7230M0377k6607
7062B087415r5595l5333K13636J73280j52138J0893m0930L53680r5566j80907
7052B238435n2480R1865M1701l02455m91o6569M7460k257k97515l369O305j04008
7040A596622j7101j03283l3553J18655p2238Q0436Q4584J47017J10633p5284J14538
7029A951026j06693k1170n5568k20753K1336O1924r8793P6553n4179K1968l2516
$$ plain form
7104 4134516 4135052 4077060 3989613 3894751 4057873 3802632 3869544 4060640 3751766 3430931 3489530
7093 3489530 3348264 3400482 3335557 3195203 3037759 3009743 2993923 2775191 2673405 2598947
7083 2598947 2672238 2753205 2582774 2562121 2340344 2198061 2084714 2136698 2161431 2027764
7073 2027764 2154827 2176435 2152279 1925458 2072144 2005622 1918831 2046415 2073645 2114022 2087415
7062 2087415 1991820 1956487 2170123 2343403 2191265 2202158 2161228 2514908 2419342 2238435
7052 2238435 2185955 2277820 2319521 2017066 2016575 1950006 1997466 1995209 1697694 1694325 1700630 1596622
7040 1596622 1579521 1476238 1442685 1561340 1489102 1569538 1654122 1801139 1911772 1836488 1951026
7029 1951026 1844333 1823163 1767595 1546842 1568178 1630102 1531309 1607862 1553683 1575651 1543135
7018A543135J49028k9191K09719J82669j14421J20181P1714J78288k47118l67241
7008A696763J60820K23130Q3419J29778m0086o8791O0236L2096J3636l2124J60736
6997B419613o6096N6467n4951m4298J05948q3246L49584J24605J29270K19053
6987C155949n514q7O4582K516j67854j48283R196j3220Q1775J98312L0664K40012
6975C448048Q7090j17040j04082j85601l81742k7098k5697k91146j08143j95373
6965B099216j1539r3901q7520k6450N8468O6736m3186j78705R0542j29877J70273
6954A914057Q2864p1108J07468r0292q4849n7689k741O0281j3357j3911J6682
6943A847405l3577R252R8513K51292j17226j59631J40828J56579M0276j7330J43586
$$ plain form
7018 1543135 1692163 1662972 1872691 2055360 1940939 2061120 2132834 2311122 2064004 1696763
7008 1696763 1857583 2080713 2164132 2293910 2253824 2185033 2245269 2277365 2291001 2258877 2419613
6997 2419613 2353517 2409984 2355033 2310735 2416683 2333437 2683021 2807626 2936896 3155949
6987 3155949 3150435 3150348 3214930 3217446 3049592 2901309 2910505 2897285 2979060 3177372 3208036 3448048
6975 3448048 3535138 3418098 3314016 3128415 2746673 2719575 2693878 2402732 2294589 2099216
6965 2099216 2087677 1993776 1906256 1879806 1938274 2005010 1961824 1783119 1873661 1743784 1914057
6954 1914057 1996921 1925813 2033281 1942989 1858140 1800451 1797710 1857991 1844634 1830723 1847405
6943 1847405 1813828 1823080 1921593 2172885 2055659 1896028 2036856 2193435 2233711 2216381 2359967
6932B359967J73348J91654Q6009K7432K93723J42281p9997J02240J28615j00219
6922C325053j15727r0348R1803m3615j45560N9167k4764J88290n5931K90551K2539
6911C501458l64899j89124j87285j17754o9680L8109k0618k04241k30913J8410
6901B173463r3345j10955J28360M8607k47089j05525K16476j06176k16968K10676
6891A897524J46731O0995k1268Q0690J31351j01955k36895J3532j12806N7792
6881A915691j10027K2463J37925m5619J01079Q1566j50907j9325K6004L5484m2400
6870A951934q8001n8602J68598j2561n4112N2206J44390P4249J4448k8014j54056
6859B010479R272j06390j38744M38699R965k2429q2925k59273K20858M5808n80
$$ plain form
6932 2359967 2533315 2724969 2810978 2838410 3132133 3274414 3194417 3296657 3425272 3325053
6922 3325053 3209326 3118978 3210781 3167166 3021606 3080773 3056009 3244299 3188368 3478919 3501458
6911 3501458 3136559 2947435 2760150 2642396 2572716 2610825 2590207 2385966 2155053 2173463
6901 2173463 2080118 1969163 2097523 2146130 1899041 1793516 2009992 1903816 1686848 1897524
6891 1897524 2044255 2105250 2083982 2164672 2296023 2194068 1957173 1970705 1857899 1915691
6881 1915691 1805664 1828127 1966052 1920433 2021512 2103078 1952171 1932846 1958850 1994334 1951934
6870 1951934 1863933 1805331 1973929 1961368 1907256 1959462 2103852 2178101 2192549 2164535 2010479
6859 2010479 2019751 1913361 1774617 2213316 2223281 2200852 2117927 1858654 2079512 2125320 2124740
6848B124740J21029k4515O5074k9421k28045j3482R9065p3783j81097j41862J28351
6837A846054K21982R104Q8194r8760N655J4261j34588j12667J73474j00355O4190
6826A976544J8002J8955K1153j25193j09821k03853j282L11364R4615k421J3875
6815B011938j24470n5897J5749k9764l4888R1858J10269j33331k7318R6275j10960
6804A809461J16989J71540k15891k64246q2115k6117J33059M3084k8624j68121
6794A489019k980K65999r003r059J1633q9214O8611L7400k2589n5670O7917k9533
6782A722531j78614j06203N9635L45789K23524K2729k30213J99697Q451k03359
6772A863967k36316q2432J26147N3088P180K18271j13976j66462j11627N4754
$$ plain form
6848 2124740 2245769 2221254 2286328 2256907 2028862 2015380 2114445 2040662 1859565 1717703 1846054
6837 1846054 2068036 2077140 2165334 2066574 2072229 2086490 1951902 1839235 2012709 1912354 1976544
6826 1976544 1994546 2013501 2034654 1909461 1799640 1595787 1594505 1905869 2000484 1998063 2011938
6815 2011938 1887468 1831571 1847320 1817556 1782668 1874526 1984795 1851464 1824146 1920421 1809461
6804 1809461 1926450 2097990 1882099 1617853 1535738 1509621 1642680 1685764 1657140 1489019
6794 1489019 1486039 1752038 1743035 1733976 1745609 1656395 1725006 1762406 1739817 1684147 1752064 1722531
6782 1722531 1543917 1437714 1497349 1843138 2066662 2089391 1859178 2058875 2067326 1863967
6772 1863967 1627651 1545219 1671366 1724454 1731634 1949905 1835929 1669467 1557840 1612594
6762A612594J93771n3805J21434q9715l5089K79434M7572J64628r2084n3269J3068
6751B108539K4746K40944M6592P4709o9895R9957M1960J9694K60455K83645L25630
6740C456976j2132R5482L72633J73840R5277J35188K2977O3392k29760j32810
6730D041063o2020n9162N8649K29540J72587K05588K80539K110j11701r2385l03516
6719D361292j91605J39625k29713j15605P5233K24421J61623K45023K94299J5594
6709D980187N6180K05332j19111l34622j41236M6882l09830L883N5291K60000
6699D702956L3695j35302Q9209P5433l11022k27187k94966k02876k13495K18306
6689C734751l04796k65445j37118q338L1168m19306j59017J45015R0088o8464
$$ plain form
6762 1612594 1806365 1752560 1873994 1784279 1749190 2028624 2076196 2240824 2148740 2095471 2108539
6751 2108539 2133285 2374229 2420821 2495530 2425635 2525592 2567552 2587246 2847701 3131346 3456976
6740 3456976 3444844 3540326 3912959 4086799 4182076 4317264 4340241 4403633 4173873 4041063
6730 4041063 3979043 3919881 3978530 4208070 4380657 4586245 4866784 4868894 4757193 4664808 4361292
6719 4361292 4169687 4309312 4079599 3963994 4039227 4263648 4425271 4670294 4964593 4980187
6709 4980187 5036367 5241699 5122588 4787966 4646730 4693612 4383782 4387665 4442956 4702956
6699 4702956 4736651 4601349 4690558 4765991 4454969 4227782 3932816 3729940 3516445 3734751
6689 3734751 3429955 3164510 3027392 3019054 3050222 2630916 2471899 2616914 2707002 2638538
6679B638538k26948K7194J81049q4942O0095m6021L6807N6820k1801l27934q7757
6668B205100m4898L02117J59184k0545m0897j9130P3968o6560k2747L8247j72758
6657B391081j45455J76261p263O1833J780K6131j8655K00513n0277j3625n1231
6646B571093n4904q430J79493j21204q5374J70376j66990l0717K7152J20637o3075
6635B538057J67413q413M395J35788r8775N7193j86250j51151L29579J05624j2007
6624B881453J45103p5783K1280q0467k37098K06394J83744j1469m1388l3317J44026
6613C102478q7640j68737Q9187k38143R5144K06923j4529j58126K56663j1975
6603C071245J95157K1410j29592k29772J26763K24318j24760j72005J7175O1102
$$ plain form
6679 2638538 2411590 2438784 2619833 2534891 2594986 2548965 2585772 2642592 2620791 2292857 2205100
6668 2205100 2160202 2462319 2621503 2600958 2560061 2540931 2614899 2548339 2525592 2563839 2391081
6657 2391081 2245626 2421887 2414624 2476457 2478237 2504368 2485713 2686226 2635949 2622324 2571093
6646 2571093 2516189 2507759 2687252 2566048 2480674 2651050 2484060 2453343 2480495 2601132 2538057
6635 2538057 2705470 2697057 2701452 2837240 2738465 2795658 2609408 2458257 2787836 2893460 2881453
6624 2881453 3026556 2950773 2972053 2891586 2654488 2860882 3044626 3033157 2991769 2958452 3102478
6613 3102478 3014838 2846101 2935288 2697145 2792289 2999212 2984683 2826557 3083220 3071245
6603 3071245 3266402 3287812 3158220 2928448 3055211 3279529 3154769 2982764 2999939 3061041
6593C061041j02365K52487R4872M2341K22610j0859J48714j98260J64201M0427
6583C715209r092R1634J98080l9410k3552J82039L6657R7206j4091J98r6918K1576
6571D159536N8949J78454j10576l236O8332J42917L14937J50443K02364J99592
6561E361712J67561J25186M95030M89500L59374L98970K06523L39351M78222Q4921
6551H506350N6654J4778k3341j83911m90518l30499l16161l41161l11819j50059
6541F430313k9700o7034l0271m16313k83761K39110J3094j31309j30655L2360
6531E625834K9955j90626j40896J3716O028J7333l12042k4501l470k41056j73665
6520D606610O0572k9467K181K1076M5775k5915J7085j44904K06969k02829r2539
$$ plain form
6593 3061041 2958676 3211163 3306035 3348376 3570986 3560127 3708841 3510581 3674782 3715209
6583 3715209 3706117 3797751 3995831 3956421 3932869 4114908 4151565 4248771 4234680 4234878 4137960 4159536
6571 4159536 4218485 4396939 4286363 4283127 4351459 4494376 4809313 4959756 5162120 5361712
6561 5361712 5529273 5654459 6149489 6638989 6998363 7397333 7603856 7943207 8421429 8506350
6551 8506350 8563004 8577782 8554441 8370530 7880012 7549513 7233352 6892191 6580372 6430313
6541 6430313 6400613 6333579 6303308 5886995 5603234 5842344 5855438 5724129 5593474 5625834
6531 5625834 5655789 5465163 5324267 5337983 5344011 5361344 5049302 5024801 5021331 4780275 4606610
6520 4606610 4667182 4637715 4639896 4660972 4706747 4680832 4697917 4553013 4759982 4557153 4464614
6509D464614J18548J12470j14470j9153O2792J72361r8680J01660J20207j73858
6499D746491n2284q4376j31615n7948J00188M8569k9316J92782n5892J47944j58571
6488D665972k66421K01060Q8448M3084j77000k5461R0173K30180l6049j29702
6478D684284J27324J51883J21776n6194n1824j0321J40189M6155j50638K07456
6468E210090J35800k4092K11342J22204M0050k24200J19628L30505K5092q85J32079
6457F077613M9612K6722K81468J83554J35488K39125J73332k7009K11517J28111
6447G479533J93896m1973R8288M13669J53787J06477M5028J23735K7667K20588
6437H820695R0306K4676L47277K30805Q3766R5601J40261K79575K74757Q3242
$$ plain form
6509 4464614 4583162 4695632 4581162 4562009 4624801 4797162 4698482 4800142 4920349 4746491
6499 4746491 4694207 4609831 4478216 4420268 4520456 4569025 4539709 4732491 4676599 4824543 4665972
6488 4665972 4399551 4600611 4689059 4732143 4555143 4529682 4619855 4850035 4813986 4684284
6478 4684284 4811608 4963491 5085267 5029073 4977249 4966928 5107117 5153272 5002634 5210090
6468 5210090 5345890 5321798 5533140 5655344 5695394 5471194 5590822 5921327 5946419 5945534 6077613
6457 6077613 6127225 6153947 6435415 6618969 6754457 6993582 7166914 7139905 7351422 7479533
6447 7479533 7673429 7631456 7729744 8143413 8297200 8403677 8448705 8572440 8600107 8820695
6437 8820695 8911001 8935677 9282954 9513759 9597525 9693126 9833387 10112962 10387719 10470961
6427A0470961K17583j21507L73886M62858M14720J76547K04878L88231L49832
6418A2937989L80502N64374N04321L33389M35460N65813N68370P04892R01672
6409A7896782N85953P14568J037328Q61082P50731Q17392J178887J217244J417047
6400B6477014J690751J678057J745125K321036K705560K840100L153387L830449
6392D6441479L823584M595491N363203O116246P035422Q276278J0002982J3411637
6384A05066322J7371238K1617688K2148508K2952719K2636863J8159416J2867840
6377B42820594O706126j4156945k8952945k6542882k3577993j8447176j4350721
6370A23498058j1446781r864733q176074p337526o681284o870759n612400m522375
$$ plain form
6427 10470961 10688544 10567037 10940923 11403781 11818501 11995048 12199926 12588157 12937989
6418 12937989 13318491 13882865 14387186 14720575 15156035 15721848 16290218 16995110 17896782
6409 17896782 18482735 19197303 20234631 21095713 21846444 22663836 23842723 25059967 26477014
6400 26477014 28167765 29845822 31590947 33911983 36617543 39457643 42611030 46441479
6392 46441479 50265063 54860554 60223757 66340003 73375425 81651703 91654685 105066322
6384 105066322 122437560 144055248 166203756 189156475 211793338 229952754 242820594
6377 242820594 249526720 235369775 206416830 179873948 156295955 137848779 123498058
6370 123498058 112051277 102186544 94010470 86672944 79991660 73120901 67508501 62986126
6362F2986126l793862l428088l046493k902600k401170k091117j678240j313801
6354D2330755j196986j158779q34592p51106p73973n34530l30177o97357m70237
6345C5583018j90718k53443j43758j77751j67689k43462j62265l4920K71787N62197
6335C5042996P14376J255590J361602J757442J478721J402476J130641M78972
6327D4622816k72763j063249j928416j869065j434764j049414p29466j01919j16912
6318C6056848L87298O50099R51207J406502J567146J647994J602404J339427J063621
6309D6672546L20363q3177n98857j380265j910451k105191k041792j960405j431585
6300C5481186j125044q34995o73883m62376k77441J76445K59381K69819O56487
$$ plain form
6362 62986126 59192264 55764176 52717683 49815083 47413913 45322796 43644556 42330755
6354 42330755 41133769 39974990 39140398 38389292 37615319 37080789 36750612 36053255 35583018
6345 35583018 35392300 35138857 34995099 34817348 34649659 34406197 34243932 34209012 34480799 35042996
6335 35042996 35757372 37012962 38374564 40132006 41610727 43013203 44143844 44622816
6327 44622816 44350053 43286804 41358388 39489323 38054559 37005145 36275679 36173760 36056848
6318 36056848 36444146 37094245 38045452 39451954 41019100 42667094 44269498 45608925 46672546
6309 46672546 46992909 46909732 46310875 44930610 43020159 40914968 38873176 36912771 35481186
6300 35481186 34356142 33521147 32847264 32384888 32107447 32283892 32543273 32813092 33469579
6291C3469579J239488J248859J440591J701371J674275J487059J132808M03508
6283D3797538p9994p92775q89161j531390j650712j846209j789077j295612j002822
6274C2919786r67177p16345J13336M09245N73167M66228R44622J098499P44138
6265C5585499Q98239K75266n45036j183214j861140j936474j799572j805471j323986
6256B6304111j243324j148474o69409m25576n43702m91353l52496m42379l60927
6247B0626471l42491o66203l16020o36000l19077k23992n32619m48617o62147
6238A6479305n08137n48827n04395k97650j56073l74784k99750j39751m04474
6229A3245464n89923n32306o42147n37868l88910m65563k65796n85264l85093
$$ plain form
6291 33469579 34709067 35957926 37398517 39099888 40774163 42261222 43394030 43797538
6283 43797538 43717544 42924769 42035608 40504218 38853506 37007297 35218220 33922608 32919786
6274 32919786 31952609 31236264 31349600 31758845 32332012 32798240 33742862 34841361 35585499
6265 35585499 36483738 36759004 36213968 35030754 33169614 31233140 29433568 27628097 26304111
6256 26304111 25060787 23912313 23242904 22817328 22273626 21782273 21429777 20987398 20626471
6247 20626471 20283980 19617777 19301757 18665757 18346680 18122688 17590069 17141452 16479305
6238 16479305 15971168 15422341 14917946 14620296 14464223 14089439 13789689 13649938 13245464
6229 13245464 12655541 12123235 11481088 10943220 10554310 10088747 9822951 9237687 8852594
6220H852594k09903l14221j99590j19031J48289l41124o5043j00931r4449j32160
6210G424431O1990l6853j87343q8321m34619m5898M4142j38805k8991R4379R0088
6199F754200p2515L1009R6161j6567J3544k11287j5082L4065K11097j65799n3978
6188F604848r3874J09788j86181j3609L8525q5085k0883o1265k1208J2684j47955
6177F135785p1995K98016J32567O9820p8509k30185m9240l1646k21851K82724
6167F235486j76955m8349j53393j54545j65467Q8831K41536k9655j8900j31336
6157E687253j51970J2213m4859O2089j01998j29394O051l2557j29886j1194k13249
6146D952499k84293j85794p3601R0078q2158k08052j38289K99994j20201k56757
$$ plain form
6220 8852594 8642691 8328470 8128880 8009849 8158138 7817014 7751971 7651040 7556591 7424431
6210 7424431 7486421 7449568 7262225 7173904 6739285 6693387 6737529 6598724 6569733 6664112 6754200
6199 6754200 6681685 6712694 6808855 6792288 6805832 6594545 6579463 6613528 6824625 6658826 6604848
6188 6604848 6510974 6620762 6434581 6420972 6459497 6374412 6353529 6292264 6271056 6283740 6135785
6177 6135785 6063790 6361806 6494373 6564193 6485684 6255499 6206259 6174613 5952762 6235486
6167 6235486 6058531 6010182 5856789 5702244 5536777 5625608 5867144 5837489 5818589 5687253
6157 5687253 5535283 5547496 5502637 5564726 5462728 5333334 5339385 5306828 5176942 5165748 4952499
6146 4952499 4668206 4482412 4408811 4498889 4416731 4208679 4070390 4370384 4250183 3993426
6136C993426J29629J0614J16986M8849n0697k71213k37655j83891J96839n287
6126C747600j05581K68674j87718q3863R8293n2464k7224j1590l1289p721j78674
6115C428443l3508j0488p5578l5016P2361j00246K1362L0738P8450p1677o0265
6104C244576J19326J98916q3759k12200p5058J15229J4455l7394P080o9070J05253
6093C327354J05759l4135m5988Q4000j70423Q7659j23129K67079Q4808n9274Q1825
6082C605535J1910L1831j19977k00018L7766J27874j33478J55509K8480J39089
6072C684521J13953l2563k47621o0346K83086J50515J29371k77496K11884K16029
6062D171333R4705K02534R2935j44129n4344K65759N8111q8295L43372J4142j41690
$$ plain form
6136 3993426 4123055 4133669 4250655 4299504 4248807 3977594 3739939 3556048 3752887 3747600
6126 3747600 3642019 3910693 3722975 3639112 3737405 3684941 3657717 3646127 3614838 3607117 3428443
6115 3428443 3394935 3384447 3308869 3273853 3346214 3245968 3267330 3298068 3376518 3304841 3244576
6104 3244576 3363902 3562818 3479059 3266859 3191801 3307030 3321485 3284091 3291171 3222101 3327354
6093 3327354 3433113 3398978 3352990 3436990 3266567 3354226 3231097 3498176 3582984 3523710 3605535
6082 3605535 3617445 3649276 3529299 3329281 3367047 3494921 3361443 3516952 3545432 3684521
6072 3684521 3798474 3765911 3518290 3457944 3741030 3891545 4020916 3743420 3955304 4171333
6062 4171333 4266038 4468572 4561507 4417378 4363034 4628793 4686904 4598609 4941981 4956123 4814433
6051D814433J23700M6694L8311j83426j65448j71913K27322n436j1506O4758L0794
6040D808283K163j07488R7559M440r7781J03197M4132k1968p1302k6793K3353
6029D757795P4831k12066J53894J23857J20369R5491n0643R7642j0982K78995
6019E429183o7131o4810L40153J22386k92995L9994k5749n5395m8140o5928N6029
6008E367597k0321k41404m0218l1484J27936l8190j90750r9479P9789J04809j78289
5997D839996J79227j22802j50406J85322J32189L3920J72920l2340j2581M7795
5987E273240K32402M9360P1466K62213J86220j56334k0840J69437L80883L6011
5977F484058J39969K13520Q7097K46367O6187M31345K56657J11415N53543K18842
$$ plain form
6051 4814433 4938133 4984827 5023138 4839712 4674264 4502351 4729673 4724237 4712731 4777489 4808283
6040 4808283 4810446 4702958 4800517 4804957 4707176 4810373 4854505 4832537 4761235 4734442 4757795
6029 4757795 4832626 4620560 4774454 4898311 5018680 5114171 5063528 5161170 5150188 5429183
6019 5429183 5362052 5297242 5637395 5759781 5466786 5506780 5481031 5425636 5377496 5311568 5367597
6008 5367597 5347276 5105872 5065654 5034170 5162106 5123916 4933166 4833687 4913476 5018285 4839996
5997 4839996 5019223 4896421 4746015 4931337 5063526 5097446 5270366 5238026 5225445 5273240
5987 5273240 5505642 5555002 5626468 5888681 6074901 5918567 5897727 6067164 6448047 6484058
5977 6484058 6624027 6837547 6924644 7171011 7237198 7668543 7925200 8036615 8590158 8809000
5967H809000J94896K5284J41739P6629l09484J12631j04267j90320j95750j44141
5957H416217l72102j58174j09107j76502o9628j43722j13863R4131N2964J02746
5947G522960r7056j02977j8227j42373p3568j96507j84949m3769n0627P1400J75990
5936F860297n6825p5697o4024j54273K37184K7891k3529J50866n1237k0445k1942
5925F808266k0340n6259K10523K48127m6630k32854r880k07763O432j13188j08309
5914F478125N4492l4898O8980K86133j04674j32810q9171R1572p5166p6857o8461
5903F397265m8286K33380k64856k3184r6440K05248O5640J5971R0299J30303Q2488
5892F787828m0512K41095J75079K1664j20617q4758J28714K22266J89193J06842
$$ plain form
5967 8809000 9003896 9029180 9170919 9247548 8938064 9050695 8946428 8756108 8560358 8416217
5957 8416217 8044115 7885941 7776834 7600332 7530704 7386982 7273119 7367250 7420214 7522960
5947 7522960 7425904 7322927 7304700 7162327 7088759 6892252 6707303 6663534 6612907 6684307 6860297
5936 6860297 6803472 6727775 6663751 6509478 6746662 6774553 6751024 6901890 6850653 6830208 6808266
5925 6808266 6787926 6731667 6942190 7190317 7143687 6910833 6900953 6693190 6699622 6586434 6478125
5914 6478125 6532617 6497719 6566699 6852832 6748158 6615348 6526177 6617749 6542583 6465726 6397265
5903 6397265 6348979 6582359 6317503 6294319 6197879 6403127 6468767 6484738 6575037 6705340 6787828
5892 6787828 6747316 6988411 7163490 7185154 7064537 6979779 7108493 7330759 7519952 7626794
5882G626794k27982J57581J28213q2412k6592j07609o2728k274j64773j18764
5872G119454K5729q9845k52354k38868j7060l11749J04295J34517K4673o9542
5862F429250j48723j2450P996J9178k10917m3968O994k35528J30082l469j04949
5851E833496p8797j2129P8950j17699k09485O2165N4301M8108r5562L50796q8907
5840E825237r5690J8350L3414j13532o2269J68200p208L07066N4131o9485M9800
5829F108014J41785r5200j93449J35075L35193k1872j8639j9236j0561J99566
5819F560676R4929l692j97186p8822m0716P2163K30700K00630J46052j39933o6995
5808F777806J5071p6299J17128l1683j69957K229L56609J07589j12665j79142
$$ plain form
5882 7626794 7398812 7556393 7684606 7602194 7575602 7467993 7405265 7402991 7238218 7119454
5872 7119454 7145183 7055338 6802984 6564116 6547056 6235307 6339602 6474119 6498792 6429250
5862 6429250 6280527 6268077 6276073 6295251 6084334 6040366 6047360 5811832 5941914 5938445 5833496
5851 5833496 5754699 5742570 5821520 5703821 5494336 5556501 5610802 5658910 5563348 5914144 5825237
5840 5825237 5729547 5747897 5781311 5667779 5605510 5773710 5766502 6073568 6127699 6058214 6108014
5829 6108014 6249799 6154599 5961150 6096225 6431418 6409546 6390907 6371671 6361110 6560676
5819 6560676 6655605 6651913 6454727 6375905 6335189 6407352 6638052 6838682 6984734 6844801 6777806
5808 6777806 6792877 6716578 6833706 6802023 6632066 6634295 6990904 7098493 6985828 6806686
5798F806686j41487J6745k8930n6907q8241J6852m1375O314l6826l17900n6433
5787F078498L13229J79577j46271n3911o8114l44651K72148L4202M5106O667k6848
5776F289632j01514r4985j50631K98220K07080L3141J19613J28771j18316R9160
5766F710171K78372k2015M9226N1219M693r5512L39O0369O593J47485j98732O5833
5754G058041R1036j52568P3204k27171j82377N5486o0984p8418J3796L7492P746
5743F635283k18157o2314K01205j02455q7300K15677O6585M5764J43595L1118
5733F869001M5229j17631N8663m8745J89733j6384J28265L58193R3587r9947N4012
5722G513976K13432j46115K79025K99071j07823Q8302k1282J7807k5065j50728
$$ plain form
5798 6806686 6665199 6681944 6653014 6596107 6507866 6524718 6483343 6489657 6452831 6134931 6078498
5787 6078498 6391727 6571304 6425033 6371122 6303008 5958357 6230505 6264707 6309813 6316480 6289632
5776 6289632 6188118 6093133 5942502 6240722 6447802 6480943 6600556 6729327 6611011 6710171
5766 6710171 6988543 6966528 7015754 7066973 7071666 6976154 6976493 7036862 7043455 7190940 6992208 7058041
5754 7058041 7149077 6996509 7069713 6842542 6660165 6715651 6654667 6576249 6590045 6627537 6635283
5743 6635283 6417126 6354812 6556017 6453562 6366262 6581939 6648524 6694288 6837883 6869001
5733 6869001 6914230 6796599 6855262 6806517 6996250 6979866 7108131 7466324 7559911 7459964 7513976
5722 7513976 7727408 7581293 7860318 8159389 8051566 8139868 8118586 8136393 8111328 7960600
5712G960600l395J22381L5030l8109q1699L3840R9025L36495K00805J18429J04085
5701H887487P4026J14711P167K15361J19082R3827R7663L44068K72638M02505
5691A0628535M62501M71770K74646K33330L64486J80658N1010K17214m65303l92920
5681A2025927k26200l03426k76028k99017J00916L11735k33912j4106q4608l4557
5671A0966724j93258p7524j3179j21609l4417Q1008j56708j05581J86375L47258
5661A0879089L57828M48667N69141L11225O14340N28826J76493M68215K29014
5652A4582838R3107j78587l51215k34852n856J04625K6922j26022n0768l0929
5642A3829263J53018J85726L42584L38778O5763P8228J09506L35497M59258L31677
$$ plain form
5712 7960600 7957205 8079586 8114616 8076507 7994808 8028648 8127673 8464168 8664973 8783402 8887487
5701 8887487 8961513 9076224 9083391 9298752 9417834 9511661 9609324 9953392 10226030 10628535
5691 10628535 11091036 11562806 11837452 12070782 12435268 12615926 12666936 12884150 12418847 12025927
5681 12025927 11799727 11496301 11220273 10921256 11022172 11333907 11099995 11085889 11001281 10966724
5671 10966724 10773466 10695942 10682763 10561154 10526737 10607745 10451037 10345456 10531831 10879089
5661 10879089 11236917 11685584 12254725 12565950 13180290 13709116 13885609 14353824 14582838
5652 14582838 14675945 14497358 14146143 13911291 13905435 14010060 14036982 13910960 13860192 13829263
5642 13829263 13982281 14168007 14510591 14849369 14915132 14993360 15102866 15438363 15897621 16229298
5632A6229298L58411L03079M63017M24150O59748O65738M07370O40181R13611
5623B1064603Q90314P72597J022508O91482R33160O75538P46116J078464J110671
5614B8985453J383526J464971J369954J894515J951575K018633K226122K512253
5606D3807002L004233L367710L608537M006736M385892M852949N100276N528608
5598G7661943N805469O031229N784604N216440M694878L452962K161334Q71904
5590A11680763o94535k450267l751759m614900n013885m880177m931293m921413
5582H0422534n284319m977545m699247m440395m073734l453877l131982k958459
5574D7402976k467821k309658k259553j995247j647007j443372j311191j485143
$$ plain form
5632 16229298 16587709 16890788 17353805 17777955 18437703 19103441 19510811 20150992 21064603
5623 21064603 21954917 22727514 23750022 24441504 25374664 26050202 26796318 27874782 28985453
5614 28985453 30368979 31833950 33203904 35098419 37049994 39068627 41294749 43807002
5606 43807002 46811235 50178945 53787482 57794218 62180110 67033059 72133335 77661943
5598 77661943 83467412 89498641 95283245 100499685 105194563 108647525 110808859 111680763
5590 111680763 110986228 108535961 104784202 100169302 95155417 90275240 85343947 80422534
5582 80422534 75138215 70160670 65461423 61021028 56947294 53493417 50361435 47402976
5574 47402976 44935155 42625497 40365944 38370697 36723690 35280318 33969127 32483984
5566C2483984j356217j130377j184995r92691r87026n64746q94778r78710o25705
5557B3768739n64017n67456p61627n34309n70151o14159n61970l76232m79166
5548A8739652o19673m53173m84346n64360m83058l68969m64402k52392j54743
5539A4894536l05807o38227m18477j76324m9627j29677k94534m06349k23442k88949
5529A1963123l16948j57241j6994j13172l70968K2532k63815j68997j1129l00988
5519A0265403k90453j40339n0279k00313j10667M0658k30089j19449M4185R9955
5509I308612k48891K2694M6864n1041J92065o8275o0577J51223l5786l5028k97259
5498H924601j02314o918j75525R1089J5652j27298k45121k72197r4414j99609
$$ plain form
5566 32483984 31127767 29997390 28812395 27819704 26832678 26267932 25373154 24394444 23768739
5557 23768739 23204722 22637266 21875639 21341330 20771179 20157020 19595050 19218818 18739652
5548 18739652 18119979 17666806 17182460 16618100 16135042 15766073 15301671 15049279 14894536
5539 14894536 14588729 13950502 13532025 13355701 13306074 13176397 12881863 12475514 12252072 11963123
5529 11963123 11646175 11488934 11471940 11358768 10987800 11010332 10746517 10577520 10566391 10265403
5519 10265403 9974950 9834611 9784332 9584019 9473352 9514010 9283921 9164472 9208657 9308612
5509 9308612 9059721 9082415 9129279 9078238 9270303 9202028 9141451 9292674 9256888 9221860 8924601
5498 8924601 8822287 8815369 8639844 8730933 8746585 8619287 8374166 8101969 8007555 7807946
5488G807946K8535j23716P9899j81474l07817J63713l2932k65848k39016j2131
5478F917159Q9533O9694j19907q7029j6148k19306k29982p3771N3606k0972R3526
5467F456403J74495j23775k37383K190J4432J30721J37765j12013k05620J08569
5457F345784P5491j2240K10641m7678J75686L21260L7103K91342K62605K85509
5447G945503L06989M57632M63458l281L07038K96676J17868o1200k23713l19738
5437I287232l76155k12904O6349k78973l72675k22355N8174j03170j79628k3052
5427G642843j10943k00897P0300P5180j35984J33271K51717Q6398j67857K19171
5417G863199J49159J94388K45827J40146j75347N147M0408J09183j93279k29981
$$ plain form
5488 7807946 7836481 7712765 7792664 7611190 7303373 7467086 7434154 7168306 6929290 6917159
5478 6917159 7006692 7076386 6956479 6869450 6853302 6633996 6404014 6330243 6383849 6362877 6456403
5467 6456403 6630898 6507123 6269740 6271930 6286362 6417083 6554848 6442835 6237215 6345784
5457 6345784 6421275 6409035 6619676 6571998 6747684 7068944 7106047 7397389 7659994 7945503
5447 7945503 8252492 8710124 9173582 9170301 9477339 9774015 9891883 9830683 9606970 9287232
5437 9287232 8911077 8698173 8764522 8485549 8112874 7890519 7948693 7845523 7665895 7642843
5427 7642843 7531900 7331003 7401303 7476483 7340499 7473770 7725487 7811885 7644028 7863199
5417 7863199 8012358 8206746 8452573 8592719 8417372 8422519 8462927 8572110 8378831 8148850
5407H148850j81578j73244j09489k85589n3966o5776l7012j22722J38587r9606
5397G158455j32750p4701j55994j99115J0490k07284r2656j544p1715N6919K3816
5386F313921P2736p8286j41089Q756J34592p8775j20752j23448j5144J38705K1847
5375F133063q9119O06Q2976j84536j89089L3765Q6121M2852j49112j56855K18737
5364E829409N396j02280j79047L3673L24237k59821l60918j428J62599R0639k43337
5353E299122M1788K68359j17900j21594q7834K55564m9822j64500J15380J66211
5343E604774n5436p1290j39784K92859L59133k50558j12268J48931r3778p449
5333E675134k0766o4798J16259p1739m5762N2070M8444j34503P3299J61731P385
$$ plain form
5407 8148850 7967272 7794028 7684539 7398950 7344984 7279208 7242196 7119474 7258061 7158455
5397 7158455 7025705 6951004 6795010 6595895 6606385 6399101 6306445 6304901 6233186 6290105 6313921
5386 6313921 6386657 6308371 6167282 6176038 6310630 6231855 6111103 5987655 5972511 6111216 6133063
5375 6133063 6043944 6044550 6127526 5942990 5753901 5787666 5873787 5916639 5767527 5610672 5829409
5364 5829409 5834805 5732525 5553478 5587151 5911388 5651567 5290649 5289221 5451820 5542459 5299122
5353 5299122 5340910 5609269 5491369 5369775 5281941 5537505 5487683 5323183 5438563 5604774
5343 5604774 5549338 5478048 5338264 5631123 5990256 5739698 5627430 5776361 5682583 5675134
5333 5675134 5654368 5589570 5705829 5634090 5588328 5640398 5688842 5554339 5627638 5789369 5796754
5322E796754j69068l8818J95238O1325l12822j19775J42429o8400R6089K6114
5312E609066J41619J75641j20473l5750j9651Q0902K49933n1667q7422J00333
5302F042531O2318r7253O1343j09044n7120J88354J63938K22765q8492K20826
5292F610166J39447Q2778K17902J97598j09536J63684P6931N8699o9183p2596
5282G295890J60056Q3533J26663J50573l5778j42463J5180K50542k16213P5531
5272G763514L8279j07746j23034o5206P6345N3044J17674J31810J27920j4546
5262G998054J94232k3766k17275K11801L09468K06611J79317J33178L42258J37346
5252I471224J4413L87453K08772Q0255j51452J17966o8294k62305k69478q3014
$$ plain form
5322 5796754 5627686 5588868 5784106 5845431 5532609 5412834 5555263 5486863 5582952 5609066
5312 5609066 5750685 5926326 5805853 5770103 5750452 5831354 6081287 6029620 5942198 6042531
5302 6042531 6104849 6007596 6068939 5959895 5902775 6091129 6255067 6477832 6389340 6610166
5292 6610166 6749613 6832391 7050293 7247891 7138355 7302039 7378970 7437669 7368486 7295890
5282 7295890 7455946 7539479 7666142 7816715 7780937 7638474 7653654 7904196 7687983 7763514
5272 7763514 7801793 7694047 7571013 7505807 7582152 7635196 7752870 7884680 8012600 7998054
5262 7998054 8192286 8168520 7951245 8163046 8472514 8679125 8858442 8991620 9333878 9471224
5252 9471224 9485637 9873090 10081862 10162117 10010665 10128631 10060337 9798032 9528554 9445540
5242I445540j8334k01922o4726k9253J35425L44267o4745q4241j29933j09195
5232I222883J05802O4801L34851k18372J73742J22025m4596N5862K74254K27308
5222A0318560K65865L2813J10928J71802K38207M76639M20772L65392L89455L13699
5212A3104132K61245L11080M89412M48581K61310N5273N36180L18562J03768j9971
5202A5869572K44438K78892K28106K88746M58955N07770N37633L39266M38662
5193A9192040M0313n7325K06777j28072k56464P2509k46635j3523j82756Q1526
5183A8708390k2122K73303M72307K46668L09596N65237O11621P46456O14048O23613
5173B3149117R35031Q20525J008840Q91743J024780J066031Q15139R05208P21923
$$ plain form
5242 9445540 9427206 9225284 9160558 9131305 9266730 9610997 9546252 9462011 9332078 9222883
5232 9222883 9328685 9393486 9728337 9509965 9683707 9805732 9761136 9816998 10091252 10318560
5222 10318560 10584425 10617238 10728166 10899968 11138175 11614814 12035586 12400978 12790433 13104132
5212 13104132 13365377 13676457 14165869 14614450 14875760 14931033 15467213 15785775 15889543 15869572
5202 15869572 16114010 16392902 16621008 16909754 17368709 17876479 18414112 18753378 19192040
5193 19192040 19232353 19175028 19381805 19253733 18997269 19069778 18823143 18809620 18626864 18708390
5183 18708390 18686268 18959571 19431878 19678546 19988142 20553379 21165000 21911456 22525504 23149117
5173 23149117 24084148 24904673 25913513 26805256 27830036 28896067 29711206 30616414 31338337
5164C1338337R77518R95018J362912J426848J490968J738967J669906J922718
5156D2923192J714255J329291J161169J175684J327280J348838J153964J701313
5148E3834986J960798K378390K860428L136310L893279M400777N615524O244620
5140H4325112O594173P868841R072693J0542792J2214877J4840132J8445544K3648845
5132A87553009L0176255L3842248L3648341L5298686L3323821K4133962J5927675
5125C93903997N9184l4853572m5461107l9109372l2081366k4113306j8820570
5118A99523888j5475249j3881381j2226141j2550997j4193589j3167852j0627256
5111A07401423q852515p414530o884180o213320n324044m517464m288896l709756
$$ plain form
5164 31338337 32315855 33310873 34673785 36100633 37591601 39330568 41000474 42923192
5156 42923192 44637447 45966738 47127907 48303591 49630871 50979709 52133673 53834986
5148 53834986 55795784 58174174 61034602 64170912 68064191 72464968 78080492 84325112
5140 84325112 90919285 98788126 107860819 118403611 130618488 145458620 163904164 187553009
5132 187553009 217729264 251571512 285219853 320518539 353842360 377976322 393903997
5125 393903997 393963181 359109609 313648502 274539130 242457764 218344458 199523888
5118 199523888 184048639 170167258 157941117 145390120 131196531 118028679 107401423
5111 107401423 98548908 91134378 84250198 78036878 72712834 68195370 63906474 60196718
5103F0196718l412271k897034k635855k221762k267727j845547j703590j192584
5095D2020348j236305q76352j338538j050656j022373j076751r89328r35048j086088
5086C2408909j116472j310371q46152j067093p65265p49173o35382p10288o10592
5077B4598121l70153m51328n62042l67652k44838m40053l88647j57522l33287
5068B1282599l81599k00437j47909l25508j63271r2099k94328j17653J61654j67678
5058A9553771J6606J34265m4447m3956J4069r8819k83716l49413k78683j25486
5048A8494191r6856k29715q3928j63961p1097j07576J9670l3598m3784r2574j76444
5037A7414328n9964J51229k0859O1696O8856j0897k35917L0659Q5871j40805j96198
$$ plain form
5103 60196718 56784447 53887413 51251558 49029796 46762069 44916522 43212932 42020348
5095 42020348 40784043 39907691 38569153 37518497 36496124 35419373 34430045 33494997 32408909
5086 32408909 31292437 29982066 29135914 28068821 27303556 26554383 25919001 25208713 24598121
5077 24598121 24227968 23776640 23214598 22846946 22602108 22162055 21773408 21615886 21282599
5068 21282599 20901000 20700563 20552654 20227146 20063875 19971776 19677448 19559795 19721449 19553771
5058 19553771 19570377 19704642 19660195 19616239 19630308 19531489 19247773 18898360 18619677 18494191
5048 18494191 18397335 18167620 18083692 17919731 17848634 17741058 17760728 17727130 17683346 17590772 17414328
5037 17414328 17354364 17505593 17484734 17546430 17615286 17604389 17368472 17399131 17485002 17344197 17147999
5026A7147999j9585j7870p1279J03426n1438j16336j26148j4303j40365m6707
5016A6647394R4034J88142J12362o3761K43352K00734J03625L11073M97271M76109
5006A8810335L56580L80276K85277L92335M91986N48675N60677P16103O88092
4997B3230336P48775N71642N20409M36086K35638l3989k15712m47200n82839o78676
4987B3784470n30947k04424k9828k27112j56468l2012J19506K01185K16325N0080
4977B3190775K93071R6738Q3407K44424J65364N7126P3285J81169L96822N29943
4967B5312124J86175J53052J91011N90945L97929J32682K83738L86133M50222
4958B8084011L44792L85379L99968O9582K95959L69757M26855N97891L15170R54105
$$ plain form
5026 17147999 17128414 17110544 17039265 17142691 17091253 16974917 16848769 16834466 16694101 16647394
5016 16647394 16741428 16929570 17041932 16978171 17221523 17422257 17525882 17836955 18334226 18810335
5006 18810335 19166915 19547191 19832468 20224803 20716789 21265464 21826141 22542244 23230336
4997 23230336 23979111 24550753 25071162 25507248 25742886 25708897 25493185 25045985 24463146 23784470
4987 23784470 23253523 23049099 23019271 22792159 22635691 22603679 22723185 22924370 23140695 23190775
4977 23190775 23483846 23580584 23663991 23908415 24073779 24130905 24204190 24385359 24782181 25312124
4967 25312124 25498299 25651351 25842362 26433307 26831236 26963918 27247656 27633789 28084011
4958 28084011 28428803 28814182 29214150 29283732 29579691 29949448 30376303 30974194 31289364 32243469
4948C2243469O42776N54349R50598J041290J103279J156858J172751J157420J197496
4939D1220286J519621J642943J595907J948410K167986K006567K491525K563786
4931E7157031K776158L087677L447495L866138M337656M888421M943930N209581
4923H9714087N502861N763912N400422N474104N018366M122595L425844K580253
4915A27002444R22118n29313j373290k178426k941594l265596l682685l833369
4907A10120289l861443m389996m390187m440197l743053l246243k743153k294451
4899H1011566k010993j356653j073946j023153p67621o04262l78883n30906m70801
4890G2794348m00805k22682N1999R5963N70385Q24520R32231J416433J550740
$$ plain form
4948 32243469 32886245 33440594 34391192 35432482 36535761 37692619 38865370 40022790 41220286
4939 41220286 42739907 44382850 45978757 47927167 50095153 52101720 54593245 57157031
4931 57157031 59933189 63020866 66468361 70334499 74672155 79560576 84504506 89714087
4923 89714087 95216948 100980860 106381282 111855386 116873752 120996347 124422191 127002444
4915 127002444 127924562 127395249 126021959 123843533 120901939 117636343 113953658 110120289
4907 110120289 106258846 101868850 97478663 93038466 89295413 86049170 83306017 81011566
4899 81011566 79000573 77643920 76569974 75546821 74779200 74174938 73796055 73265149 72794348
4890 72794348 72393543 72170861 72222860 72318823 72889208 73713728 74645959 76062392 77613132
4881G7613132J882391K240000K255064K497220K603879K704094K699024K094956
4873I6589760J536985L21969l96237j010520j844659j979328k231434k322385
4865H8664151k349050k318793k031036j932719k253905k565837k572271k321915
4857G0318625k292559j856067j840583j628332j492393j483957j501515j576729
4849E6646490j847502j981378k130273k242183j941028j942302j773064j709763
4841D1078997j752255j382478j217393j083438j176268j178748j031756j056899
4833C1199762p94628q28123r57939q55983m29163l72747o19230n17305l83556
4824B5441088m54528k70242k63255o05209m54386l16198j84273l56840j34252
$$ plain form
4881 77613132 79495523 81735523 83990587 86487807 89091686 91795780 94494804 96589760
4873 96589760 98126745 98448714 98052477 97041957 95197298 93217970 90986536 88664151
4865 88664151 86315101 83996308 81965272 80032553 77778648 75212811 72640540 70318625
4857 70318625 68026066 66169999 64329416 62701084 61208691 59724734 58223219 56646490
4849 56646490 54798988 52817610 50687337 48445154 46504126 44561824 42788760 41078997
4841 41078997 39326742 37944264 36726871 35643433 34467165 33288417 32256661 31199762
4833 31199762 30405134 29577011 28619072 27763089 27333926 26961179 26341949 25824644 25441088
4824 25441088 24986560 24716318 24453063 23847854 23393468 23077270 22892997 22536157 22401905
4815B2401905p1955j26669j98366j48611Q1154P1726l4923P5574q7771m87589
4805B1474475m56310p459j27790r1700j17682j80443M8341j46090k82588O1416
4795B0174170q5368P4535m0368O3146N4686q1190K4737j54323P6965J77500n0323
4784B0234167J64474k18360j68752J36092J49089j04658Q6503O9102M4175l5569
4774B0356263J30384k1597k05526o8601j41220J27188k70111o2203j21621O2746
4764A9785702J34513J33678n6254K51441K55762k71626N820L57901J37085K6768
4754B0760790O9816j04347P6341P2083k9181N4010R3706O9094N4907P084n2691
4743B1071612J94857K45416M10763J97829J70710L90175M69878M83828N64130
$$ plain form
4815 22401905 22329950 22203281 22004915 21856304 21937458 22009184 21974261 22049835 21962064 21474475
4805 21474475 21018165 21010706 20882916 20791216 20673534 20493091 20541432 20395342 20112754 20174170
4795 20174170 20088802 20163337 20122969 20186115 20240801 20159611 20184348 20030025 20106990 20284490 20234167
4784 20234167 20398641 20180281 20011529 20147621 20296710 20192052 20278555 20347657 20391832 20356263
4774 20356263 20486647 20465050 20259524 20190923 20049703 20176891 19906780 19844577 19722956 19785702
4764 19785702 19920215 20053893 19997639 20249080 20504842 20233216 20239036 20596937 20734022 20760790
4754 20760790 20830606 20726259 20802600 20874683 20845502 20899512 20993218 21062312 21117219 21124303 21071612
4743 21071612 21266469 21511885 21922648 22120477 22291187 22681362 23151240 23635068 24199198
4734B4199198O47375P21532O77089R42196Q55894J275604J198858J530659J819730
4725C3868135J898803K069898K123779K579144L299520L699119M406165N363188
4717E9307751O907767Q525540R935463J0665108J0918204J0986057Q734253N625495
4709A31605638J509068p805573j3809284j2440593j0430389q149626o339827n114075
4701F9025339m130872l671755l151864l126878k643688k095131j810650j470821
4693D6923680j043864q92875q94486o21952m85893m62696k30306J50835L48401
4684D2790844M63326O34530R01633J023869J168033J261947J327068J286026J299844
4675E2157120J010875Q56934M83777L71098L50396P26203J173850J800300K007474
$$ plain form
4734 24199198 24846573 25568105 26245194 27187390 28043284 29318888 30517746 32048405 33868135
4725 33868135 35766938 37836836 39960615 42539759 45839279 49538398 53944563 59307751
4717 59307751 66215518 74741058 84676521 95341629 106259833 117245890 125980143 131605638
4709 131605638 133114706 125309133 111499849 99059256 88628867 80479241 74139414 69025339
4701 69025339 64894467 61222712 58070848 54943970 52300282 50205151 48394501 46923680
4693 46923680 45879816 44986941 44092455 43470503 42984610 42521914 42291608 42442443 42790844
4684 42790844 43254170 43888700 44790333 45814202 46982235 48244182 49571250 50857276 52157120
4675 52157120 53167995 54024929 54508706 54879804 55230200 55956403 57130253 58930553 60938027
4666F0938027K439937K588350K913267L319928K504846K018652J476022Q32012
4658G9031041O32746R38922J499347K108693L122984L766706M743205N610698
4650A01454342O763972P910728R307933J0837827J1883071J2094935J2438528
4643A72691336J1772981R822051O670631J803513k422169m208218m918620n249207
4635A85962298o708320r613584j1654952j1622620j0172818q721054p184874o023354
4627A14260722n155167m573058m312696m315578l893959l288312k634929k402078
4619H3684945k574692k843061l130201l221673l482910l121609k678805k216321
4611F0415673j966000j433473j075552r25841r08361j163507j056163j021734
$$ plain form
4666 60938027 63377964 65966314 68879581 72199509 74704355 76723007 78199029 79031041
4658 79031041 79663787 80602709 82102056 84210749 87333733 91100439 95843644 101454342
4650 101454342 108218314 116129042 125436975 136274802 148157873 160252808 172691336
4643 172691336 184464317 194286368 200956999 202760512 200338343 196130125 191211505 185962298
4635 185962298 179253978 169640394 157985442 146362822 136190004 127468950 120284076 114260722
4627 114260722 109105555 104532497 100219801 95904223 92010264 88721952 86087023 83684945
4619 83684945 81110253 78267192 75136991 71915318 68432408 65310799 62631994 60415673
4611 60415673 58449673 57016200 55940648 55014807 54106446 52942939 51886776 50865042
4603E0865042j342072j709318j850933j739572j652275j561031j097245j195946
4595C8716650j120743j065383q41309j012206r15050n79360o13880n56565j22188
4586C1889966k26829k74262N6554K1399O1561K80627K68579J64908M84932O20973
4576C3348408L42475M55081J92633L37055N6656R7106L69807J55589q542P6050
4566C5422318L28681M79219M14094K29556R3172k34041k25450j88091m75964n21906
4556C5321588n43750p44197j204700j502445j150461q97161o42922l74863m51561
4547B7809528k48045q5073J6260K76243J79908K00376N01144P43174Q41212J242561
4537C1477288J062606J133047J378733J324976J185733J388895J343836J447676
$$ plain form
4603 50865042 49522970 47813652 45962719 44223147 42570872 41009841 39912596 38716650
4595 38716650 37595907 36530524 35689215 34677009 33761959 33182599 32568719 32012154 31889966
4586 31889966 31663137 31388875 31445429 31466828 31528389 31809016 32077595 32242503 32727435 33348408
4576 33348408 33690883 34145964 34338597 34675652 34732308 34829414 35199221 35354810 35346268 35422318
4566 35422318 35750999 36230218 36644312 36873868 36967040 36732999 36507549 36319458 35843494 35321588
4556 35321588 34777838 34033641 32828941 31326496 30176035 29278874 28635952 28261089 27809528
4547 27809528 27561483 27476410 27492670 27768913 27948821 28149197 28650341 29393515 30234727 31477288
4537 31477288 32539894 33672941 35051674 36376650 37562383 38951278 40295114 41742790
4529D1742790J037040R55562R51165Q52897Q66040J345001J497891J068272Q26373
4520E1143031P04189N20595N19575P00796P67844R73241J328036K070523K669457
4511F1397287L165433M107016M978120N826399P080676Q563328R294863R920744
4503A14333866J0097152R363055P638225M772165J143934m554401j0717579j3598676
4495A18477741j2941779j1313518r289592p665737o586595n677424m891936m520678
4487E5590482m226014l911177l531974k917612k596638k407026j916408j807055
4479C2276578j527755j398089j197999j225461q69844q42573p22098n12425l91022
4470B3589312j39819r1911k16894L4263M45832L15851K96609M76256L31384M36542
$$ plain form
4529 41742790 42779830 43735392 44686557 45539454 46405494 47750495 49248386 50316658 51143031
4520 51143031 51847220 52367815 52887390 53588186 54356030 55329271 56657307 58727830 61397287
4511 61397287 64562720 68669736 73647856 79474255 86554931 95118259 104413122 114333866
4503 114333866 124431018 133794073 141432298 146204463 147348397 142793996 132076417 118477741
4495 118477741 105535962 94222444 84932852 77267115 70680520 65003096 60111160 55590482
4487 55590482 51364468 47453291 43921317 41003705 38407067 36000041 34083633 32276578
4479 32276578 30748823 29350734 28152735 26927274 26057430 25214857 24492759 23980334 23589312
4470 23589312 23449493 23357582 23140688 23174951 23620783 23936634 24233243 24709499 25040883 25477425
4460B5477425K31153k13023o60187j095837r73964p33630n04310k78317l87505
4451B0861805j60156M17261J89383J22383K00481J50925J51156j62483p34847
4442B1035908o74851r95610p70683q99290p40491o69514n21295l22840m48650
4433A4992684k65489l80887j38155K1949o8017Q3110K76086J58060K17886J79676
4423A5076903J27469J7057L50054R7811M2539j86355j90550l82921n80541o46404
4413A3725062m84104j97936j36297k76196o7946R2858J43282J18694j87573m6805
4403A2683039j50314l82712o78721n41166m63641k82602l74124k84738j19706
4394I405315k05705k93994l24297j07902j48214j07914j76296k0531P0586j35838
$$ plain form
4460 25477425 25708578 25495555 24835368 23739531 22765567 22031937 21527627 21249310 20861805
4451 20861805 20701649 21118910 21308293 21430676 21631157 21782082 21933238 21770755 21035908
4442 21035908 20361057 19365447 18594764 17695474 16954983 16285469 15764174 15441334 14992684
4433 14992684 14727195 14346308 14208153 14230102 14162085 14245195 14521281 14679341 14897227 15076903
4423 15076903 15204372 15221429 15571483 15669294 15711833 15525478 15334928 14952007 14371466 13725062
4413 13725062 13240958 13043022 12906725 12630529 12562583 12655441 12798723 12917417 12729844 12683039
4403 12683039 12532725 12150013 11471292 10930126 10466485 10183883 9809759 9525021 9405315
4394 9405315 9199610 8905616 8581319 8473417 8325203 8217289 8040993 8020462 8091048 7955210
4384G955210o8529j25524k05111N3956j4409M7603p3299j55488R7511j01300J5216
4373G425836R9435J23504j54744R8858M2608n4081j26616J10450J99255k13587
4363G550918Q9333J78267l80920j39443K01433K50899K7250K1291j70389k51789
4353G376850j63249l43014m29656j07385N3908l20574k69125L9259j45645O0088
4343E751457l30035j47166M3074p4485k30976k78776k9455R8560j05000n1048
4333D646150N6177j01447k52179l3465n7314l1046l4969p2528q351M2901k11407
4322C942522k41154K21856N8313L6849m5935L9862j81863J3306j74229j19913
4312C549614m9076j18341o6299M737k39799K12034N5668O5719J14300j09004J25805
$$ plain form
4384 7955210 7886681 7761157 7556046 7610002 7595593 7643196 7569897 7414409 7511920 7410620 7425836
4373 7425836 7525271 7648775 7494031 7592889 7635497 7581416 7454800 7565250 7764505 7550918
4363 7550918 7640251 7818518 7437598 7298155 7499588 7750487 7777737 7799028 7628639 7376850
4353 7376850 7213601 6870587 6440931 6333546 6387454 6066880 5797755 5837014 5691369 5751457
4343 5751457 5421422 5274256 5317330 5242845 5011869 4733093 4703638 4802198 4697198 4646150
4333 4646150 4702327 4600880 4348701 4315236 4257922 4226876 4191907 4119379 4111028 4153929 3942522
4322 3942522 3701368 3923224 3981537 4018386 3972451 4012313 3830450 3843756 3669527 3549614
4312 3549614 3500538 3382197 3315898 3320635 3080836 3292870 3348538 3414257 3528557 3419553 3545358
4301C545358j43453j48762J91580j33322j0382R4548J02172J49297p5887l13093
4291C258056j05711j08908p4974Q0877R3592j28612o0621j36033j53288Q9559
4281B753937J87328j8289r1829j31901Q7984j25934N6615m8186m6497p0310l70539
4270B182379n3480J49841p3492j6357J72481n96M4050j31767o8778l54920K02854
4259B052215L33065k5267N0500L9633J68738n8623k32l9255n8392J19154L2784
4248B614320O136R2608J13705k54099L0873J83633J13090j39849J27278J05818
4238B993513j11287K68073K27427n142p1203j1698K8279j77694M7298J64187K03208
4227C554961J98086L20769M2216K53932Q2193K27425p7510j13781r7316r0162
$$ plain form
4301 3545358 3401905 3253143 3444723 3311401 3301019 3395567 3497739 3647036 3571149 3258056
4291 3258056 3152345 3043437 2968463 3049340 3142932 3014320 2953699 2817666 2664378 2753937
4281 2753937 2941265 2922976 2831147 2699246 2787230 2661296 2717911 2669725 2623228 2552918 2182379
4270 2182379 2128899 2278740 2205248 2188891 2361372 2360776 2404826 2273059 2204281 1849361 2052215
4259 2052215 2385280 2360013 2410513 2450146 2618884 2560261 2560029 2520774 2462382 2581536 2614320
4248 2614320 2620456 2713064 2826769 2572670 2603543 2787176 2900266 2760417 2887695 2993513
4238 2993513 2882226 3150299 3377726 3372584 3301381 3289683 3317962 3140268 3187566 3351753 3554961
4227 3554961 3753047 4073816 4116032 4369964 4452157 4679582 4602072 4488291 4390975 4300813
4217D300813J88103j78508k42271l1109k37574j76389M8057J04302j14179q7692
4207C573553o3314q4938Q6523O7944j85130K27102K71308n8974j56664P9560M52738
4196D209708J56041J69113k0858J86179J64382L28408R3179J34118K35375L11771
4186E967416N54022L44874K01292J55051l7923p2212j66198m3978n2429j26081
4176F723834k62465J07276L927j9058m7792L55021L34548K42717M87893N37739
4166H463640N70340P21676N60109O08668M76557M85990K78603J17078p2839l21225
4156A1888597m85295n18879m84087m50470m73218o68513n02071m11581j80685
4147G713798k77662M34K38204Q399m4242K27757J23094K19653J25622L7550p12
$$ plain form
4217 4300813 4488916 4310408 4068137 4037028 3799454 3623065 3671122 3775424 3661245 3573553
4207 3573553 3510239 3425301 3511824 3579768 3394638 3621740 3893048 3834074 3677410 3756970 4209708
4196 4209708 4365749 4534862 4514004 4700183 4864565 5192973 5286152 5420270 5655645 5967416
4186 5967416 6521438 6866312 7067604 7222655 7184732 7112520 6946322 6902344 6849915 6723834
4176 6723834 6461369 6568645 6572572 6553514 6505722 6860743 7195291 7438008 7925901 8463640
4166 8463640 9033980 9755656 10315765 10924433 11400990 11886980 12165583 12282661 12209822 11888597
4156 11888597 11403302 10884423 10400336 9949866 9476648 8808135 8306064 7894483 7713798
4147 7713798 7436136 7436570 7674774 7683173 7638931 7866688 7989782 8209435 8335057 8372607 8371895
4136H371895J65059K01491R0172o1153k11839r5955O5190J09417O1230J73931
4126H869438K38714J08570m5958J01295m9355k8311k82610k06816p7515k50428
4116H377024k71074l55634j15501k59772l39814j61206j48807k78578k9718J78918
4106F595838K6278j04778K38435R2353k5757K44596m0137k08071j25285l56692
4096F336780r3834n23120k89820l99775k13232k37186l15445r8785m6608o3507
4086D055468n3986j66541Q5611n5333K9848j47433P0187L05791J63562J07987
4076D395161p6035J8297p2377J39727K77575J63902J77461j52632p7828K37961
4066E031212J25052l02031k8408j05255l81635k23862l47989j05010j36763p2284
$$ plain form
4136 8371895 8536954 8738445 8828617 8767464 8555625 8459670 8524860 8634277 8695507 8869438
4126 8869438 9108152 9216722 9170764 9272059 9222704 9194393 8911783 8704967 8627452 8377024
4116 8377024 8105950 7750316 7634815 7375043 7035229 6874023 6725216 6446638 6416920 6595838
4106 6595838 6622116 6517338 6755773 6848126 6822369 7066965 7026828 6818757 6693472 6336780
4096 6336780 6242946 5719826 5430006 5030231 4816999 4579813 4264368 4165583 4118975 4055468
4086 4055468 4001482 3834941 3920552 3865219 3895067 3747634 3817821 4123612 4287174 4395161
4076 4395161 4319126 4337423 4265046 4404773 4682348 4846250 5023711 4871079 4793251 5031212
4066 5031212 5156264 4854233 4825825 4720570 4338935 4115073 3767084 3662074 3525311 3453027
4056C453027k94267l13284j17195L4201j11677p8082k91907j53075j94709K15138
4046B148170k8059J7580j4485J30824L5096j18651k08865J45280q8077J0860K15557
4035B245230o0148j95606j38541K4303k2667j01728J44119j28386q7168k6171
4025A653237k3605J263K40022J76252q4939L036j06123j26219n2587K9539L072
4014A712948j36001J00120J10520J65435N0086J14762p3549k17781J04384J34593
4004B065517O0431j87073J15405q5069K7550j32828j52037n0952j17549k2997
3994A520398O4469j8008J87546k7357q2843j74423Q7015R0002j42443K6207r511
3983A521052l11859J299k820k530j12901k1658O789K19917j04460k04595M6018
$$ plain form
4056 3453027 3158760 2845476 2728281 2762482 2650805 2572723 2280816 2127741 1933032 2148170
4046 2148170 2120111 2137691 2123206 2254030 2289126 2170475 1961610 2106890 2018813 2029673 2245230
4035 2245230 2185082 1989476 1850935 1875238 1852571 1750843 1894962 1766576 1679408 1653237
4025 1653237 1629632 1630895 1870917 2047169 1962230 1965266 1859143 1732924 1680337 1709876 1712948
4014 1712948 1576947 1677067 1787587 1953022 2003108 2117870 2044321 1826540 1930924 2065517
4004 2065517 2125948 1938875 2054280 1969211 1996761 1863933 1711896 1660944 1543395 1520398
3994 1520398 1584867 1566859 1754405 1727048 1644205 1469782 1556797 1646799 1504356 1530563 1521052
3983 1521052 1209193 1210492 1207672 1205142 1092241 1070583 1077372 1297289 1192829 988234 1034252
3972A034252j8462K9177r0332o6994J16837l481L2259R3364j46725j50781j81715
3961F47399l842R7642J52154K2602P3257m8349M3423r6172j31821J04716L5459
3950H96468L6134M1594O1930j36797o0118K08473k21191p0707j45095Q8702J33320
3939H32713n6223J65757J32088j09117j77905J96138O4990j6794J22486q9202
3929A064931K2255N5295q4175K5494j39609m3111R4937J62714J88390J52310N4598
3918A554029J36690R0596n6935j48106L17758J76334J31032J08620J64868J65709
3908B640595K07226J27174J9554L41623l7136k32780Q6874l573j1588o2397j20326
3897B955246k58658k23378R898m0632J15057k81623m7086j14009Q486l3108l1426
$$ plain form
3972 1034252 1015790 1044967 954635 887641 1004478 1000997 1033256 1126620 979895 829114 647399
3961 647399 643557 741199 893353 915955 989212 940863 984286 888114 756293 861009 896468
3950 896468 932602 974196 1036126 899329 839211 1047684 826493 755786 610691 699393 832713
3939 832713 776490 942247 1074335 965218 787313 983451 1048441 1031647 1154133 1064931
3929 1064931 1087186 1142481 1058306 1083800 944191 901080 996017 1158731 1347121 1499431 1554029
3918 1554029 1690719 1781315 1724380 1576274 1894032 2070366 2201398 2310018 2474886 2640595
3908 2640595 2847821 2974995 2994549 3336172 3299036 3066256 3153130 3149557 3137969 3075572 2955246
3897 2955246 2696588 2473210 2483108 2442476 2557533 2275910 2228824 2114815 2123301 2090193 2058767
3886B058767J88134J06560K12345O806m5440P9480q0950J57952J19213J33262
3876B936129J64981K59690Q4946K9454J96081N7408J6811j50006j41934j49647
3866C303913j42213j11100k45212k38962j64226l29224k2769l9432q4730J35351
3856B061396l3113j50606n6015J9924j07776m1260n7058N9006j29888P4005K4975
3845A663590k65510P5624J0111J57541j08800L7951j10192o7142j31431r1970
3835A169772K03100n144M4045j02282j55159Q6270N746L7245k34841J01977K964
3824A153693O4352J4831n4485O4703O425j01155j49719o1820K63173M4031j32520
3813A111509J36301m0784P3242k5297P9921O0371k2606j62959K956j72864j43207
$$ plain form
3886 2058767 2246901 2353461 2565806 2572612 2527172 2606652 2525702 2683654 2802867 2936129
3876 2936129 3101110 3360800 3445746 3475200 3671281 3728689 3745500 3595494 3453560 3303913
3866 3303913 3161700 3050600 2805388 2566426 2402200 2072976 2050207 2010775 1926045 2061396
3856 2061396 2028283 1877677 1821662 1841586 1733810 1692550 1635492 1694498 1564610 1638615 1663590
3845 1663590 1398080 1473704 1483815 1641356 1532556 1570507 1460315 1393173 1261742 1169772
3835 1169772 1372872 1367728 1411773 1309491 1154332 1240602 1246348 1283593 1048752 1150729 1153693
3824 1153693 1218045 1232876 1178391 1243094 1249519 1148364 998645 936825 1199998 1244029 1111509
3813 1111509 1247810 1207026 1280268 1254971 1334892 1395263 1372657 1209698 1212654 1039790 896583
3802H96583j52441J36577M7535J4727q0199p6981N0113K13613Q7420l6730l7063
3791A063154k02340k957n6802O9920P9646j2652j3588r1131P5801J6338K59661
3780A185050J3622j12143l22488M1895Q0431Q7479j50753j04833J12209J92736
3770A023205J59885Q514m5357k11244J15500j03813j1803K85135p2974p0907P062
3759A083203k5327J00119P1473m3263l29816J3501K88175L4937j40015O1552m2109
3748A072430K1968J27912j26610j95914N8672K0641J30661L2377M4451O4532n8187
3737A192933K38489j19427k01659J63029p4921M5191j45969q9623j34377j87858
3727F85808n3058R618J50567J93107l9472j7063M7344O3271M4684J31813L0901
$$ plain form
3802 896583 744142 880719 928254 942981 862782 785801 835914 1049527 1136947 1100217 1063154
3791 1063154 860814 857857 801055 870975 950621 937969 924381 833250 909051 925389 1185050
3780 1185050 1198672 1086529 764041 805936 886367 973846 823093 718260 830469 1023205
3770 1023205 1183090 1191604 1146247 935003 1050503 946690 934887 1220022 1147048 1076141 1083203
3759 1083203 1057876 1157995 1229468 1186205 856389 869890 1158065 1193002 1052987 1114539 1072430
3748 1072430 1094398 1222310 1095700 899786 958458 979099 1109760 1142137 1186588 1251120 1192933
3737 1192933 1431422 1311995 1110336 1273365 1198444 1243635 1097666 1008043 873666 685808
3727 685808 632750 642368 792935 986042 946570 929507 976851 1040122 1084806 1216619 1247520
3716A247520j13253j03422J0604j53848J50986K56854k9260j86217q8674K94551
3706A285841J28097L9599n5302j22830m829j4121L4121k62169Q7210r2630j64196
3695H58791P0405l4014L027J36079k8599j81472p0450K25002L2214k48023L3687
3684G96647n0064m6890R4791Q3512j35853K5387l9805m6723n0943K14288J45398
3673I89745K0078O2409j3833j85570n7030M5339k9286J0543N6545J3431J09582
3662A021953n0063j42564p9036M3876J95407j53640M6949j8137n3847m7388K36419
3651I99929O6913j78218Q3934l717k8184k73174L9484J22989J74777J7643n878
3640A016498j60183N2245J15019p0393J456L9452l7265o8302m4362J99762j61486
$$ plain form
3716 1247520 1134267 1030845 1041449 887601 1038587 1295441 1266181 1079964 991290 1285841
3706 1285841 1413938 1453537 1398235 1275405 1270576 1256455 1290576 1028407 1115617 1022987 858791
3695 858791 929196 895182 898209 1034288 1005689 824217 753767 978769 1010983 762960 796647
3684 796647 746583 699693 794484 877996 742143 767530 727725 681002 630059 844347 989745
3673 989745 1009823 1072232 1058399 872829 815799 861138 831852 842395 898940 912371 1021953
3662 1021953 971890 829326 750290 794166 989573 835933 882882 864745 810898 763510 999929
3651 999929 1066842 888624 972558 968841 940657 667483 706967 829956 1004733 1022376 1016498
3640 1016498 856315 908560 1023579 953186 954642 994094 956829 888527 844165 1043927 882441
3629H82441q6633P1280J29691j61507k7496K14176j15865Q161J67117r4527m6309
3618I40529K4202j64595K63020K10502J55484J393p1996J24626K7307q5249k4211
3607A401012k9681J29533k87783r5284L3692M4350J14946j67076O3664R125m056
3596A212442n7227K7490J88784j27943m7883P8601o1651l864l0203N7449P671
3585A243666O6003L15336K5243J23982q6632j51059N6820j60634j01128J88251
3575A519848K32882j11267O3459J12108k14054N370q8977j11071j14471O7757
3565A361584j09188J13380p8751m8700J86285K27238K5809j07281l5681N9855
3555A594550K1756l0458l7304N1253O9207K912J86409L0757r5648j21833N5512
$$ plain form
3629 882441 795808 867088 996779 835272 807776 1021952 906087 914248 1081365 986838 940529
3618 940529 964731 800136 1063156 1273658 1429142 1430535 1358539 1483165 1510472 1425223 1401012
3607 1401012 1371331 1500864 1213081 1117797 1151489 1195839 1310785 1143709 1207373 1216498 1212442
3596 1212442 1155215 1182705 1371489 1243546 1195663 1274264 1212613 1208749 1178546 1235995 1243666
3585 1243666 1309669 1625005 1650248 1774230 1687598 1536539 1593359 1432725 1331597 1519848
3575 1519848 1752730 1641463 1704922 1817030 1602976 1608346 1519369 1408298 1293827 1361584
3565 1361584 1252396 1365776 1287025 1238325 1424610 1651848 1677657 1570376 1534695 1594550
3555 1594550 1616306 1585848 1548544 1599797 1669004 1671916 1858325 1889082 1793434 1671601 1727113
3544A727113K87788K1485o7324J63235p3450K47158o7592k8072o1898J35647J59920
3533B444010j534N8607K0885J22892m0522m140K01294K52153K83886o328j33563
3522C197640q9316J36460Q1397j83862J02768j6089J57452K28093j57213k5294
3512C432036K9557l1846K94378J73284q5637M0315J43203K68204J14886J70203
3502D548583J31078J45421j09105L38680J83886M2708J86174J64399O7746O8699
3492E768269L6734N7240J8143J084K14740L32644K92195P3219K90486M06372J94385
3481G685511K47192N39460L24993M11912L09431N41373M24403N83526O87168O28970
3471A2383939Q25421P66533O51222Q53809Q03782P98197P98540M05481K34963
$$ plain form
3544 1727113 2014901 2036386 1969062 2132297 2058847 2306005 2238413 2210341 2148443 2284090 2444010
3533 2444010 2442476 2501083 2521968 2644860 2604338 2600198 2801492 3053645 3337531 3331203 3197640
3522 3197640 3108324 3244784 3326181 3142319 3245087 3228998 3386450 3614543 3457330 3432036
3512 3432036 3461593 3429747 3724125 3897409 3811772 3852087 3995290 4263494 4378380 4548583
3502 4548583 4679661 4825082 4715977 5054657 5238543 5281251 5467425 5631824 5699570 5768269
3492 5768269 5805003 5862243 5880386 5881470 6096210 6428854 6721049 6794268 7084754 7491126 7685511
3481 7685511 7932703 8472163 8797156 9209068 9518499 10059872 10484275 11067801 11754969 12383939
3471 12383939 13209360 13975893 14627115 15480924 16284706 17082903 17881443 18286924 18521887
3462A8521887K1570o20764p72629p06558m42171j008345n79596n96412p59865
3453A3057117m46026n40510l82352j76739l42497k93692l51593l83834q1155K7724
3443A0086443m8493j60836n1111J48228J36250L42746N47163L86955N58153O57357
3433A2602855N62070M02121N46011q6387n62498j394614r59109p77761p03612
3424I629076l47587m17907l22437m24801n44636j60986l22168l46175k51658j75478
3414F315243j34887p1852j15003j17727j48782k53647K13397K1479J39112K16248
3404F063581L41917J46274K10415K80695J23871m1934l9045m49438k74012l96624
3394E965700l86557l77612l83522m9691m34817J93142J8952k48768l44627k43963
$$ plain form
3462 18521887 18543457 17922693 17150064 16443506 16001335 14992990 14413394 13816982 13057117
3453 13057117 12611091 12070581 11688229 11511490 11168993 10875301 10523708 10139874 10058719 10086443
3443 10086443 10037950 9877114 9826003 9974231 10110481 10453227 11000390 11387345 11945498 12602855
3433 12602855 13164925 13567046 14113057 14026670 13464172 12069558 11110449 10332688 9629076
3424 9629076 9281489 8863582 8541145 8116344 7571708 7410722 7088554 6742379 6490721 6315243
3414 6315243 6180356 6108504 5993501 5875774 5726992 5473345 5686742 5708221 5847333 6063581
3404 6063581 6405498 6551772 6762187 7042882 7166753 7124819 7085774 6636336 6362324 5965700
3394 5965700 5579143 5201531 4818009 4768318 4333501 4526643 4545595 4296827 3952200 3708237
3384C708237j85066j67495J58790k47533k21150j17314R4151R859K5589J31239
3374C189307l60992j59556q9123j06901M8499J8605K5118J47987j61204j36912
3364B414828J3719m0457n5579r2090j41856Q2694K2586k12890j39095J18717Q9268
3353B059845K3526j42962j3893Q453j3529k2166l1391M4427j94949j93213K81345
3342A805493J5593k81683K4123M2674J0560k9683p8379J65842L4301j22455K08097
3331A794483J45216n3349k38932o7481r6316N0575J88794J07131p3289r9211m3903
3320A613718n6973k34116j33314J19659K27146j77299k31327j5035J27653j40349
3310A099763l7810J30206p3638L8691l4186j7407M6897K9119J806r2430J4506
$$ plain form
3384 3708237 3523171 3355676 3514466 3266933 3045783 2928469 3022620 3032479 3058068 3189307
3374 3189307 2828315 2668759 2579636 2472735 2521234 2539839 2564957 2712944 2551740 2414828
3364 2414828 2428547 2388090 2332511 2240421 2098565 2181259 2203845 1990955 1851860 1970577 2059845
3353 2059845 2083371 1940409 1926516 1934969 1921440 1899274 1867883 1912310 1717361 1524148 1805493
3342 1805493 1821086 1539403 1563526 1606200 1616760 1587077 1508698 1674540 1708841 1586386 1794483
3331 1794483 1939699 1886350 1647418 1579937 1483621 1534196 1722990 1830121 1756832 1657621 1613718
3320 1613718 1556745 1322629 1189315 1308974 1536120 1358821 1127494 1112459 1240112 1099763
3310 1099763 1061953 1192159 1118521 1157212 1123026 1105619 1152516 1181635 1183441 1091011 1105517
3299A105517L3960J17606J37315K00053j21937r2561k57485j60108J92045K73166
3289A427571k8510k10718q3668K1909j34947j7414M6247m6271k3877k6195P6203
3278A000330L7098l0051j75504M5727J40456k2085j26379J99699m7600j21056
3268I00635r4605O61l5636J03016n0483Q7001j44552M8224J30673q1555j30927
3257G32452M3382j796J06647p8487J2148j88169j71895K32891J28022q1260j41345
3246E92590K4447p5539K86682Q8450l4344k19380j95602J44010O2534l43067O4597
3235C95378K01573k3520j0489J51341K4333k09084J50992J09566j28484P3687
3225G35293r5146j924j00791j54548k03188J67968L52457M2070p7389p9952P193
$$ plain form
3299 1105517 1139477 1257083 1394398 1594451 1472514 1379953 1122468 962360 1154405 1427571
3289 1427571 1399061 1188343 1104675 1126584 991637 974223 1020470 974199 950322 924127 1000330
3278 1000330 1037428 1007377 831873 877600 1018056 995971 869592 1069291 1021691 900635
3268 900635 806030 806691 771055 874071 823588 910589 766037 814261 944934 863379 732452
3257 732452 775834 774038 880685 802198 814346 626177 454282 687173 815195 733935 592590
3246 592590 617037 541498 828180 916630 882286 662906 467304 611314 673848 330781 395378
3235 395378 596951 573431 562942 714283 738616 529532 680524 790090 661606 735293
3225 735293 640147 638223 537432 382884 179696 347664 700121 742191 664802 584850 592043
3214E92043j08303k4309J73013K4904j07884J11171J34725J600J5996L5603r0232
3203G58327o1534J62791R4575j86347j47244J53886j17956P1595M0803l6463J69463
3192I01896q6416Q0322J00300n1643m2335K6936j70079J79263J39633N7616j654
3181A133839r2400q2690o4513J61487l6342K5795q7507N4548K07885k37821J23491
3170A105772L54081J11075l8512k88963J22696J27037l1982k8073M2593K05973
3160A681697l7287m3521L65100K04754j23936Q7675J63578P5935J75182q9129
3150B460048K4045L1763R8314K00135j30398J45178o2693J31935J26755J09236
3140C134318j09575O6854J29526j21387P5792J25225L56256J80417R5052L12665
$$ plain form
3214 592043 483740 459431 632444 657348 549464 660635 795360 796960 812956 848559 758327
3203 758327 696793 859584 954159 767812 620568 774454 656498 728093 768896 732433 901896
3192 901896 815480 895802 996102 944459 902124 929060 758981 938244 1077877 1135493 1133839
3181 1133839 1041439 958749 894236 1055723 1019381 1045176 957669 1012217 1220102 982281 1105772
3170 1105772 1459853 1570928 1532416 1243453 1366149 1493186 1461204 1433131 1475724 1681697
3160 1681697 1644410 1600889 1965989 2170743 2046807 2134482 2298060 2373995 2549177 2460048
3150 2460048 2484093 2515856 2614170 2814305 2683907 2829085 2766392 2898327 3025082 3134318
3140 3134318 3024743 3091597 3221123 3099736 3175528 3300753 3657009 3837426 3932478 4245143
3130D245143j09980j33493M01898N19429j27042o7184J27434L4210J04891M8874
3120E044180R7132j73028j15960j02857j64187n4678o1302P6497O8564J80466
3110D794827j57144n3342J59970J6681M2096J73866J0008p7171O5427m3324R4542
3099E026436N2409J56800J35756Q7929J04504N4642k61216k73001K7477j85322
3089D926414k73262j6612l29656o6748P0147j82710j55081K4513r5705l5009j34184
3078C732107j22238m6254L4121n9610n618j56833L321k1819J6015j14999j74307
3067C083886p3173k39604P7538k9737n4450j36591j64062j56079r3995j02019
3057B111714j76043k10314n13J69035j91981k82023O7182M822l7229r2678n7472
$$ plain form
3130 4245143 4135163 4001670 4403568 4922997 4795955 4728771 4856205 4890415 4995306 5044180
3120 5044180 5141312 4968284 4852324 4749467 4585280 4530602 4469300 4545797 4614361 4794827
3110 4794827 4637683 4584341 4744311 4760992 4803088 4976954 4986962 4909791 4975218 4931894 5026436
3099 5026436 5078845 5235645 5371401 5459330 5563834 5618476 5357260 5084259 5111736 4926414
3089 4926414 4653152 4636540 4306884 4240136 4310283 4127573 3972492 3997005 3901300 3866291 3732107
3078 3732107 3609869 3563615 3597736 3538126 3532508 3375675 3378996 3357177 3373192 3258193 3083886
3067 3083886 3010713 2771109 2848647 2818910 2764460 2627869 2463807 2307728 2213733 2111714
3057 2111714 1935671 1725357 1724844 1893879 1701898 1419875 1487057 1491879 1454650 1361972 1304500
3046A304500n7586p0140j0788m6697k47612K36979o5239j91989J98441r2080J40693
3035A098482j73130k12287L5644j38488k7353J34187l147J14296j97416j04730
3025E26058j39301J26231J4564j52723l5857j46135m806L285J21272L0050M0709
3014C83347L2830N6476j46825r2848J45522M3200j24421k47086p6514J97681l8342
3003A33020o0269M4552N1451l6426J36952o1999j57896j439j56310J24141K22480
2992B38257o0522j89173j03232J70203P203j11519N9115r8682q6941L6868o7261
2981b05684J32358R5661J58808j22985J3517j45497l5048o0998r2193O9481O9454
2970a23126N4583J2723P5862k9411j22868k46159j3327K75939j47430j15400l1947
$$ plain form
3046 1304500 1246914 1176774 1165986 1119289 871677 1108656 1043417 851428 1049869 957789 1098482
3035 1098482 925352 713065 748709 610221 582868 717055 713908 828204 630788 526058
3025 526058 386757 512988 527552 374829 338972 192837 188031 191316 312588 342638 383347
3014 383347 416177 472653 325828 232980 378502 421702 297281 50195 -26319 171362 133020
3003 133020 72751 117303 168754 132328 269280 207281 49385 47946 -108364 15777 238257
2992 238257 177735 -11438 -114670 55533 62736 -48783 10332 -88350 -175291 -138423 -205684
2981 -205684 -73326 22335 181143 58158 71675 -73822 -108870 -169868 -262061 -192580 -123126
2970 -123126 -68543 -55820 20042 -9369 -132237 -378396 -391723 -115784 -263214 -378614 -410561
2959d10561l1137J71869k2805q3801J87868l1246L199j88482j72737K43032K51628
2948h3173r4705j79740Q7198j13254M9736o325R1123q9411l4583k6957l5464K16049
2936b19506P2290j23408j1184j44856J37233n259r0623j41094k1715q1011j58908
2925g88041J50171K32982J01101K8654p0327L00748p0689j69296j07705l5714
2915d28116o5056j47807K45022J98504r0115k16935J44032J36182j446k43690
2905d69425l0467K10933o8743n8112j06556J00715J78976j05267M4336K1967m855
2894b86498L247j58729L2255J29798k8610j69770l4899n4000k6984K57463n2556
2883c89283j08430m4487n6303Q0299L07474M1999p6477q067j93119J43207r7799
$$ plain form
2959 -410561 -441698 -269829 -292634 -376435 -188567 -219813 -216614 -405096 -577833 -334801 -83173
2948 -83173 -177878 -357618 -270420 -383674 -333938 -340263 -249140 -338551 -373134 -400091 -435555 -219506
2936 -219506 -147216 -270624 -281808 -426664 -289431 -294690 -385313 -526407 -548122 -629133 -788041
2925 -788041 -637870 -404888 -303787 -275133 -345460 -44712 -115401 -284697 -392402 -428116
2915 -428116 -493172 -640979 -395957 -197453 -287568 -504503 -360471 -224289 -225735 -469425
2905 -469425 -499892 -288959 -357702 -415814 -522370 -421655 -242679 -347946 -303610 -281643 -286498
2894 -286498 -283251 -441980 -409725 -279927 -308537 -478307 -513206 -567206 -594190 -336727 -389283
2883 -389283 -497713 -542200 -598503 -518204 -210730 -168731 -245208 -253275 -446394 -303187 -400986
2872d00986k21000r705j03872P4560J79255m1414k22434R1699K4099p3586K35179
2861d68205N9577j88057K01025J78889r2510p5892J14785j841l1173Q2390k32131
2850d53143q8586K3959Q6356O5225m2520M513J01456j0679j52198j82139L5841
2839f11915K63323j11423P8261j28070K5698L7855j60573J65084J08867J02811
2829b30082k54719o840j12681k0551R8190O4519n7656Q951K37080J0071k2M6296
2817b17444Q5105j21565q8733j51221j1458J36858J43141j56839j23036n0844
2807e56036p0742P125J03689L6414J14948R9193j34975j85843J37826J12614j70545
2796e06332R2161R7532J26225p6470o3571q6264j36535J54668K5593K3441j31946
$$ plain form
2872 -400986 -621986 -631691 -735563 -661003 -481748 -523162 -745596 -653897 -629798 -703384 -468205
2861 -468205 -408628 -596685 -395660 -216771 -309281 -385173 -270388 -272229 -303402 -221012 -453143
2850 -453143 -541729 -517770 -431414 -366189 -408709 -404196 -302740 -313419 -465617 -647756 -611915
2839 -611915 -348592 -460015 -381754 -509824 -484126 -446271 -606844 -441760 -332893 -230082
2829 -230082 -484801 -491641 -604322 -624873 -526683 -462164 -519820 -510869 -273789 -263718 -263740 -217444
2817 -217444 -132339 -253904 -342637 -493858 -505316 -368458 -225317 -382156 -505192 -556036
2807 -556036 -626778 -619653 -515964 -479550 -364602 -265409 -400384 -586227 -448401 -335787 -506332
2796 -506332 -414171 -316639 -190414 -266884 -330455 -416719 -553254 -398586 -372993 -349552 -481498
2785d81498j73419j80317J26028J52883K06348J65930l0107n4154r5638j92306
2775e56250R9887j04347N7297J9495l5252L71766j18448O8658O7765l4651j64435
2764c28515l18642p650J16333J18594J06365j10639l5083J1615n9050o0715k0457
2753e87844J09969J40272o9920J3818m3404k16042J74341J41678j86615o5900
2743e89647M1097J50434J717o5452j78513J3259Q917j67058R4662L08450J8582
2732c63552j06227P4203l1120R8567o5247j11031J46555j06467j75838P3444R8084
2721d68629K48595Q1286j39137j75832o3381n8740J6584J03730q9142J30806K3423
2710c90437L9638l4005j12771j11007R9205j07008J83090k2211P5299o0825j60034
$$ plain form
2785 -481498 -654917 -835234 -709206 -556323 -349975 -184045 -214152 -268306 -363944 -556250
2775 -556250 -456363 -560710 -503413 -483918 -519170 -147404 -265852 -197194 -129429 -164080 -328515
2764 -328515 -647157 -654807 -538474 -419880 -313515 -424154 -459237 -447622 -506672 -567387 -587844
2753 -587844 -477875 -337603 -407523 -393705 -437109 -653151 -478810 -337132 -523747 -589647
2743 -589647 -548550 -398116 -396399 -461851 -640364 -627105 -618188 -785246 -690584 -382134 -363552
2732 -363552 -469779 -395576 -426696 -328129 -393376 -504407 -357852 -464319 -640157 -566713 -468629
2721 -468629 -220034 -138748 -277885 -453717 -517098 -575838 -559254 -455524 -544666 -413860 -390437
2710 -390437 -350799 -384804 -497575 -608582 -509377 -616385 -433295 -455506 -380207 -441032 -601066
2699f01066K85491n2495j11855m4018R8871N2022j52001r6432J30354k9349j03324
2688f23802j00906O0942O3398J44792k29012Q2414J2934L0635M0261N6960m2703
2677e04087m5544J41355r3229L8286l4831R9889j9388l9907J62748J19974l4708
2666b09442Q0p3209q2124j38874J08305k32928j052Q3905J25172L8504Q4671j07632
2654d04624j20616J96671K883p2991J05975k46474q9171M3804r5474J53856K5158
2643e01003R2589L3401l1359P5795K3535n4330n2661Q198Q7686k9784J12834k04527
2631d39626Q6199J65763j44260p3416p1402j90926o6506J9266K78256j43152j9391
2620e99195N5001K4604K2750k0021M6499J57375N4929J5256k62319K12407n8523
$$ plain form
2699 -601066 -315575 -368070 -479925 -523943 -425072 -373050 -525051 -621483 -491129 -520478 -623802
2688 -623802 -724708 -663766 -600368 -455576 -684588 -602174 -589240 -558605 -518344 -461384 -504087
2677 -504087 -549631 -408276 -501505 -463219 -498050 -398161 -417549 -457456 -294708 -174734 -209442
2666 -209442 -209362 -282571 -364695 -503569 -395264 -628192 -629244 -545339 -420167 -381663 -296992 -404624
2654 -404624 -525240 -328569 -325686 -398677 -292702 -539176 -628347 -584543 -680017 -526161 -501003
2643 -501003 -408414 -375013 -406372 -330577 -307042 -361372 -414033 -405835 -318149 -347933 -235099 -439626
2631 -439626 -353427 -187664 -331924 -405340 -476742 -667668 -734174 -714908 -436652 -579804 -599195
2620 -599195 -544194 -519590 -496840 -516861 -470362 -312987 -258058 -242802 -505121 -292714 -351237
2609c51237j54286L8103p0547M4184J85525M8355O1765k5280J2882p39K8096Q4118
2597i9061j09905Q9689j34189O283r567J37014o075q8528K246K22299j19356r7293
2585b06443n065L9626j80498j14357J04103J09194j17617l9434J000l272K00980
2574b11783J09106K1760k01312n77M6747r9040j02123j70212J40737K8461J42903
2563b95333J53644q6245j34253J72098k0932j24166o486r061J11602j75759j76068
2552e90959J27385K86551j83692P2448R546J2786j07357r1734R9880K03568m3112
2541b04690j29080n0961o1860O8814L1954N1728l5012o733m9106n0127J24529
2530c10544j09634j25054J65425J39087M4010j18552q9395J83026Q1412k5780
$$ plain form
2609 -351237 -505523 -467420 -537967 -493783 -308258 -259903 -198138 -223418 -210536 -211275 -183179 -99061
2597 -99061 -208966 -119277 -253466 -247183 -256750 -119736 -125811 -214339 -212093 10206 -109150 -206443
2585 -206443 -211508 -171882 -352380 -466737 -362634 -253440 -371057 -410491 -409491 -412763 -211783
2574 -211783 -102677 -80917 -282229 -282806 -236059 -335099 -437222 -607434 -466697 -438236 -295333
2563 -295333 -141689 -227934 -362187 -190089 -211021 -335187 -341673 -350734 -239132 -414891 -590959
2552 -590959 -463574 -177023 -360715 -288267 -278721 -265935 -373292 -465026 -365146 -161578 -204690
2541 -204690 -333770 -384731 -446591 -377777 -345823 -294095 -329107 -335840 -384946 -435073 -310544
2530 -310544 -420178 -545232 -379807 -240720 -196710 -315262 -404657 -221631 -140219 -165999
2520a65999o1852l6100l8656o6945J35799m2300j07210q4877L59929J35057j08942
2509h2096O9708n999n1469j38998j82955o2583J16134M8610L9939J1722k15842
2498d53829J70678O5673K74881O2877M5896R608r7170K1590k99o9467k78097j50565
2486c98224M60185j4293j98477l808J11190J06844j36247j11777j04012L08971
2476B0352k00301j58487m5494J52353L00100q9517n7808N6469p8010J4587P2954
2465a2802P6765p362j72534J0576j53300J88612J8525Q3313J51311j70380K11129
2454B23853n8593j3052j37142k07673M3933J30792J24432L0177j05619K09827
2444B40935N554p5636J06490J36310p1493r0767j09676p3970l0970J0846R1431
$$ plain form
2520 -165999 -227851 -263951 -302607 -369552 -233753 -276053 -383263 -468140 -108211 26846 -82096
2509 -82096 -12388 -18387 -69856 -208854 -391809 -454392 -338258 -289648 -249709 -237987 -453829
2498 -453829 -283151 -217478 57403 120280 166176 175784 78614 100204 99905 30438 -247659 -398224
2486 -398224 61961 47668 -150809 -154617 -43427 63417 -72830 -184607 -288619 20352
2476 20352 -179949 -338436 -383930 -231577 68523 -20994 -78802 -22333 -100343 -85756 -12802
2465 -12802 63963 56601 -115933 -105357 -258657 -70045 -51520 31793 183104 12724 223853
2454 223853 165260 152208 15066 -192607 -148674 -17882 106550 136727 31108 240935
2444 240935 246489 170853 277343 413653 342160 251393 141717 67747 36777 47623 139054
2433A39054L3144k12359J8611m0699J57853Q785o6683p6227k27429K23744K07975
2422A65769O1441J9110j4893j18937L178j48816l423n4001J40759K41800j18869
2411A73118J47260M5239j45811J89749j08381R7307P4734k41023J72821O8326
2401D73339r0763J4486L3546j5112L1010J82879l0352K0600K89999J38079k43355
2390H04356k232K96340k5068k2249j97343N656J01635m4273L631K98852J25989
2379A345294j59866m6666L2116J56621J55455J28392Q5656K01799J41345Q526
2369B048672K0151K1413l0606J62766J75090L63837J56446j85787J37573K45029
2359C114584R0212K50009J73961L87644K77942R6314L72178M74144K43070O55586
$$ plain form
2433 139054 172198 -40161 -21550 -62249 95604 104389 37706 -38521 -265950 -42206 165769
2422 165769 227210 246320 231427 112490 115668 -33148 -36571 -90572 50187 291987 173118
2411 173118 320378 365617 219806 409555 301174 398481 473215 232192 405013 473339
2401 473339 382576 397062 430608 415496 446506 629385 599033 619633 909632 1047711 804356
2390 804356 802124 1098464 1073396 1051147 853804 859460 961095 916822 920453 1219305 1345294
2379 1345294 1185428 1138762 1170878 1327499 1482954 1611346 1697002 1898801 2040146 2048672
2369 2048672 2068823 2090236 2059630 2222396 2397486 2761323 2917769 2731982 2869555 3114584
2359 3114584 3204796 3454805 3628766 4016410 4294352 4390666 4762844 5236988 5480058 6135644
2349F135644O97370J89412N12864N63510Q12186R75639P97978J070372J306305
2340A3061280J352282J391025J440560J252663J584850J892467K505156K786156
2332B7266439L240087M801157O242113P046688O935634P540381Q431523O312332
2324G7816354L066691K91286p741964j1479562r300015p490139n522379m444624
2316C5195648l663360l186155k368210k091564k316697j872342j458545j420082
2308A6818693j547008j499390j109158j069316j160496q33594n71771q45248n19271
2299G663441l85207n51116m38235k48175l17201m35698l41666k54330k97722k65936
2289D128155k78622j47871k58272L9512j93835k39806j29894l08927j64486k46883
$$ plain form
2349 6135644 6833014 7022426 7535290 8098800 8910986 9886625 10684603 11754975 13061280
2340 13061280 14413562 15804587 17245147 18497810 20082660 21975127 24480283 27266439
2332 27266439 30506526 35307683 41549796 48596484 55532118 63072499 71504022 77816354
2324 77816354 80883045 81174331 73432367 61952805 52652790 45162651 39640272 35195648
2316 35195648 31532288 28346133 25977923 23886359 21569662 19697320 18238775 16818693
2308 16818693 15271685 13772295 12663137 11593821 10433325 9599731 9027960 8182712 7663441
2299 7663441 7278234 6727118 6288883 6040708 5723507 5287809 4946143 4691813 4394091 4128155
2289 4128155 3849533 3701662 3443390 3482902 3289067 3049261 2919367 2610440 2445954 2199071
2279B199071l7164o4022k22493j85234k85548J46978j6209p4843j19615j9118
2269A321803K43751k44512k32261L9031l0396k66063N6914L4640k37428J45894
2259H31373m7599j85769O2354q9134o2747O7227J19632k30940q6153j01002J31303
$$ plain form
2279 2199071 2161907 2097885 1875392 1690158 1404610 1551588 1535379 1460536 1340921 1321803
2269 1321803 1565554 1321042 1088781 1127812 1097416 831353 888267 922907 685479 831373
2259 831373 783774 598005 660359 571225 508478 575705 695337 464397 378244 277242 408545
$$ [...]
##END NTUPLES=NMR SPECTRUM
##END=
