##TITLE=1H_DE-80H_X3
 200.13MHz, d2o
 8 sc
 
 19ns.26.2.2025
##JCAMPDX= 6.0         $$ Bruker NMR JCAMP-DX V2.0
##DATA TYPE= NMR SPECTRUM
##DATA CLASS= NTUPLES
##ORIGIN= UXNMR, Bruker Analytische Messtechnik GmbH
##OWNER= pz
$$ XWIN-NMR		Version 3.5
$$ Mon Oct 13 15:14:51 2025 Russian Standard Time (UT+4h)  Yarkov@DPX200
##.OBSERVE FREQUENCY= 200.1313
##.OBSERVE NUCLEUS= ^1H
##.ACQUISITION MODE= SIMULTANEOUS
##.ACQUISITION SCHEME= undefined
##.AVERAGES= 8
##.DIGITISER RES= 18
##SPECTROMETER/DATA SYSTEM= spect
##.PULSE SEQUENCE= zg30
##.SOLVENT NAME= CDCl3
##.SHIFT REFERENCE= (INTERNAL, CDCl3, 0, 15.9598)
##AUDIT TRAIL= $$ (NUMBER, WHEN, WHO, WHERE, WHAT)
$$ ##TITLE= Audit trail, XWIN-NMR		Version 3.5
$$ ##JCAMPDX= 5.01
$$ ##ORIGIN= Bruker BioSpin GmbH
$$ ##OWNER= Yarkov
$$ C:/Bruker/XWIN-NMR/data/yarkov2/nmr/H-C/1/pdata/1/auditp.txt
$$ ##AUDIT TRAIL=  $$ (NUMBER, WHEN, WHO, WHERE, WHAT)
(   1,<2025-10-13 15:13:16.29 +0400>,<Yarkov>,<DPX200>,
      <created by zg, POWCHK disabled, PULCHK disabled
       configuration hash MD5:
       00 E9 B6 7A A2 85 ED C7 34 08 36 98 17 FE 4E 26
       data hash MD5: 16K
       9B E3 52 61 21 6C CD 4C 98 98 73 AF BF F8 E0 84>)
(   2,<2025-10-13 15:13:29.82 +0400>,<Yarkov>,<DPX200>,
      <Start of raw data processing
       efp BC_mod = 2 LB = 0.25 FT_mod = 6 PKNL = 1 PHC0 = -2644.588 PHC1 = 15.19097 SI = 16K 
       data hash MD5: 16K
       23 B7 A2 56 03 34 FD 8C F6 10 65 54 EA B9 D8 F9>)
$$ ##END=
$$ 
$$ hash MD5
$$ C8 4D 64 DC FD AB EE F2 F3 87 D1 A4 9A E7 78 1F
##$RELAX= 
##$RELAX= 
##$RELAX= 
##$RELAX= 
##$RELAX= 
##$RELAX= 
$$ Bruker specific parameters
$$ --------------------------
##$DU= <C:/Bruker/XWIN-NMR>
##$EXPNO= 1
##$NAME= <H-C>
##$PROCNO= 1
##$TYPE= <nmr>
##$USER= <yarkov2>
##$AMP= (0..31)
100 100 100 100 100 100 100 100 100 100 100 100 100 100 100 100 100 100 
100 100 100 100 100 100 100 100 100 100 100 100 100 100 
##$AQSEQ= 0
##$AQ_mod= 1
##$AUNM= <au_zg>
##$AUTOPOS= <>
##$BF1= 200.13
##$BF2= 200.13
##$BF3= 200.13
##$BF4= 200.13
##$BF5= 200.13
##$BF6= 200.13
##$BF7= 200.13
##$BF8= 200.13
##$BYTORDA= 1
##$CFDGTYP= 0
##$CFRGTYP= 5
##$CHEMSTR= <none>
##$CNST= (0..31)
1 1 145 1 1 1 1 1 1 1 1 1 1 1 1 1 1 1 1 1 1 1 1 1 1 1 1 1 1 1 1 1 
##$CPDPRG= <>
##$CPDPRG1= <>
##$CPDPRG2= <>
##$CPDPRG3= <>
##$CPDPRG4= <mlev>
##$CPDPRG5= <mlev>
##$CPDPRG6= <mlev>
##$CPDPRG7= <mlev>
##$CPDPRG8= <mlev>
##$CPDPRGB= <>
##$CPDPRGT= <>
##$D= (0..31)
0 0.7 0 0 0 0 0 0 0 0 0 0.03 0 0 0 0 0 0 0 0 0 0 0 0 0 0 0 0 0 0 0 0 
##$DATE= 1760353995
##$DBL= (0..7)
120 120 120 120 120 120 120 120 
##$DBP= (0..7)
150 150 150 150 150 150 150 150 
##$DBP07= 0
##$DBPNAM0= <>
##$DBPNAM1= <>
##$DBPNAM2= <>
##$DBPNAM3= <>
##$DBPNAM4= <>
##$DBPNAM5= <>
##$DBPNAM6= <>
##$DBPNAM7= <>
##$DBPOAL= (0..7)
0.5 0.5 0.5 0.5 0.5 0.5 0.5 0.5 
##$DBPOFFS= (0..7)
0 0 0 0 0 0 0 0 
##$DE= 6
##$DECBNUC= <off>
##$DECIM= 32
##$DECNUC= <off>
##$DECSTAT= 4
##$DIGMOD= 1
##$DIGTYP= 9
##$DL= (0..7)
0 120 120 120 120 120 120 120 
##$DP= (0..7)
$$ [...]
##$SUBNAM2= <"">
##$SUBNAM3= <"">
##$SUBNAM4= <"">
##$SUBNAM5= <"">
##$SUBNAM6= <"">
##$SUBNAM7= <"">
##$SUBNAM8= <"">
##$SUBNAM9= <"">
##$SW= 18.0517328524113
##$SWIBOX= (0..15)
0 0 2 0 0 0 0 0 0 0 0 0 0 0 0 0 
##$SW_h= 3612.71676300578
##$TD= 16384
##$TD0= 1
##$TE= 0
##$TE2= 300
##$TE3= 300
##$TEG= 300
##$TL= (0..7)
0 120 120 120 120 120 120 120 
##$TP= (0..7)
150 150 150 150 150 150 150 150 
##$TP07= 0
##$TPNAME0= <>
##$TPNAME1= <>
##$TPNAME2= <>
##$TPNAME3= <>
##$TPNAME4= <>
##$TPNAME5= <>
##$TPNAME6= <>
##$TPNAME7= <>
##$TPOAL= (0..7)
0.5 0.5 0.5 0.5 0.5 0.5 0.5 0.5 
##$TPOFFS= (0..7)
0 0 0 0 0 0 0 0 
##$TUNHIN= 0
##$TUNHOUT= 0
##$TUNXOUT= 0
##$USERA1= <user>
##$USERA2= <user>
##$USERA3= <user>
##$USERA4= <user>
##$USERA5= <user>
##$V9= 5
##$VALIST= <valist>
##$VCLIST= <CCCCCCCCCCCCCCC>
##$VD= 0
##$VDLIST= <DDDDDDDDDDDDDDD>
##$VPLIST= <PPPPPPPPPPPPPPP>
##$VTLIST= <TTTTTTTTTTTTTTT>
##$WBST= 1024
##$WBSW= 4
##$XGAIN= (0..3)
0 0 0 0 
##$XL= 0
##$YL= 0
##$YMAX_a= 264026
##$YMIN_a= -389471
##$ZGOPTNS= <>
##$ZL1= 120
##$ZL2= 120
##$ZL3= 120
##$ZL4= 120
##$ABSF1= 0
##$ABSF2= 0
##$ABSG= 0
##$ABSL= 0
##$ALPHA= 0
##$AQORDER= 0
##$ASSFAC= 0
##$ASSFACI= 0
##$ASSFACX= 0
##$ASSWID= 0
##$AUNMP= <proc_1d>
##$AZFE= 0.1
##$AZFW= 0.1
##$BCFW= 0
##$BC_mod= 2
##$BYTORDP= 0
##$COROFFS= 0
##$CY= -3
##$DATMOD= 1
##$DC= 0
##$DFILT= <>
##$DTYPP= 0
##$F1P= 0
##$F2P= 0
##$FCOR= 1
##$FTSIZE= 16384
##$FT_mod= 6
##$GAMMA= 0
##$GB= 0
##$INTBC= 1
##$INTSCL= 3.241238e-09
##$ISEN= 128
##$LB= 0.25
##$LEV0= 0
##$LPBIN= 0
##$MAXI= 10000
##$MC2= 0
##$MEAN= 0
##$ME_mod= 0
##$MI= 1.114404
##$NCOEF= 0
##$NC_proc= -7
##$NLEV= 6
##$NOISF1= 3.799351
##$NOISF2= 2.8
##$NSP= 0
##$NTH_PI= 0
##$NZP= 0
##$OFFSET= 15.9598
##$PC= 1
##$PHC0= -2644.588
##$PHC1= 15.19097
##$PH_mod= 1
##$PKNL= yes
##$PPARMOD= 0
##$PSCAL= 0
##$PSIGN= 0
##$REVERSE= no
##$SF= 200.129912325831
##$SI= 16384
##$SIGF1= 3
##$SIGF2= 2
##$SINO= 0.751879
##$SIOLD= 32768
##$SREGLST= <19F.Aceton>
##$SSB= 0
##$STSI= 16384
##$STSR= 0
##$SW_p= 3612.71676300578
##$SYMM= 0
##$S_DEV= 0
##$TDeff= 16384
##$TDoff= 0
##$TI= <>
##$TILT= no
##$TM1= 0
##$TM2= 0
##$TOPLEV= 0
##$USERP1= <user>
##$USERP2= <user>
##$USERP3= <user>
##$USERP4= <user>
##$USERP5= <user>
##$WDW= 1
##$XDIM= 16384
##$YMAX_p= 366409794
##$YMIN_p= -1426460
$$ End of Bruker specific parameters
$$ ---------------------------------
##NTUPLES= NMR SPECTRUM
##VAR_NAME=  FREQUENCY,     SPECTRUM/REAL,   SPECTRUM/IMAG
##SYMBOL=    X,             R,               I
##VAR_TYPE=  INDEPENDENT,   DEPENDENT,       DEPENDENT
##VAR_FORM=  AFFN,          ASDF,            ASDF
##VAR_DIM=   16384,         16384,           16384
##UNITS=     HZ,            ARBITRARY UNITS, ARBITRARY UNITS
##FACTOR=    0.220516191357247, 1,           1
##FIRST=     3194.03332801557, 0,            0
##LAST=      -418.683434990206, 0,           0
##MIN=       -418.683434990206, -1426460,    0
##MAX=       3194.03332801557, 366409794,    0
$$ Real data points
##PAGE= N=1
##DATA TABLE= (X++(R..R)), XYDATA
$$ [...]
9386 1441334 1628518 1692174 1725532 1769107 1680517 1685215 1634444 1591489 1615281 1685642 1664375
9375 1664375 1636568 1712069 1563628 1680670 1767139 1928344 1707433 1568559 1548558 1686549
9365 1686549 1799416 1903397 1762833 1814727 1966710 1954273 2126116 2217168 2069417 2145700
9355 2145700 2023860 1725268 1634910 1882304 1818021 1745059 1881541 1682007 1826251 1667320
9345 1667320 1722653 1636454 1692944 1835969 1746867 1721645 1968063 1925617 1933803 1907209 2016940
9334 2016940 1774449 1719790 1757380 1738624 1839898 1748319 1792823 1540252 1683330 1908817
9324 1908817 1849106 1638305 1638563 1765077 1833678 1681029 1580732 1577472 1778531 1976866 1685455
9313 1685455 1684226 1914854 2099792 1894650 1786342 2027499 2264093 2156881 2023599 2042648
9303 2042648 1793527 1359209 1459215 1679607 1532566 1668318 1904467 2165252 2093148 2023506
9293 2023506 1733866 1587482 1702346 1578913 1771203 1782805 1893663 1845652 1928459 1820418
9283 1820418 1745045 1921771 1740849 1710480 1854527 1914128 2152745 1987839 1566902 1550516
9273 1550516 1837174 1922545 1794323 1887112 1795588 1914950 1852457 1916712 2131358 2147564 1989753
9262 1989753 2107860 2120304 2158709 2153435 1864189 1910244 2216154 2153319 1989383 2018326 2070806
9251 2070806 1986678 2110218 2070480 2076063 2352007 2374086 2127970 2007279 1992416 1900255 1876902
9240 1876902 2084595 2193085 1809688 1860181 1839900 1744361 2048746 2218831 2131614 1895687
9230 1895687 1856486 2043961 2007670 2179625 2236104 2102461 1832716 1996476 2015182 2193757
9220 2193757 2157836 2427645 2551921 2106840 1937654 1968151 2260446 2129715 2131647 2022385
9210 2022385 2205469 2209560 2165982 2195033 2268942 2177474 2141950 2194553 2042057 1916595 1982487
9199 1982487 1996774 2174628 2531496 2553095 2220920 2131185 2103904 2228652 2238831 2426542
9189 2426542 2364698 2173375 2178436 2283658 2484498 2588497 2429112 2327080 2228945 2065548
9179 2065548 2320116 2082764 1922464 2357364 2342927 2408170 2421191 2357321 2306925 2496063
9169 2496063 2526912 2493516 2265088 2148238 2031695 2015979 2327791 2475158 2700197 2736407
9159 2736407 2334866 2168317 2100647 2137665 2184491 2037264 2191439 2242108 2161427 2258651 2312152
9148 2312152 1981984 2048736 2057166 2202376 2188509 2352654 2166529 2332415 2351721 2163120
9138 2163120 2113183 2153957 2261042 2312816 2368177 2447888 2384251 2291929 2427904 2538158 2601376
9127 2601376 2381535 2444176 2369315 2149457 2148867 2199051 2188770 2133022 1977739 2172828 2222718
9116 2222718 2212640 2337794 2084585 2143398 2108695 2192027 2284633 2456717 2349812 2336839 2317483
9105 2317483 2504682 2396206 2337577 2502817 2440577 2432739 2609234 2654372 2471142 2500595 2669613
9094 2669613 2724890 2700865 2476351 2458111 2514691 2421237 2509635 2562893 2642442 2598259 2596432
9083 2596432 2876069 2577880 2355986 2237331 2311219 2481398 2307810 2359243 2497873 2574478
9073 2574478 2428183 2814139 2811539 2655912 2590582 2497494 2454469 2592233 2443810 2432913 2458192
9062 2458192 2623001 2812223 2608261 2557847 2556241 2579056 2462486 2458166 2480394 2520966 2425978
9051 2425978 2676035 2698361 2581588 2660756 2594222 2667170 2530602 2547629 2620055 2612357 2617968
9040 2617968 2518810 2406275 2460094 2561659 2665546 2602869 2432521 2600071 2602637 2239771
9030 2239771 2122085 2142410 2356635 2515300 2554652 2479033 2402853 2366473 2527792 2486389 2463675
9019 2463675 2601182 2456902 2424237 2419302 2283401 2250140 2268618 2071821 2401663 2421266 2231264
9008 2231264 2152189 2109789 2292900 2585586 2780284 2381362 2434420 2451997 2644683 2639716 2628131
8997 2628131 2445495 2477816 2165184 2187396 2273300 2254688 2089506 2323877 2576657 2569400 2807068
8986 2807068 2724534 2588695 2619044 2737963 2620331 2522677 2444630 2190400 2462332 2701568
8976 2701568 2645863 2566534 2513721 2519641 2347937 2726266 2520453 2329465 2337017 2569694 2510105
8965 2510105 2630323 2867460 3023300 3082958 2674148 2619416 2638796 2589884 2741932 2829977
8955 2829977 2954503 2855961 2785794 2804896 2637981 2650823 2628220 2531546 2513041 2542350 2586126
8944 2586126 2841477 2992804 2871209 2876852 2830636 2656656 2818866 2496144 2344699 2480639
8934 2480639 2715244 2923246 2676126 2606593 2729610 2698395 2517781 2557321 2434002 2630723
8924 2630723 2611407 2547734 2277545 2413046 2494017 2733888 2733239 2744392 2615463 2633937 2615467
8913 2615467 2685147 2719219 2708032 2852018 2632899 2448591 2613574 2899618 2729946 2372152
8903 2372152 2293565 2557502 2683096 2567255 2552341 2960144 3242707 2756229 2451979 2637767
8893 2637767 2838628 2662207 2760718 2908803 2942601 2681999 2358638 2819512 2983873 3124622
8883 3124622 2763675 2565029 2565379 2632241 2762583 2977770 3014418 2961517 2836373 2729325 2591252
8872 2591252 2608464 2691570 2609465 2906205 3029906 2812989 2583028 2660894 2782480 2650268
8862 2650268 2529177 2567557 2651339 3004230 2988142 2967551 2989228 2955341 3092920 2725042 2497953
8851 2497953 2438974 2639151 2800204 3004079 3091125 3131233 3147606 2986841 2795058 2937328
8841 2937328 3009251 2773248 2870127 3186773 3071325 2879234 3035970 3000509 3036062 3136945
8831 3136945 3152489 2844245 2762680 2966911 2804851 2853468 2899397 2742224 2941385 3251744
8821 3251744 3227157 3053227 3032235 3155451 2980751 3052744 3073506 2959944 3033741 3141153
8811 3141153 3063593 3060561 3225930 3218809 3012520 3201735 3342426 3467631 3421135 3196616 3423812
8800 3423812 3365710 2855911 3056622 3095283 3170986 3227083 3117630 3224136 3090395 3138919
8790 3138919 3549275 3567577 3473258 3307755 3523631 3515415 3510772 3723336 3476852 3415018 3467156
8779 3467156 3555923 3371382 3441481 3369248 3643058 3240134 3159834 3217191 3370898 3491823
8769 3491823 3636356 3835967 3541023 3737720 3756044 3575541 3520876 3602496 3593749 3405059
8759 3405059 3497166 3464635 3390996 3561028 3613007 3723777 3901863 3584722 3730784 3660148
8749 3660148 3547480 3464646 3660023 3828879 3797111 3634379 3587215 3847239 3870406 3643014
8739 3643014 3705093 3747069 3657768 3937694 3828511 3846826 3675411 3647026 3746371 3853953 3681314
8728 3681314 3572811 3445702 3540611 3865102 3981600 3858043 3824360 4029317 3931002 3875985
8718 3875985 4032110 4128885 4057885 3818471 3964435 4110662 3848146 3967425 3996076 3950399
8708 3950399 4103687 4307205 3952095 3938770 4220295 3837965 3876312 4206225 4088508 3899998
8698 3899998 4090131 4137729 4315661 4085376 4043435 4069470 4200329 4402300 4446410 4616700
8688 4616700 4323158 4283193 4457220 4731016 4577002 4319493 4513459 4579366 4593862 4496381
8678 4496381 4674225 4709691 4646806 4855336 4936705 5083469 5075599 4807856 4935984 5227659
8668 5227659 5124371 5043209 5072046 4936141 5032552 5013855 4803489 4873426 4851592 4984998 4926935
8657 4926935 4850539 5063290 4924852 5092758 5125877 5235921 5372668 5222345 5303426 5629869
8647 5629869 5869503 5804715 5416830 5439106 5736063 5414446 5421108 5548479 5407034 5402675 5415757
8636 5415757 5399880 5727438 5809424 5751414 5651199 5632283 5827986 5930449 5802433 5695233
8626 5695233 5794462 6110116 6047596 6170255 6199358 6153867 6017488 5766998 5587887 5765863
8616 5765863 5949041 5927972 5894971 5964750 6080813 5940172 5796191 5793163 5945917 6088591
8606 6088591 6135303 6325843 6359247 6107145 5859011 5763069 5911449 5829825 5899466 6298100
8596 6298100 6305204 6335776 6486616 6397213 6537218 6540011 6454010 6331585 6413156 6536946 6732929
8585 6732929 7145283 6717731 6498228 6672829 6874965 7096967 6665469 6979130 7024572 6751414
8575 6751414 6928720 6907425 6875941 6925183 6776640 7139897 7304673 7119757 7062054 6931471
8565 6931471 7075250 7180616 7274662 7478577 7486367 7417517 7494697 7880211 7695063 7600734 7511340
8554 7511340 7595952 7710514 7790248 8080076 8310057 8234737 8236545 8255702 8394189 8896946 8870584
8543 8870584 8943653 9098439 8969524 9158018 9150160 9163899 9252812 9231394 9429452 9597198 9633002
8532 9633002 9940688 10105162 10178840 10344215 10444691 10699910 10698494 10920427 11247992 11510733
8522 11510733 11795843 11797146 11726964 11864327 11979207 12208958 12596897 12953832 13341364 13653193
8512 13653193 13939865 14071771 14630482 15311263 15813671 16549909 16852817 17696823 18305607
8503 18305607 19005842 19576523 20420394 21191557 21988533 23011071 24078340 25265897 26633749
8494 26633749 27981462 29421077 30528538 31572190 32856409 33479636 33832756 33994412 33523841
8485 33523841 32397513 31226888 29963541 28933558 28215848 26950883 25987485 25549369 24880361
8476 24880361 24363870 23941924 23539502 23039901 22874380 22705770 22593243 22754279 22713119 22722975
8466 22722975 22653134 22927918 23253775 23579635 24099172 24618152 25013649 25682911 26249520 26796190
8456 26796190 27442642 28286153 29232419 30211731 31443544 32725432 34126976 35291497 36617675
8447 36617675 38126877 39810723 41216831 42502652 44134984 45474858 46270957 46853288
8439 46853288 47050978 47120142 46890242 46851951 46400302 46165627 45955731 46223832 46477504 46907120
8429 46907120 47545846 48239947 49225498 49928172 50767939 51722941 52542136 53338418 53711875
8420 53711875 53504916 53274857 52917112 52676374 52040449 51489438 51182472 51093720 51127616 51449701
8410 51449701 51973238 52555922 53484009 54718394 55996223 57201796 58406538 59588551 60607242
8401 60607242 61158776 61219154 60930698 60408716 59632944 58675615 57494345 56347098 55430539
8392 55430539 54696501 54359011 54261871 54403504 54615008 54769661 55195954 55495431 55809198 56077697
8382 56077697 55645529 54956013 53734724 52071217 50458123 48512948 46655589 44614866
8374 44614866 42437492 40365053 38595684 37218290 35955687 34650665 33375092 32247889
8366 32247889 31210229 30118496 29460249 28718713 28116194 27582863 27132832 26809201 26532094
8357 26532094 25956366 25545217 25660764 25401621 25477427 25310969 25019679 25229419 25206348 25280949
8347 25280949 25642664 25738264 26002685 26146114 26254942 26530738 27239652 27642591 28233364 28622202
8337 28622202 29194228 30148691 30922709 31866153 32631380 33688947 34852315 35932403 37321839
8328 37321839 38744637 40323284 41799626 43484198 45660592 47801754 49860706 52036705
8320 52036705 53708289 55425616 57386999 58976620 60233131 61380614 61986901 62475510
8312 62475510 62895690 63113531 63645089 63949182 64270496 64234991 63717119 63277665 62393475 61291299
8302 61291299 59925464 58461747 56932309 55276229 53791368 52398536 51226067 50050534
8294 50050534 49152344 48501223 48255446 47998135 48040519 48110262 48256994 48667200 49388250 50335988
8284 50335988 51298028 52286930 53630101 55316062 56782005 58383037 60053777 61577168
8276 61577168 62759646 63939076 64874200 65213281 65625415 66282807 66227747 66372593 66389807
8267 66389807 65720531 65376391 65050017 64537780 63742601 62438598 61075689 59432447 57229834
8258 57229834 54833123 52272217 49663117 47351054 45388908 43256837 41550571 40089303
8250 40089303 38586014 37202088 36001861 34604669 33797478 33150403 32373619 31996531 31199210
8241 31199210 30457956 30368337 29833811 29226671 29207754 29369931 29056054 28671514 28510447 28930133
8231 28930133 29081557 29233831 29318817 29477311 29446211 29690999 30065139 30126197 30365345 30870053
8221 30870053 31410386 31771955 32223774 33054959 34082991 34586085 35421507 36451249 37454027
8212 37454027 38432045 39607256 40785505 41643535 42459477 43133225 43323191 43710577 43760048
8203 43760048 43602759 43333725 43382147 43294820 43199121 42909965 42952634 42690630 42621840 41680323
8193 41680323 41968011 40018868 37251340 37360630 36820374 36463157 36134395 36003753 35834045
8184 35834045 36398663 36571252 36743085 37387484 37954013 38408633 39006742 40122415 41552999
8175 41552999 42649726 43933772 45550537 47231042 49300354 51271406 52478275 54052213
8167 54052213 55102221 55930272 56554075 57219106 56930804 56499126 56443558 55789915 55034224
8158 55034224 54440581 54013135 52915187 52250067 51319091 49788117 47810371 45981506 44505096
8149 44505096 42648694 40637209 38747435 37241518 35874147 34597187 33593449 32528307
8141 32528307 31687304 30936506 30472082 30199214 29641531 29498361 29380555 29502675 29816994
8132 29816994 29895942 30297891 30992367 31383408 31736692 32180977 32310105 32046750 32254909 31954196
8122 31954196 31755222 31553938 31105094 30711490 30200650 29816537 29219022 28848737 28278880
8113 28278880 27638474 26710410 25908839 24730114 23710717 22688941 21781273 20915757 20064302
8104 20064302 19082204 18301178 17533785 17315289 17000464 16553569 16107473 15511144 15145418
8095 15145418 14837982 14552790 14193606 13756769 13655306 13735846 13393332 13182664 13206094 13059303
8085 13059303 12973774 12702375 12300626 12079779 12000183 11928316 11814424 11429064 11181944 10758047
8075 10758047 10508901 10575214 10407227 10257368 10134562 10048456 9801571 9963719 9746456 9633372
8065 9633372 9422227 9450273 9191896 9291981 9567470 9372418 9583230 9532845 9609421 9743784
8055 9743784 10016155 10116931 9985966 9877150 9797473 9782158 9590922 9562539 9428518 9498510
8045 9498510 9336135 9161198 9034167 8796636 8639993 8860159 8495789 8474281 8283836 7864414
8035 7864414 7822922 7544224 7277254 7181872 6965067 6841552 6639126 6462388 6050342 6148737
8025 6148737 6138034 5909535 5883238 5585905 5760410 5804901 5716745 5871416 6076005 5701336
8015 5701336 5704149 5588748 5801212 5809193 5823794 5760674 5652425 5437330 5327265 5247415 4976589
8004 4976589 5114925 4885128 4733226 4700491 4786600 4701028 4564274 4281150 4318768 4161161
7994 4161161 3841300 3901559 3674771 3662570 3613611 3592804 3203567 3068083 2953021 2895373
7984 2895373 2922580 2729568 2705958 2668865 2716383 2378919 2402146 2390374 2280950 2271224 2470342
7973 2470342 2157267 2053854 2274569 2184184 2333380 2073352 2064342 2044623 1973650 1960616 1848344
7962 1848344 1635139 1633206 1890581 2004533 1890316 1893772 2058981 1865513 1776633 1877353
7952 1877353 1720625 1753119 1773406 1846189 1727334 1627911 1582047 1624005 1578008 1599905 1831191
7941 1831191 1800845 1668209 1582960 1718444 1786527 1718993 1685731 1559364 1499073 1380307 1422576
7930 1422576 1421884 1266945 1291671 1474092 1587970 1352472 1459537 1482266 1484443 1294566 1418583
7919 1418583 1462652 1331482 1474998 1590310 1432480 1398632 1354792 1314850 1229718 1424767
7909 1424767 1356132 1184020 1225823 1364370 1521605 1456150 1399499 1128506 1253379 1281269
7899 1281269 1388547 1343946 1497442 1573668 1567053 1397716 1441630 1226126 964735 924028 1040699
7888 1040699 1109616 1233765 1156516 1052920 960532 1083451 1250596 997738 893655 949511
7878 949511 1015353 1098217 973360 798531 943606 1014809 1264344 986184 765416 968697
7868 968697 736873 871381 914023 863035 952243 923805 1171239 1028627 1133768 960684
7858 960684 1035796 1029433 1119524 1192602 955807 1088320 1285438 1162540 1166813 1268829 1150613
7847 1150613 1378881 1182484 1225455 1319631 1310292 1278008 1094239 1143810 1228310 1246888 1245516
7836 1245516 1221835 1039937 1111990 1150384 1194491 1425839 1588021 1516431 1699502 1812755
7826 1812755 1475367 1307140 1480979 1663252 1727781 1614021 1410011 1291989 1450167 1508095
7816 1508095 1378713 1332840 1313636 1506958 1749848 1763111 1609235 1698632 1665693 1680730 1789350
7805 1789350 1682089 1580929 1573631 1653924 1891249 1682368 1659603 1645824 1553970 1604416 1647440
7794 1647440 1846060 1647757 1619614 1509995 1437064 1522373 1524574 1646885 1631316 1522152 1514436
7783 1514436 1346358 1187974 966409 919528 996471 1139234 974033 866075 896757 1068290
7773 1068290 1255994 1082020 928864 1150209 1110894 1009447 900904 939842 1181181 975081
7763 975081 1085853 1092898 748308 979407 993973 833950 1013343 937486 1211554 1291211 854704
7752 854704 642126 671553 802820 788106 419592 449714 820777 1257029 1337047 1144208
7742 1144208 913326 989020 1083131 687294 808742 839088 839469 1010447 946440 687841 777861
7731 777861 865461 723510 651523 754828 726600 602131 713191 747771 937617 939369 1303171
7720 1303171 1254340 1155455 901995 319910 478241 719846 909364 978944 946714 1025437
7710 1025437 832912 592813 640271 827316 930292 771211 832517 629645 642940 855579
7700 855579 829990 722424 560226 588748 650003 651729 416609 460377 576210 606557 648279
7689 648279 670180 499249 560499 545073 616204 728673 863296 692448 617331 603606 597986
7678 597986 667747 717492 772991 584193 699161 521519 589780 889066 853859 775414 824246
7667 824246 665501 494925 694165 666629 655943 760933 519081 727844 826064 546783
7657 546783 774817 758302 810270 537019 630165 786795 705471 491780 630615 582360 615741
7646 615741 690346 580587 566716 490009 594293 593586 764946 685181 722463 984096 753275
7635 753275 658250 685614 699509 679430 484216 423412 730045 750188 632485 719625 614876
7624 614876 860866 873264 844631 761822 920174 710085 841968 690232 403776 388557
7614 388557 507203 386074 550823 598092 503082 730758 726423 888816 852058 784736 909523
7603 909523 909246 846323 855354 1219926 1103287 1010095 876129 1123878 1010383 909664 819404
7592 819404 827086 959491 882300 894236 874966 886459 771695 880462 740334 894069 688932
7581 688932 685772 610722 405389 561162 802719 619658 460763 647148 628528 641159 621553
7570 621553 533733 436999 569321 929447 1033567 889621 612817 639474 621833 480610
7560 480610 556189 804159 983457 896659 853814 737137 659036 584581 757572 622811 637421
7549 637421 809510 646375 596287 721124 954036 993059 776578 709220 826779 603692
7539 603692 706433 742088 695027 737537 904757 718981 760839 1067140 911987 867860 648436
7528 648436 428644 345874 632580 775947 582654 794980 707234 609680 642403 693376 717145
7517 717145 1000692 896670 620714 635693 688318 702196 1032009 977532 852433 806116 684779
7506 684779 897824 1031603 914256 1087665 1110240 975092 827546 686450 879879 727981
7496 727981 705733 592019 869735 731126 720350 728527 817623 717525 820978 912829 809279
7485 809279 985056 999718 1032234 825287 814946 828561 997556 762591 627908 771610
7475 771610 757125 788533 934781 910993 1006835 1019792 721627 697759 842253 818690 775353
7464 775353 917369 1188833 1117768 1095280 1106055 1053529 1148904 902901 985660 1198081 1048881
7453 1048881 987787 795994 901233 894930 789677 758937 928437 1023376 1018091 1063772 1025757
7442 1025757 943689 1005184 883749 816400 839736 949813 1078807 899155 748208 880119
7432 880119 1043172 674699 791578 1054921 927021 877548 994426 895225 867345 1026536
7422 1026536 1116678 1208675 1107404 836897 1036978 1146335 1154967 920675 915053 886629 975886
7411 975886 1095751 1214761 965911 809284 1030570 991087 1016142 1076598 993811 1020499 903251
7400 903251 821990 941916 805479 744823 707591 704569 887014 960970 783586 1033796 977420
7389 977420 1134940 779550 656038 872713 1184179 1219194 966714 1000047 1018792 991486
7379 991486 1030654 1093443 1093559 1097443 737884 997673 1143320 1377878 1556368 1488654 1228021
7368 1228021 1139137 1312400 1051071 1031968 978759 1159512 1183488 898875 1242097 1382890
7358 1382890 1444287 1379314 1176915 1151460 1200860 1256777 1002802 1014004 1339313 1309448 1266466
7347 1266466 1087467 1333663 1250168 1062141 1237037 1139357 1185536 1330657 1416495 1432069
7337 1432069 1338136 1059426 1105632 1217006 1229343 1286022 1283369 1354058 1625566 1307168 1144805
7326 1144805 1102372 1314665 1189259 987482 1252400 1433759 1510982 1147349 1264272 1206796
7316 1206796 1316378 1221159 1195589 1279411 1033368 1074323 1241235 1454272 1200137 1116680
7306 1116680 1363080 1290563 1432551 1259616 1401114 1439515 1233827 1196439 1342892 1359476
7296 1359476 1492785 1707393 1425780 1316445 1662573 1627944 1420262 1563230 1554833 1843311
7286 1843311 1694719 1535824 1451998 1480647 1209293 1205852 1346007 1288824 1527723 1734755
7276 1734755 1825477 1534710 1566622 1563866 1436533 1422209 1294030 1379058 1219919 1294935 1144234
7265 1144234 1107772 1381487 1353742 1349535 1305373 1322313 1314040 1267501 1251891 1267791 1159963
7254 1159963 1196280 1384723 1353891 1225508 1187085 1212259 1135835 1176530 1322128 1256939 1249117
7243 1249117 980671 1048787 1195922 906941 990002 1074518 1235720 1253036 1113417 1228923
7233 1228923 1608107 1633456 1336925 1396973 1292694 1216063 1095584 1057431 1302828 1362931
7223 1362931 1421078 1226063 1070962 1221947 1294343 1159732 1082795 1165935 1365894 1376843
7213 1376843 1378877 1280346 1379727 1211255 1301638 1253236 1361772 1321678 1347098 1370078 1099552
7202 1099552 1199128 1225608 1463306 1389364 1248966 1218258 1235183 1057474 1160217 1343775
7192 1343775 1269545 1345035 1238050 1056678 1414362 1563149 1414173 1532992 1482127 1506739
7182 1506739 1559011 1530189 1564997 1773661 1697482 1613699 1909833 1600930 1447919 1444429 1398186
7171 1398186 1437968 1237774 1500487 1385316 1574758 1585293 1542268 1604012 1523856 1511140 1330163
7160 1330163 1345062 1531809 1784484 1699482 1547618 1448259 1610857 1693517 1826487 1664638
7150 1664638 1722812 1488756 1608730 1488229 1712992 1897376 1566956 1638825 1837057 1782088
7140 1782088 1472613 1443513 1453298 1534186 1652816 1601109 1705224 1746486 1636216 1715877 1712757
7129 1712757 1784515 1730346 1485873 1320083 1349597 1264637 1565311 1625509 1529704 1644189 1404845
7118 1404845 1620328 1730578 1777888 1701518 1585987 1547208 1653824 1647480 1758101 1812056 1811648
7107 1811648 1585687 1794375 1765198 1514784 1651839 1775189 1957103 1900052 1731415 1690228
7097 1690228 1552058 1800132 2005287 1919646 1926448 1879441 1580930 1351932 1524033 1408572
7087 1408572 1365255 1534753 1568335 1569641 1510036 1674523 1601044 1529215 1836070 1999054 1830914
7076 1830914 1628599 1576401 1464645 1661200 1632855 1567192 1644950 1578660 1607049 1737036 1672205
7065 1672205 1436501 1583145 1651448 1687158 1644349 1535425 1737949 1445200 1424959 1366894
7055 1366894 1453453 1527773 1595585 1685737 1857360 1592587 1509745 1348236 1415564 1496198 1527528
7044 1527528 1606873 1709246 1860407 1822934 1351975 1466453 1623059 1678790 1769275 1938911
7034 1938911 1704773 1520079 1594463 1426918 1725305 1885698 1613151 1465727 1466595 1569283
7024 1569283 1353481 1356429 1769817 1897890 1622058 1710617 2037084 1780822 1888250 2020281
7014 2020281 1891739 1734967 1448764 1719123 1573056 1505896 1707647 1764795 1783934 1859835
7004 1859835 1758281 1596346 1631021 1452895 1383920 1474721 1690779 1498403 1792917 1739745
6994 1739745 1662209 1916944 1620415 1649314 1698548 1752535 1882647 1605709 1524287 1481212 1723685
6983 1723685 1849790 1786865 1917468 1933223 1898931 1807125 1778191 1930409 1766748 1820399 1825447
6972 1825447 1899494 1929098 1962270 1767967 1668445 1766002 1874740 1879663 1835214 1619581 1929416
6961 1929416 2067999 2121562 2022201 1768213 1701452 1931498 2033056 2136920 2181352 2277043
6951 2277043 2032702 1849988 2089644 1872256 1742906 1660529 1448685 1677627 1791870 1855736
6941 1855736 1817398 1899755 2120399 1922682 1912168 2076001 2135998 1996760 1734618 2214926
6931 2214926 2337464 1961462 1972290 1969533 1886101 1835872 1975954 1722301 1792617 1871289 1807848
6920 1807848 1482653 1737743 1898744 1761150 1914330 1787804 1812481 1786479 1691686 1763386
6910 1763386 1691091 1828037 2101230 1967089 1899196 1993893 1887432 1791165 1695981 1691404 1896159
6899 1896159 1826702 1754924 1979350 1863091 1828971 1678300 1581481 1980820 2028277 1843883
6889 1843883 1894357 1600634 1831079 2045273 1926262 1797058 1914629 2068251 1972878 1688471
6879 1688471 1718042 1960932 2008832 1980122 2149370 2256461 2119299 2085807 2360492 2212777
6869 2212777 2246989 2232470 2049755 2085536 1881733 1775836 1978748 2254116 2108517 1970997
6859 1970997 1956135 1923138 1972345 2037383 2147384 2163662 1997765 2130707 2127186 2072597 2007871
6848 2007871 2055544 1965089 2122023 2234821 2112805 2175184 2137539 1995980 1970575 1996095 2050884
6837 2050884 2137453 2152209 1745992 1816378 1963720 1807529 1902707 1928201 2082445 2391266
6827 2391266 2138297 2125959 1964300 1775164 2018802 1999798 1930274 2124031 2059604 1859930
6817 1859930 1967002 2040681 2188187 2223501 2118102 1981920 2014662 1906099 1894404 1850069
6807 1850069 1822721 2010419 2108063 2225231 2297994 2492677 2074368 1876338 1952165 1934362
6797 1934362 2098822 2083380 1823127 1946135 2199993 2211491 2539699 2268198 2348236 2549703
6787 2549703 2558534 2293300 2212488 2362713 2230159 2003760 2128926 2184679 2447146 2483848
6777 2483848 2440671 2691639 2678958 2525083 2619571 2413104 2269271 2108570 2152316 2033637
6767 2033637 2015302 2210657 2395828 2357811 2506816 2428495 2536399 2553186 2392112 2434571
6757 2434571 2530322 2695163 2680942 2283450 2374034 2699566 2555025 2539521 2429525 2443972
6747 2443972 2628289 2754633 2585534 2725108 2644222 2842515 2930457 2659249 2410824 2518934
6737 2518934 2449927 2768864 2957368 3091173 2876613 2873624 2770077 2786481 3253284 3544787
6727 3544787 3515629 3485219 3388795 3406676 3229446 3081047 3211269 3339879 3398956 3431568 3368653
6716 3368653 3357235 3168532 3297910 3296386 3363230 3422900 3371110 3200693 2977043 3130436 3164590
6705 3164590 2930216 2761420 2927638 2922905 3069160 3104521 3070130 3123598 3105145 3106671 3103489
6694 3103489 2856795 2745690 2821089 2973926 2973965 2993571 2839134 2669936 2909553 2843087 2995350
6683 2995350 2972432 2913121 2941856 2898357 2997976 2976157 3132961 3177394 3195133 3160792 3129206
6672 3129206 3337707 3654191 3543389 3541280 3669372 3470831 3416581 3529114 3476037 3355466
6662 3355466 3281589 3074666 3139579 3222177 3121135 3267856 3491620 3331170 3068178 3152300
6652 3152300 3078177 2863217 2825359 2809394 2748855 2866359 3042039 3029183 2756403 2871362
6642 2871362 2732122 2727855 2661909 2824934 2965155 2942238 2791022 2687570 2936834 2850961
6632 2850961 2989528 2861418 2717639 2604243 2674737 2782036 2767416 2648089 2540132 2787880
6622 2787880 2807522 2801122 2806487 2975103 2693854 2544487 2624779 2728703 2649820 2564567 2676584
6611 2676584 2740219 2667525 2797718 2929192 2849452 2798873 2896390 2755855 2693951 2301358 2519414
6600 2519414 2561867 2774786 2978429 2925910 3069402 3034524 3204589 2920130 2788794 2836177
6590 2836177 2872571 2742796 2528618 2510607 2768296 2664434 2684797 2622974 2655665 2904409
6580 2904409 2805067 2946102 2911228 2503559 2388252 2418811 2481991 2801361 3036246 3245745
6570 3245745 2986470 2662591 2821540 2967956 3134413 3029841 3038681 2851241 2836238 2864998
6560 2864998 2956346 2867566 2887036 3015520 2919422 2792139 2782298 2476117 2595831 2922465 2706139
6549 2706139 2674597 2861803 2860469 2842823 2767015 2758700 2753067 2764528 2786921 2718310 2566305 2856616
6537 2856616 2921592 2754933 2607634 2475004 2426501 2564626 2606443 2778390 2832600 2763536
6527 2763536 2673176 2738776 2852562 2697874 2534807 2567076 2486405 2280559 2480817 2636733
6517 2636733 2415509 2193538 2471222 2508934 2438617 2506459 2796740 2869851 2667678 2739630
6507 2739630 2619422 2703858 2687340 2648545 2494110 2507202 2545127 2508944 2937901 2834539 2607358
6496 2607358 2564295 2604529 2780906 2887429 2916475 2908708 2765956 3068081 3027906 2807869 2899251
6485 2899251 3134163 3015987 2974232 3060801 3124677 2952247 2826684 3102458 2910328 2858713
6475 2858713 3233356 3102439 2860210 2779219 2870897 3121061 3124950 3002751 3002245 2666330 2693227
6464 2693227 2741366 2701464 2726174 2915418 3093125 2954619 2768636 2635342 2892180 2935166
6454 2935166 2840625 2972674 2860292 2940277 3032905 2969265 2769459 2923923 3162885 3142190
6444 3142190 2967967 2972447 3080065 3011361 2973386 2920113 2853948 2788152 2756078 2958383 3100321
6433 3100321 2989337 3027078 2994932 3073315 3017480 3064119 3043704 2811892 2860529 3081301 2942780
6422 2942780 3100450 3384424 3399785 3400594 3324586 3100420 3106483 3150661 3194139 3216854 3087768
6411 3087768 3180638 3294400 3214973 3249679 3410610 3334448 3309649 3249003 3402826 3495413 3316438
6400 3316438 3302549 3284882 2982407 3065637 3302307 3314102 3333495 3001903 3268334 3299642 3296893
6389 3296893 3491634 3384251 3234644 3288918 3246455 3327412 3413233 3161502 3066091 3187710
6379 3187710 3165368 3181999 3220394 3474837 3477155 3191704 3349484 3437490 3391216 3525583 3407388
6368 3407388 3387264 3315447 3488815 3636470 3412981 3497293 3546275 3351010 3503013 3640650
6358 3640650 3667029 3570972 3640858 3801235 3834784 3707260 3660167 3519484 3565547 3626106 3598927
6347 3598927 3500538 3456386 3694947 3701639 3845811 3688958 3772514 3641844 3703176 3798064 3749733
6336 3749733 3665290 3837961 3760156 3380061 3437492 3589317 3577973 3482993 3612920 3774042
6326 3774042 3699932 4010077 4037660 4057747 3996140 3742773 3701329 3928033 3914773 4014389 4003105
6315 4003105 3654120 3858758 3967606 3912859 3847075 3807366 3852362 4004624 4142855 4000898
6305 4000898 4027629 3798290 3859609 3780801 3714183 4100209 4054573 3751058 3748162 3843568 4234961
6294 4234961 4325786 3982864 4124650 4318921 4420126 4164163 4076573 4413718 4370691 4357324
6284 4357324 4519034 4308460 4098587 4093429 4249037 4304798 4426845 4449030 4353241 4270075 4506350
6273 4506350 4470439 4513488 4452412 4656155 4821942 4498976 4596585 4869676 4822625 4429759
6263 4429759 4534829 4552141 4499467 4463962 4544081 4631227 4654185 4456185 4639624 4691209 4996757
6252 4996757 5036227 4840725 4845053 4890262 4838871 4926775 4750758 4584439 4856048 4891254 5292975
6241 5292975 4764007 4983148 5044869 4874403 5244070 5239664 5191281 5303054 5521873 5462153
6231 5462153 5232367 5232153 5149579 5092533 5394897 5436377 5352068 5716298 5487361 5337700 5363052
6220 5363052 5307969 5401445 5359299 5486547 5461764 5158523 5038659 5170443 5465588 5508126
6210 5508126 5327668 5388764 5528168 5152406 5468751 5657276 5417680 5171341 5284310 5610805
6200 5610805 5717300 5717956 5567934 5642083 5776786 5475702 5639167 5716153 5471034 5496245 5702794
6189 5702794 5602885 5541262 5774994 5835890 6002233 5701035 5399153 5539870 5682907 5887186
6179 5887186 5862088 6075994 6047009 5707039 5746713 5526093 5751157 5810412 6070324 6140363
6169 6140363 6247941 6001419 5896826 6088717 6015649 6086795 6170547 6338460 6522252 6541519
6159 6541519 6379773 6282566 6492076 6478944 6493310 6414986 6427857 6868155 6973704 6981810 7031544
6148 7031544 6763089 6876604 7068488 7181258 7366591 7203280 7234546 7388077 7622068 7620102
6138 7620102 7639271 7955677 8063881 7961853 8035192 8305117 8467462 8268432 8345339 8553808
6128 8553808 8461495 8926897 8992238 9030137 9183372 9485589 9559027 9810585 10225993 10432432
6118 10432432 10760069 10875839 11104077 11388020 11454108 11105577 11194604 11338129 11121699 10808190
6108 10808190 10185012 10145701 9912471 9957914 9990251 9855293 9827179 9623704 9738852 9491751
6098 9491751 9448121 9387652 9377234 9212282 8869053 8854289 8784023 8517316 8333507 8368638 8186794
6087 8186794 8304652 8438342 8550982 8573388 8471694 8397582 8394449 8530662 8546205 8280771
6077 8280771 8334416 8486857 8682783 8658751 8536771 8493520 8222696 8467439 8440738 8494269
6067 8494269 8628143 8650081 8822320 8652424 8440814 8622449 8707390 8591350 8809595 9004645
6057 9004645 8842117 8768993 8823329 9090056 9155947 9045248 9026548 9299087 9399303 9414331
6047 9414331 9476234 9426592 9503526 9428716 9474816 9558633 9593236 9586536 9478462 9693897 9631286
6036 9631286 9942358 10090456 10230167 10228918 10043829 10094667 10464220 10642937 10634427 10633634 10537225
6025 10537225 10472123 10644191 10613728 10622995 10742190 11051907 11167459 11227449 11483324 11635150
6015 11635150 11622860 11700634 11752592 11640776 11625940 11563443 11585141 11538125 11586502 11967543 12140848
6004 12140848 12169601 12283453 12519432 12568073 12725207 12794370 13001525 13161028 13243523 13303254
5994 13303254 13183334 13222519 13555853 13906867 13785447 13941466 14116862 14558725 14521956 14585931
5984 14585931 14540607 14567375 14708915 15043824 15377388 15514743 15837714 16144240 16245475 16499335
5974 16499335 16531562 16684964 16980352 17405413 17777013 18001547 18284610 18356861 18412526 18777026
5964 18777026 19051908 19459901 19899897 20227543 20358490 20871330 21458233 21914344 22252103
5955 22252103 22470225 22906449 23398827 23905452 24583359 25420363 25832248 26165319 26936156
5946 26936156 27811808 28735875 29586034 30087464 30896439 31916193 33091413 34065967 35250283
5937 35250283 36208091 37719810 39230850 40540942 42141996 43980074 45675744 46999224
5929 46999224 48893205 50951951 52877373 54284347 56142866 58111116 60140671 61836388
5921 61836388 63121712 65019785 67088850 69012196 70725334 72766639 74966582 76755058
5913 76755058 78843118 80777143 82885466 84916101 86773258 88898794 90958197 93380330
5905 93380330 95575230 98024014 100867603 103499196 106303417 109723435 113459922 117210803
5897 117210803 121052860 125070438 129115711 132788587 135457252 137457120 139135621 139852172
5889 139852172 139296292 138521574 137760978 136967215 136300222 136001849 136311723 137068115 138268739
5880 138268739 139878105 141561470 143723516 146393877 148779567 150608427 152329336 153471404
5872 153471404 153596910 152790850 151268284 149034590 146062649 143205549 139593112 136184720
5864 136184720 132845972 129650537 127419364 125733878 124190822 123224477 123092769 123200560
5856 123200560 123718118 124782941 126555014 128830145 131466846 134237951 137415359 140315796
5848 140315796 143334428 146157528 148130624 149202870 149819480 149490012 148326893 146603809
5840 146603809 144479194 141947035 139147189 136477840 133964854 131941391 130427661 129075038
5832 129075038 128117364 127946436 128137010 128372557 128696242 128919391 128962804 128283938 126907720
5823 126907720 125046155 122311662 119110096 115389670 111843946 107953187 103859885 100183073
5815 100183073 96736639 93535774 90954855 87995668 85087423 82528739 80391836 78004884
5807 78004884 76052443 73907055 71665523 69717518 67742418 65932013 64101701 62270382
5799 62270382 60219655 58222372 56539848 54744406 52832233 51162468 49313811 47727486
5791 47727486 46107289 44427270 42485322 40789268 39131386 37679003 36026616 34487283
5783 34487283 32793379 31131585 29787034 28655212 27617327 26517190 25604670 24692664
5775 24692664 23683865 23119992 22458909 21643052 20767340 20191745 19631077 18951860 18183541
5766 18183541 17909062 17708903 17252747 16889843 16505732 16177857 15691538 15583746 15338657
5757 15338657 15274657 15056753 14588948 14208980 14162982 14037679 13684272 13447964 13244026 13152132
5747 13152132 12981957 12804739 12486366 12252834 12025075 11868979 11938368 11646764 11315079 11260593
5737 11260593 11167200 11136703 11124895 10815819 10584285 10251665 10198163 10178229 10030430 10118190
5727 10118190 10040912 9961473 9823940 9632707 9518492 9494055 9335388 9201141 9170160 9050916
5717 9050916 8923356 8711722 8627821 8414468 8207046 7978144 8037419 7656376 7503084 7678901
5707 7678901 7415834 7392849 7217993 6825428 6623788 6736867 6979045 6710675 6518330 6376072
5697 6376072 6210877 5949687 5890744 6097527 6187547 5936048 5909382 6029739 5872940 5860708
5687 5860708 5526994 5409232 5702371 5654833 5479745 5292721 5302848 5431943 5429480 5360252
5677 5360252 5135391 4989442 5282694 5079815 4950377 4917817 5002668 5013889 4820094 4747346
5667 4747346 4816357 5070367 5017876 4697268 4780069 4890628 4547939 4626960 4692865 4597623 4578788
5656 4578788 4696082 4492242 4488516 4439338 4441550 4379568 4359402 4244480 4093382 4056384 4191058
5645 4191058 4208387 4435183 4489071 4632727 4365135 4279059 4334353 4376902 4511599 4270874
5635 4270874 4398016 4453730 4357564 4446953 4513847 4560981 4436647 4343707 4286150 4327766 4365669
5624 4365669 4438839 4416652 4510874 4601882 4586729 4549268 4571565 4532612 4604993 4593447 4494358
5613 4494358 4611194 4773472 4751510 4745061 4616355 4616972 4657379 4802825 5074989 4839263 4981354
5602 4981354 4996884 5088635 4822638 4803387 4756009 4913393 5033500 4705140 4553535 4812168
5592 4812168 4869400 4982869 5050283 5000394 5097990 5182761 5189782 5339464 5416266 5376553 5206253
5581 5206253 5425329 5564080 5356274 5502705 5592509 5641547 5657786 5617690 5646239 5324695
5571 5324695 5327185 5548867 5727280 5725423 5585847 5950209 5819742 5744619 6063013 6033717 5932934
5560 5932934 6046055 6416876 6599697 6596124 6628829 6681256 6570255 6646939 6737397 6949028 6994810
5549 6994810 7207112 7324535 7486663 7729270 7644031 7775209 7719217 7858675 8057933 8305545
5539 8305545 8511222 8561416 8740790 8942180 8865244 9203286 9274714 9291317 9068831 9139515
5529 9139515 9090798 8907437 8729139 8700356 8699735 8746330 8620854 8339407 8166188 8247813 8144764
5518 8144764 7814894 7732656 7569027 7455448 7251461 7317948 7370727 7653637 7338992 7064747
5508 7064747 7046251 6830384 6537626 6708775 6694858 6315963 6448536 6625369 6427128 6579449
5498 6579449 6560336 6226006 6321829 6449714 6370578 6222142 6177133 6273451 6459497 6327172
5488 6327172 6242580 6314040 6447773 6562972 6399631 6401488 6446454 6508564 6512810 6527848 6555444
5477 6555444 6466130 6631088 6891722 7065529 6791838 6674377 6723459 6632498 6604286 6795876
5467 6795876 7057412 7089638 6882793 7025849 7032167 7008465 6962792 6953284 7145555 7599153 7559858
5456 7559858 7122180 6926574 7073733 7053177 7113164 7009488 6913142 6933154 6772658 6638246
5446 6638246 6820495 6676806 6673567 6829443 6727756 6781140 6611466 6357960 6236139 6195674
5436 6195674 6085795 6329972 6375917 6166719 5988341 6134995 6246976 6516913 6348982 6409175
5426 6409175 6129042 6090211 6168348 6130023 6212333 6145011 6231959 6283275 6058401 5957618 5813643
5415 5813643 5826744 5855538 5995285 6071623 5897605 5884183 5985165 5843235 5795683 6096019
5405 6096019 6286281 6258953 6149791 5944004 5642627 5670165 5991591 5763841 5782936 5869978
5395 5869978 5855335 6094442 5750037 5806630 6302315 6248039 6102410 6372037 6147293 6576811
5385 6576811 6719751 6473081 6463209 6460410 6295069 6575058 6772632 6253056 6495967 6590022
5375 6590022 6439657 6457071 6444131 6428107 6547040 6759631 6795371 6368021 6361395 6511173 6466362
5364 6466362 6338437 6034058 6282856 6425940 6407354 6168496 6237851 6456965 6462837 6462080 6644083
5353 6644083 6673321 6592841 6578807 6590462 6517415 6548650 6556768 6761801 6831089 6917100 7131426
5342 7131426 7254225 7092160 7069189 6838492 6668403 6849950 6743292 6806060 7154609 7031262
5332 7031262 7183177 7226427 7349908 7451244 7279905 7354816 7533431 7575562 7422609 7395962
5322 7395962 7219464 7482823 7326680 7486930 7624987 7656134 7536432 7599061 7697299 7767804
5312 7767804 7873769 7995007 7918260 7924997 7560081 7704752 7917850 8079425 8218827 8258643
5302 8258643 8222996 8168922 8226122 8325409 8490015 8326332 8507335 8696221 8670406 8557398
5292 8557398 8625484 8874250 9203620 9139052 9095286 9165801 9388005 9499477 9380412 9674640
5282 9674640 9763434 9713745 9947167 9620665 9813285 9997562 10018210 10197503 10390302 10469280
5272 10469280 10393185 10582147 10654549 11037930 10974832 10851660 10849089 10725046 10796257 10883785 11046924
5261 11046924 11209299 11576016 11928691 12113487 12029051 12114036 12124117 12202927 12400965 12547125
5251 12547125 12665408 12842067 13030261 13044700 13107704 13124548 13272677 13642510 14069151 13995904
5241 13995904 13778818 14252143 14638825 14788387 14945124 15239123 15429275 15583161 15764519
5232 15764519 16145131 16124535 16238203 16642270 17024401 17292304 17519254 17566320 17758167 18258950
5222 18258950 18769285 19068352 19576821 20087258 20387347 20616312 20914124 21545630 21857295
5213 21857295 22464700 23031525 23515115 24401508 24889243 25280598 26006602 26755034 27491527
5204 27491527 28236349 28901947 29654357 30662528 31540711 32576642 33774158 34792871 35575016
5195 35575016 36808906 38116463 39549825 40888664 42322760 44131138 46174801 48034550
5187 48034550 50310918 52236133 54836359 57642418 60388129 63458400 66358077 69744331
5179 69744331 73399339 77444045 81845593 86601746 91480103 96727394 102125449 108185697
5171 108185697 114392650 120983921 127940802 135236687 142734720 150449514 158633249 166459635
5163 166459635 174050279 181184553 187715531 193712574 198528607 202105615 204296124 204970129
5155 204970129 204238064 201885345 198244465 193487478 187547866 181026618 173982865 166146209
5147 166146209 157943705 149833960 141790422 133805511 125943104 118386728 111287128 104609662
5139 104609662 98243505 92273167 86558493 81512047 76879298 72451845 68449485 64545771
5131 64545771 61128440 57828409 54961320 52265764 49531238 47398891 45170998 42906039
5123 42906039 41096436 39382344 37814340 36286345 34647981 33225136 32058729 30824341
5115 30824341 29949534 28685524 27421329 26462771 25618568 24857210 24168245 23428680 22912201
5106 22912201 22439208 21877274 21546307 20541611 19824448 19253604 18922098 18665049 18096151
5097 18096151 17928668 17583626 17216605 16643012 16313346 16079134 15646810 15475685 15214173
5088 15214173 14836745 14866042 14583173 14416097 14192129 14042828 14018467 13617594 13398258 13394434
5078 13394434 13128841 12904362 12669042 12492846 12650510 12588170 12406379 12381270 12051054 12151883
5068 12151883 12154999 11633437 11433103 11382585 11447337 11066841 11021529 10777450 10456191 10287871
5058 10287871 10175296 9780526 9748942 9771637 9724224 9361018 9351407 9369790 9259246 9105282
5048 9105282 8690638 8635963 8704057 8560274 8537535 8674967 8658499 8386566 8130702 7986597
5038 7986597 7933448 7787453 7779071 7614361 7518776 7292961 7312508 7096023 7016826 7193913 7021001
5027 7021001 7059591 7093898 6930363 6707905 6685466 6644302 6526528 6538899 6494029 6170663 6143726
5016 6143726 6291971 6325142 6273198 6572480 6556208 6366185 6160769 6235813 6301586 6360536 6529441
5005 6529441 6376248 6099737 5930774 6176215 6278641 6146079 6231496 5961331 5995835 6272576
4995 6272576 6260927 6276713 6406873 6379624 6145161 6259164 6517768 6584331 6392710 6444370
4985 6444370 6345777 6223273 6255235 6290035 6130024 6144316 6052317 5814674 6085255 6072935 6072242
4974 6072242 6394235 6336375 6089798 6321595 6162234 6015397 5870265 5950192 5974728 5995582
4964 5995582 6038103 5984667 5601348 5831944 5923197 5791685 5801258 5770902 5890180 5729934 5817527
4953 5817527 5808396 5746427 5716733 5781975 5603031 5855217 5760765 5656210 5639275 5696727 5701989
4942 5701989 5417316 5487526 5610710 5385954 5339078 5516709 5333818 5260048 5434014 5649764
4932 5649764 5444544 5650596 5761113 5530649 5446319 5614618 5463603 5107456 5091771 5222022
4922 5222022 5087981 4999324 5203829 5173279 5074059 5099474 5061435 5337995 5477962 5358221
4912 5358221 5121889 5297670 5435916 5494454 5499980 5404998 5250374 5253982 5479776 5462273 5521795
4901 5521795 5636205 5623873 5595036 5569277 5340831 5529447 5657884 5465915 5543676 5513245
4891 5513245 5578922 5591964 5285132 5271702 5350503 5643071 5689498 5722093 5824180 5677881 5833349
4880 5833349 5903932 6085347 5980973 6043273 5965209 5773121 5948881 5957753 5950892 5974468 6304593
4869 6304593 6275911 6180876 6096857 6342063 6421455 6352978 6496546 6586982 6407238 6248432 6667620
4858 6667620 6740737 6669769 6544618 6648418 6721170 6720303 6649188 6792573 7074245 6748721 6638963
4847 6638963 6790774 6780320 6946096 6834971 6672393 6748478 6449581 6530850 6820506 6651144
4837 6651144 6312765 6480791 6412203 6656707 6667556 6490761 6276603 6315477 6653828 6782148
4827 6782148 6681786 6935546 6800149 6623797 6624797 6795768 6850071 6899846 7019136 7126736
4817 7126736 7069141 7009212 6930180 7012313 7052421 7049680 7020711 7148035 7205779 7092484 7101894
4806 7101894 7030578 7242629 7295951 7563195 7621189 7619054 7750473 7748264 7920126 7738021 7831371
4795 7831371 8241698 8337556 8335932 8471755 8483030 8437057 8345219 8134684 8334904 8586128 8605839
4784 8605839 8597993 8615695 8779468 8938435 8923993 8917732 8748428 8891507 8937648 8860146 8777920
4773 8777920 9195560 9076679 8977989 9116990 8794751 8774771 9028954 9016125 8807563 8901199
4763 8901199 9106273 9105011 8867914 8829787 9260230 9368738 9274510 9192407 9241222 9370847 9546143
4752 9546143 9669616 9725790 9725437 9562044 9439189 9471560 9518155 9472264 9407644 9666273 9821559
4741 9821559 10088737 10153983 10027745 9915901 9937416 10253770 10499590 10591313 10607806 10337351
4731 10337351 10414320 10780998 10734066 10739612 10678927 10817477 11136955 11175830 11378652 11309142 11621843
4720 11621843 11813950 11803695 11669426 11748339 11970449 11956814 12017420 12189117 11687790 11981253
4710 11981253 12316312 12420994 12357561 12310267 12697510 12748027 13028021 13221589 13408568 13589841
4700 13589841 13666076 13803322 14180748 14280259 14252530 14592449 14713409 14607955 14817349 14721921
4690 14721921 14936145 14991853 14860094 15017370 15221425 15225896 15046677 14975752 14843086 14762084
4680 14762084 14921265 14924012 14956547 14943951 15101607 15035087 14809055 14622732 14820044 14425312
4670 14425312 14390483 14667751 14765369 15070239 14899868 14877978 14828062 14746012 14756247 14953597
4660 14953597 14981882 14884105 15102933 15017290 15079561 15214411 15340564 15361875 15219413 15295593
4650 15295593 15565797 15524085 15277492 15568400 15477132 15417902 15402388 15600080 15745791 16055979
4640 16055979 16253997 16137643 16128266 16108622 16084740 15777158 15917228 16071652 16139597 16093178
4630 16093178 16122980 16039955 16103009 16306486 16473757 16324213 16560112 16376521 16408886 16681617
4620 16681617 16949600 16918564 16825469 16970635 17261494 17384463 17581751 17891913 17888386 18053040
4610 18053040 18079032 18246015 18335530 18409440 18523905 18761499 19066519 19231669 19327239 19304839
4600 19304839 19745766 19970578 20211893 20404797 21040908 21243524 21347292 21459491 21657465
4591 21657465 22173619 22351123 22486826 22990917 23450168 23882045 24287064 24400985 24564453
4582 24564453 24707337 24892014 24854431 25380700 25650217 25980995 26207456 26531067 26913199 27202653
4572 27202653 27593155 28128140 28548462 28727520 29090556 29703414 29927736 30003087 30195418 30862946
4562 30862946 31274860 31462458 31865727 32399664 32911826 33516070 33961056 34381420 34839025
4553 34839025 35683416 36441101 37235681 38176935 38678556 39317978 40320164 41128373 41975674
4544 41975674 42974353 43949806 45036246 46183158 47077928 48202970 49232519 50461640 51800242
4535 51800242 52943232 54129850 55340635 56824609 58212263 59592115 61091169 62819475
4527 62819475 64567994 66662412 68651901 70254644 72775894 75015762 77098823 79450715
4519 79450715 82328273 85060654 87899484 91224715 94301964 97700108 101520153 105537599
4511 105537599 109772331 114441508 119441707 124681342 129914989 135743934 142213950 149013446
4503 149013446 156074077 163571922 171785430 180171122 188987137 198366846 208122307 218104054
4495 218104054 228498203 239395419 250785592 262225229 273919276 285877237 297274735
4488 297274735 308758276 319740466 329401969 338348900 346073570 352012206 355704132 357279224
4480 357279224 356766471 353573553 348458063 341604265 332763749 322514543 311340571 299027435
4472 299027435 286196981 273282451 260004986 246599401 233344037 220363856 208181848
4465 208181848 196936334 186109837 176128319 167162020 158438424 150554001 143544566 137457896
4457 137457896 131449781 125876059 120689053 116161257 112023246 107914380 104570064 101419358
4449 101419358 98354608 95493522 92876082 90357389 88151899 86164232 84300673 82783342
4441 82783342 81429908 80151624 78881104 77852014 77001793 76290816 75645089 75174908 74903355
4432 74903355 74367360 73979010 73586511 73324110 73137000 72580527 71941809 70911734 69730035
4423 69730035 68695924 67674859 66212744 64899125 63237194 61612556 59946391 58318813
4415 58318813 56576829 55055966 53762368 52338186 50923483 49743728 48654120 47684710
4407 47684710 46617015 45365827 44215585 43671180 42870090 41984861 40933460 40130193 39340927
4398 39340927 38518634 37817315 37395467 36917088 36232035 35938022 35731883 35186403 34775282
4389 34775282 34409445 33857338 33678483 33419068 33201090 32922206 32833746 32558177 32509799 32103237
4379 32103237 31853655 31823777 31563120 31420140 31484374 31355385 31243510 31105974 31193404 31170436
4369 31170436 31115940 31056988 31227392 31324121 31212366 31321453 31580347 31834814 31665616 31374696
4359 31374696 31624975 31573038 31733004 32030031 32106789 32395125 32710816 32913580 33136562 33333188
4349 33333188 33512493 33867391 33925657 34326265 34860423 35011936 35476898 35876615 36325291 36467803
4339 36467803 36711040 36907158 36959290 37394903 37767755 38053559 38707675 39180699 39695364 40043053
4329 40043053 40484664 41029679 41821937 42379308 42749944 43812815 44603099 45037791 45681967
4320 45681967 46783013 47711618 48573064 49541418 50700271 51593285 52868643 54181318 55405778
4311 55405778 56894105 58245188 59547321 60966020 62592962 64402083 66799877 68896010
4303 68896010 71133327 73507759 75938417 78696962 81927969 85030264 88360876 92334992
4295 92334992 96315423 100833532 105974110 111693418 117742391 124781941 132015205 139408792
4287 139408792 147720352 156295771 165066722 174747444 185576921 196844634 209269402 222635576
4279 222635576 237585984 253879034 271373300 290050462 308815246 326378522 342110808
4272 342110808 355101881 363469232 366409794 363635142 355225877 341507877 324751757 305808244
4264 305808244 286607334 268369678 251433473 236035749 222011424 209153875 196983179
4257 196983179 186101449 176157009 167427544 159847576 152919999 147185005 141921348 137642745
4249 137642745 134123774 130607601 128053009 125981476 124087681 122561293 121042388 120213473
4241 120213473 119696899 119841943 120388824 121284162 122404419 123894125 126036373 128394428 131095519
4232 131095519 134385948 138730605 143416109 148701236 154231904 160527464 167507329 174856719
4224 174856719 182861853 191540524 201093753 211273438 222246332 233848512 246933868
4217 246933868 260814521 275877794 291533093 306785461 321572824 335202898 346572668
4210 346572668 354490886 358875729 359244925 355023101 346557499 334525873 320368294 305207734
4202 305207734 289767223 274750260 260300291 246769131 233992975 221409757 209473147
4195 209473147 198297343 187352702 177013113 167556539 158453953 150109313 142255360 135000266
4187 135000266 128370458 122032551 116057598 110987179 105818971 100795212 96119831 91735025
4179 91735025 87817504 84349831 81067281 77856359 74835272 72016323 69548350 66916921
4171 66916921 64380904 62297312 60011459 57867609 56263907 54341385 52821968 51330528
4163 51330528 49909291 48441552 47038333 45730580 44875129 43566445 42516298 41499407
4155 41499407 40209394 39044383 38107646 37347849 36427798 35999143 35170162 34357319 33210292
4146 33210292 32401215 31995031 31144354 30138511 29773163 29535740 29006139 28466541 27926932
4137 27926932 27684365 27369537 26962588 26422638 26239586 25686936 25644672 25398776 25106629 24985081
4127 24985081 24622363 24389786 24059666 23842563 23361292 22942664 22956857 22461017 22064728 21846658
4117 21846658 21652224 21625179 21521728 21371980 21351590 21036327 20722987 20691153 20705153 20724256
4107 20724256 20942762 21075733 21149355 21078614 21244418 21576747 21793769 21868295 21969229 22268289
4097 22268289 22547380 22875960 23173244 23563327 23820149 23870328 24245967 24467167 24524797 24698476
4087 24698476 24941742 25300862 25265919 25140789 24853257 24722610 24653156 24589006 24702213 24744395
4077 24744395 24684889 24844263 24972723 24842320 24900397 25047415 25265418 25853616 26013966 26085643
4067 26085643 26239672 26044810 26071582 25928394 25861542 25453744 25175808 25195029 24767409 24578062
4057 24578062 24288618 24078515 24020951 23917277 23740047 23793086 23881151 23804552 23830861 23753284
4047 23753284 23679737 23757701 23971986 23994351 23913015 24288885 24374749 24569379 24655668 24523979
4037 24523979 24458539 24600572 24597884 24731879 24852456 24731063 24549565 24595241 24469941 24428204
4027 24428204 24267935 24142107 23972159 23720895 23443109 23149080 22636610 22551093 22375145 21814941
4017 21814941 21160824 21127612 20756513 20597518 20546103 20071978 19612124 19287692 19029328 18384819
4007 18384819 18240130 17898758 17493725 17207160 16776701 16295332 15855708 15561721 15411953
3998 15411953 14940748 14599154 13962612 13613667 13677409 13436769 13132377 12896329 12560547 12319675
3988 12319675 11829227 11813952 11456617 11123611 11128775 11127375 10880267 10671428 10411065 9939464
3978 9939464 9518399 9591697 9494395 9244062 9040320 8961514 8652612 8536783 8551177 8412315
3968 8412315 8266188 8055723 7998717 7788321 7567627 7566043 7470621 7273561 7140381 7142750 7056052
3957 7056052 6988137 7129741 6899368 6867891 6837169 6699454 6284007 6099544 6225600 6223649
3947 6223649 6173180 5921342 5644069 5372306 5296060 5243177 5019412 4773803 4240219 4267060
3937 4267060 4416089 4576877 4592627 4386424 4348555 4183712 3972744 3948603 3844940 3708081
3927 3708081 4015687 4004893 3875964 3724056 3674547 3747676 3539618 3378370 3301306 3400505
3917 3400505 3392429 3178786 3180563 3165050 2858685 2949163 3030604 3285906 3344821 3196778 3437470
3906 3437470 3654984 3204957 3062360 3086929 3000488 2929541 2896841 2833481 2337041 2321779 2590619
3895 2590619 2567028 2395212 2337455 2076599 1938482 1990055 2064650 1829682 1830045 1642306 1261698
3884 1261698 1348914 1570338 1546892 1503764 1322957 1193045 1165943 1213606 915426 714079
3874 714079 949726 887859 1013160 1127040 1127305 1251475 992431 1001427 1015462 1222196 1424590
3863 1424590 1398138 1374828 1465513 1486008 1108144 959652 1021200 1088139 966211 1051087 903691
3852 903691 612840 354017 407907 386127 450918 344843 349804 416612 554066 399713 348361
3841 348361 376001 253918 -15892 -121723 39189 119076 99187 -42737 116880 -180911
3831 -180911 -218053 -209862 -174003 -94189 -157849 -249811 -221007 -325783 -175058 141594 191851
3820 191851 192401 -63164 -413520 -565442 -465138 -362064 -312735 -244040 -500592 -589499 -483266
3809 -483266 -540761 -544038 -489113 -612954 -458121 -530542 -662997 -496448 -455169 -337198 -487285
3798 -487285 -423058 -442256 -601350 -717703 -490587 -285899 -429788 -758515 -539574 -354365
3788 -354365 -471490 -500069 -440685 -380816 -362246 -305511 -305485 -492876 -523363 -531444 -438863 -190631
3776 -190631 -448955 -726719 -511540 -278263 -425170 -484845 -444240 -550112 -263643 -230126
3766 -230126 -369923 -413571 -433074 -270642 -144929 84693 149588 -70187 -271838 -577882
3756 -577882 -682943 -310673 -162247 -422555 -598378 -396545 -234328 -101268 -175874 -126379
3746 -126379 -319829 -184100 -134551 -453256 -523817 -517205 -342036 -219315 -252835 -164667 -146972
3735 -146972 -293885 -171415 -117159 -148716 -369570 -275390 -271330 -378036 -33993 -92627 -139193
3724 -139193 -54301 66302 -157006 -355612 -419110 -363302 -317435 -150627 -307273 -492903
3714 -492903 -552618 -341954 -315275 -479523 -522327 -523517 -540067 -370466 -300252 -369839 -531329
3703 -531329 -721585 -704086 -358912 -489521 -597022 -334580 -233103 -296067 -415408 -84466
3693 -84466 -92491 -313217 -439085 -339353 -199474 -288231 -321267 -303483 -448167 -310594 -482672
3682 -482672 -471055 -469472 -516924 -544111 -210166 -199447 -480451 -570130 -611321 -500847 -508229
3671 -508229 -538508 -390351 -267190 -503373 -516040 -474029 -710564 -491393 -228646 -371428
3661 -371428 -219437 -395714 -593033 -504193 -750422 -943994 -957813 -787120 -836780 -853578
3651 -853578 -1000153 -1007214 -991006 -898721 -866523 -819699 -822390 -704866 -855147 -993069 -998637
3640 -998637 -789678 -552343 -514452 -843267 -854489 -736956 -661931 -659058 -723379 -597184 -689964
3629 -689964 -648671 -488728 -495490 -589685 -513421 -394436 -573812 -908595 -823001 -883433 -928445
3618 -928445 -824120 -710057 -572769 -604835 -832289 -709940 -626557 -910160 -723354 -815800
3608 -815800 -1055152 -1172209 -1239964 -951228 -812758 -444257 -477151 -903730 -1033954 -916880
3598 -916880 -718056 -680590 -945046 -882972 -858072 -964835 -977450 -847624 -763847 -629841 -642660
3587 -642660 -704976 -868456 -1225892 -1193551 -1300373 -1146898 -936265 -1002146 -910158 -970077 -938615
3576 -938615 -1144883 -1022497 -1260498 -1207860 -1119221 -941871 -1051442 -1106341 -970418 -846993
3566 -846993 -790341 -879892 -947707 -1119076 -866127 -914708 -923856 -979222 -800783 -390255 -538049
3555 -538049 -870730 -1078097 -1113143 -1070367 -721871 -533352 -676502 -900854 -928568 -921738 -1139533
3544 -1139533 -1013240 -886823 -1150224 -1065200 -1112449 -1202514 -1068615 -879209 -935475 -912622
3534 -912622 -1020058 -979372 -887037 -827305 -808710 -928735 -722081 -832741 -856244 -980874 -754904
3523 -754904 -591227 -681183 -742733 -722010 -670705 -824229 -748675 -421466 -517247 -538726 -684147
3512 -684147 -929519 -1083158 -1011509 -1014838 -696731 -750132 -745556 -558019 -433109 -685635 -915483
3501 -915483 -800373 -748411 -680703 -774092 -887185 -1034636 -1204985 -1107039 -806938 -895457 -1000427
3490 -1000427 -824676 -791065 -642630 -618076 -582904 -649233 -696589 -569023 -550152 -603626 -596781
3479 -596781 -658163 -870330 -713423 -635092 -671653 -661450 -557707 -554778 -683662 -729097 -593152
3468 -593152 -709631 -773137 -571081 -560308 -647330 -329018 -186478 -370922 -277122 -406215
3458 -406215 -364530 -403935 -354461 -465784 -436059 -480836 -506927 -492204 -470755 -330807 -316553
3447 -316553 -246991 -494443 -413183 -276940 -96553 -67563 -235078 -85955 -187407 -214132
3437 -214132 -124276 -145279 -83867 -427399 -574561 -482379 -410034 -500698 -393908 -287925 -168741
3426 -168741 -49514 31098 -64378 3544 -28060 119725 91737 -67579 -181999 -100602 -254901
3415 -254901 -192123 -117247 -191637 -83730 -209648 -350037 -251614 210727 -16974 -87619 123026
3404 123026 330153 330053 219406 291091 270413 319366 382494 265707 169120 227750 355043
3393 355043 112918 129028 50009 245915 215840 145285 68040 -34418 -78359 -125662 -126613
3382 -126613 24140 216078 278103 157345 60744 107358 26631 234259 110984 14164 148277
3371 148277 245271 275921 385405 314814 205003 270283 143733 155013 179481 204641 441903
3360 441903 384932 536520 484185 311146 313320 479699 677665 562225 475843 342410 212909
3349 212909 325967 283737 491200 551397 562997 614036 449204 592766 621749 537881 432939
3338 432939 615037 730327 685109 854047 845113 769246 808277 1031003 878617 871197 548228
3327 548228 577236 848641 746686 851211 1044560 1072322 1154424 1015704 1052381 1214054
3317 1214054 1356750 1269012 1266118 1471415 1735137 1774498 1883435 1821510 1595648 1748284
3307 1748284 1673221 1664943 1769017 1848780 1933899 1926239 1982573 2029737 1780307 1635856 1408229
3296 1408229 1342889 1683874 1900519 1774771 1715332 1706541 1767103 1565448 1487248 1550893 1478097
3285 1478097 1432095 1640982 1647910 1768698 1423254 1447083 1762380 1707161 1776588 1615368 1682343
3274 1682343 1744507 1899192 1943286 1767888 1823048 1657285 1638347 1407273 1283905 1565901
3264 1565901 1339930 1315730 1367553 1175722 950999 952007 816675 580901 778010 902639
3254 902639 995920 800949 638537 579484 610249 557671 838848 605961 545646 741881 698007
3243 698007 517705 490221 248800 196678 487242 332258 243648 505337 578920 407073
3233 407073 508168 631892 605727 869915 919104 801653 689459 654854 718172 354246
3223 354246 323797 440057 383928 522636 486747 422442 563093 571061 625290 668613 731638
3212 731638 768612 613623 479857 495298 692607 1080268 803508 849114 801099 579090
3202 579090 675872 780865 639124 797181 1057536 878600 799579 858860 682098 510685
3192 510685 777607 670424 543886 554243 719185 904827 1136636 1084091 924016 757152
3182 757152 726323 897859 1084846 1155784 1102439 1029332 896658 1200032 1244687 1425495 1459693
3171 1459693 1384544 1500131 1482073 1478444 1470879 1295180 1545642 1734429 1942836 1915617 1798749
3160 1798749 1561945 1494014 1688974 1813588 1700817 1747791 1994282 2117679 2256173 2229487
3150 2229487 1974613 2119109 2264216 2226386 2428126 2359833 2569837 2623282 2755916 2719216
3140 2719216 2511151 2550865 2669267 2901067 2938426 2892695 2938939 3080818 3215681 3526235
3130 3526235 3617678 3639841 3587448 3525493 3616257 3767105 4043402 4328438 4455153 4414233 4719012
3119 4719012 4879173 4786965 4961358 4894686 5065484 5084010 5443096 5773107 5570036 5868241
3109 5868241 6058331 6022262 6142626 6125808 6289387 6566284 6805464 7001256 6944680 7033635
3099 7033635 7488717 7626154 7978227 8263989 8348431 8568726 8998751 9269946 9510415 9564300
3089 9564300 9708484 9998096 10021784 10455173 10980670 11489138 11649108 11888933 12075725 12357661
3079 12357661 12524141 12958771 13283717 13583636 14134851 14471468 15023699 15385807 15816263
3070 15816263 16144199 16708731 17553565 18049701 18543819 19092694 19768108 20204625 21019475
3061 21019475 21448905 21920809 22543890 23368343 24100849 25082675 25910711 26474897 27345867
3052 27345867 28419287 29076799 29874798 30838429 31779618 32573635 33235311 33812319 34574118
3043 34574118 34910850 34925104 34870963 34747496 34658596 34282454 33835958 33412494 32710307 31723736
3033 31723736 31027943 30377048 29693835 28564142 27415213 26534570 25577182 24732058 23717284
3024 23717284 22905752 22171884 21170831 20142138 19378084 18765920 17861645 17331821 16802062
3015 16802062 16103084 15380950 14520500 13945732 13523468 13000517 12278138 11775738 11325512
3006 11325512 11126974 10786480 10235898 9664673 9221128 9264410 9040302 8484280 8320576 8161563
2996 8161563 7678258 7582632 7326582 7207155 6915715 6690750 6501889 6405420 6341774 6347513
2986 6347513 6316014 5780110 5402808 5376898 5475942 5303956 5185269 4959465 4803492 4618409
2976 4618409 4291010 4227027 4171222 4293656 4394693 4289953 3925809 3983947 3757086 3746049
2966 3746049 3629059 3338147 3070546 3265782 3368452 3082787 3174485 3182324 2896529 2650584
2956 2650584 2814232 2704699 2713370 2749165 2475662 2573833 2596264 2570054 2348508 2604362 2541567
2945 2541567 2475344 1935022 2030044 2070119 2200431 2356696 2329586 2378291 2307143 2191388 1753662
2934 1753662 1757494 1861864 1769958 1551471 1679457 2063139 2239030 1995062 1604022 1603175 1474438
2923 1474438 1368260 1565097 1511083 1378963 1489012 1639549 1709557 1690237 1495112 1599972
2913 1599972 1650113 1682304 1650236 1608967 1504568 1431306 1472371 1508525 1614924 1741480 1397886
2902 1397886 1312395 1189842 1362011 1244629 1123648 1179457 1327664 1352088 1352709 1392797 1487690
2891 1487690 1489330 1435228 1447558 1375819 1190624 1255427 1194726 1160012 1125088 1178812 1339094
2880 1339094 1368155 1093765 909327 975021 1215874 1175880 1201179 997185 914782 985696 1079097
2869 1079097 943086 925641 1085243 1082030 911242 1136506 983432 837019 640192 707838
2859 707838 923181 1003291 1000043 868812 947710 837356 890045 903879 997822 880147 764182
2848 764182 1138576 1123098 816891 972843 994917 1051325 939028 764944 1070091 920188
2838 920188 1089360 1335671 1187838 1246668 1333176 1467090 1320342 1401080 1433415 1474837 1194799
2827 1194799 1399859 983702 720643 798683 1030792 1112035 1056373 940769 848980 1023275
2817 1023275 1227528 1089901 1067518 1201921 1176365 1150946 1270368 1214709 1408710 1378780
2807 1378780 1280143 1077019 1488856 1756545 1511882 1490527 1271457 1181280 1326435 1396735
2797 1396735 1655117 1867019 1720026 1580474 1544428 1541529 1572901 1763223 1890272 1605468
2787 1605468 1792131 1851973 1923761 1831034 1735617 1713241 1485938 1603895 1657112 1859394 1871363
2776 1871363 1937197 2066493 2264682 2575677 2358074 2230656 2265073 2335284 2701347 2484236
2766 2484236 2800709 2836859 2726919 2631340 2813837 3015973 3000870 2993427 3061196 3357377 3463008
2755 3463008 3623159 3517731 3576594 4101191 4308755 4414684 4612564 4946913 5051525 5057062
2745 5057062 5165381 5429044 5504365 6004994 6202449 6239037 6719693 7224035 7511458 7938811
2735 7938811 8213468 8750283 9099537 9193331 9561581 10011304 10568749 11166083 11577388 12172672
2725 12172672 12417931 12804236 13101212 13330778 13547283 13995635 14140279 14221799 14723353 14996980
2715 14996980 15022885 15203432 15708762 16010636 16412242 16335832 16358735 16843208 17361640 17717052
2705 17717052 18050379 18232458 18635832 19202884 19849302 20280397 20521329 20966266 21573717
2696 21573717 21824229 22089178 22021938 21977818 21529664 20893437 20361398 19742333 18938379 18610793
2686 18610793 18074214 17368450 16840175 16360985 15884462 15467596 15136639 14905959 14380348
2677 14380348 14203546 14124614 13815065 13543353 13492490 13316294 13179184 13229614 13256834 13089215
2667 13089215 13002052 13025112 12616339 12589508 12499938 11921585 11482102 10864629 10623005 10382707
2657 10382707 9865499 9433839 9005044 8609479 7843158 7618114 7369831 7025309 6789362
2648 6789362 6536400 6575046 6291784 5792336 5641579 5090913 4826077 4832693 4678279 4527567
2638 4527567 4326935 3884566 3896570 3901115 3708386 3383665 3490129 3406106 2834537 2730957
2628 2730957 2681532 2838601 2645482 2271959 2190152 2279784 2304015 2273084 2021373 1703898
2618 1703898 1615643 1653789 1327160 1147101 1205595 1206673 959294 976493 941013 498442 733684
2607 733684 693300 751634 871663 921704 774252 864397 876108 589026 474607 291173 191219
2596 191219 136109 276090 443316 439375 418110 109879 37919 9068 19716 -19134 42306
2585 42306 220938 123444 -4487 -67692 -328076 -119467 -40818 166338 117529 -182982 -176202
2574 -176202 -128602 -97983 -324918 -174866 -135080 -147817 -377369 -592033 -339388 -330023 -494553
2563 -494553 -494754 -671801 -670665 -610341 -625301 -531773 -221476 -256555 -336143 -421716 -224979 -348417
2551 -348417 -567180 -480498 -774912 -790518 -572642 -564138 -624759 -854449 -708110 -617464 -621110
2540 -621110 -663615 -587273 -730196 -891313 -952560 -603913 -497855 -648253 -550947 -623632 -836099
2529 -836099 -760472 -958715 -1080415 -678714 -624196 -562911 -609537 -559240 -563086 -567529 -449680
2518 -449680 -516684 -489761 -627007 -892092 -848944 -856694 -1004701 -852651 -737154 -653078 -627628
2507 -627628 -725149 -931108 -989176 -1044527 -1188696 -1070110 -821336 -836907 -793551 -625666 -682979
2496 -682979 -672527 -815645 -926157 -921633 -787473 -955237 -575191 -735903 -826730 -633910
2486 -633910 -815120 -677679 -750624 -783607 -538118 -805092 -801014 -868875 -966150 -901752 -962252
2475 -962252 -1160567 -953095 -994504 -938691 -1117606 -1297964 -1266381 -1241897 -1214160 -1021831 -755948
2464 -755948 -827110 -762925 -877297 -802672 -798216 -899488 -980096 -1066690 -1016851 -899885 -1014738
2453 -1014738 -989866 -1054076 -1021471 -938472 -850675 -1125153 -986391 -919365 -766429 -839580 -842025
2442 -842025 -871404 -988159 -957199 -612777 -592847 -852980 -773429 -845174 -692579 -887000 -995389
2431 -995389 -979451 -912162 -785119 -673544 -801034 -846627 -608543 -705888 -816836 -869018 -851794
2420 -851794 -744963 -739328 -791803 -818875 -1088432 -1050654 -954936 -788367 -721810 -1136997 -1253391
2409 -1253391 -1106248 -990916 -1140898 -834662 -895722 -932019 -757430 -1083078 -915341 -830187
2399 -830187 -702832 -677611 -951162 -1045082 -907771 -555872 -555610 -741056 -687346 -882774 -957798
2388 -957798 -876567 -769688 -713413 -666171 -634145 -819893 -952864 -838427 -768857 -653381 -768478
2377 -768478 -946474 -1007613 -764521 -566137 -915753 -701287 -702702 -952917 -969138 -877277 -636883
2366 -636883 -665336 -942500 -858879 -733804 -798565 -785700 -865696 -994766 -859979 -825929 -723452
2355 -723452 -807185 -918645 -802790 -872261 -979660 -996090 -683702 -964251 -819700 -697561
2345 -697561 -852106 -1024050 -850024 -698715 -809538 -452639 -819609 -792367 -656704 -656315
2335 -656315 -781125 -614136 -487867 -818091 -982518 -929066 -1036938 -1055251 -1066795 -1020271
2325 -1020271 -719895 -913458 -1079980 -946595 -956072 -974833 -609168 -692736 -996346 -954566
2315 -954566 -1063990 -1111718 -1214446 -931484 -570008 -509702 -916869 -1093760 -1181023 -1248665
2305 -1248665 -1262302 -1150271 -840375 -825198 -793368 -803387 -902885 -1111041 -1119918 -1093915 -1082755
2294 -1082755 -862001 -747727 -633269 -996147 -755257 -707698 -1041095 -1043337 -1072950 -847406
2284 -847406 -740049 -585621 -680782 -1005152 -840320 -826120 -692866 -775282 -1013292 -915949
2274 -915949 -847050 -1070116 -1240706 -935641 -885339 -799699 -909475 -838298 -909205 -986950 -754972
2263 -754972 -936763 -1184511 -765529 -723138 -707139 -861371 -844076 -904938 -865696 -673211 -1018022
2252 -1018022 -1249059 -1207767 -887348 -837657 -826801 -859626 -730923 -698582 -630774 -1020344 -1179486
2241 -1179486 -1035655 -959210 -801721 -840822 -758897 -702774 -929986 -1059542 -511321 -456461
2231 -456461 -716319 -774422 -786485 -851621 -744664 -809495 -903733 -842952 -787072 -869594 -591787
2220 -591787 -733713 -609767 -911871 -913716 -904551 -783328 -658415 -510434 -574137 -591936 -500529
2209 -500529 -481213 -467946 -624179 -785868 -1077083 -1031890 -698890 -688150 -647222 -606354 -809734
2198 -809734 -729992 -768528 -856275 -736538 -608235 -830902 -969302 -918214 -676110 -817316
2188 -817316 -775884 -935430 -1019154 -865962 -680385 -980595 -1225527 -1159918 -778701 -752392
2178 -752392 -943516 -967935 -871428 -717924 -615089 -820581 -866982 -707856 -636901 -621088 -583942
2167 -583942 -658445 -547099 -627373 -532777 -748300 -872125 -813009 -535752 -236830 -484719
2157 -484719 -668799 -606716 -364806 -402548 -695009 -822282 -1036732 -1160556 -1047551 -767594
2147 -767594 -601534 -1009636 -955642 -843263 -780961 -946396 -823159 -832406 -812076 -735185 -860607
2136 -860607 -963491 -927935 -596532 -546191 -589121 -617081 -463876 -341148 -352352 -533341 -620114
2125 -620114 -447988 -402994 -509334 -764794 -629810 -516230 -669072 -518347 -617635 -623966
2115 -623966 -440126 -382751 -642512 -504064 -495914 -669276 -702015 -566323 -546381 -634280 -453434
2104 -453434 -333525 -371902 -499148 -642674 -598214 -555241 -383423 -712238 -972412 -946775
2094 -946775 -895416 -743895 -684546 -522155 -406474 -435100 -170569 -238902 -635352 -686689 -386044
2083 -386044 -462486 -650077 -575965 -489261 -676018 -512192 -167635 -209643 -412732 -743369
2073 -743369 -851768 -768271 -637222 -701548 -597552 -738315 -450855 -531378 -325171 -422536
2063 -422536 -504689 -508867 -254038 -378946 -645865 -889984 -645123 -620254 -646570 -407589 -460659
2052 -460659 -447274 -811833 -357104 -246389 -293028 -336640 -632606 -709686 -780738 -455685 -414191
2041 -414191 -212350 -58652 -166772 -419407 -403136 -351227 -293345 -468401 -519157 -405596
2031 -405596 -333234 -279951 -214395 -108168 -141333 -209942 -325479 -281828 -177825 -150542 -100237
2020 -100237 -44890 -261481 -127292 -144767 -369497 -380107 -358481 -611445 -370472 -95634
2010 -95634 -255381 -525707 -365288 -376180 -220953 88164 164238 -150779 -368353 -312431
2000 -312431 -413333 -255942 -167887 78402 -50821 -166450 10670 5245 172843 362933
1990 362933 334186 226190 -31478 -163437 -57604 240350 208894 174671 267241 116710
1980 116710 39302 124131 143670 255710 638840 633970 391965 378992 371934 283180 315425
1969 315425 299478 552449 761331 745385 666022 719627 564854 407796 623679 780488
1959 780488 712946 636998 671789 787477 1022918 1140655 1136744 1348531 1244501 1345999 1503788
1948 1503788 1524158 1487700 1409952 1551128 1496873 1779282 1882203 2137165 2178551 2086960 2440195
1937 2440195 2448613 2290124 2271221 2606389 2764991 2945822 3140335 3565863 3678859 3702542
1927 3702542 3854470 4214163 4539167 4807879 5191433 5471000 5702857 6284325 6720275 6986714
1917 6986714 7469294 8165267 8891995 9392106 10189757 10929651 11916473 12656966 13386582 14473021
1907 14473021 15678171 16881676 17782601 18808842 20409089 22026688 23663903 25837108
1899 25837108 27679274 29378627 30909148 32170127 33016660 33498160 33287556 32484404 30995918
1890 30995918 29196903 26968487 24937200 23066453 21358550 19518928 17800477 16708331
1882 16708331 15530098 14625524 13483906 12148745 10971840 10241348 9685639 8994529 8364677
1873 8364677 7756395 7395707 6819283 6299711 6045715 5299769 5127977 4793593 4433607 4336444
1863 4336444 4017311 3625843 3547727 3326719 3014267 2713191 2638451 2538170 2334324 2328218
1853 2328218 2280212 1783499 1642318 1676785 1345140 1089943 1276546 1131775 1082075 1150685
1843 1150685 1055994 844897 1081356 944479 827740 833262 474083 348471 620429 756522
1833 756522 733445 551981 572868 601038 610699 527778 640062 654320 361249 185493 -3514
1822 -3514 201267 94829 51759 106868 53012 -94218 65295 186012 171798 97024 54658
1811 54658 37605 89540 26435 75668 117814 32782 -276353 -385965 -269747 -242512 -335623
1800 -335623 -119755 -306138 -265170 -190035 -259045 -225185 -311430 -226537 -319245 -96658 -287762
1789 -287762 -409700 -694283 -657371 -350579 -255580 -325683 -612030 -662219 -551482 -501596 -199494
1778 -199494 -424470 -938134 -771512 -592101 -498271 -369713 -415311 -787458 -886166 -681930
1768 -681930 -329232 -250735 -336794 -475774 -509214 -510185 -500156 -593469 -396974 -646009 -655697
1757 -655697 -532729 -763971 -745875 -674872 -461797 -429079 -545247 -509594 -450587 -678684 -812353
1746 -812353 -759919 -789050 -551586 -409691 -436841 -563945 -575252 -502161 -484899 -581355 -462255
1735 -462255 -631160 -507810 -383334 -743490 -1067979 -1240367 -896508 -927474 -656219 -435243
1725 -435243 -610141 -366419 -461560 -494667 -781801 -481581 -565303 -885485 -1045405 -1120017
1715 -1120017 -1032366 -1006449 -800783 -824978 -954317 -1167883 -1193479 -1186843 -868969 -799749 -681694
1704 -681694 -675720 -661583 -536116 -486319 -824209 -862107 -786506 -581444 -353941 -429428 -626190
1693 -626190 -564881 -669222 -659252 -722606 -736723 -763966 -875773 -844301 -986464 -828041 -763604
1682 -763604 -621293 -645061 -847840 -912617 -955241 -718393 -853331 -937536 -909204 -837485 -826166
1671 -826166 -793546 -1124469 -1090811 -867855 -1046515 -952274 -892948 -866475 -821023 -712178 -741647
1660 -741647 -617222 -587667 -491082 -696196 -673387 -660347 -446863 -490337 -754594 -732318 -695464
1649 -695464 -800858 -975254 -920266 -849802 -552396 -452857 -562980 -655087 -707819 -677649 -697182
1638 -697182 -712482 -587243 -524384 -714851 -838864 -700539 -462137 -371716 -519319 -468822
1628 -468822 -662550 -707669 -860409 -643933 -426809 -527089 -425967 -584912 -686326 -729938
1618 -729938 -796737 -616701 -608300 -633496 -733253 -772659 -628052 -741890 -823052 -1252765 -1147636
1607 -1147636 -985091 -832553 -428814 -582589 -576969 -615790 -503508 -565486 -574320 -711802 -845159
1596 -845159 -676015 -531826 -516067 -601744 -603254 -684016 -753688 -694704 -876083 -886202 -742835
1585 -742835 -609993 -677641 -613815 -610023 -683602 -787075 -876091 -934170 -840907 -515330 -855743
1574 -855743 -884190 -834503 -939809 -929386 -842080 -786082 -805364 -696217 -731846 -1039552 -1049650
1563 -1049650 -807791 -637956 -618606 -644902 -521192 -668326 -788499 -726918 -812976 -680959
1553 -680959 -769778 -834906 -775501 -726789 -915420 -814757 -820890 -778816 -808948 -750631 -905447
1542 -905447 -670905 -670578 -834496 -1173876 -1197996 -897192 -681951 -717097 -826090 -861782 -824536
1531 -824536 -665048 -409184 -554259 -674155 -284203 -225119 -85566 -316775 -394846 -464507
1521 -464507 -497149 -643266 -650648 -657956 -869792 -774634 -517263 -697554 -677952 -608705 -464016
1510 -464016 -408755 -711463 -805828 -908234 -993528 -974769 -716452 -750274 -810564 -625727 -671094
1499 -671094 -646130 -608068 -660775 -692294 -715616 -646781 -549244 -854912 -1055426 -979468 -875068
1488 -875068 -800934 -823065 -727187 -848850 -1279824 -1185716 -1041184 -997140 -810467 -829122 -832321
1477 -832321 -641511 -727956 -687084 -906784 -833723 -765209 -791925 -861059 -722892 -781132 -744673
1466 -744673 -731087 -752240 -440321 -547018 -749597 -700376 -797113 -858483 -851495 -845501 -814285
1455 -814285 -820363 -935806 -1109371 -1120331 -833848 -675578 -943100 -877381 -755914 -972872
1445 -972872 -748466 -941600 -1015742 -1000000 -1013022 -900066 -934303 -890209 -947947 -815352 -909422
1434 -909422 -1000873 -1071705 -753928 -752284 -407900 -343728 -382491 -541464 -783308 -808096 -866298
1423 -866298 -831589 -765840 -697286 -781941 -1013648 -829774 -964449 -1134766 -954496 -901300 -969462
1412 -969462 -1012181 -780160 -801948 -979279 -861400 -752674 -614681 -621729 -581479 -725014 -920395
1401 -920395 -1056918 -623033 -554784 -846387 -668995 -872476 -959045 -797311 -755656 -627375
1391 -627375 -666378 -651482 -623978 -640578 -781547 -992006 -709491 -455139 -504579 -648705 -543064
1380 -543064 -587760 -729343 -926665 -783438 -883452 -491728 -298668 -300556 -455710 -600533
1370 -600533 -715890 -783570 -578263 -677742 -932627 -914194 -658401 -707946 -664624 -712614 -712126
1359 -712126 -698561 -400386 -545542 -680793 -481231 -690090 -1013979 -1073379 -976558 -713384
1349 -713384 -795896 -930118 -750438 -682548 -665150 -799827 -834943 -686357 -449147 -641037
1339 -641037 -499059 -516309 -703239 -685129 -862513 -684255 -674554 -582300 -631307 -690788 -493520
1328 -493520 -455005 -240856 -547756 -964539 -863371 -955635 -828731 -628515 -585631 -675396
1318 -675396 -730714 -581380 -610997 -826404 -1048500 -956101 -809661 -947828 -872328 -878570 -1022201
1307 -1022201 -958833 -831229 -926021 -774992 -642319 -770160 -927117 -886171 -872290 -888144
1297 -888144 -828523 -907161 -869689 -825274 -925731 -1018027 -916998 -794977 -871827 -920245 -866150
1286 -866150 -1089412 -764918 -726608 -704803 -522649 -400352 -422428 -612411 -606461 -616959 -807891
1275 -807891 -771432 -988042 -664444 -705250 -493256 -423264 -580995 -682336 -782150 -984729
1265 -984729 -1030268 -813482 -666987 -735661 -857688 -802532 -1054691 -615438 -791032 -693660
1255 -693660 -563741 -431596 -424274 -606215 -677374 -789667 -732163 -562521 -632622 -637646 -692183
1244 -692183 -748208 -811465 -962723 -669983 -592470 -833430 -754464 -657652 -415878 -705060 -520867
1233 -520867 -696498 -1095222 -934175 -793166 -567096 -531298 -469635 -695568 -687015 -771845 -925435
1222 -925435 -982065 -716215 -524095 -904634 -874597 -883422 -448620 -452561 -568922 -742042 -976088
1211 -976088 -768818 -746354 -855579 -802528 -858121 -811339 -761289 -849623 -1043542 -894191 -600968
1200 -600968 -575969 -579074 -410449 -405107 -594080 -871456 -927264 -673722 -716250 -530730 -838968
1189 -838968 -734499 -836832 -767396 -480123 -755827 -875436 -545369 -616607 -789520 -591605
1179 -591605 -828900 -897294 -603573 -782068 -825588 -638478 -514313 -691785 -565323 -360470
1169 -360470 -353772 -489920 -705990 -442855 -356292 -516430 -494454 -587941 -616252 -708857 -592833
1158 -592833 -560000 -737609 -849055 -582523 -411337 -657258 -696229 -582404 -544552 -423886
1148 -423886 -434877 -407107 -495129 -847869 -923836 -962120 -826150 -752237 -1015458 -1081079 -842022
1137 -842022 -681087 -576361 -677516 -681416 -691125 -716730 -493837 -647498 -678315 -740009 -928071
1126 -928071 -714547 -504239 -823292 -810028 -526926 -858581 -811620 -572222 -964875 -1030843
1116 -1030843 -650351 -816702 -684678 -412035 -505997 -576061 -474731 -597419 -615807 -742089
1106 -742089 -751509 -927823 -749241 -617659 -499760 -476168 -703698 -577938 -639798 -697832 -748668
1095 -748668 -601594 -670018 -696899 -801666 -671853 -610568 -738479 -654817 -657763 -622082 -429372
1084 -429372 -412849 -567345 -806967 -637440 -728447 -786095 -749130 -617011 -628783 -825177 -796804
1073 -796804 -916112 -853535 -769373 -579404 -516289 -368509 -768042 -754433 -675589 -823869 -895222
1062 -895222 -691616 -575620 -693594 -683175 -785192 -757713 -635087 -700781 -765225 -631435
1052 -631435 -498126 -415224 -680023 -809166 -802054 -763825 -751869 -733726 -725106 -487542 -698837
1041 -698837 -964027 -589552 -657128 -669817 -647998 -632077 -427422 -407748 -456039 -557214 -618761
1030 -618761 -540494 -736088 -1019507 -728323 -458766 -488934 -778810 -718340 -664025 -499285
1020 -499285 -430098 -713533 -555089 -686775 -669834 -579266 -680679 -548901 -614054 -805789
1010 -805789 -888339 -550168 -525850 -714362 -654717 -726388 -629694 -722376 -641554 -777252 -676064
999 -676064 -528093 -603812 -781390 -833508 -719602 -617612 -591234 -589230 -668062 -813157 -618313
988 -618313 -600059 -864181 -844011 -797631 -906069 -662813 -797328 -743791 -688551 -583533 -587475
977 -587475 -737325 -977120 -899333 -454078 -728625 -800152 -755223 -664622 -799585 -770714 -711437
966 -711437 -834483 -682679 -650290 -1019112 -778328 -701310 -817020 -579652 -550155 -602300 -868280
955 -868280 -1087389 -1051369 -724149 -670443 -582442 -411217 -507824 -770838 -923236 -756452 -613496
944 -613496 -533599 -310821 -518956 -749034 -671770 -598049 -675432 -602513 -503170 -402833 -691961
933 -691961 -412633 -427947 -464544 -485728 -467754 -535606 -647013 -742017 -641669 -387305 -582419
922 -582419 -624824 -712144 -373963 -399849 -517631 -372718 -597626 -724127 -708270 -593861 -815414
911 -815414 -762306 -500295 -399864 -377288 -279099 -235611 -397518 -433120 -542884 -701456 -666996
900 -666996 -685698 -678352 -504500 -516995 -856188 -815216 -707343 -654948 -303130 -515659 -488453
889 -488453 -359664 -144303 -269796 -375925 -442969 -569290 -693951 -797409 -731755 -514893
879 -514893 -499835 -499846 -532588 -418689 -537300 -530191 -462534 -571281 -642539 -736018 -656465 -769966
867 -769966 -687707 -813510 -786439 -567352 -188711 -419411 -543884 -497968 -553073 -564582 -618428
856 -618428 -520189 -583279 -633220 -580701 -407171 -470014 -325321 -508096 -330452 -517723 -749143
845 -749143 -651573 -548485 -429190 -495867 -572778 -843745 -788662 -694588 -468194 -569076 -749784
834 -749784 -677496 -827371 -651647 -579655 -836698 -973740 -933175 -882411 -575201 -658208 -682241
823 -682241 -516604 -506116 -439783 -480615 -856918 -691578 -706750 -698156 -429880 -809888 -898491
812 -898491 -763382 -615222 -291737 -463629 -594371 -558177 -509755 -612826 -623484 -604757 -654220
801 -654220 -468194 -672394 -620344 -438729 -367921 -584286 -606975 -729799 -603206 -432897
791 -432897 -583761 -753715 -912726 -834815 -649697 -720224 -783229 -832039 -859118 -813783 -806855
780 -806855 -829592 -579023 -504589 -382902 -482877 -627542 -504313 -600224 -666986 -621122 -435127
769 -435127 -778251 -732141 -442295 -630164 -541962 -385526 -361871 -194887 -399334 -618815
759 -618815 -535626 -669541 -613046 -568556 -450370 -536402 -588112 -664262 -871085 -826821 -893101
748 -893101 -728782 -400005 -417388 -575380 -571210 -644469 -763795 -494468 -607106 -481644 -351372
737 -351372 -601545 -613486 -791608 -850783 -576406 -834878 -788907 -375543 -396142 -519600 -482567
726 -482567 -527006 -649709 -532421 -548084 -407189 -348548 -444137 -534393 -691797 -632959 -528119
715 -528119 -553106 -728355 -696172 -528586 -372960 -547376 -617572 -549445 -641360 -506015 -183953
704 -183953 -581328 -749249 -823614 -837856 -519139 -373066 -742847 -766461 -615970 -607761 -485991
693 -485991 -438844 -391576 -575929 -585719 -862018 -830404 -1013574 -742869 -545377 -478458 -413001
682 -413001 -683453 -587153 -481396 -351819 -287568 -265660 -316626 -614731 -528159 -718388 -762534
671 -762534 -745164 -802390 -651460 -741607 -742848 -682427 -462417 -392376 -818668 -737203 -386238
660 -386238 -560356 -543065 -492926 -553873 -582098 -729038 -717084 -741276 -616460 -703528 -519662
649 -519662 -585760 -456773 -584231 -689895 -624790 -486491 -278730 -350183 -209068 -277043 -615000
638 -615000 -482656 -517822 -594053 -581327 -653210 -701643 -749974 -724020 -583382 -375996 -307123
627 -307123 -421336 -796188 -728790 -724768 -881727 -804742 -602507 -609407 -700961 -345593 -355663
616 -355663 -303496 -413322 -501063 -622855 -799782 -560610 -575760 -632798 -794098 -730273 -849569
605 -849569 -805496 -673581 -829620 -863753 -679387 -828781 -672804 -658395 -603660 -663471 -743663
594 -743663 -330371 -261634 -589838 -620083 -376818 -289879 -755896 -881835 -665857 -563897
584 -563897 -606983 -527069 -570253 -361414 -478327 -600461 -504402 -521797 -708427 -942657 -797991
573 -797991 -652555 -473548 -584220 -583905 -549244 -556840 -305097 -544562 -584573 -293919 -362907
562 -362907 -425235 -641010 -582389 -451679 -485764 -617772 -446447 -390961 -655806 -777387 -542812
551 -542812 -597139 -754396 -660261 -429934 -686969 -824435 -661219 -548861 -524500 -616380 -607548
540 -607548 -599615 -659450 -796051 -720437 -695794 -284499 -375152 -618354 -664682 -574409 -673350
529 -673350 -799639 -677079 -856808 -716215 -474643 -698951 -713955 -811850 -709781 -683974
519 -683974 -667136 -417000 -397269 -361102 -195395 -301497 -348261 -333859 -314818 -514595 -815589
508 -815589 -808180 -650315 -662405 -665482 -645697 -638766 -966062 -971844 -603934 -656556 -683259 -524462
496 -524462 -533903 -583870 -476004 -427657 -548762 -660269 -772048 -917150 -951660 -1171722 -796598
485 -796598 -642223 -718767 -608501 -309359 -608077 -432561 -495750 -842179 -735159 -749067
475 -749067 -480407 -377902 -436069 -604865 -641908 -432212 -296849 -279225 -749668 -735373 -594536
464 -594536 -626482 -638512 -598807 -671357 -699789 -714286 -641984 -595454 -639486 -458515 -401599 -376704
452 -376704 -550221 -758818 -926022 -866551 -606324 -622064 -584417 -741767 -756194 -611807 -582949
441 -582949 -339520 -31934 -296396 -161356 -364709 -552597 -516622 -471717 -465350 -722093 -645281
430 -645281 -577748 -739973 -974827 -696578 -571845 -399360 -363791 -469468 -422714 -325637 -268331
419 -268331 -409510 -512057 -322492 -352856 -553880 -532114 -348029 -577090 -465125 -529213
409 -529213 -580345 -243123 -443826 -619867 -542302 -531691 -691808 -547388 -372630 -401466 -421668
398 -421668 -517516 -681051 -628767 -488644 -332980 -339695 -621863 -375427 -581167 -874439 -681756
387 -681756 -452862 -410253 -364333 -381182 -257366 -306079 -371296 -341571 -327645 -417720 -682272
376 -682272 -742208 -512113 -393092 -483358 -555998 -321511 -404434 -334930 -431698 -524934 -451681
365 -451681 -433177 -433048 -503317 -610675 -458201 -363206 -361322 -266236 -303642 -240324 -278676 -154875
353 -154875 -572776 -520197 -294276 -436274 -519262 -634495 -462399 -655429 -571795 -452224
343 -452224 -515688 -523302 -652249 -722161 -720240 -619043 -620574 -473661 -553811 -490081 -463750 -328070
331 -328070 -286833 -299972 -297681 -304948 -669082 -627091 -683654 -661020 -422491 -491426 -343913 -477939
319 -477939 -452736 -391001 -480888 -657858 -406303 -395428 -518339 -559991 -479631 -392929 -420453
308 -420453 -454769 -553773 -431932 -640610 -745913 -599476 -558977 -417327 -582845 -672401 -557296
297 -557296 -663926 -454455 -373752 -326685 -340870 -310969 -618187 -841765 -528683 -493482 -513784
286 -513784 -429725 -490149 -695799 -822304 -615173 -552205 -332766 -223089 -270500 -183275 -238519
275 -238519 -202862 -332958 -493841 -575601 -590832 -276636 -221054 -480811 -604370 -489160 -476638
264 -476638 -541750 -564245 -503795 -308631 -188247 -239534 -225748 -433801 -671679 -376531 -317279
253 -317279 -542278 -515965 -413033 -613462 -523865 -250309 -483878 -575185 -409667 -248425
243 -248425 -382298 -514532 -492202 -411033 -322601 -218108 -291409 -263275 -421366 -656324 -429338
232 -429338 -489436 -256313 -495116 -585574 -612133 -465223 -429815 -336020 -507693 -771097 -673651
221 -673651 -604831 -611684 -466572 -558930 -499018 -428017 -468360 -347888 -387386 -598117 -580066
210 -580066 -204542 -435650 -410877 -483652 -404276 -343351 -426749 -380939 -495943 -568442 -693062
199 -693062 -874523 -778145 -664462 -583414 -364930 -388154 -640938 -666024 -537341 -564474 -682711
188 -682711 -576417 -537290 -444292 -457696 -364859 -251197 -280959 -345577 -286868 -606887 -509403
177 -509403 -531469 -609968 -604978 -625540 -535577 -386148 -352742 -460144 -317665 -315060 -565616
166 -565616 -721095 -405861 -249148 -305131 -376948 -227601 -388053 -500539 -629235 -491817
156 -491817 -495178 -543785 -505450 -592064 -527931 -608981 -461791 -401384 -545562 -648612 -501135
145 -501135 -477333 -717919 -681459 -566851 -444728 -417088 -298552 -379162 -485643 -515525 -400684
134 -400684 -299797 -344986 -377913 -387501 -654876 -795761 -725690 -506672 -493515 -338671 -320340
123 -320340 -363522 -407429 -579977 -769346 -714020 -474131 -543157 -517224 -419047 -569655 -721904
112 -721904 -414592 -535137 -741815 -501024 -444774 -429266 -541534 -874963 -803885 -724390 -473028
101 -473028 -193845 -301972 -445915 -395337 -503472 -421024 -368292 -423593 -681682 -608278 -456714
90 -456714 -443995 -135340 -301171 -541584 -571527 -680473 -557545 -448330 -424846 -486683 -481610
79 -481610 -524693 -539072 -561409 -573019 -674888 -766379 -718007 -547728 -625359 -621103 -503165 -578084
67 -578084 -587058 -596220 -572527 -604089 -651003 -672725 -661025 -792037 -720772 -574035 -551189 -632664
55 -632664 -607302 -481458 -560238 -620971 -357116 -382224 -431188 -391597 -471763 -386526 -398144 -407701
43 -407701 -387619 -555041 -659361 -612623 -537737 -620229 -567242 -799697 -738525 -709922 -637148
32 -637148 -635646 -816641 -820516 -741141 -748823 -601801 -516836 -665048 -728725 -833128 -787919 -771846
20 -771846 -775769 -530535 -414253 -519039 -594020 -723488 -492018 -519594 -564020 -515893 -443497
9 -443497 -570915 -728271 -582163 -609095 -544376 -571850 -630236 -605493 -653090
0 -653090
$$ Imaginary data points
##PAGE= N=2
##DATA TABLE= (X++(I..I)), XYDATA
16383 -1833173 -1699321 -1655393 -1748258 -1617603 -1485971 -1524982 -1524376 -1490505 -1538837 -1443644 -1352736
16372 -1352736 -1371694 -1325621 -1373718 -1460836 -1381305 -1200480 -1232821 -1195882 -1079059 -1168224 -1047547
16361 -1047547 -1004270 -883632 -914474 -953158 -990842 -1098831 -1215352 -1085772 -829820 -724604
16351 -724604 -687333 -680418 -697699 -579231 -468334 -447626 -499614 -306434 -362784 -307781 -135037
16340 -135037 -209337 -137684 -269195 -198425 68090 2848 -99386 -31104 15426 -110512 -115479
16329 -115479 124188 175642 231771 292754 422732 367663 362286 358250 239238 149844 344451
16318 344451 404637 387585 596095 672483 542228 385234 320575 312316 572473 679909 474267
16307 474267 521808 540949 633263 774785 767410 777935 852552 717400 915422 1171971 1050102
16296 1050102 1052892 1110776 1110197 967563 1117816 1200435 1163419 1352118 1507544 1386309 1394616
16285 1394616 1449677 1423521 1523830 1663486 1537497 1569705 1501890 1495818 1370018 1519800
16275 1519800 1525468 1627172 1635711 1575569 1608897 1535555 1475317 1676281 1925456 1837503 1758951
16264 1758951 1763067 1981667 2080231 2111988 1976885 2103817 2175663 2146173 2428999 2134009
16254 2134009 1871268 2062512 2138319 2077478 2128042 2149077 2204729 2148846 2350318 2524962
16244 2524962 2582635 2539840 2355394 2655203 2534915 2483122 2476724 2417781 2359588 2391165 2427305
16233 2427305 2456982 2390665 2444339 2544411 2509767 2681346 2617285 2479712 2750982 2723935
16223 2723935 2719298 2780953 2884900 2858073 2952973 2632946 2447312 2695140 2596542 2687226 2718886
16212 2718886 2783837 2801634 2743693 3144723 3210987 3053986 2952577 2878219 2666724 2746563
16202 2746563 2798191 2829679 2735162 2720806 2895313 2890473 2967246 3133642 3087415 2998581 3012555
16191 3012555 3111030 3131828 3132055 3026956 2967718 3075334 2966073 2956882 3095426 3380585 3176842
16180 3176842 2902639 3290060 3409965 3415051 3483649 3251532 3070534 3196123 3190818 2915699
16170 2915699 3026978 3164371 3116384 3037074 3268187 3434760 3423014 2971761 3063344 3349873
16160 3349873 3440372 3497568 3686539 3306057 3279158 3342313 3331731 3420287 3413097 3360451 3328520
16149 3328520 3558645 3672137 3551495 3416477 3452503 3523907 3387283 3374048 3339807 3391373
16139 3391373 3568512 3754853 3856731 3899437 3839793 3540964 3651186 3667358 3450009 3625667
16129 3625667 3739148 3606877 3800013 3855012 3579259 3444226 3425248 3505930 3471819 3450404
16119 3450404 3472676 3490021 3484102 3415866 3501338 3438694 3653495 3607906 3614953 3432168 3285616
16108 3285616 3444842 3619892 3699199 3664326 3426162 3456402 3760746 3945285 3593105 3833109
16098 3833109 3530410 3483262 3516020 3545639 3899679 3655863 3624127 3857777 3916806 3756346
16088 3756346 3764164 3728241 3891080 3985787 3827784 3797373 3671015 3765838 4008380 3724245
16078 3724245 3503147 3441540 3457603 3751602 3903799 3581263 3838134 3923319 3981405 3955329
16068 3955329 3972992 3645861 3812950 4086787 3928756 4061760 3834146 3668906 3653157 3880647
16058 3880647 3955574 3823524 3791567 3637472 3651238 3476766 3571570 3725683 3797336 3855531
16048 3855531 3888266 3890836 3755409 3683737 3643816 3669105 3661112 3469173 3481180 3749331 3663034
16037 3663034 3485097 3609170 3671640 3784974 3544496 3651950 3856936 3847773 3947847 3781529
16027 3781529 3874039 3848394 3731707 3776714 3729022 3716662 3923561 3825875 3638978 3663635 3834740
16016 3834740 3906113 3914698 3870221 3947279 4006013 4063482 3983110 3970829 3828033 3629471 3853734
16005 3853734 3533750 3474999 3554227 3585568 3590632 3606116 4033368 4004697 3884796 4018680 4054507
15994 4054507 3992281 3835056 3821183 3869046 3713938 3843458 3939080 4088037 3779939 3840684
15984 3840684 3890150 3906665 3537372 3409220 3863499 3880529 3966926 3810677 3531865 3748327
15974 3748327 3924410 3644162 3583869 3667635 3486448 3564448 3698119 3840850 3884683 3839680
15964 3839680 3857303 3943773 4016952 3822093 3693456 3668656 3596279 3647211 3854956 3934499 3943704
15953 3943704 3840705 3698568 3642511 3897190 3813762 3675096 3810118 3787469 3736221 3961347
15943 3961347 3931666 3900490 3825583 3748072 3904380 3981404 3789041 3523641 3557694 3670323
15933 3670323 3769412 3675472 3849896 4037096 3844819 3883690 4094940 3949882 4054410 4109074
15923 4109074 4061287 4060192 3916208 3862215 4085931 4074893 3968243 4046421 3767029 3699669 3641232
15912 3641232 3882678 3991516 3959835 3951424 3890158 3819443 3824468 3664544 3682192 3734990 3752158
15901 3752158 3647300 3435488 3692596 3879615 3774196 3653704 3661317 3866290 3855346 3620141
15891 3620141 3576183 3681997 3522841 3568433 3941795 3700553 3902715 3850288 3764936 3743809
15881 3743809 3452040 3588066 3666793 3994582 4040737 4027076 3757544 3614144 3787368 3983950
15871 3983950 3802012 3830539 3871969 3803395 3633034 3746534 3836333 3859046 3984231 4039059
15861 4039059 3965367 3949683 4009830 3697981 3812886 3578428 3730887 3803012 4031155 4019542
15851 4019542 3902625 4041078 3816547 3793092 3691635 3843578 3934418 3655462 3716978 3972263
15841 3972263 3994553 3995462 4114343 4021998 3902178 3751392 3645586 3633868 3571461 3630484 3879595
$$ [...]
##END NTUPLES=NMR SPECTRUM
##END=
