##TITLE=1H_DE-80H_X3
 200.13MHz, d2o
 8 sc
 
 19ns.26.2.2025
##JCAMPDX= 6.0         $$ Bruker NMR JCAMP-DX V2.0
##DATA TYPE= NMR SPECTRUM
##DATA CLASS= NTUPLES
##ORIGIN= UXNMR, Bruker Analytische Messtechnik GmbH
##OWNER= pz
$$ XWIN-NMR		Version 3.5
$$ Fri Oct 10 10:26:24 2025 Russian Standard Time (UT+4h)  Yarkov@DPX200
##.OBSERVE FREQUENCY= 200.1313
##.OBSERVE NUCLEUS= ^1H
##.ACQUISITION MODE= SIMULTANEOUS
##.ACQUISITION SCHEME= undefined
##.AVERAGES= 8
##.DIGITISER RES= 18
##SPECTROMETER/DATA SYSTEM= spect
##.PULSE SEQUENCE= zg30
##.SOLVENT NAME= CDCl3
##.SHIFT REFERENCE= (INTERNAL, CDCl3, 0, 15.4836)
##AUDIT TRAIL= $$ (NUMBER, WHEN, WHO, WHERE, WHAT)
$$ ##TITLE= Audit trail, XWIN-NMR		Version 3.5
$$ ##JCAMPDX= 5.01
$$ ##ORIGIN= Bruker BioSpin GmbH
$$ ##OWNER= Yarkov
$$ C:/Bruker/XWIN-NMR/data/yarkov2/nmr/H-C/1/pdata/1/auditp.txt
$$ ##AUDIT TRAIL=  $$ (NUMBER, WHEN, WHO, WHERE, WHAT)
(   1,<2025-10-10 10:25:28.71 +0400>,<Yarkov>,<DPX200>,
      <created by zg, POWCHK disabled, PULCHK disabled
       configuration hash MD5:
       00 E9 B6 7A A2 85 ED C7 34 08 36 98 17 FE 4E 26
       data hash MD5: 16K
       57 77 CE 78 7B 1C 74 97 AA 2B 2A E4 99 3C 52 F9>)
(   2,<2025-10-10 10:25:32.06 +0400>,<Yarkov>,<DPX200>,
      <Start of raw data processing
       efp BC_mod = 2 LB = 0.25 FT_mod = 6 PKNL = 1 PHC0 = -2636.563 PHC1 = 8.79097 SI = 16K 
       data hash MD5: 16K
       11 AB 75 C3 B1 FE 68 43 F0 80 CB 7D 55 5E 57 4A>)
(   3,<2025-10-10 10:25:38.26 +0400>,<Yarkov>,<DPX200>,
      <abs ABSG = 5 
       data hash MD5: 16K
       BE 69 E1 9F E3 AD 55 0D 40 32 F9 B7 19 77 3C A5>)
$$ ##END=
$$ 
$$ hash MD5
$$ FE B7 84 7E 20 41 1D 68 00 D3 2B A8 D2 60 5F E5
##$RELAX= 
##$RELAX= 
##$RELAX= 
##$RELAX= 
##$RELAX= 
##$RELAX= 
$$ Bruker specific parameters
$$ --------------------------
##$DU= <C:/Bruker/XWIN-NMR>
##$EXPNO= 1
##$NAME= <H-C>
##$PROCNO= 1
##$TYPE= <nmr>
##$USER= <yarkov2>
##$AMP= (0..31)
100 100 100 100 100 100 100 100 100 100 100 100 100 100 100 100 100 100 
100 100 100 100 100 100 100 100 100 100 100 100 100 100 
##$AQSEQ= 0
##$AQ_mod= 1
##$AUNM= <au_zg>
##$AUTOPOS= <>
##$BF1= 200.13
##$BF2= 200.13
##$BF3= 200.13
##$BF4= 200.13
##$BF5= 200.13
##$BF6= 200.13
##$BF7= 200.13
##$BF8= 200.13
##$BYTORDA= 1
##$CFDGTYP= 0
##$CFRGTYP= 5
##$CHEMSTR= <none>
##$CNST= (0..31)
1 1 145 1 1 1 1 1 1 1 1 1 1 1 1 1 1 1 1 1 1 1 1 1 1 1 1 1 1 1 1 1 
##$CPDPRG= <>
##$CPDPRG1= <>
##$CPDPRG2= <>
##$CPDPRG3= <>
##$CPDPRG4= <mlev>
##$CPDPRG5= <mlev>
##$CPDPRG6= <mlev>
##$CPDPRG7= <mlev>
##$CPDPRG8= <mlev>
##$CPDPRGB= <>
##$CPDPRGT= <>
##$D= (0..31)
0 0.7 0 0 0 0 0 0 0 0 0 0.03 0 0 0 0 0 0 0 0 0 0 0 0 0 0 0 0 0 0 0 0 
##$DATE= 1760077528
##$DBL= (0..7)
120 120 120 120 120 120 120 120 
##$DBP= (0..7)
150 150 150 150 150 150 150 150 
##$DBP07= 0
##$DBPNAM0= <>
##$DBPNAM1= <>
##$DBPNAM2= <>
##$DBPNAM3= <>
##$DBPNAM4= <>
##$DBPNAM5= <>
##$DBPNAM6= <>
##$DBPNAM7= <>
##$DBPOAL= (0..7)
0.5 0.5 0.5 0.5 0.5 0.5 0.5 0.5 
##$DBPOFFS= (0..7)
0 0 0 0 0 0 0 0 
##$DE= 6
$$ [...]
##$SUBNAM3= <"">
##$SUBNAM4= <"">
##$SUBNAM5= <"">
##$SUBNAM6= <"">
##$SUBNAM7= <"">
##$SUBNAM8= <"">
##$SUBNAM9= <"">
##$SW= 18.0517328524113
##$SWIBOX= (0..15)
0 0 2 0 0 0 0 0 0 0 0 0 0 0 0 0 
##$SW_h= 3612.71676300578
##$TD= 16384
##$TD0= 1
##$TE= 0
##$TE2= 300
##$TE3= 300
##$TEG= 300
##$TL= (0..7)
0 120 120 120 120 120 120 120 
##$TP= (0..7)
150 150 150 150 150 150 150 150 
##$TP07= 0
##$TPNAME0= <>
##$TPNAME1= <>
##$TPNAME2= <>
##$TPNAME3= <>
##$TPNAME4= <>
##$TPNAME5= <>
##$TPNAME6= <>
##$TPNAME7= <>
##$TPOAL= (0..7)
0.5 0.5 0.5 0.5 0.5 0.5 0.5 0.5 
##$TPOFFS= (0..7)
0 0 0 0 0 0 0 0 
##$TUNHIN= 0
##$TUNHOUT= 0
##$TUNXOUT= 0
##$USERA1= <user>
##$USERA2= <user>
##$USERA3= <user>
##$USERA4= <user>
##$USERA5= <user>
##$V9= 5
##$VALIST= <valist>
##$VCLIST= <CCCCCCCCCCCCCCC>
##$VD= 0
##$VDLIST= <DDDDDDDDDDDDDDD>
##$VPLIST= <PPPPPPPPPPPPPPP>
##$VTLIST= <TTTTTTTTTTTTTTT>
##$WBST= 1024
##$WBSW= 4
##$XGAIN= (0..3)
0 0 0 0 
##$XL= 0
##$YL= 0
##$YMAX_a= 325735
##$YMIN_a= -527321
##$ZGOPTNS= <>
##$ZL1= 120
##$ZL2= 120
##$ZL3= 120
##$ZL4= 120
##$ABSF1= 15.51221
##$ABSF2= -2.539639
##$ABSG= 5
##$ABSL= 3
##$ALPHA= 0
##$AQORDER= 0
##$ASSFAC= 0
##$ASSFACI= 0
##$ASSFACX= 0
##$ASSWID= 0
##$AUNMP= <proc_1d>
##$AZFE= 0.1
##$AZFW= 0.1
##$BCFW= 0
##$BC_mod= 2
##$BYTORDP= 0
##$COROFFS= 0
##$CY= -3
##$DATMOD= 1
##$DC= 0
##$DFILT= <>
##$DTYPP= 0
##$F1P= 0
##$F2P= 0
##$FCOR= 1
##$FTSIZE= 16384
##$FT_mod= 6
##$GAMMA= 0
##$GB= 0
##$INTBC= 1
##$INTSCL= 3.241238e-09
##$ISEN= 128
##$LB= 0.25
##$LEV0= 0
##$LPBIN= 0
##$MAXI= 10000
##$MC2= 0
##$MEAN= 0
##$ME_mod= 0
##$MI= 1.114404
##$NCOEF= 0
##$NC_proc= -6
##$NLEV= 6
##$NOISF1= 3.799351
##$NOISF2= 2.8
##$NSP= 0
##$NTH_PI= 0
##$NZP= 0
##$OFFSET= 15.48356
##$PC= 1
##$PHC0= -2636.563
##$PHC1= 8.79097
##$PH_mod= 1
##$PKNL= yes
##$PPARMOD= 0
##$PSCAL= 0
##$PSIGN= 0
##$REVERSE= no
##$SF= 200.130007634038
##$SI= 16384
##$SIGF1= 3
##$SIGF2= 2
##$SINO= 0.751879
##$SIOLD= 32768
##$SREGLST= <19F.Aceton>
##$SSB= 0
##$STSI= 16384
##$STSR= 0
##$SW_p= 3612.71676300578
##$SYMM= 0
##$S_DEV= 0
##$TDeff= 16384
##$TDoff= 0
##$TI= <>
##$TILT= no
##$TM1= 0
##$TM2= 0
##$TOPLEV= 0
##$USERP1= <user>
##$USERP2= <user>
##$USERP3= <user>
##$USERP4= <user>
##$USERP5= <user>
##$WDW= 1
##$XDIM= 16384
##$YMAX_p= 374576841
##$YMIN_p= -429235
$$ End of Bruker specific parameters
$$ ---------------------------------
##NTUPLES= NMR SPECTRUM
##VAR_NAME=  FREQUENCY,     SPECTRUM/REAL,   SPECTRUM/IMAG
##SYMBOL=    X,             R,               I
##VAR_TYPE=  INDEPENDENT,   DEPENDENT,       DEPENDENT
##VAR_FORM=  AFFN,          ASDF,            ASDF
##VAR_DIM=   16384,         16384,           16384
##UNITS=     HZ,            ARBITRARY UNITS, ARBITRARY UNITS
##FACTOR=    0.220516191357247, 1,           1
##FIRST=     3098.72490264308, 0,            0
##LAST=      -513.991860362703, 0,           0
##MIN=       -513.991860362703, -429235,     0
##MAX=       3098.72490264308, 374576841,    0
$$ Real data points
##PAGE= N=1
##DATA TABLE= (X++(R..R)), XYDATA
$$ [...]
9955 86121 -39845 -89383 -37164 2997 18484 176356 37523 -44263 111637 108748 83780
9944 83780 156908 172247 111929 140939 111629 -5758 31565 63852 91146 145021 203508 117920
9932 117920 196609 116748 118225 30108 91307 -14879 -25285 143622 206636 171999 146696
9921 146696 205659 47263 85971 162892 48550 -76737 2669 9156 55284 -102245 -63114
9910 -63114 97658 131106 171096 84322 57004 137428 223432 251302 136843 67055 -8867
9899 -8867 14799 34160 64788 21075 67464 15256 -4197 -9083 3917 120291 275087 221106
9887 221106 66259 106108 166672 56046 34209 93457 122500 73723 66675 94099 125322
9876 125322 86921 127482 129554 106735 137815 41904 83778 28853 90065 83898 -14960 16904
9864 16904 40740 140298 80388 83473 84614 29506 66946 11061 82044 28110 81320 146862
9852 146862 36560 99917 78200 77255 113603 181391 154987 118482 92107 169605 245584 70566
9840 70566 71214 -75480 39419 58452 -70173 -14021 78870 217393 84108 39652 54924
9829 54924 160986 137209 86475 108584 186768 115435 36052 23653 10901 -69119 -211707
9818 -211707 -168373 -104994 -24584 -10211 -122712 -79808 -64306 1995 39269 53407 103430
9807 103430 -27225 -34845 -53026 -55472 -18289 28932 48427 54235 57126 22354 52414 9097
9795 9097 -15229 -16918 -217510 -204118 -179151 -157501 23375 91671 160444 60134 79006 -23551
9783 -23551 87522 150096 47344 11318 -89934 -41842 44306 84448 -83519 -59142 -111558
9772 -111558 -113771 38065 -23538 -161212 -118185 -92501 -96734 9791 -46389 68145 66028
9761 66028 5539 30130 38708 14443 -128532 -4651 40869 -9743 -39740 -19116 20016 88662
9749 88662 35447 23443 -28865 72312 13233 -43855 -176588 -108664 -11541 97738 195066
9738 195066 84590 122597 46779 -62703 15147 15903 -93647 -107407 -138448 -51119 -109912
9727 -109912 4435 120496 1393 -46921 -75229 -68635 -160404 -119586 -2503 88897 15145
9716 15145 -41802 -85599 -86838 -22100 -28412 -61162 -136463 -15892 124743 12080 8108 -82849
9704 -82849 -1683 2220 -38343 -85718 -126897 36992 21717 119101 102063 117673 218038 285907
9692 285907 153801 61541 1936 97726 177013 -1434 42786 81974 81968 201215 184884 59045
9680 59045 9977 116659 -38169 -11591 88306 129644 158207 163045 128424 213305 122121 68476
9668 68476 15243 69750 178157 76817 65309 105169 65053 108227 138609 101653 59312
9657 59312 22064 -3592 54620 87345 125322 84749 6661 212390 139194 97223 177006 98197
9645 98197 102900 163314 165753 178388 221216 284920 268889 226670 88350 90229 135297 197285
9633 197285 221807 356442 307347 403493 196998 41320 95686 79352 73908 -13612 8336
9622 8336 83029 166698 107567 42737 43396 194214 315082 320888 249021 234193 177687 108321
9610 108321 185774 340254 401761 292907 81536 124118 98776 239365 396353 445985 313768
9599 313768 318527 315314 389734 401555 360468 288698 380735 459307 494247 533705 523435 481070
9587 481070 538165 525467 249004 294966 283350 291448 324673 289221 91359 80532 78269 25752
9575 25752 65921 98255 189386 173813 234060 306135 283540 219917 111374 -29792 -5645
9564 -5645 113385 126222 163780 241526 289023 231439 163669 144378 218096 179899 246516 213448
9552 213448 261423 259330 169562 155574 271768 388864 312399 201614 358226 384791 287709
9541 287709 303359 344606 419242 421754 415115 310578 272998 317182 395138 364785 338845 381123
9529 381123 361567 302748 245482 373745 430217 384673 392254 336086 354458 480104 439011
9518 439011 357073 355845 322485 361786 280015 246715 230735 154415 135491 255554 355261 274025
9506 274025 240112 393485 485274 312972 278127 199699 109321 183788 202756 227852 248586
9495 248586 249228 248866 319075 295254 232585 233991 254412 203772 193688 249159 280968 232558 305119
9482 305119 334952 299855 335387 302956 267634 266021 357265 376675 333112 395993 353067 285133
9470 285133 274073 227681 110394 96187 251206 268763 264635 226368 203662 185896 212545
9459 212545 176021 237843 155519 207786 213991 200753 166096 118569 263752 199065 123879 226556
9447 226556 120473 -3741 10044 4392 146282 15356 -37353 94002 29996 -23958 26334
9436 26334 60817 71101 126735 106121 41502 103271 218602 176035 107506 151825 324786
9425 324786 238310 238168 291381 181418 198321 254811 231038 257527 356491 408421 409433 408517
9413 408517 406926 288468 206945 362616 385305 432791 507738 576204 499440 469816 639579
9402 639579 680201 905157 917617 966633 1003678 1053824 978643 952224 944392 794759 653215
9391 653215 650860 537294 538812 500753 396239 334841 310546 280782 254185 248734 283173 324341
9379 324341 261440 261747 306506 328593 360424 362430 402932 280531 193829 155573 80546 -1719
9367 -1719 125206 136475 64605 82404 216945 215503 114816 150145 140519 267365 397917
9356 397917 397281 268878 235722 353049 305533 279404 318045 135283 88789 120087 323184
9345 323184 417255 275525 197763 195329 248212 149027 178719 259094 354473 189094 264257
9334 264257 234125 175462 166311 249239 346661 232051 231784 115462 244983 318105 340528 265270
9322 265270 199489 119220 184908 165448 233163 223620 190513 139879 202809 197804 149403 236215
9310 236215 186607 227427 271936 214462 245191 188188 274213 347574 415698 306396 155321
9299 155321 133815 134128 121462 81018 186234 218247 307981 423697 374139 359977 372642 412651
9287 412651 309620 295356 260690 206007 175580 154292 167138 192715 287520 423394 313506
9276 313506 261193 304003 234504 169801 203746 202470 222983 267434 237436 149140 260926 239431
9264 239431 210107 355291 327124 364854 438498 467055 484806 414081 267306 233106 340099
9253 340099 384121 268731 295316 350958 453316 396999 412097 294975 229639 289222 419431
9242 419431 325363 328212 268578 228067 448293 406873 482521 559021 464234 329971 348168
9231 348168 437494 404068 312154 224070 315529 532034 539537 380381 349779 430945 436196 399267
9219 399267 370034 489370 565282 538649 634992 680926 514856 448880 573266 629957 675877
9208 675877 678645 764263 734111 495959 520201 588593 504841 605020 669294 561485 566372
9197 566372 564090 542490 543667 536715 546225 638343 726193 716832 714003 609513 603750 630152 666330
9184 666330 735861 731667 650894 631964 585013 532910 603163 647897 688206 715787 762636 849061
9172 849061 662196 750038 854149 827400 750560 698871 696285 575061 584004 607404 584011
9161 584011 589641 625691 611580 604933 594648 731009 806959 765518 756670 660667 580226 700403
9149 700403 729218 659188 818130 827587 848627 807431 849849 779767 832493 780597 702200 819224
9137 819224 818276 722415 744431 781420 830122 839225 809257 967599 975593 934324 887212 948033
9125 948033 1025463 1064353 1026146 1028587 1057921 1201542 1233232 1228372 1322039 1346225 1319862 1371335
9113 1371335 1535558 1646806 1674515 1687779 1756670 1717572 1732858 1739250 1680379 1675149 1611089
9102 1611089 1612147 1657416 1536450 1493889 1440118 1393768 1449641 1456564 1562738 1628209 1679471
9091 1679471 1676698 1616792 1724341 1761048 1661583 1681812 1666169 1777516 1726676 1605770 1702901
9080 1702901 1801505 1752077 1858999 1897439 2057093 1981208 2008755 1943129 2058798 2104833 2189128
9069 2189128 2237532 2273783 2251979 2234762 2329543 2251870 2309985 2289679 2169388 2047496 2069353
9058 2069353 2075442 2216941 2257743 2241298 2112310 2153197 2330350 2367446 2423084 2473255 2479680
9047 2479680 2529467 2288970 2253294 2330652 2259977 2223469 2251655 2316394 2170449 2129984 2093599
9036 2093599 2087916 2146499 2089346 2025077 2009324 1914976 1983005 2014725 1966398 2010740 2036202 2050165
9024 2050165 2085143 2072627 2140304 2199436 2251952 2365964 2268509 2234277 2442938 2458426 2509900
9013 2509900 2405636 2294875 2307606 2284434 2250188 2282089 2348285 2404078 2476891 2603086 2552022
9002 2552022 2505576 2591571 2592241 2620586 2750912 2877983 2788205 2858097 2827443 2983535 3075686
8991 3075686 3142382 3123562 3148846 3340066 3440307 3500495 3641641 3759162 3812727 3852574 4044792
8980 4044792 4183023 4329282 4365348 4377250 4564524 4710558 4857976 5035465 5112299 5258454
8970 5258454 5357547 5538725 5807422 6009917 6115658 6337822 6424782 6559580 6827337 7161424
8960 7161424 7420500 7804122 8238110 8462877 8890077 9463699 9852203 10306703 10929407 11520821
8950 11520821 12100394 12955236 14009931 15103481 16355023 17830029 19264979 20980118
8942 20980118 22817306 25051681 27438470 29979144 32941174 36484424 39773484 43100824
8934 43100824 47121862 52067993 58010311 65756138 76235501 90026844 104327545 118848381
8926 118848381 130643276 137055409 139609617 136062309 124693977 108189187 93741591
8919 93741591 81862602 72400878 64518175 58027512 52775057 48296957 43735210 39730706
8911 39730706 36603119 34081602 31832692 30123915 28480605 26929435 25589966 24401232
8903 24401232 23392822 22510566 21725017 21041624 20430599 20079708 19733352 19512173 19382712
8894 19382712 19325382 19254472 19286447 19565126 19532205 19524105 19829093 19987112 20171556 20663205
8884 20663205 21098862 21792734 22541310 23450158 24606303 26104666 27761717 29746971 32072781
8875 32072781 34216313 35826278 37114923 37436749 36996962 35878011 34403843 32714072
8867 32714072 31286609 30040947 29208893 28740643 28552620 28628069 29143497 30197098 31563912
8858 31563912 33393724 35317452 37573881 39493128 40823533 41406572 40993519 39870238
8850 39870238 38271437 36512124 34893682 33607877 32796311 32146381 31793568 31919769 32234155
8841 32234155 32930123 33796506 35175051 37045413 39438837 42096991 44544936 46800078
8833 46800078 48347583 48941759 48372589 46895197 44615575 41827280 39496771 37708428
8825 37708428 36365198 35381665 34822155 34755370 35132727 35972138 37180104 39004610 41103337
8816 41103337 43203237 45059008 46140435 46425175 45435248 43448963 40816021 37648703
8808 37648703 34494517 31850173 29454345 27607892 25976428 24481921 23284692 22139302
8800 22139302 21133384 20224997 19385784 18648277 17944346 17217736 16826418 16354148 15757171
8791 15757171 15239885 14969529 14648387 14353491 14081208 13872742 13706421 13680029 13651299 13644222
8781 13644222 13582428 13586808 13643730 13702672 13774870 13880962 13980312 14215484 14481801 14693398 15020643
8770 15020643 15507174 15922846 16212858 16860416 17508463 18320858 19109577 20052615 21082609
8761 21082609 22103574 23585543 25257161 27360053 29864436 32531093 35448418 38131954
8753 38131954 40716733 42805994 44044559 44568706 44436770 43996277 43657564 43901673 44644316
8744 44644316 45771337 47233305 48405716 49098820 49189757 48157115 46199548 43642230 40900546
8735 40900546 38214300 35805649 33775302 32102351 30893472 30006998 29203653 28654006 28344283
8726 28344283 28159344 28267911 28415792 28642688 29144065 29891395 30760366 31858573 33266564
8717 33266564 34793921 36707386 39098789 41609629 44238356 46697040 49236396 51247235
8709 51247235 52699624 53202892 53012604 52497171 51844027 51485340 51785595 52536625 53616515
8700 53616515 54682802 55397007 55669356 54922682 53146379 50554987 47362630 44056869 40760496
8691 40760496 37880849 35467064 33184222 31457476 29855676 28541331 27536033 26776430
8683 26776430 25986524 25443999 25035891 24661763 24398183 24211570 24019534 23922109 23856594 23482843
8673 23482843 23126610 22970133 22801748 22609041 22322648 22142285 21989899 21781215 21480993
8664 21480993 21431169 21501925 21713827 22127842 22640282 23025884 23359193 23657461 23918165 24062917
8654 24062917 24000178 23952079 23880658 23824775 23902890 24149629 24566186 25209508 26079336 27357973
8644 27357973 28982915 30705740 32300417 33578005 34413928 34983606 34633943 33755520 32743864
8635 32743864 31801491 31251447 30967642 31159067 31482940 31678251 31613069 31574655 30864519 29513609
8625 29513609 27926765 26174490 24941569 23943771 23034431 22500484 22233210 22030877 21897680
8616 21897680 21935553 21897981 22127647 22578211 23374092 24145777 25040836 26044789 27098327
8607 27098327 28472806 30107833 32137811 34447203 37154382 40116746 43084767 45596431
8599 45596431 47482297 48516245 48492147 47549613 46014498 44359282 43326243 43021356 43072609
8590 43072609 43495837 43883296 43889897 43441308 42024647 40124522 37512697 34643778 32011694
8581 32011694 29654447 27597493 25917651 24434581 23268587 22197073 21315975 20516274
8573 20516274 19966306 19777037 19582145 19299080 19466303 19738107 19773639 20123783 20603468 21387543
8563 21387543 22255014 23459990 24626101 25759920 26729869 27363400 27668017 27566131 26847714
8554 26847714 25820602 25116292 24602394 24239342 24083119 24088182 24144610 23995976 23523101 22755015
8544 22755015 21803261 20288960 18703402 17393334 16233762 15349548 14403256 13648713 13038256
8535 13038256 12599795 11974132 11543831 11341099 10942234 10734704 10642722 10518400 10490649 10364516
8525 10364516 10290444 10356110 10407446 10529245 10619964 10856966 10945461 11054108 11057849 10944810 11045337
8514 11045337 10939227 10731111 10677200 10590091 10379915 10241160 10143890 10044513 9856625 9766879
8504 9766879 9458180 9109078 8812004 8447818 8210809 7895642 7786836 7609079 7386756 7262343
8494 7262343 7187855 7004159 6843673 6889078 6934001 6841742 6781789 6980794 7039736 7163994 7452165
8483 7452165 7718553 7969613 8327303 8758643 9154161 9596191 9904202 10236514 10426922 10435628
8473 10435628 10293348 10166951 9978277 9703686 9340004 9294115 9257260 9231807 9349895 9401694
8463 9401694 9260719 9014832 8880820 8575894 8341281 8057397 7763138 7466333 7040427 6850395
8453 6850395 6629080 6390227 6259599 6098943 5988379 5984061 5979231 5782449 5695518 5612694 5510447
8442 5510447 5482509 5495317 5699510 5799670 5738381 5929155 5950944 5922575 6066293 5944942
8432 5944942 5654765 5385514 5146608 5124395 5089950 4972444 4976870 5039082 5085073 5210746 5192986
8421 5192986 5265408 5039568 4793106 4482163 4311048 4127971 3791328 3557975 3416991 3304391
8411 3304391 3091508 2939001 2749748 2626006 2457680 2378273 2348455 2185026 2226974 2174649
8401 2174649 2070040 2096787 2024792 1969922 1983508 1970220 1828186 1781912 1783067 1704182 1588915
8390 1588915 1708641 1708840 1684992 1595741 1588509 1532045 1530753 1536352 1371413 1285598 1365540 1360781
8378 1360781 1347711 1423934 1385239 1353638 1235892 1238683 1151437 1181097 1234539 1237638 1396853
8367 1396853 1346124 1192592 1116752 1129652 1014021 1076392 1082457 1030156 1035571 1017863 1163758
8356 1163758 1077869 949462 863677 992806 1101100 1049110 1031108 906737 893224 865899 1000672
8345 1000672 910710 929902 1063657 882535 843153 1019391 974323 1117693 1034434 960380 998963
8334 998963 968556 926499 800075 826943 875535 942204 985869 989940 941601 899129 780866
8323 780866 768277 869535 754040 633454 647346 810183 804082 699884 788313 754518 656029
8312 656029 720397 764517 652836 727827 733028 661748 685009 662917 703385 594672 475826
8301 475826 648908 703471 606594 516962 580092 568528 735775 704783 579809 567007 633647
8290 633647 719418 808474 673218 628042 571148 701932 769845 808588 807814 855389 805600 705331
8278 705331 745380 757100 847545 924659 875545 876844 924613 839906 785518 903033 875687 799623
8266 799623 900880 1018773 1009360 944052 1046572 979662 1054983 1074088 1104856 1106171 1054081
8255 1054081 926853 873049 878627 920617 706515 750978 871590 763082 868696 890085 784616
8244 784616 795283 903607 1027448 1030477 1054548 1082844 1109513 1223028 1195783 1205228 1119152
8233 1119152 1157917 1231768 1113670 1098745 1088625 1074211 941723 1004611 835010 770170 980427
8222 980427 842753 619532 586352 690922 799404 710288 770171 801742 720899 552021 521691
8211 521691 431218 397652 450296 506755 408104 345257 532486 581392 602525 555195 544021
8200 544021 439596 401447 407418 550198 635668 680102 670081 979791 -99492 -429235 -79081
8189 -79081 -98509 106157 210054 234027 134746 106297 169166 285815 185321 236898 199373
8178 199373 208086 157669 297258 340469 325635 403469 356231 207888 219998 242955 207994
8167 207994 233916 359827 309212 212672 286826 264782 309358 399812 243774 175100 60937
8156 60937 83275 197074 335808 306225 184380 93051 35109 123193 147613 142899 70135
8145 70135 106436 188260 114788 80239 -26608 -18340 108614 197918 128850 22311 -131610
8134 -131610 5436 199325 184630 150097 -21001 23676 140626 137150 41776 35574 150643
8123 150643 93053 54912 18204 13303 64765 94969 -51 -14572 15698 76215 28978 37763
8111 37763 109313 82897 183071 143768 103021 -17971 74726 128651 25149 75045 43648
8100 43648 -47323 5723 -16956 -13319 26409 7657 8573 -71768 -67984 90355 17231 -30478
8088 -30478 59760 -30202 -141032 -95504 -84226 -38404 51920 69806 62465 234080 64432
8077 64432 -43899 106391 -43772 5318 29793 46636 -20750 -10436 -64207 -127888 2471
8066 2471 -59822 -101856 -11208 66259 -36962 65876 127559 113260 162155 183938 42835
8055 42835 51612 77688 -39704 -16921 8731 68128 115262 98662 34886 7654 323 -27966
8043 -27966 -16606 -104225 -45977 40298 72181 -29411 8435 100430 74625 41052 18080 64466
8031 64466 98447 38676 -69724 15120 -56457 -10339 -69287 -79031 -6505 29342 57590 48816
8019 48816 29227 38117 -38178 -112571 -7289 -3321 43842 149537 120552 36758 92798 101700
8007 101700 54440 -37263 -32672 16512 -53491 -58348 5298 94657 202585 65034 123121 141780
7995 141780 113720 150007 181534 82144 31971 56438 80781 32572 12251 71379 3719 54285
7983 54285 -21571 23673 38776 14560 20011 195168 144341 34775 44029 99192 113121 103258
7971 103258 95860 -32360 -82885 10260 24038 -76868 -34588 129392 134861 -108193 -175948
7960 -175948 -69214 -52832 -15699 -64061 -111307 -122680 -60747 100627 -25280 30518 63071
7949 63071 -70861 -75552 -143564 -52371 29394 -1025 -94601 -88981 -31668 -23603 -58045 -45524
7937 -45524 3471 -26414 -64342 -76275 -113484 -99055 -194873 -236446 -158452 -22319 60517 38449
7925 38449 -7703 -10512 -5445 13394 47215 -38548 -57913 -39277 -179959 -200094 -69825 -162993
7913 -162993 -119037 -12645 102868 11126 -40107 -44671 -146011 -171444 -147268 -59186 -9017
7902 -9017 -151180 -104011 -75348 -133557 39488 40094 -101182 -144375 -77459 13806 15248 2612
7890 2612 36309 -21170 66597 163409 149636 47322 -33862 -75409 -38440 -175168 -119016 -6075
7878 -6075 46430 73218 -21649 582 57197 -23677 -53442 25475 17394 33129 -102781 -29230
7866 -29230 15314 -5467 41822 118951 -59060 -50309 40280 -5755 85182 198428 174399 238060
7854 238060 160784 115351 77137 -2683 -15988 -60255 -15795 -18384 -21808 31327 -13428 -13304
7842 -13304 -102148 -161625 -99142 -56893 43421 -29337 105604 -13560 49555 -92168 -68589
7831 -68589 74693 106343 88506 37782 31033 59401 -92917 -147974 -54682 -91454 47721
7820 47721 6444 82865 45668 77760 19713 -96271 73686 65940 35309 -69855 -48164
7809 -48164 58552 136626 76228 -114734 -197989 18776 208795 18298 19931 121423 2931
7798 2931 -8852 49079 -34452 -57141 -18933 -916 80213 241190 281615 167775 65459
7787 65459 84934 142731 171895 172440 173474 223380 313579 146190 106483 208891 156858 229627
7775 229627 428744 171698 125340 46430 -46550 67412 117875 204571 238405 148191 163634
7764 163634 169033 192784 110440 81350 277266 194987 60334 67359 62860 84785 126922 149705
7752 149705 137329 179285 183380 230172 146786 106331 103955 89875 243202 226731 191264 155721
7740 155721 146488 21109 43375 80173 119552 198529 9955 105375 59703 58918 98432 149211
7728 149211 167380 56918 94264 151979 224710 200452 158798 205003 283280 248534 356615
7717 356615 396491 270629 358186 330514 188478 219751 208502 253587 301094 293839 365129
7706 365129 287817 260279 292655 242287 335970 332327 411674 473017 385140 332399 305268 223771
7694 223771 195182 231545 353490 197150 228184 181128 136923 92407 71352 169401 65808
7683 65808 46739 123868 56827 109855 179724 210867 14101 -27931 75371 175799 154919
7672 154919 49033 107009 58770 21384 8434 151560 81024 -24435 62457 98510 185324
7661 185324 130289 -16278 -12135 56535 90741 81989 63458 64939 4904 -15724 -74739 8539
7649 8539 85542 187165 7707 -2820 -32487 -50915 -76919 -150811 -85120 68365 -77957
7638 -77957 -116099 27468 960 13735 52692 78669 -185453 -110278 -8666 14218 119655
7627 119655 118079 71253 187066 75111 -27098 -26459 6821 47024 114998 147111 84566 58130
7615 58130 169189 123076 131626 107608 113566 173946 199688 109123 180480 159977 160266 137335
7603 137335 194953 259978 195528 171927 179755 233724 256873 169343 126373 231590 187501 172233
7591 172233 83235 63185 254491 318741 298052 194983 193528 242989 312729 225110 204866
7580 204866 221385 124482 204828 286845 257358 239978 189567 242834 245370 267989 264255 316251
7568 316251 331928 245623 346955 360643 331999 289936 275433 388208 343964 311623 269649
7557 269649 369488 321677 235816 196741 133598 166150 308933 316721 200803 156657 189513
7546 189513 197619 235964 68277 209110 169637 175123 358415 199194 241331 182746 141903
7535 141903 70424 186386 48570 56733 222321 243914 214354 360238 262473 200047 226384
7524 226384 114733 119440 81781 129702 177713 226003 125255 67568 70680 35828 -38183 44965
7512 44965 167251 108472 155612 219007 235346 101582 213208 225573 184093 36397 82548
7501 82548 156590 272028 326711 267115 292858 215480 133035 269013 273933 255819 225753 56933
7489 56933 62433 60636 143016 253627 171646 164545 180503 178744 81054 73288 179261 197644
7477 197644 210620 94345 53724 138420 48590 90358 63319 96406 -10100 -7276 24328
7466 24328 24751 -72624 -64882 17374 160479 132828 -9633 117296 162865 22493 -2802 21315
7454 21315 125105 179506 115180 27986 33144 194388 386827 346969 8548 -9962 215714
7443 215714 217798 164236 201415 151083 105669 36122 82274 95494 112415 72688 136823 211076
7431 211076 219057 156994 197722 297420 269810 179143 221513 116646 219672 128980 197466
7420 197466 177777 241632 270670 156497 274777 253383 207837 194806 149842 146867 162998
7409 162998 238484 77754 74427 49191 -37341 20171 45956 101306 157288 167531 165219 172883
7397 172883 215338 41809 416 142021 232500 191703 166179 207013 206150 162120 148738 275697
7385 275697 261543 288758 301107 238464 288044 347761 386147 286479 286251 472790 254090 275686
7373 275686 358121 218919 317000 330916 290754 357694 401521 337100 249745 252734 251283 94194
7361 94194 123107 296328 353312 298727 312610 179160 299333 366573 267690 238578 254530
7350 254530 319328 310905 332642 244021 356735 403430 330133 294244 277071 236965 300831 325310
7338 325310 196662 241380 149762 203360 324718 187296 159139 257308 263507 277498 317433
7327 317433 335800 241559 161053 237921 243863 282562 260124 232814 160054 273490 229373 237491
7315 237491 240339 292998 277790 244803 113029 221981 240512 321611 361487 332699 349150
7304 349150 275877 209243 176928 258252 272293 352290 359438 234300 255472 345625 302339 206905
7292 206905 248915 348058 323044 244884 173500 155795 264192 406847 397822 299592 234602
7281 234602 142680 164231 168679 153166 300598 352914 270858 197250 299602 345536 185670
7270 185670 243821 336730 195927 185490 289967 288825 342538 335853 275306 296212 326649 436678
7258 436678 385445 280891 297596 436048 369473 334886 285118 295352 408351 484574 513737
7247 513737 430702 296824 313426 367959 264661 277367 364982 460573 484808 374792 284840
7236 284840 376998 303022 264583 272800 190546 305047 300815 191482 272217 291275 332542 343888
7224 343888 266988 396408 482816 339930 362984 324756 345303 463262 365269 395312 530525
7213 530525 545292 447273 539465 680210 613056 661879 678156 586744 697815 731791 806916
7202 806916 783976 677201 693975 748589 711716 701002 662444 750591 808767 829029 901081
7191 901081 928799 937297 954333 840158 900886 953913 1035593 1069392 1051362 1227463 1376533
7180 1376533 1402625 1365092 1466419 1380526 1286774 1315111 1411059 1544298 1638642 1715351 1793802
7169 1793802 1831611 1842239 2053374 2204463 2254825 2273025 2360583 2549340 2636408 2524912 2595857
7158 2595857 2588892 2720434 2790160 2638266 2660694 2613676 2564232 2513945 2445608 2424704 2396229
7147 2396229 2399462 2282383 2127940 2110472 2027395 2021976 1950253 1857000 1871901 1805845 1677765
7136 1677765 1627828 1552524 1487285 1514814 1517140 1553912 1466174 1230802 1087225 1115960 1259222
7125 1259222 1146130 1159314 1240734 1081650 1139126 1186487 1100520 1041359 1090388 1071217 1115242
7114 1115242 1165631 1169691 1287041 1297236 1269016 1318185 1335002 1356884 1567063 1679140 1845796
7103 1845796 1913415 1922455 2030470 2132290 2266081 2343131 2351445 2373739 2289876 2353312 2225185
7092 2225185 2102055 2091543 1984552 1911905 1829266 1731758 1628487 1517855 1394505 1323205
7082 1323205 1213921 1112486 1131743 1161752 1194409 948767 839520 860850 792165 769634 920955
7071 920955 823590 708823 736572 615345 687949 775671 754785 743625 641585 654150 682389
7060 682389 625501 590791 694912 578655 473080 599740 645012 695318 791237 662425 648610
7049 648610 857175 796330 755066 802055 902624 884599 1006218 1055278 959224 873338 955820
7038 955820 945002 888998 831345 922740 1040184 1169960 1287027 1371584 1482170 1503573 1609457
7027 1609457 1689991 1661594 1645613 1547034 1566751 1528736 1359394 1251669 1173180 1162101 1118424
7016 1118424 1133116 934877 876666 873818 798438 709384 809867 879648 789778 804447 788826
7005 788826 739438 803801 781236 588874 618698 684697 661075 634945 630543 675267 617721 600952
6993 600952 552908 502487 653044 522305 492366 540776 596567 503961 482128 591883 589863
6982 589863 580358 451866 430798 465261 503614 582752 654473 577255 503418 411076 361264 435121
6970 435121 458293 435134 407552 480172 566913 497607 439913 455616 436518 402953 332821 290297
6958 290297 224953 369601 511336 607725 556923 490482 414264 380754 491998 530849 622908
6947 622908 509577 448795 523119 393811 435005 500014 391712 364873 579411 653413 542462
6936 542462 549497 520064 568544 633172 532176 457451 566687 529924 486598 493853 453621 456829
6924 456829 523560 414013 389458 447595 392966 402897 508384 589653 584893 601833 505035 492571
6912 492571 407484 426465 417924 388950 482494 502494 551826 438309 427921 482346 395590 406758
6900 406758 397744 349986 319908 410193 470784 507903 507603 408255 299552 467209 515153 414819
6888 414819 471695 585087 667724 714550 607056 571930 674449 557149 620600 552417 523452
6877 523452 517406 544690 533121 588258 609606 712959 620067 581882 554422 493015 700770
6866 700770 554566 543701 611690 618319 608862 618314 588057 509042 435977 520616 617458 537097
6854 537097 642273 630111 581016 599166 556947 360020 366618 398289 296869 369469 373668
6843 373668 470758 500559 448138 464986 461927 502692 458559 484297 570191 659971 655789 635316
6831 635316 642083 641556 546625 483483 612236 610595 569599 601559 594467 588654 595612 667023 542881
6818 542881 451255 500306 537924 534803 502784 419700 463016 531617 497723 475068 452453 364294
6806 364294 327121 447733 549621 573524 685883 791049 760090 723239 775989 720709 776296
6795 776296 887010 1030255 1086530 1219147 1472406 1503453 1395658 1431669 1452198 1458142 1659812
6784 1659812 1646911 1571559 1412826 1381874 1286922 1280776 1249510 1170350 1004191 1020687 983074
6773 983074 866696 778738 741252 767587 850747 851153 806698 766368 760716 719130 780884 797087
6761 797087 816469 820121 841203 997606 979868 1046946 1039123 1035846 1134498 1167224 1185306 1203544
6749 1203544 1295426 1355228 1470684 1440061 1589018 1624587 1556702 1468402 1416162 1331925 1311667
6738 1311667 1314748 1223009 1220002 1190446 1174726 1005348 979015 1022625 1068105 1012914 949454 953184
6726 953184 924770 826641 924348 921431 884401 808417 982917 1109117 957153 892004 939851
6715 939851 963590 932934 911665 932874 928999 916426 991876 1061934 1077796 1078531 1121386 1038445
6703 1038445 1014284 1072411 1174970 1239218 1226043 1212026 1140181 1228027 1284947 1229226 1199400
6692 1199400 1144760 1144722 1288850 1246584 1201902 1147157 1328908 1329946 1254959 1348827 1271735 1152784
6680 1152784 1095371 1135984 1182723 1251027 1321696 1213645 1048029 1114310 1211371 1169854 1104446
6669 1104446 1106668 1296462 1304818 1242308 1296713 1386806 1505786 1561234 1449252 1396148 1620278
6658 1620278 1608093 1664471 1711853 1679438 1600421 1479704 1456316 1367429 1339356 1437928 1465825
6647 1465825 1343925 1228160 1230795 1203944 1282493 1196652 1218194 1207765 1192636 1331409 1328768
6636 1328768 1398993 1327529 1247038 1347916 1419204 1374450 1334707 1364756 1460195 1417811 1322907
6625 1322907 1381413 1307116 1279463 1116097 1141443 1256631 1213337 1160731 1201037 1213140 1193873
6614 1193873 1298943 1293190 1295939 1304462 1262369 1176847 1262082 1233573 1116185 1243328 1374516
6603 1374516 1411844 1317535 1351810 1450959 1452305 1343046 1349858 1557427 1699702 1689425 1603460
6592 1603460 1605004 1726584 1787352 1698702 1725793 1706163 1735479 1771532 1823519 1836498 1836371 1781971
6580 1781971 1899100 2041463 2079220 2053848 2118026 2190585 2127810 2226118 2183057 2290808 2478858
6569 2478858 2509486 2568916 2680498 2893145 2924021 3018081 3066398 3176439 3323268 3282298 3482648
6558 3482648 3647908 3808485 3980049 4103181 4400444 4568932 5005972 5514085 5961392 6380378
6548 6380378 6770435 7284462 7607109 7690274 7661747 7443586 7152397 6740684 6291954 5816586
6538 5816586 5558176 5525084 5115266 4743920 4610466 4383979 4199398 3977492 3814605 3759134
6528 3759134 3677662 3617314 3451413 3338245 3181339 2960940 2856624 2917200 2893646 2827373
6518 2827373 2840941 2758608 2660235 2668591 2623152 2648001 2635670 2675821 2498939 2379939 2475474
6507 2475474 2458032 2297250 2308587 2444182 2459567 2527689 2424782 2201137 2153824 2235371 2201670
6496 2201670 2226469 2220639 2172535 2142068 2092236 2055734 2021089 1950092 1967557 2079359 2057844
6485 2057844 2059352 2041643 2119620 1948870 1959176 2104075 2073150 2056556 2042041 2022797 2133016
6474 2133016 2069075 2078764 2172499 2227178 2324115 2497079 2406211 2322829 2363134 2431361 2462798
6463 2462798 2448844 2493585 2549524 2566293 2481369 2366668 2392965 2504868 2596593 2676960 2597740
6452 2597740 2508436 2499908 2684222 2577710 2678162 2815893 2723215 2671301 2738797 2740586 2799513
6441 2799513 2897581 3047221 3102045 3081285 3008932 2897941 3075313 3036124 3050202 3201020 3144211
6430 3144211 3089993 3106065 3268025 3299773 3494503 3589903 3609542 3590056 3541336 3510610 3591744
6419 3591744 3706473 3798474 3762922 3695061 3729911 3836910 3951235 4128782 4090332 4072402 4154076
6408 4154076 4279069 4263441 4187767 4384134 4539562 4569567 4734054 4822800 4845966 4900032 4871044
6397 4871044 4894943 4945992 5214567 5319286 5392263 5382512 5357503 5437503 5584115 5680832 5745059
6386 5745059 5763071 5894516 6212089 6484709 6644045 6796430 6933001 7086570 7304984 7485282
6376 7485282 7792641 8173798 8367474 8598053 8873689 9225112 9658738 10162784 10685275 11082374
6366 11082374 11648101 12233062 12826824 13523376 14280105 15129734 16036103 17013551 18276921
6357 18276921 19645502 21092935 22728767 24323747 25863740 27422948 28853450 30142537
6349 30142537 31213410 32152719 33228789 34421712 35683021 37038015 38503178 40094213
6341 40094213 41638367 42917965 44035387 44958782 45975890 47242287 48704537 50248170
6333 50248170 51797925 53482451 55121579 56680046 58243273 59995835 62159968 64995854
6325 64995854 68858106 73528040 79023639 84897489 90934975 96252729 100295587 102892585
6317 102892585 103280204 101318088 97850993 93666399 89737448 86466914 84159111 82957420
6309 82957420 82623068 83340214 85095427 87904035 91556643 95921764 100818308 105759960
6301 105759960 110632317 114737255 117122491 117546142 116185493 113512707 109536537 104132634
6293 104132634 97845064 91906495 86429995 81761168 77970048 74946970 72597848 70992518
6285 70992518 69950900 69518619 69855665 70697976 72136915 74311890 77374627 81033502 85482317
6276 85482317 90689987 96288040 101816502 107305216 111944530 115167468 116741170 116454919
6268 116454919 114571222 111543282 107652866 103052847 98335615 94051056 90380957 87538366
6260 87538366 85441258 84384882 84277973 85212848 87362868 90155201 93299619 96833408
6252 96833408 100025093 102180721 102997669 101773641 98626646 94016359 88766792 83539274
6244 83539274 78589145 74212328 70569200 67604174 65094821 62961732 61136504 59509896
6236 59509896 57826605 56217335 54714957 53069374 51644514 50461191 49370094 48200020
6228 48200020 47269020 46139895 44882097 43468259 41901460 40346455 38972176 37707121
6220 37707121 36725594 35691391 34756243 33746498 32414009 30808571 29116772 27451719
6212 27451719 25729045 24129276 22793925 21721618 20654065 19593344 18723178 17927655
6204 17927655 17135223 16535500 16005602 15467317 14947305 14479403 14099348 13739617 13340974
6195 13340974 13034208 12941672 12760104 12489542 12318538 12161471 11923298 11728443 11510971 11196255
6185 11196255 10913148 10811022 10618485 10402560 10199380 9951105 9859156 9609539 9472725 9376294
6175 9376294 9220118 9083089 8927640 8788119 8821361 8856310 8684854 8547477 8463260 8290201
6165 8290201 8236277 8033865 7917077 7988820 7940216 7888894 7727326 7589394 7509021 7415411 7378972
6154 7378972 7344242 7332266 7211650 7177705 7085060 7004568 6871557 6821848 6673653 6419505 6188506
6143 6188506 6087698 6021693 5907462 5692638 5443320 5254807 5157378 4960783 4765385 4674268
6133 4674268 4600958 4594547 4562798 4562328 4431642 4338240 4331604 4180512 4004563 3993082 3983702 3785369
6121 3785369 3803468 3650653 3458545 3425530 3469264 3353082 3241986 3268667 3189817 3161248 3210416
6110 3210416 3188865 3132029 3048378 3098533 3052141 2993086 3005473 2981647 2951859 2904764 2881902
6099 2881902 2796122 2713221 2660915 2604773 2592232 2669860 2695965 2790729 2661361 2651839 2731646
6088 2731646 2780353 2705839 2704167 2663792 2591284 2509233 2553351 2569148 2478333 2457610 2485431 2520233
6076 2520233 2432819 2352608 2348098 2310825 2267107 2244805 2333235 2276324 2327400 2245569 2240465 2266297
6064 2266297 2175310 2098984 1981646 2020806 2215474 2354451 2297058 2222678 2053690 2036564 2084054
6053 2084054 2195219 2183281 2211976 2346548 2456518 2523640 2498563 2523896 2547243 2607193 2638134
6042 2638134 2585748 2532601 2577881 2471797 2392806 2364719 2348850 2446858 2462979 2431398 2357101
6031 2357101 2430993 2579172 2457154 2336847 2352919 2461666 2503520 2500636 2656955 2691996 2709929
6020 2709929 2690576 2703742 2639710 2879924 3021386 3043250 3031612 3107537 3336930 3411402 3533830
6009 3533830 3468397 3456304 3334899 3263782 3135125 3050846 3167134 3272899 3238423 3167088 3196394
5998 3196394 3299471 3323762 3324976 3301025 3382168 3378577 3426081 3315774 3378784 3486031 3605557
5987 3605557 3680812 3747474 3924383 4068193 4302413 4558634 4748781 4889403 5019247 5143051
5977 5143051 5382178 5531553 5621012 5771377 6056846 6201529 6370195 6756591 7132296 7456429
5967 7456429 7779069 7927559 8215756 8329587 8205460 8071070 7798411 7454751 7210394 6881314
5957 6881314 6607553 6264555 6034080 5874501 5478008 5302031 5219385 5029020 4947417 4846886
5947 4846886 4776293 4650590 4540904 4496600 4363083 4218257 4133491 3962230 4045365 4029287
5937 4029287 3858884 3799509 3792318 3660355 3696952 3695668 3572927 3340492 3256944 3161888 3207825
5926 3207825 3286657 3236264 3118103 3025932 3048078 3084842 3022766 2943147 2960198 3068065 3007200
5915 3007200 2923980 3055487 3154466 3127571 3064627 3200057 3217959 3148616 3204378 3207500 3389314
5904 3389314 3516301 3591675 3526815 3499343 3583981 3674875 3702453 3741205 3876566 3839680 3885380
5893 3885380 3927665 4089614 4108351 3914111 3932856 3998311 3817775 3862709 3952329 4102609 4090727
5882 4090727 4028116 3954120 3961245 3862681 3646242 3598957 3589948 3576416 3540051 3324426 3427424
5871 3427424 3399303 3378928 3236037 3086876 3113238 2992296 2982397 2990938 2846257 2919161 2934380
5860 2934380 3023463 2923240 2823319 2812045 2755238 2773084 2845127 2785138 2761836 2728135 2735424
5849 2735424 2725354 2737937 2808155 2738076 2564031 2465531 2519759 2564859 2627384 2582167 2601151
5838 2601151 2551311 2502770 2493361 2477129 2633226 2615026 2626381 2544243 2500303 2525131 2499715
5827 2499715 2479822 2523631 2558777 2532006 2640897 2617237 2578283 2499970 2643764 2769100 2684104
5816 2684104 2668144 2692688 2600253 2639742 2646618 2514081 2615515 2786314 2850215 2835969 2705146
5805 2705146 2643717 2692759 2657444 2700910 2737941 2752443 2750225 2787708 2847023 2680837 2710795
5794 2710795 2512199 2498875 2580176 2590901 2559093 2667630 2569872 2513707 2579390 2716247 2596468
5783 2596468 2655458 2608262 2584826 2642041 2594280 2598877 2564285 2528787 2604582 2736929 2798613
5772 2798613 2785777 2777565 2753751 2771857 2714229 2696864 2813178 2851949 2840749 2843591 2907405 2952151
5760 2952151 2828598 2844341 2870286 3002617 2955604 2938292 3031824 2943102 2925595 3009073 2972968
5749 2972968 2976192 2949571 2718379 2947869 3084421 3189466 3089429 3197999 3165476 3040073
5739 3040073 3117709 3217327 3174468 3263385 3285050 3291353 3285948 3265376 3453236 3462366 3401231 3419739
5727 3419739 3538242 3567338 3447075 3524371 3671894 3576129 3608884 3732865 3618769 3624515 3757611
5716 3757611 3724097 3747696 3781250 3759458 3949088 3876462 3894720 4002803 3951540 3902897 4091311
5705 4091311 4318240 4330166 4333889 4456797 4431363 4511676 4560825 4441604 4508575 4628639 4678937
5694 4678937 4744257 4723606 4727546 4776221 4904451 5150913 5244411 5359450 5459440 5478710 5636242
5683 5636242 5745925 5774684 5716836 5667855 5625832 5670264 5879425 5941011 5826978 5831033 5872821
5672 5872821 5940205 5947571 5972389 6057702 6258780 6346149 6398027 6399364 6522501 6803936 6898814
5661 6898814 7006937 7305713 7557535 7902542 8349055 8673680 9043220 9364819 9740083 10129997
5651 10129997 10608162 10709709 10661157 10650185 10721066 10924378 10914549 10924861 11114842 11315706
5641 11315706 11615367 11869063 12139298 12378436 12729559 13049817 13441543 13832343 14356047
5632 14356047 14794575 15369853 16063161 16880830 17610023 18333233 19150882 20229131 21400466
5623 21400466 22525209 23902698 25326098 26788349 28355264 29965908 31503697 33284566
5615 33284566 35271675 37347124 39895060 42693863 45599477 48920979 52841525 56804629
5607 56804629 61166837 66268673 71803551 78040271 84812743 92322572 100454239 109253307
5599 109253307 118605757 128500568 138583966 148779723 158675793 167873542 175819149 181922759
5591 181922759 185862050 187550907 186711698 183684572 178871114 172488323 165182103 157399993
5583 157399993 149048282 140253818 131370617 122422545 113478177 104820662 96738986 89210778
5575 89210778 82400104 76311644 70681808 65610815 60873503 56692757 53066481 49642551
5567 49642551 46564213 43602816 41040171 38896870 36967196 35312698 33657287 32173985
5559 32173985 30874104 29653691 28436405 27269007 26256797 25138384 24127110 23169145
5551 23169145 22378485 21494173 20781584 20140671 19407012 18688838 18123550 17641602 17018733
5542 17018733 16328454 15823104 15403651 14975669 14571452 14185377 13718025 13236169 13024801
5533 13024801 12638148 12178561 11768747 11603293 11485692 11156928 10981301 10741143 10559203
5524 10559203 10451003 10199962 10097964 9920135 9708194 9735222 9625575 9534946 9409535 9264949
5514 9264949 9135751 9129458 9139971 9005424 8832535 8767821 8714722 8559721 8357432 8249982
5504 8249982 8216416 8129073 8105087 8016794 7814678 7691359 7711213 7326990 7134099 7003089
5494 7003089 6870144 6709582 6603601 6419430 6283297 6230126 6168895 5976578 5781822 5767097
5484 5767097 5533895 5314893 5212088 5178891 5083323 5053390 4931250 4901788 4823367 4678717
5474 4678717 4618585 4630628 4569293 4505821 4462396 4360571 4294732 4271564 4190607 4122884 4086728
5463 4086728 4125007 4116252 4019349 3960891 4054849 4071071 3955533 3993459 3899767 3948329 3858521
5452 3858521 3808892 3814591 3884174 3851813 3808696 3873327 3878377 3801881 3807228 3867647 3690091 3822350
5440 3822350 3836730 3845384 3803131 3812905 3838401 3900924 3841748 3885982 4024732 3974206 3944259 3861470
5428 3861470 3991493 4041479 3931514 3992690 4089048 4214534 4338947 4258791 4381701 4390938 4568034
5417 4568034 4787768 4823743 5002653 5250241 5418753 5566593 5771708 6029820 6234720 6518791
5407 6518791 6869795 7224466 7562724 8115345 9060880 10063965 11142293 12094427 12811383
5398 12811383 13649769 14450144 14891201 14636368 13352106 11970162 10917984 9913248 9220627
5389 9220627 8572033 7980763 7376245 6797157 6478977 6275861 5988578 5715685 5379736 5084431
5379 5084431 4938814 4869258 4662354 4531681 4393193 4180126 4016673 3880441 3844885 3789191
5369 3789191 3848838 3766558 3593078 3545694 3501688 3307511 3376491 3416295 3201808 3110053 3067903
5358 3067903 3079346 3023011 2876226 2812511 2742817 2713293 2749176 2778381 2644714 2595679 2588651
5347 2588651 2666961 2705436 2805164 2781409 2826804 2916560 2882217 2891042 2824331 2770544 2619704
5336 2619704 2461923 2450441 2456244 2529837 2489462 2566115 2383730 2439083 2506954 2489729 2472778
5325 2472778 2366995 2448584 2465827 2496535 2482988 2479556 2404619 2398030 2532407 2595479 2546179
5314 2546179 2587339 2452648 2535438 2507390 2463874 2479749 2425661 2407399 2324729 2352391 2447013
5303 2447013 2461039 2461888 2456992 2474101 2492579 2536714 2614267 2568368 2522395 2643876 2688632 2651517
5291 2651517 2705775 2776383 2833670 2835334 2927609 3041596 3094437 3111319 3138076 3192599 3060400
5280 3060400 2966757 2953335 2893130 2928682 2880819 2834493 2766993 2652625 2460677 2503867 2453067
5269 2453067 2318325 2475455 2590225 2425674 2363099 2285048 2258165 2232727 2365295 2449233
5259 2449233 2364449 2436028 2359391 2366516 2337221 2342283 2354783 2464171 2434919 2402578 2516963
5248 2516963 2528977 2550498 2628713 2753225 2838482 2903414 2976173 2871026 2905437 2945264 2970030
5237 2970030 2933043 3083430 3122114 3218794 3330816 3393115 3433119 3539625 3460274 3607151 3625074
5226 3625074 3488368 3546336 3527157 3450997 3388468 3296729 3309135 3349260 3407170 3419966 3458936
5215 3458936 3550745 3725409 3879293 3797863 3854536 3917272 3933830 4027960 4066092 4073633 4153179
5204 4153179 4110694 4105152 4070696 4068809 3994084 4137488 4144541 4075922 4093636 4137308 4174258 4211077
5192 4211077 4127074 4184985 4220548 4429008 4542172 4507565 4557420 4662226 4773161 4851444 4758694
5181 4758694 4664357 4571869 4403447 4401711 4492676 4442937 4414805 4573776 4589883 4510036 4414410
5170 4414410 4475028 4650165 4613573 4704400 4865322 4864696 4927442 5066869 5101824 5109414 5311111
5159 5311111 5325208 5373715 5441077 5607341 5798581 6030322 6167156 6225659 6381695 6406973
5149 6406973 6505321 6445525 6384856 6328912 6295543 6359271 6434160 6274923 6200580 6110874 6021751
5138 6021751 6167189 6300091 6370963 6484638 6572288 6536741 6673448 6885420 7085430 7259147
5128 7259147 7608797 7982084 8346745 8638693 8977147 9341113 9569323 9831853 9807477 9615539
5118 9615539 9391037 9088723 8742564 8608495 8619364 8533206 8356452 8333143 8448838 8496994
5108 8496994 8530256 8504867 8490585 8313394 8084049 7909758 7844608 7712256 7626877 7578868 7383828
5097 7383828 7393106 7365898 7287471 7175255 7261328 7173105 7107891 7182389 7187616 7061139 7080990
5086 7080990 7076104 7031222 7136241 7114469 7122289 7079928 6983446 7044151 7006274 6968628 7090104
5075 7090104 7157032 7163000 6999567 6907655 6817412 6709035 6548504 6480048 6470978 6333815 6243299
5064 6243299 6245929 6175577 6135049 5952758 5945093 5808454 5877130 5959246 6063126 5935683 5819843
5053 5819843 5883374 5799019 5806780 6020102 6113688 6117603 6077870 6134299 6251243 6370777 6486256
5042 6486256 6624493 6658106 6557984 6717231 6842011 6862301 6882869 6878711 6912647 7114768 7302415
5031 7302415 7386017 7333868 7507910 7673295 7781815 7975576 8133759 8268467 8337846 8552249
5021 8552249 8831942 9180880 9373333 9593268 9909242 10259365 10502718 10607509 10881022 10948586
5011 10948586 11017806 11041811 10994800 11075528 11210773 11295426 11510061 11792013 12222437 12542349
5001 12542349 12685622 12992370 13295290 13415307 13655351 13784565 13788041 13784009 13741900 13816678
4991 13816678 13896653 13935506 14111288 14366975 14501159 14559093 14831136 15084166 15398079 15674097
4981 15674097 15961773 16417289 16826325 17203182 17720027 18384063 18892238 19464736 19997012
4972 19997012 20477680 20990439 21542549 22080910 22695270 23263548 23919143 24597514 25134824
4963 25134824 25724825 26384221 26979485 27807940 28427565 29061205 29943263 30847162 31786653
4954 31786653 32655573 33744739 34840455 36067479 37565403 39161791 40726839 42391583
4946 42391583 44424167 46651849 48697236 50908836 53351284 56043240 58843810 61993739
4938 61993739 65454089 69349720 73543125 78214080 83466900 89362066 95873229 102858174
4930 102858174 110402492 118714330 127563493 137107234 147591600 158909725 171128400 184307978
4922 184307978 198466400 213448816 229178319 245333710 261463312 277180696 291816294
4915 291816294 304549055 314764300 321895527 325005027 323934663 318896641 310441777 299269958
4907 299269958 285973485 270883975 254525625 237405771 219892900 202497711 185998438
4900 185998438 170827568 156978526 144837606 134019073 124439482 116002892 108612764
4893 108612764 101942017 96197937 91185822 86709865 82723383 79221599 76241827 73513343
4885 73513343 70919793 68454564 66091024 63801173 61525617 59292058 57201028 55296322
4877 55296322 53495483 51825203 50217392 48618629 47163362 45971454 44848758 43958150
4869 43958150 43130962 42423630 41847213 41350800 40937555 40609961 40322922 40390453 40376576 40509875
4859 40509875 40790377 41188743 41770754 42618064 43608581 44851203 46286273 47989202 49912623
4850 49912623 52206376 54625051 57056842 59569737 61659990 63482847 64705213 65316748
4842 65316748 65019936 63723406 61577803 58988311 56007617 53014678 49824940 46786851
4834 46786851 44035852 41577311 39238627 37090066 35125252 33374448 31912408 30512717
4826 30512717 29281895 28161404 27065234 26077788 25249942 24546795 23797266 23185279 22732646
4817 22732646 22268087 21815781 21441050 21114250 20736344 20353897 19958069 19561876 19271739
4808 19271739 18918326 18692245 18509934 18301524 18127684 17866308 17725165 17642109 17597353 17396163
4798 17396163 17274124 17160702 17212110 17204844 17116669 17085393 17126330 16964407 16953104 16980667 17110526
4787 17110526 17018854 16890740 16906140 16962119 16905693 16961921 16976569 16902041 16872808 16905273 17097023
4776 17097023 17285192 17562160 17712034 17685905 17809201 18074704 18243980 18406890 18520914 18658854
4766 18658854 18818358 19159871 19204898 19333710 19506651 19644454 19749201 19934420 20064855 20221857
4756 20221857 20481720 20838665 21108943 21401451 21723228 21889172 21996622 22364328 22595420
4747 22595420 22900629 23144416 23477108 23847463 24352662 24838041 25206846 25736479 26351992
4738 26351992 26808032 27507085 28288464 28982683 29743871 30720909 31816326 33030940 34102874
4729 34102874 35386481 36744846 38322660 40195605 42409723 44776774 47406188 50531625
4721 50531625 53965053 57755260 62072572 66910608 72380456 78603883 85534314 93171317
4713 93171317 101586676 111212202 121466274 132309305 144961218 160446684 180032505
4706 180032505 204701003 236203710 271719082 305872901 335810047 358289129 372337075
4699 372337075 374576841 354850265 317487081 280274058 247653320 220818948 198535796
4692 198535796 179408318 163221185 149785549 138070695 127157099 117393262 109386926
4685 109386926 102889364 97530809 93015122 89337350 86216375 83671449 81537852 79661390
4677 79661390 78335623 77287540 76535649 76129930 76166612 76522311 76994058 77882951 79079682
4668 79079682 80609209 82610556 85188372 88361599 92046546 96096101 100620465 105879826
4660 105879826 111711329 118322389 125635451 133704133 142604747 152483150 163411325 175974565
4652 175974565 190955676 208854814 230194150 255184939 282258838 309058138 332837423
4645 332837423 350412569 360093364 360197506 349099859 327960648 302108708 276585044
4638 276585044 253768487 234347178 218247481 205069586 194132099 184758260 175948869
4631 175948869 167877739 160253628 152610057 144255621 135892504 127971136 120695909 114189509
4623 114189509 108085696 102453202 97257818 92386771 87932650 83827194 80224192 76664976
4615 76664976 73334366 70101635 67011948 64220401 61745061 59263978 57151449 55407769
4607 55407769 53608378 51893968 50331961 48734521 47320174 45942524 44592757 43430596
4599 43430596 42245760 41100092 40030439 38888106 37616401 36380348 35205475 34052182
4591 34052182 32965530 31974293 31008062 30084436 29343665 28722619 28163367 27643786 27191420
4582 27191420 26773592 26279785 25808030 25343466 24903170 24470237 24095626 23640766 23340607
4573 23340607 22983266 22698216 22481153 22281496 21990984 21929507 21849915 21518411 21389071 21176229
4563 21176229 21001179 20867263 20808621 20732131 20620324 20414221 20143700 19991179 20028214 19755296
4553 19755296 19532199 19243724 18970154 18702196 18137673 17682939 17311648 17163146 17046316
4544 17046316 16880684 16895198 16918591 16893360 16998393 17097848 17295642 17424922 17590976 18046882
4534 18046882 18337099 18778309 19121696 19637530 20184345 20575253 21055680 21502069 22096547
4525 22096547 22693746 23326120 23760696 23871832 23912197 23810875 23393727 22700900 22077854 21553496
4515 21553496 21081269 20935143 20688439 20634287 20730697 20913244 21281100 21846776 22417437 23483583
4505 23483583 24800789 26247589 27791315 29222643 30150712 30737183 30679114 29935994 28473600
4496 28473600 26385754 24355485 22420692 20587940 19067299 17786400 16620238 15590450
4488 15590450 14785306 14004156 13229955 12539663 12089973 11562970 10980973 10626868 10319293
4479 10319293 9926835 9549476 9242423 9096873 8915686 8727558 8487967 8335357 8148266
4470 8148266 8023030 7864573 7753960 7856453 7794884 7661463 7765952 7674964 7555223 7521608
4460 7521608 7508390 7647446 7564819 7515463 7312535 7337557 7150357 6880166 6769585 6817276
4450 6817276 6819704 6856477 6913031 7121277 7109361 7123663 7156362 7152056 7147369 6959691 6704375
4439 6704375 6665397 6475786 6356461 6264395 6303043 6359925 6336419 6340835 6194106 6004184 6091850
4428 6091850 6059769 5888444 5924683 5944692 5982501 6020505 6022474 5849771 5804429 5751876 5698680
4417 5698680 5658835 5602843 5475442 5517127 5439315 5370472 5358422 5323898 5167735 5204548 5242551
4406 5242551 5198464 5104719 5032212 4922781 4860730 4745141 4638816 4693752 4543968 4377143
4396 4377143 4333738 4269054 4138552 4204604 4255892 4313122 4431619 4473627 4572255 4677068 4731556
4385 4731556 4956288 5186868 5332986 5309541 5294806 5098579 4904398 4674435 4336305 4116183
4375 4116183 4052826 3939519 3810678 3757561 3636836 3594553 3498495 3470830 3483531 3467978 3456715
4364 3456715 3418031 3373251 3432972 3512072 3395834 3305868 3350209 3414106 3446155 3458705 3538795
4353 3538795 3502182 3576166 3711976 3819237 3872880 3772398 3758474 3776573 3817226 3827324 3820332
4342 3820332 3825941 3925574 3988289 3937429 3704241 3628933 3497388 3412120 3340788 3135840 3029616
4331 3029616 2947289 2757045 2780122 2741018 2718916 2730709 2675734 2608205 2461510 2404783 2375905
4320 2375905 2330117 2351599 2373412 2244792 2241353 2210212 2175175 2092698 2035142 2123350 2096584
4309 2096584 2053251 1956269 1844377 1931348 1966971 2015936 2000167 2007565 1879421 1959613 2072351
4298 2072351 2093413 2185732 2108046 2076624 2014191 2070509 2161049 2183750 2114657 2019981 2028492 2066582
4286 2066582 2032576 1826891 1792480 1688356 1760640 1774643 1740329 1725542 1720575 1685732 1718097
4275 1718097 1720145 1616544 1536701 1529786 1493866 1481829 1475099 1403835 1368482 1450451 1575302 1495621
4263 1495621 1430561 1418777 1417008 1421856 1327729 1401800 1400499 1341998 1263476 1221993 1357386 1245051
4251 1245051 1095329 1135424 1178081 1016138 1055860 1135002 1206817 1159195 1097213 1063250 1173622
4240 1173622 1379045 1288417 1315526 1291607 1112453 1192506 1277657 1348982 1289416 1136717 1063360
4229 1063360 1141318 1194675 1033993 1067196 996544 1010319 1265775 1301213 1245829 1318092 1200347
4218 1200347 1275800 1412784 1424003 1405842 1418596 1516119 1351529 1229699 1362591 1310616 1395209
4207 1395209 1410312 1302027 1305374 1314457 1252574 1222174 1345452 1163230 1221488 1105419 1089710
4196 1089710 1202154 1258162 1296049 1283687 1303722 1291317 1160067 1331425 1330175 1219401 1367598
4185 1367598 1439520 1555339 1464514 1572395 1638825 1616349 1695144 1712940 1712762 1747469 1811265
4174 1811265 1810632 1794831 1800369 1739337 1816639 1734092 1630063 1641211 1708296 1744866 1804529 1853803
4162 1853803 1845408 1846620 2011672 2099847 2068673 2256718 2274992 2394744 2417989 2468637 2528437
4151 2528437 2521591 2448976 2369526 2192024 2157384 2136402 2009091 1816407 1890180 1965464 1845913
4140 1845913 1771465 1782205 1825709 1724602 1612275 1803276 1856390 1755866 1774952 1844344 1977557
4129 1977557 2070123 2056141 2059261 2121750 2119822 2127361 2195263 2221091 2136740 2216970 2169356 2148096
4117 2148096 2228054 2185639 2169809 2247175 2252933 2096236 2018923 2011012 2041439 2110599 2006285
4106 2006285 1919038 1832655 1816322 1693416 1625580 1601965 1656384 1743361 1714895 1572560 1486539
4095 1486539 1442737 1511471 1519521 1630474 1685947 1619681 1610590 1660328 1605449 1469554 1356884
4084 1356884 1387080 1464857 1355650 1336320 1391166 1418174 1313139 1337682 1363839 1407582 1281019
4073 1281019 1275037 1430117 1281688 1220955 1282261 1252816 1381950 1435878 1401796 1401300 1447742
4062 1447742 1610557 1651892 1584959 1521028 1490389 1491495 1539424 1390931 1361001 1399607 1399518 1310638
4050 1310638 1443179 1364840 1235882 1257798 1171718 1097316 1060730 1160620 1231021 1187172 1187114 1184693
4038 1184693 1275711 1301422 1177731 1228757 1087538 1160645 1315349 1291588 1354846 1368083 1450574
4027 1450574 1494293 1459585 1403568 1465521 1383594 1409239 1382165 1328214 1357660 1421941 1464374
4016 1464374 1502507 1443065 1391480 1465100 1395217 1491411 1581820 1624853 1636196 1608480 1686509
4005 1686509 1703028 1632861 1546341 1341796 1346742 1419871 1390686 1350781 1301077 1381225 1483561
3994 1483561 1384137 1405405 1430899 1451234 1368828 1505563 1376554 1390156 1390295 1481454 1326395
3983 1326395 1152069 1211666 1239526 1251387 1306297 1398730 1313938 1343076 1195796 1111628 1147132
3972 1147132 1190505 1203892 1148396 1110913 1064895 1063868 1148463 1112133 1127984 1143862 1093380 1023133
3960 1023133 1017543 1037542 1125404 1017121 1011000 1009983 1237643 1185333 1008642 1055390 1144296
3949 1144296 1165610 1124597 1165360 1073729 1063978 1084902 1055553 1046704 1146911 1075622 1150612 1060595
3937 1060595 1072977 1051280 1010610 1007089 1008237 986210 988065 929926 907316 1048223 1069678 1121578
3925 1121578 1160542 1162061 1172420 1123391 1167958 1163308 1131819 1249163 1229777 1212368 1220941 1158537
3913 1158537 1094750 1176931 1314914 1265730 1267613 1263257 1235156 1338267 1354556 1437741 1481342
3902 1481342 1393522 1267895 1344947 1369180 1433327 1565111 1489512 1438679 1378084 1414220 1446103
3891 1446103 1377032 1449479 1492701 1595888 1598019 1484901 1458052 1581820 1557310 1509996 1428834
3880 1428834 1382119 1486783 1565719 1583268 1625844 1677007 1656248 1561871 1661467 1707919 1770382
3869 1770382 1762591 1649887 1621840 1594217 1646524 1670033 1628522 1686349 1660274 1660913 1691394 1744113
3857 1744113 1750556 1745921 1762956 1843880 1764099 1788927 1878907 1845257 1797154 1731500 1736762 1586983
3845 1586983 1719718 1740152 1828069 1770140 1711243 1747930 1689409 1660444 1622797 1652171 1784754
3834 1784754 1745932 1767332 1895945 1770193 1744928 1688473 1659644 1708034 1753222 1660332 1530614
3823 1530614 1637473 1603471 1507281 1449748 1475834 1468938 1444348 1550963 1569046 1582600 1580506
3812 1580506 1655873 1781850 1692547 1573374 1651143 1734175 1587861 1637154 1689690 1741998 1893082
3801 1893082 1806015 1712815 1694321 1563389 1532711 1575865 1714141 1766119 1604508 1696254 1797714
3790 1797714 1616762 1665093 1710122 1812727 1777088 1735280 1680173 1731587 1732156 1638955 1751592
3779 1751592 1750121 1712225 1711462 1610033 1590885 1660321 1760116 1824380 1859430 1745094 1748369 1933062
3767 1933062 1842695 1992577 1985620 1941100 2053307 2032794 1819266 1942688 1947959 1974929 2030428
3756 2030428 1993476 2096899 2335462 2312090 2260184 2289112 2261381 2234792 2256735 2161207 2346084
3745 2346084 2547447 2644575 2801850 2831715 2830883 2963998 3098186 3199945 3281006 3312122 3362094
3734 3362094 3423276 3481649 3468618 3382124 3366392 3334437 3220348 3117825 3005242 3017889 2875303
3723 2875303 2817198 2810902 2824178 2776123 2880122 2885120 2866068 2842783 2887517 2975201 2841685
3712 2841685 2843155 2894186 2963002 3031833 3027172 3105311 3203034 3345428 3337093 3431269 3413669 3452015
3700 3452015 3376989 3322696 3226570 3072159 3096041 2959844 2837147 2782971 2633459 2661108 2577694
3689 2577694 2433341 2376170 2487613 2422060 2350427 2327712 2261816 2228816 2199196 2284954 2218569
3678 2218569 2178294 2181955 2023275 2026178 2107770 2119817 2154339 2093479 2045032 2048156 2007245 1851791
3666 1851791 2021107 2085475 1954985 1871124 1928473 1903707 1933183 2083024 2053986 1950380 1956110
3655 1956110 1900080 1836375 1903839 2060009 2063014 1993970 1955825 1878953 1924705 1874349 1884323 1897481
3643 1897481 1892308 1932223 2018533 1982604 1919106 1837678 1887557 1913301 1833151 1876244 1904997 1831657
3631 1831657 1847025 1990481 1957834 2133541 2211113 2172383 2097509 2080633 2090787 2172011 2148642
3620 2148642 2065568 2025026 2051630 2057838 2074580 2089480 2159287 2282281 2249719 2170649 2187518
3609 2187518 2250790 2387247 2273688 2318759 2404275 2343130 2277186 2373296 2469733 2511923 2550736
3598 2550736 2579097 2462244 2511286 2529824 2545032 2427765 2363354 2461276 2415619 2573845 2650655
3587 2650655 2670695 2599177 2763179 2782523 2797503 2698929 2694100 2726830 2734405 2886136 2819387
3576 2819387 2812296 2883219 3002204 3094024 3066186 3096387 3154568 3245786 3365022 3361152 3270935
3565 3270935 3239678 3223510 3222504 3211438 3347973 3439102 3506100 3429041 3454526 3667384 3714284
3554 3714284 3785242 3837763 3843358 3938517 3781272 3929932 3956342 4008244 4127401 4234917 4469145
3543 4469145 4475135 4441722 4558839 4692571 4787300 4948931 5010692 5153650 5371575 5561679
3533 5561679 5697868 5851982 5987221 6012254 6186306 6223833 6141282 6159671 6273740 6372797
3523 6372797 6378357 6506803 6549025 6759213 7066020 7229513 7336860 7398261 7462635 7673415
3513 7673415 7789972 7853069 8033530 8260551 8515299 8825040 9102684 9384479 9606143 9938690
3503 9938690 10276663 10607122 10835674 11217392 11444744 11700514 11854462 11914806 12247907 12561679
3493 12561679 12750313 12869446 13260727 13615503 14103600 14644393 15238537 15732904 16282740
3484 16282740 16803094 17488728 18251789 19107191 20205186 21175643 21949393 22637862 23520828
3475 23520828 24231980 25032864 25743815 26042056 26252518 26238184 25864314 25329762 24832076 24170192
3465 24170192 23455153 22745186 21971899 21185573 20470361 19814825 19114018 18552718 18073915
3456 18073915 17713774 17233580 16761378 16408399 16116594 15870547 15631769 15385352 15236369
3447 15236369 15114380 14871896 14836133 14881191 14881034 14808127 14850369 14851431 14889670 14682812 14347926
3436 14347926 13791115 13339898 12972386 12462288 12176072 11854473 11652714 11348848 11045440
3427 11045440 10845846 10746472 10578398 10355175 10258284 10184391 10182183 10113040 10017049 9990651 9921923
3416 9921923 9979907 9948914 10022251 10261874 10630878 11066846 11287798 11635469 11961636 12051589
3406 12051589 11996616 11620747 10923581 10414151 9993156 9358788 8988109 8684949 8505913 8220551
3396 8220551 8066547 7918166 7695771 7712779 7660435 7493351 7208635 7273968 7183107 7038255
3386 7038255 7023390 6958761 6896422 6890179 7015360 7113200 7203300 7419064 7620232 7644089 7761452
3375 7761452 7697490 7548474 7411293 7263581 7008225 6702719 6529321 6354096 6221793 5954516
3365 5954516 5900548 5732006 5590724 5455485 5417690 5342059 5228528 5216914 5108803 4895497
3355 4895497 4845997 4875916 4805847 4666113 4578152 4584170 4481516 4425884 4430577 4488155 4524299
3344 4524299 4543177 4297030 4191761 4047581 4061991 4031036 4042344 3982641 4041659 4044804 3983838
3333 3983838 4034109 4119867 4135721 4153414 4136360 4092027 4132917 4079089 4174783 4067767 4026289
3322 4026289 4036530 3978480 3840588 3629767 3567657 3455839 3417519 3430836 3375390 3404299 3422191
3311 3422191 3394036 3456812 3406450 3375280 3365450 3405760 3409512 3342487 3367654 3393797 3253066 3219617
3299 3219617 3251393 3262472 3369551 3366241 3197757 3220714 3190707 3047705 2998739 2986807 2991540
3288 2991540 2988080 3105176 3049682 3035468 2929386 2821395 2715877 2870866 2840521 2833305 3001750
3277 3001750 2984932 2880594 2918419 2831682 2752240 2695465 2880949 3071943 2898239 2839709 2908551
3266 2908551 2917017 2917926 2930568 2886546 2725991 2575134 2548434 2606833 2492957 2477557 2566366
3255 2566366 2543961 2501637 2474322 2387750 2288300 2335408 2404544 2388576 2309656 2415138 2459488
3244 2459488 2512902 2482169 2323581 2369958 2461196 2478862 2600188 2585693 2408051 2307438 2325060
3233 2325060 2382313 2385629 2295001 2357242 2362208 2288319 2292090 2338833 2419496 2420475 2328990 2257774
3221 2257774 2337186 2401242 2374808 2239874 2291595 2419993 2373921 2379083 2373886 2448548 2561388
3210 2561388 2443805 2429268 2391143 2367467 2375429 2417733 2568888 2526604 2605303 2699723 2662577
3199 2662577 2778316 2762594 2728924 2785026 2771236 2754599 2797153 2796477 2824407 2854015 2916175 2985414
3187 2985414 2936216 2932927 2934908 3058806 3198756 3128687 3277908 3252019 3235944 3482649 3508288
3176 3508288 3563393 3642681 3625502 3776686 3942248 4008426 4136084 4086356 4196372 4332932
3166 4332932 4518289 4645782 4676194 4866643 4877357 4902987 5109801 5249663 5339712 5514329
3156 5514329 5704551 5642767 5748183 5909226 6115583 6151579 6189943 6262120 6378361 6462213
3146 6462213 6579197 6790368 7077701 7344828 7445231 7666718 7961234 8182765 8448879 8751297
3136 8751297 9029571 9369436 9676724 10009431 10226879 10361092 10616484 10680389 10795233 10618835
3126 10618835 10441291 10347607 10171224 10067392 9914367 9765498 9801231 9757389 9826858 9942406
3116 9942406 9973484 10048341 10249753 10388778 10537975 10663474 10906478 11195376 11335872 11403474
3106 11403474 11554960 11604385 11529082 11681223 11723566 11656629 11424015 11379232 11133145 10849312
3096 10849312 10559386 10288869 10099762 9858435 9634639 9422706 9312130 9082491 8960681
3087 8960681 8966697 8743948 8646304 8559428 8581705 8610595 8587522 8465029 8288805 8069204 7989743
3076 7989743 7737904 7585769 7358051 7203580 7023237 6805414 6487710 6118508 5817846 5596884
3066 5596884 5534883 5356299 5034897 4823116 4697257 4556197 4512230 4383905 4267237 4085818
3056 4085818 3978347 4120197 3986333 3835052 3667443 3628949 3607763 3495117 3327336 3287277
3046 3287277 3321933 3189833 3058621 2852812 2743967 2660125 2592320 2573045 2416329 2370091
3036 2370091 2343682 2320683 2283255 2247258 2136378 2030433 2053397 1936766 1840596 1740017 1683216
3025 1683216 1807443 1860450 1762709 1642331 1551253 1516264 1505191 1620058 1695406 1534352 1366460
3014 1366460 1539571 1643896 1631323 1508811 1462877 1453332 1463359 1372388 1308626 1228221 1260471
3003 1260471 1206862 1149315 1256605 1386479 1431814 1263446 1154266 1187459 1140335 1239609 1199504
2992 1199504 1008437 1009553 1137407 1058451 988223 970397 935648 900546 873169 789058 820261
2981 820261 874103 914487 1008781 965244 833429 687490 702826 703332 740177 763455 752400 853276
2969 853276 762176 881431 867755 785719 823998 797641 782850 648422 643073 601794 555899
2958 555899 583743 589096 625708 638092 630314 562856 425536 414809 389210 439339 486557 478174
2946 478174 374867 345815 333734 343042 390153 451554 556911 533681 393320 429057 428078 504495
2934 504495 533940 479890 497081 344854 344706 343816 396580 427064 487163 575213 557866 504341
2922 504341 439081 369583 415713 510653 455068 284356 242357 287367 351510 247075 203709
2911 203709 274034 240420 283927 214595 242904 291242 322873 304255 286610 108823 73778
2900 73778 180867 121379 133761 232510 171255 206549 196285 315382 361974 250721 318171
2889 318171 204068 269395 286921 234474 247581 212618 193181 205248 289239 350097 318210
2878 318210 265800 334181 366116 360960 296075 257082 313200 322048 346903 469883 351175 329909
2866 329909 300789 230587 290958 216905 91938 76236 164322 226516 210663 167109 221209
2855 221209 323756 278063 113428 153329 171852 94387 150756 234678 183339 259595 203169
2844 203169 182540 113392 -15384 91442 171570 105014 281435 210774 64805 68285 108489
2833 108489 246595 188883 248292 144270 249693 170177 120936 353144 261316 226616 170116
2822 170116 111785 45512 61022 111460 213851 235390 187198 277669 252522 236655 212575
2811 212575 164210 127563 112443 95188 178421 144372 152282 236918 134890 122609 269503
2800 269503 205382 142849 80280 69380 104078 98232 113200 112524 84994 133785 153212 -3425
2788 -3425 -52258 112913 199867 163928 132652 85446 118634 65915 14384 42260 1464 35438
2776 35438 104198 81812 131728 115274 75178 147201 154594 41976 -2804 -2431 19876 -61145
2764 -61145 10753 93384 19858 30905 72138 98680 51901 7548 86382 91496 -8893 -40705
2752 -40705 -6974 -21495 -45581 -48351 -13724 -19467 27009 -25112 -11272 36813 -90699 -107895
2740 -107895 -142888 -72148 108090 203122 130117 106939 65242 90253 25379 94073 181590
2729 181590 12011 21182 50287 47528 9262 89022 96665 39651 51118 100286 128441 79014
2717 79014 -3847 72643 26449 3596 -24925 -10171 23844 -1403 -9349 -32361 479 2609
2705 2609 -17446 -167367 -118823 -47215 -37144 -9182 41876 57925 109709 178595 -6730 -114560
2693 -114560 -122662 -52136 -24013 -56477 -12510 -86152 65081 61341 -13348 3283 100918 154699
2681 154699 175698 158191 92925 50891 4525 -60035 120449 127401 -4361 75586 62640
2670 62640 -193 -49908 -5668 -41086 -12710 -42654 -52700 -59677 -5767 16214 -76851 -104344
2658 -104344 31053 -16723 -107580 -30591 -8505 49192 75322 39587 51310 -146327 51130
2647 51130 -53367 46378 149279 -15858 -77734 -23872 -2112 -88923 15218 19427 -19348
2636 -19348 -77247 -3343 79258 71464 -2816 126771 93084 58383 113641 19282 -113536 11383
2624 11383 32066 75855 90469 60198 52514 -48348 -69221 -146991 -170364 -83724 43400 29577
2612 29577 70462 51212 153424 118714 -78684 62051 50826 182938 291733 299232 311437
2601 311437 301600 229563 246223 176585 194053 119626 159594 218959 161850 118720 175772 187901
2589 187901 141021 166704 142917 165206 164230 187443 81353 51501 58466 74282 173401 277137
2577 277137 297318 171554 44682 75912 122489 69016 76184 -5908 38384 110781 144628
2566 144628 93554 13613 27833 6266 -30196 -120524 -115838 -88095 -79888 33700 119718 157997
2554 157997 36340 -22574 -81374 -34598 94577 13141 888 91754 -1802 2281 152567
2543 152567 -68281 -117259 11250 41720 29085 -37312 -29515 -73828 -168757 -141974 -141483 -61953
2531 -61953 83625 147862 119399 10596 -43807 103838 196378 189516 57686 23062 -32636
2520 -32636 29258 53934 -35994 -179576 -231110 -35754 89658 2362 40385 189983 189096
2509 189096 110315 96924 102952 120156 145856 53893 37098 60506 123067 211562 236340 142834
2497 142834 36716 26093 30215 125773 13417 42733 142496 130947 26301 -59826 43847
2486 43847 152983 190086 53849 56983 159675 254649 198674 76076 43606 76060 159009
2475 159009 86053 57050 69391 123236 184398 155656 41165 -4762 38300 120428 76974
2464 76974 62974 85046 89510 91850 80748 62989 35010 85524 151908 168682 165651 147253
2452 147253 124427 223952 214173 153752 137978 230777 263381 193830 157214 196109 183269 346292
2440 346292 363399 122982 211083 251289 289327 303329 203962 227773 257957 242551 158370
2429 158370 171935 156738 126075 236237 238342 310202 347214 317924 287370 303551 330246 300263
2417 300263 429259 300678 285784 311348 379489 429624 425722 379519 291473 330165 211882
2406 211882 300119 400896 445124 569721 517732 487818 415252 412520 475163 553411 592244
2395 592244 597230 634515 639502 710950 773400 730097 881939 845519 1020631 1147033 1095404
2384 1095404 1030988 1065851 1138598 1043363 1102258 1121331 1107611 1177259 1182422 1307000 1334681
2373 1334681 1457391 1572210 1531601 1734565 1679298 1821088 1979930 2011196 2189351 2301005
2363 2301005 2471055 2711069 2811980 2986299 3316316 3564334 3733702 4133757 4523006 4989301
2353 4989301 5351431 5969897 6592109 7303776 8100518 8948752 9763934 10670037 11785345
2344 11785345 12837407 14029382 15171289 16359983 18059553 19929602 22459881 25805710
2336 25805710 30424878 35408114 40567652 45176484 47674345 49062957 48550114 45194553
2328 45194553 39450911 34085646 29527309 25984543 23001737 20450111 18350351 16772882
2320 16772882 15305529 13836791 12596765 11623298 10844307 10079903 9296936 8578965 7940492
2311 7940492 7232871 6741374 6339037 5900858 5558823 5320307 5024116 4680631 4464191 4325199
2301 4325199 4096246 3836451 3618343 3506007 3336994 3290116 3136912 2877265 2717206 2524392
2291 2524392 2296228 2359302 2271338 2147615 2090933 1917846 1886771 1735657 1619249 1642399
2281 1642399 1536883 1473507 1515518 1436951 1346104 1286528 1245611 1227428 1139671 1123399 1127824
2270 1127824 1095022 946315 856799 848004 928486 873671 898279 793507 861651 658029 774096
2259 774096 902373 854244 820665 805314 679907 815815 952730 747015 601713 633797
2249 633797 722203 638461 628510 681236 624153 541211 479157 558185 500383 433620 553576 530357
2237 530357 541061 507958 470941 475323 528927 512552 483488 411488 385336 379956 557692 467074
2225 467074 406864 490395 478710 388201 305999 333354 440785 458183 369858 376591 316081 163377
2213 163377 156098 265558 265769 273714 276439 333743 378603 280348 214542 167681 227976 366628
2201 366628 387776 212799 286703 188349 279802 197794 189633 281556 296618 140535 134539 122346
2189 122346 180819 310149 289787 281238 179126 295695 242825 174339 114136 161890 110120
2178 110120 77401 65086 68379 226074 76784 50075 73101 93760 63839 35787 159063
2167 159063 138621 149762 151423 135624 99059 113600 171993 19887 -16082 212370 175001
2156 175001 167481 -11490 -2413 62165 -19087 45282 58565 49483 -28007 3303 53403 127455
2144 127455 33729 -15129 -2774 -63433 -19520 -62824 -18488 -21179 -11336 97506 -5075 -4407
2132 -4407 -18455 -7889 -51220 -84766 -176 22222 70223 75383 68335 46553 -9672 7458
2120 7458 67457 100274 107513 -1677 11372 74823 -2104 -31182 792 -98088 -180688 -174827
2108 -174827 -61045 62643 139443 64644 -40703 -6070 -66316 -104909 -80346 -93756 -70165
2097 -70165 -97042 -112037 -65856 -77324 -176640 -54995 63629 38045 61960 64416 -54299
2086 -54299 -61517 -49341 86543 221720 120887 69869 66406 -20974 -61561 -57449 -56805 61732
2074 61732 77223 39213 -31312 35035 124268 82590 52591 139866 200017 221367 323377 299220
2062 299220 208146 164126 223121 255282 181786 163151 169138 145815 179161 114483 179353 118478
2050 118478 50398 37249 81434 135954 131665 18665 36747 19161 -57495 5339 159165
2039 159165 93192 -233390 -132547 -82325 -178014 -177358 -155258 -146784 -159175 -179582 -146542 -149816
2027 -149816 -18102 -22200 -61063 -49753 23982 25751 -22564 52736 6350 -18 53577 35162
2015 35162 -18480 -79520 -36299 10025 -25348 -44758 -108353 -97155 4213 90662 83773 -17151
2003 -17151 102424 -67059 -15409 -67903 -175566 -183657 -90091 -26775 -57481 17355 -7425
1992 -7425 -4041 -105883 -143532 -56332 20525 -119594 -60573 -33830 -77603 -85880 -26034 -25589
1980 -25589 48854 -67734 -127776 -94034 -15764 -8994 15133 -152267 -5128 87106 31388
1969 31388 -80206 -73523 -36503 3539 52119 -64735 -142534 -61405 -58668 -117806 -54703 -110697
1957 -110697 -31685 -97638 -118857 -156161 -93608 -63498 2200 35303 117992 144798 65740 -71428
1945 -71428 -3117 41587 -29 -21179 -34369 -56332 -87967 -73804 -26407 24252 37934 41940
1933 41940 10651 -75686 -77262 -91301 -14946 -27493 -49804 -235291 -225805 -159675 -80937 -90518
1921 -90518 -106764 -108838 -220897 -253011 -173879 -98292 11735 -77192 -235423 -31286 77089
1910 77089 -5734 -10862 -37448 -122118 -39712 -16170 -30313 60487 -12699 -72814 43530 -26719
1898 -26719 7020 -70495 -179232 -214638 -174527 -108336 -110241 50172 -236 -51770 31709 -88063
1886 -88063 -18068 80349 54432 -54575 -108011 -49171 -637 -104834 -86782 -38827 -72684
1875 -72684 -78376 -70631 75077 66249 115684 170137 -32334 -11692 14122 -114508 -142587 -76130
1863 -76130 -158500 -136370 -69227 -30809 -44936 -85271 -90901 -99970 29616 -24007 -121386 -98946
1851 -98946 -76020 -23602 -89813 -84644 -143392 -193336 -210758 -99533 -240949 -148706 8511
1840 8511 -94311 -40620 -93439 -63316 -104979 -62823 76336 94338 -68465 -106857 -28427
1829 -28427 -4402 -57702 -107622 -73090 -24471 -79142 -44761 -46875 -61637 -125711 -109178 -6374
1817 -6374 25078 -100878 15868 81721 -14924 -96905 -130234 25615 -2461 -86300 -57916
1806 -57916 31674 135127 154179 111022 123051 70367 25410 -26781 -56625 -55893 -84882 -66955
1794 -66955 -135303 -87222 -4645 -133491 -86897 -143346 -99429 -100366 24861 -123742 -235223
1783 -235223 -178501 -118321 -141206 -206604 -107182 -154429 -100054 -17073 -4849 21173 -25993 -71710
1771 -71710 -102182 -51099 -23761 -92045 -19795 -140457 -162841 -123416 -161784 -121533 -20844
1760 -20844 -34263 34037 2472 -30177 80737 -52886 -39719 -37774 -28127 6226 4724 -4849
1748 -4849 -87702 -122410 -164804 -101108 -36506 17994 -63144 8146 -19178 -174304 -60800 -43394
1736 -43394 -137801 -116933 -120259 -89748 -107114 -48139 67701 -44454 -25448 -62921 -100934 -13395
1724 -13395 -57149 43988 -12933 -44894 -52300 -20437 42812 -31174 123142 116848 6669 -42401
1712 -42401 -11883 -68684 -50656 -38759 28607 98400 -67760 -76400 -4672 141620 45669 -5940
1700 -5940 -94816 -102440 -32071 44616 -42129 -34517 -39209 -63249 -105381 -19105 -87086 -93746 -25533
1687 -25533 -73620 -88810 -110442 10483 99468 112564 46156 75759 52316 167577 93654
1676 93654 24264 19899 -37617 -55263 60765 80501 78037 68822 86493 -18042 -90581 -84756
1664 -84756 -96381 -67125 -51932 1966 -41361 -2383 -10084 55912 117515 57219 50132 61248
1652 61248 51272 -6607 -81174 -84752 -67530 -82651 -27238 -106094 -178110 -207355 -52458 -25933
1640 -25933 31821 14478 -10545 -53221 -135880 -103269 -30114 -28500 107587 100634 45773 -93294
1628 -93294 -88207 78563 -60391 -9290 -55876 24406 119689 90186 -20567 -56751 -82391
1617 -82391 39009 60948 -10721 37460 161723 145688 1419 -21528 52585 112404 108853
1606 108853 -60857 -103859 -71771 -28749 -23509 -25103 1416 58421 -24891 -76715 -838 63765
1594 63765 65892 14821 -9669 99694 9427 -65232 -76305 -122799 -83292 -130063 -21403 -42143
1582 -42143 -26763 -28076 8211 118400 207116 162320 11812 -126518 -2082 -8843 -53083
1571 -53083 395 63772 50477 32323 -49215 -51565 -3794 -44964 -71567 -100433 -30232 -46212
1559 -46212 -53391 53930 -20861 12878 13600 47642 -56382 -69673 -90441 -179098 -90394 -99379
1547 -99379 -68079 -53079 -83465 -124803 -39582 86190 84322 49841 -92680 -53571 -1089 159959
1535 159959 118841 -120168 -172734 -176782 -179263 -187646 -145602 -90717 -96567 -95601 -30680 23890 137118
1522 137118 185998 62553 55228 157156 60105 -3092 -75789 -100425 -126934 -56379 45215
1511 45215 -40323 -163954 -60429 -161401 -116333 -1565 9430 -72233 -53740 -78832 -58438
1500 -58438 -28281 -44306 -51524 -54567 -76032 -198331 -209899 -105657 -34339 91418 138622 127273
1488 127273 67220 -35493 -81977 -110727 -143994 -10925 50410 45848 -93664 -70436 48805
1477 48805 98384 64849 -114648 -172106 -271010 -98301 -48064 -55542 44557 60167 36641
1466 36641 32047 11361 -9290 -16393 -109218 -90306 42044 8147 -33319 7216 72992 39705
1454 39705 -57290 -135248 -253674 -183337 -104723 -66022 -97631 -102424 -6365 56457 -19309 -29387
1442 -29387 -16088 27040 8891 53824 3980 -4553 41602 -35917 60795 6246 -64440 -105938
1430 -105938 -121371 -149571 -63172 20640 -21875 -103273 -77628 -53035 -80939 89279 45538
1419 45538 -28733 -93381 -94560 -183806 -207262 -158904 -62112 72589 57052 -13313 -342 -3692
1407 -3692 -77147 60818 93289 59004 47159 143699 84155 11676 52142 91126 56142 116998
1395 116998 -47614 -55371 -16633 -24316 -71159 -109587 -79183 -74662 -15489 91138 -965 -55090
1383 -55090 -57626 -101225 -233700 -127138 -115564 -153768 -192864 -133443 -110479 -32339 -88879 -77287
1371 -77287 -55157 -93966 -57055 -81313 -53962 -101861 -45424 -81926 -79909 -71807 14606 41373
1359 41373 -19392 -113907 -24924 -15429 -36032 -109092 -60802 -154798 -131923 -132780 -105061 -44735
1347 -44735 -10324 -9069 -12147 106822 -26818 -24325 -25753 -53602 -12874 63787 89736 -21618
1335 -21618 -3530 10389 -42504 33431 -32266 -103721 5310 33040 -17302 -73361 -21926 68199
1323 68199 60368 -31952 76414 22187 79435 34565 -2414 56859 -38810 48389 96639 4066
1311 4066 -77566 -44142 85358 30152 -42133 -93282 -88125 50184 59029 100435 116315 65506
1299 65506 -46979 -120265 -113752 -93351 -127774 6428 65973 -19879 -156837 -177107 -250321
1288 -250321 -200087 -176457 -83974 -142152 -176295 -101794 -114064 -41913 -34892 -184362 -178393 -130186
1276 -130186 -245075 -82990 23983 -663 -109778 -44992 -1514 -8603 2366 16484 -61051
1265 -61051 85845 30623 33829 28537 97760 84782 67673 8493 -115401 -16882 2896 -54869
1253 -54869 -6487 -16843 -17447 79710 -24679 50738 208142 89649 15708 29580 96715 96706
1241 96706 31410 -169 -49108 28358 29587 45940 123211 30510 67999 100173 -69256 -103107
1229 -103107 -34826 -62435 -65533 41423 66455 18314 -140838 -203313 -173988 -74069 -133840
1218 -133840 -57299 -92417 -46206 110784 83352 -72128 -88488 46463 82227 -30289 -24236
1207 -24236 3810 41889 172100 194081 55174 98530 18065 -8090 -19679 -4747 33373
1196 33373 61965 158081 -6318 -74826 -25867 67828 29183 66460 -17869 43713 -25960 -87194
1184 -87194 42601 109264 111749 -8873 -96776 -17210 -10633 114711 79665 91881 90815 130515
1172 130515 151975 101993 84389 24069 81966 60881 60904 35343 19809 4567 29688 -27344
1160 -27344 -33724 -110230 -118022 -39776 48430 -13927 367 -52727 -76604 -46694 -38189 -32588 91527
1147 91527 45425 17472 79611 52098 -30180 54750 52614 -1570 77592 28449 24077 -16786
1135 -16786 61216 121309 197327 59131 -13857 2148 -14765 -6842 -37085 -67875 -97479 -21607
1123 -21607 -15383 37066 47541 -30464 -113843 -12693 17794 65580 31307 78092 8083 -1551
1111 -1551 71056 123857 153809 110096 107180 171790 72079 -81226 36489 13540 -32078 22692
1099 22692 -6672 25872 30315 -6131 -7734 63570 197417 -10572 -72621 -98158 -39498 -3406
1087 -3406 -20773 -1789 61550 -26970 -42126 -50645 -109262 -51245 139214 143108 105503 -62783
1075 -62783 -174644 -92423 22933 44565 68101 48105 -44230 -11667 84542 -110534 -29639
1064 -29639 147312 -29623 -55910 22201 -872 -2864 21436 -27958 -10766 -14361 -81981 -50413
1052 -50413 -174064 -12830 28757 -21528 28869 -132645 14155 43561 -3273 39253 -41088
1041 -41088 -73402 -127519 -97349 -97104 -86944 -3736 -35968 5243 -7922 -46242 -17386 62201
1029 62201 -63680 -36218 95637 67534 77968 36217 -29154 105330 69538 31997 24764
1018 24764 -35934 31634 84980 -35432 -38282 -87721 18671 23633 -44171 -3390 58177 51057
1006 51057 94760 113 65095 55372 -82334 -78971 17360 26529 57149 127068 83879 70426
994 70426 20281 89765 -21808 -100488 -69650 -62111 -14041 -77020 16644 -12450 -62356 116815
982 116815 93450 101907 34070 35176 12370 57712 42892 22781 -41739 -80289 30368 64001
970 64001 79386 15639 -60821 71666 140806 152869 127819 42967 68463 -4596 50244 39042
958 39042 -18462 33539 21974 21056 -35755 47854 58085 149075 110266 -7943 16936 1008
946 1008 62321 -7812 -9053 56565 -19398 -69979 -72137 -4442 -116015 -217981 -175094 -245811
934 -245811 -263473 -150154 -116881 -37381 48549 -75314 -128498 -93019 1444 50772 -44751
923 -44751 -126521 -124833 -105797 -6233 63154 112892 10745 -179551 -181017 -172625 -57469 86710
911 86710 71602 17668 -101934 -19255 64748 98354 205342 219694 207971 174883 177563 61879
899 61879 -73332 -184641 -86949 57057 231113 211467 93896 178985 105304 99257 64658
888 64658 100639 83515 128913 101803 -57217 -7788 -23200 16673 8229 -37282 9845 37200
876 37200 42673 99958 43448 109454 96723 106616 144999 133578 136041 76590 160952 -20820
864 -20820 -12780 58387 -53454 -45929 -9362 -126699 -147281 -11495 -332 138577 227599 173439
852 173439 242940 59477 -58372 -106794 1195 9445 6977 -16875 -139079 -15542 14567
841 14567 48224 98482 60157 91568 86737 -14808 42737 55629 102968 22543 -76297 -89494
829 -89494 -65300 -74046 -49644 -29593 -20697 62741 -79494 -150937 -111041 -3722 15026 -4743
817 -4743 -25216 -55425 134233 78409 -2117 114866 119693 88731 -11916 -29860 1249 79029
805 79029 33204 -8306 77816 136350 159926 146857 6738 1077 77694 204564 162232 -5426
793 -5426 -32952 808 66881 79760 67697 12235 -104040 -126649 -74916 -74089 -1104 24978
781 24978 44904 86199 121940 29611 97021 64671 -67636 -44263 -8274 107166 11800 -114199
769 -114199 -34790 -107033 -37858 -77599 -122470 -147692 -48536 49143 98777 29818 82617 185256
757 185256 184844 54035 109510 115979 68341 195925 211956 103067 39667 126604 149385 -486
745 -486 64283 31265 51445 -3707 -122120 -56563 -156859 -139174 -14053 -6089 22049 66788
733 66788 105402 7520 65088 141199 43838 50601 -21525 33296 -74663 -43127 -130419 -152490
721 -152490 6524 -59491 -40257 -33840 -98946 44124 -37033 25538 111457 117530 77695 73029
709 73029 14330 -63805 -90353 -30845 -74023 -11488 -78873 -139820 -225312 -204466 -50700 -51226
697 -51226 -16215 67967 103253 128483 87891 24377 -95669 -102041 82700 9889 -42594 -50908
685 -50908 38639 -17576 -12961 72345 -18986 -30854 13885 -15080 18146 -17631 -3436 6185
673 6185 9745 -8197 -54207 -32423 -16067 39646 -78481 -155021 -112219 -36865 -190424 -217475
661 -217475 -111874 -58804 50645 -33474 38957 194432 175929 269936 175137 156719 197632
650 197632 115698 -45389 -47813 -44110 -152029 -167226 -102307 -81769 -95343 7140 -16631 24857
638 24857 14422 -75592 -37539 59913 23832 53084 161314 48725 -23984 79920 14975
627 14975 -54785 -107611 -87764 -62857 12773 -81360 -31504 -99252 -221650 -37716 82508
616 82508 -41428 -21958 -121821 -148262 -119617 -43929 -28837 -89464 3713 -85759 -111770 -189575
604 -189575 -178676 -138602 -108234 -118690 -140075 14242 -22547 -7925 88480 42409 -20862 -25965
592 -25965 3206 -9256 -29516 -26360 97691 19848 53900 115492 97442 47977 -61374 -260817
580 -260817 -162117 -93585 -135135 -110414 -148539 -65248 80824 131867 83910 6265 -144663
569 -144663 -163033 -203817 -203038 -114240 -60327 41757 80747 125763 121987 132257 3173 -50049
557 -50049 6685 -16088 94548 -6116 -76842 -95099 -89146 -49220 -3767 48947 64128 12578
545 12578 5066 -58995 -91963 -30465 -186880 -147763 69268 -25219 -43387 -88265 -114400 -152752
533 -152752 -107257 -172603 -131600 38976 10064 -102476 -60752 28357 97318 8218 -155265
522 -155265 -106854 52611 103210 71074 80756 109832 116081 48826 99826 56281 -15544 84205
510 84205 -13802 -45510 41564 -7272 -33140 4602 13154 -1283 86066 58333 57219 64216 38937
497 38937 80296 96286 60738 41021 27727 86701 77072 80365 143931 35723 498 90286
485 90286 36331 -106035 -112298 39993 37350 209015 115644 28130 164643 -41423 -77196
474 -77196 28301 -17832 26062 38589 47662 8647 73499 99661 69400 24183 63938 22065
462 22065 106840 -31945 -69952 -95761 -50624 68049 1645 100154 58142 57385 63839 46841
450 46841 6711 106500 83417 102217 -58105 -128330 -55478 -63097 13577 46198 93295 121145
438 121145 156570 115142 38371 -8407 -50393 -40230 85176 51512 -46526 -175978 -89163
427 -89163 -91093 33771 93885 -1988 -37217 12797 19258 60256 67735 48556 -4870 68992
415 68992 58499 103163 212488 41328 -27411 -44059 -32432 2252 -22166 -8610 80279 116211
403 116211 105153 -30562 37323 44648 -51833 42520 185292 -28854 28053 70090 105292
392 105292 109280 -12549 -52684 49461 60390 29867 -40396 -31591 -24600 5674 17114 -81546
380 -81546 -105008 -110791 -154647 -63916 -128 -37041 43761 80223 138098 108797 17109 35942
368 35942 101380 216349 61886 99303 166685 98618 12171 85018 140969 146388 -4347 -24973
356 -24973 -121093 -19241 111706 52155 47406 46571 -52577 -78486 -38074 -86465 -97093 -42767
344 -42767 -71403 -151402 -79419 17315 61861 -17479 9979 -51074 73619 89309 -98567 -136851
332 -136851 -18869 -105646 -154588 -103546 61928 69491 60385 23287 37406 552 -13037 46567
320 46567 53766 12831 -9175 -42042 -8729 125488 38407 -60927 -57241 -232256 -78812 25142
308 25142 -10222 15437 -1161 83164 59571 68639 59959 112025 188963 152042 80051 197578
296 197578 241579 41194 -102714 -32692 21069 60414 63557 108585 172849 141071 150480 34485
284 34485 -42160 73467 197960 82510 67541 70687 14575 -70121 -44036 -11015 -21539 29995
272 29995 18686 17801 125523 87291 134771 144355 240 17221 40515 -41794 -78692 -30375
260 -30375 51658 -39748 -92295 -147492 -47549 -69958 -94875 103480 76828 2888 16256 -55426
248 -55426 -53982 53529 52882 122746 123492 143744 68764 22968 7255 105332 92172 116457 116921
235 116921 27220 -18926 -23286 96452 67244 32844 274 -90582 -36624 -34138 -86749 -196430
223 -196430 -81332 7365 5543 -47138 -93752 14630 -38840 33315 25005 62615 130959 69980
211 69980 -17300 30213 26252 -63471 82980 132480 36892 -41925 -73208 -6289 -32437 -120437
199 -120437 -73598 -66758 31892 197649 178029 131434 137032 92502 91224 47280 187575 97686
187 97686 -15098 -33889 -45044 37401 -22846 -76505 67595 43733 23405 -19697 -86042 44866
175 44866 61712 51864 30406 60860 115055 12194 24873 70965 -39999 -104810 -62389 28557
163 28557 18477 21453 21831 46186 54228 55465 56071 39740 -3776 94845 31878 -25224 20617
150 20617 -15318 -18812 55901 73318 -15698 -4353 -36131 -40602 -73510 11269 3657 14587 31511
137 31511 -14463 46251 39589 143395 193997 113964 91073 83027 57400 6298 9792 23549
125 23549 -33798 -77357 -38470 31975 85008 45796 13324 -51611 -51013 10302 -81058 -77837 -122404
112 -122404 -92395 -75133 12831 -32478 -75652 77385 80746 98728 134991 50455 11343 -5408
100 -5408 98224 144365 72060 49791 63851 30195 4449 -1709 10738 72924 113876 139541
88 139541 -27774 -139650 -54212 -22377 63646 70005 -40237 -43381 18119 85051 26334 5660
76 5660 25648 9062 -35403 -16160 18770 -36147 -86150 -27198 9151 114183 66190 55560
64 55560 74612 47373 38629 56173 90950 5295 24720 90649 68509 88311 85750 53843 35370
51 35370 89980 110192 18794 -14472 32527 64960 20370 37219 -23206 -18094 27982 93449
39 93449 96414 26688 6536 -16223 -20879 -23745 -21538 -42355 -33926 34354 -7899 -13275 47758
26 47758 34734 94413 96108 52337 7231 -1232 16815 56695 58779 21020 31786 75373 220964
13 220964 224936 181247 123576 15478 -28154 -60515 -36272 -27698 -1797 -2899 -71730 -30864
1 -30864 -112980
0 -112980
$$ Imaginary data points
##PAGE= N=2
##DATA TABLE= (X++(I..I)), XYDATA
16383 -1066335 -1035730 -993425 -1044954 -974149 -922402 -901484 -853047 -803630 -811877 -837154 -837072 -767502
16371 -767502 -754723 -702260 -683547 -660372 -622444 -624617 -658713 -707694 -644051 -542655 -582190
16360 -582190 -537399 -504124 -483880 -460009 -452336 -496990 -391270 -189885 -235768 -249381 -227775
16349 -227775 -213098 -109423 -144057 -245557 -239758 -215904 -217086 -129914 -109532 -25575 54553
16338 54553 74746 111498 121961 112125 88679 104873 143435 32991 120331 123363 116958 220840
16326 220840 250483 319621 336831 205572 233641 454694 438389 385805 424948 479088 472926
16315 472926 423722 378062 423916 538954 552128 516083 632407 643776 658548 652493 640311
16304 640311 727070 770050 863927 860474 708854 739896 846412 935452 894557 999684 1022210
16293 1022210 985704 940465 955139 1086422 1154073 1147052 1158388 1259974 1255118 1336455 1320000
16282 1320000 1278140 1232717 1295229 1315518 1313546 1298072 1194924 1281547 1319604 1306419 1288117
16271 1288117 1358082 1417803 1490897 1473937 1458254 1434928 1455688 1459205 1515743 1520441 1522488 1598573
16259 1598573 1664266 1649287 1700328 1659338 1659791 1660099 1565900 1706467 1750035 1799888 1608876 1603930
16247 1603930 1713458 1724163 1816580 1899036 1901592 1832944 1879039 1813078 1776447 1847975 1889410
16236 1889410 1816525 1866739 1986566 2015901 2052916 2061269 1953934 1991992 1913555 1949493 2065486
16225 2065486 1943708 2001769 1965898 2034947 2033415 2068076 2198584 2088700 2088696 2238862 2183902
16214 2183902 2018600 1978039 2036399 2093529 2182186 2292608 2218769 2226841 2263375 2317911 2291039
16203 2291039 2279855 2265661 2299562 2309939 2297405 2454100 2359955 2365581 2355243 2254580 2331198
16192 2331198 2500097 2546965 2407654 2407190 2436068 2417950 2529334 2468534 2321469 2446999 2613419
16181 2613419 2610885 2563388 2474285 2471607 2543170 2522518 2477442 2546959 2524846 2491916 2481100 2604658
16169 2604658 2624189 2525047 2431908 2475797 2540884 2508977 2511438 2440593 2464943 2543573 2601041
16158 2601041 2704214 2667775 2688850 2668662 2639206 2591903 2610156 2646043 2574276 2578308 2485596
16147 2485596 2462407 2521317 2537230 2536302 2595169 2658015 2686329 2685246 2781765 2666053 2721428 2749849
16135 2749849 2642450 2603756 2519527 2713306 2753384 2772282 2738161 2733355 2720490 2763396 2767025
16124 2767025 2765793 2821597 2803980 2797908 2777232 2717929 2749177 2777653 2751707 2789725 2732639 2756028
16112 2756028 2733725 2832277 2797783 2715485 2744519 2649368 2689778 2845825 2777409 2761020 2828320
16101 2828320 2873340 2852204 2761174 2734538 2697371 2594530 2588872 2753226 2726604 2624964 2701881
16090 2701881 2706595 2742010 2789609 2825012 2848700 2796222 2852766 2776214 2758631 2908291 2907686 2828095
16078 2828095 2824004 2919655 2984202 2925720 2834971 2787663 2739169 2753486 2679141 2738904 2671060
16067 2671060 2805797 2920677 2900454 2801148 2731297 2897037 2887047 2995137 2873494 2852360
16057 2852360 2822761 2824022 3013199 2937706 2818806 2870891 2890948 2749482 2732118 2797290 2851508
16046 2851508 2884498 2861185 2833009 2895545 2929153 2875429 2766056 2826834 2789266 2841415 2799579
16035 2799579 2764070 2803235 2687580 2793668 2890779 2939489 2913958 2861970 2859955 2753944 2856697
16024 2856697 2930947 2837702 2918355 2958325 2732214 2862448 2823241 2712781 2874596 2881957 2914069
16013 2914069 2998764 3062499 2763273 2796536 2915966 2991534 2884268 2794064 2850390 2827549 2765380
16002 2765380 2787166 2697237 2701476 2894895 2874430 2870681 2867220 2892040 2880137 2895356 2971570 2801773
15990 2801773 2900895 2933995 2880163 2938298 2903667 2864235 2758580 2863046 3042245 2912419
15980 2912419 2907017 2923518 2810689 2933294 2890909 2810830 2918865 2854460 2961648 2963190 2992749
15969 2992749 3004094 2992428 2932572 2797533 2828142 2731596 2876046 2760164 2717972 2774695 2683626
15958 2683626 2799068 2884588 2891574 2944279 2833024 2899729 2929444 2893164 2986841 2848756 2825222
15947 2825222 2910726 2950145 2853196 2842636 2840365 2841130 2747598 2804056 2966448 2843367 2856326
15936 2856326 2923684 2865573 2884994 2973629 3003425 2999926 2839456 2853588 2868093 2917135 2904514
15925 2904514 2938050 3019188 2924615 2808350 2813178 2836706 2850607 2849867 2787406 2878811 2919772 2940658
15913 2940658 2934884 2951317 2866156 2864203 2905028 2934584 3016661 2944383 2888688 2871639 2849224 2897811
15901 2897811 2968404 2977528 2880506 2747801 2898773 2908741 2924069 2877855 2846121 2863733 2814651
15890 2814651 2890958 2907917 2882922 2838851 2877046 3036288 2983890 2983116 3091750 3029797 2983182
15879 2983182 2953352 3023727 3062135 2965967 2934820 2969979 2984102 2818620 2819985 2914623 2788912
15868 2788912 2753467 2802369 2843411 2792642 2791434 2806431 2906638 2801530 2864674 2926029 2908228
15857 2908228 2852276 2858974 2899361 2831048 2951137 2939205 3034702 3081297 2976481 2881738 2853427
15846 2853427 2785677 2759087 2845315 2807425 2895249 2800632 2734250 2727382 2834065 2907779 2797690
15835 2797690 2825052 2832873 3024897 2957995 2890686 2911969 2889455 2930347 2970963 2948232 2927980
15824 2927980 2938053 2882248 2843068 2856948 2868254 2880680 2842417 2859467 2825441 2909766 2973438
15813 2973438 2962376 2921323 2938670 2975718 2966619 2982813 2948666 2886201 2905473 2925648 2972314
15802 2972314 2989616 2939059 2948963 2995322 3077608 2893644 2817811 2909399 2889277 2988411 2935486
15791 2935486 2842142 2883870 2883025 2907251 2948372 2890042 2868264 2964465 3017521 3025772 2947911 3040322
15779 3040322 2952506 2834716 2880401 2993715 2908010 2953437 3072653 3017022 2936532 2856461 2837707
15768 2837707 2921964 2919757 2957060 2889856 2857673 2866565 2775482 2899140 2951034 2952494 3012410 2987155
15756 2987155 2920548 2901038 2815077 2942631 3026112 2895767 2860883 2843323 2848915 2869761 2964756
15745 2964756 2871520 2912604 2938233 2950660 2891189 2898189 2926360 3026224 2957731 2832347 2807218
15734 2807218 2899894 2869790 2804060 2963542 2847992 2840758 2973600 3004955 2871380 2845580 2947101
15723 2947101 3090090 3007544 2946848 2988413 2970227 2800250 2830782 2905685 2953542 2913607 3021777
15712 3021777 3146792 3057640 3074431 2930568 2788152 2775022 2860787 2862217 2983524 3004437 2968687
15701 2968687 2996258 2964231 3031551 2996492 2909412 2948841 3043108 3001951 2975794 3053823 2990675
15690 2990675 2959721 2962855 2828447 3012058 2933142 2979885 2877053 2901252 2970146 2996528 2934812
15679 2934812 2947368 2986338 2974156 3111210 3038485 2950490 2937851 2976040 2965002 2883764 2844549
15668 2844549 2891483 2976304 3067897 2990261 3014041 3034658 2965783 3112577 3003300 2966258 3028198
15657 3028198 2958034 2881026 2773297 2810374 2908262 2999955 3032689 2987221 2890091 2916557 2796794
15646 2796794 2770580 2847462 2827243 2802840 3004698 3069638 2971714 2998621 2938163 3012768 2973401
15635 2973401 2881659 2854071 2855227 2894868 2897408 2953895 2938533 3022774 2970341 2902258 2994643 3046879
15623 3046879 3056995 3041796 3061605 2962252 2876428 2872999 2913564 3033925 3037573 2997245 2960945
15612 2960945 2959944 2982334 3016229 2967862 3053914 3020980 3004814 3134576 2994289 2813812 2860163
15601 2860163 2876263 2926951 2997244 3058373 3047964 3104797 3009674 3073307 3081968 3014492 3127959
15590 3127959 3040944 3017040 3026379 2938787 2985882 3016987 2902019 2931604 3146648 3170894 3157626
15579 3157626 3037040 2980873 2984548 3009219 2996329 3031193 3003764 2902943 2898146 3019660 3025404
15568 3025404 2960432 3008562 3004791 2955426 2935201 2895271 2861754 2937562 3049592 3130679 3097533
15557 3097533 3176878 3117288 3068542 3001963 3077206 2968330 2907334 2952212 2835706 2877048 2896545
$$ [...]
##END NTUPLES=NMR SPECTRUM
##END=
