##TITLE=1H_DE-80H_X3
 200.13MHz, d2o
 8 sc
 
 19ns.26.2.2025
##JCAMPDX= 6.0         $$ Bruker NMR JCAMP-DX V2.0
##DATA TYPE= NMR SPECTRUM
##DATA CLASS= NTUPLES
##ORIGIN= UXNMR, Bruker Analytische Messtechnik GmbH
##OWNER= pz
$$ XWIN-NMR		Version 3.5
$$ Wed Oct  8 10:29:34 2025 Russian Standard Time (UT+4h)  Yarkov@DPX200
##.OBSERVE FREQUENCY= 200.1313
##.OBSERVE NUCLEUS= ^1H
##.ACQUISITION MODE= SIMULTANEOUS
##.ACQUISITION SCHEME= undefined
##.AVERAGES= 8
##.DIGITISER RES= 18
##SPECTROMETER/DATA SYSTEM= spect
##.PULSE SEQUENCE= zg30
##.SOLVENT NAME= CDCl3
##.SHIFT REFERENCE= (INTERNAL, CDCl3, 0, 15.4759)
##AUDIT TRAIL= $$ (NUMBER, WHEN, WHO, WHERE, WHAT)
$$ ##TITLE= Audit trail, XWIN-NMR		Version 3.5
$$ ##JCAMPDX= 5.01
$$ ##ORIGIN= Bruker BioSpin GmbH
$$ ##OWNER= Yarkov
$$ C:/Bruker/XWIN-NMR/data/yarkov2/nmr/H-C/1/pdata/1/auditp.txt
$$ ##AUDIT TRAIL=  $$ (NUMBER, WHEN, WHO, WHERE, WHAT)
(   1,<2025-10-08 10:28:19.35 +0400>,<Yarkov>,<DPX200>,
      <created by zg, POWCHK disabled, PULCHK disabled
       configuration hash MD5:
       00 E9 B6 7A A2 85 ED C7 34 08 36 98 17 FE 4E 26
       data hash MD5: 16K
       0E A5 59 8F 61 4D 5D 02 33 E0 CF 3C 26 04 44 1E>)
(   2,<2025-10-08 10:28:50.18 +0400>,<Yarkov>,<DPX200>,
      <Start of raw data processing
       efp BC_mod = 2 LB = 0.25 FT_mod = 6 PKNL = 1 PHC0 = -2281.05 PHC1 = 12.99097 SI = 16K 
       data hash MD5: 16K
       57 D3 09 CB 7E FF 5D 7B 69 3B 3D 7B F0 84 26 E8>)
(   3,<2025-10-08 10:28:54.42 +0400>,<Yarkov>,<DPX200>,
      <abs ABSG = 5 
       data hash MD5: 16K
       F6 B8 C5 5E 3C 33 1B 04 7D 84 34 37 62 E6 AE 4D>)
$$ ##END=
$$ 
$$ hash MD5
$$ C4 16 34 86 0D 06 A9 3D 52 EC 94 E5 5C 9D 71 C9
##$RELAX= 
##$RELAX= 
##$RELAX= 
##$RELAX= 
##$RELAX= 
##$RELAX= 
$$ Bruker specific parameters
$$ --------------------------
##$DU= <C:/Bruker/XWIN-NMR>
##$EXPNO= 1
##$NAME= <H-C>
##$PROCNO= 1
##$TYPE= <nmr>
##$USER= <yarkov2>
##$AMP= (0..31)
100 100 100 100 100 100 100 100 100 100 100 100 100 100 100 100 100 100 
100 100 100 100 100 100 100 100 100 100 100 100 100 100 
##$AQSEQ= 0
##$AQ_mod= 1
##$AUNM= <au_zg>
##$AUTOPOS= <>
##$BF1= 200.13
##$BF2= 200.13
##$BF3= 200.13
##$BF4= 200.13
##$BF5= 200.13
##$BF6= 200.13
##$BF7= 200.13
##$BF8= 200.13
##$BYTORDA= 1
##$CFDGTYP= 0
##$CFRGTYP= 5
##$CHEMSTR= <none>
##$CNST= (0..31)
1 1 145 1 1 1 1 1 1 1 1 1 1 1 1 1 1 1 1 1 1 1 1 1 1 1 1 1 1 1 1 1 
##$CPDPRG= <>
##$CPDPRG1= <>
##$CPDPRG2= <>
##$CPDPRG3= <>
##$CPDPRG4= <mlev>
##$CPDPRG5= <mlev>
##$CPDPRG6= <mlev>
##$CPDPRG7= <mlev>
##$CPDPRG8= <mlev>
##$CPDPRGB= <>
##$CPDPRGT= <>
##$D= (0..31)
0 0.7 0 0 0 0 0 0 0 0 0 0.03 0 0 0 0 0 0 0 0 0 0 0 0 0 0 0 0 0 0 0 0 
##$DATE= 1759904898
##$DBL= (0..7)
120 120 120 120 120 120 120 120 
##$DBP= (0..7)
150 150 150 150 150 150 150 150 
##$DBP07= 0
##$DBPNAM0= <>
##$DBPNAM1= <>
##$DBPNAM2= <>
##$DBPNAM3= <>
##$DBPNAM4= <>
##$DBPNAM5= <>
##$DBPNAM6= <>
##$DBPNAM7= <>
##$DBPOAL= (0..7)
0.5 0.5 0.5 0.5 0.5 0.5 0.5 0.5 
##$DBPOFFS= (0..7)
0 0 0 0 0 0 0 0 
##$DE= 6
$$ [...]
##$SUBNAM3= <"">
##$SUBNAM4= <"">
##$SUBNAM5= <"">
##$SUBNAM6= <"">
##$SUBNAM7= <"">
##$SUBNAM8= <"">
##$SUBNAM9= <"">
##$SW= 18.0517328524113
##$SWIBOX= (0..15)
0 0 2 0 0 0 0 0 0 0 0 0 0 0 0 0 
##$SW_h= 3612.71676300578
##$TD= 16384
##$TD0= 1
##$TE= 0
##$TE2= 300
##$TE3= 300
##$TEG= 300
##$TL= (0..7)
0 120 120 120 120 120 120 120 
##$TP= (0..7)
150 150 150 150 150 150 150 150 
##$TP07= 0
##$TPNAME0= <>
##$TPNAME1= <>
##$TPNAME2= <>
##$TPNAME3= <>
##$TPNAME4= <>
##$TPNAME5= <>
##$TPNAME6= <>
##$TPNAME7= <>
##$TPOAL= (0..7)
0.5 0.5 0.5 0.5 0.5 0.5 0.5 0.5 
##$TPOFFS= (0..7)
0 0 0 0 0 0 0 0 
##$TUNHIN= 0
##$TUNHOUT= 0
##$TUNXOUT= 0
##$USERA1= <user>
##$USERA2= <user>
##$USERA3= <user>
##$USERA4= <user>
##$USERA5= <user>
##$V9= 5
##$VALIST= <valist>
##$VCLIST= <CCCCCCCCCCCCCCC>
##$VD= 0
##$VDLIST= <DDDDDDDDDDDDDDD>
##$VPLIST= <PPPPPPPPPPPPPPP>
##$VTLIST= <TTTTTTTTTTTTTTT>
##$WBST= 1024
##$WBSW= 4
##$XGAIN= (0..3)
0 0 0 0 
##$XL= 0
##$YL= 0
##$YMAX_a= 315458
##$YMIN_a= -506081
##$ZGOPTNS= <>
##$ZL1= 120
##$ZL2= 120
##$ZL3= 120
##$ZL4= 120
##$ABSF1= 15.47585
##$ABSF2= -2.575999
##$ABSG= 5
##$ABSL= 3
##$ALPHA= 0
##$AQORDER= 0
##$ASSFAC= 0
##$ASSFACI= 0
##$ASSFACX= 0
##$ASSWID= 0
##$AUNMP= <proc_1d>
##$AZFE= 0.1
##$AZFW= 0.1
##$BCFW= 0
##$BC_mod= 2
##$BYTORDP= 0
##$COROFFS= 0
##$CY= -3
##$DATMOD= 1
##$DC= 0
##$DFILT= <>
##$DTYPP= 0
##$F1P= 0
##$F2P= 0
##$FCOR= 1
##$FTSIZE= 16384
##$FT_mod= 6
##$GAMMA= 0
##$GB= 0
##$INTBC= 1
##$INTSCL= 3.241238e-09
##$ISEN= 128
##$LB= 0.25
##$LEV0= 0
##$LPBIN= 0
##$MAXI= 10000
##$MC2= 0
##$MEAN= 0
##$ME_mod= 0
##$MI= 1.114404
##$NCOEF= 0
##$NC_proc= -6
##$NLEV= 6
##$NOISF1= 3.799351
##$NOISF2= 2.8
##$NSP= 0
##$NTH_PI= 0
##$NZP= 0
##$OFFSET= 15.47585
##$PC= 1
##$PHC0= -2281.05
##$PHC1= 12.99097
##$PH_mod= 1
##$PKNL= yes
##$PPARMOD= 0
##$PSCAL= 0
##$PSIGN= 0
##$REVERSE= no
##$SF= 200.130009176305
##$SI= 16384
##$SIGF1= 3
##$SIGF2= 2
##$SINO= 0.751879
##$SIOLD= 32768
##$SREGLST= <19F.Aceton>
##$SSB= 0
##$STSI= 16384
##$STSR= 0
##$SW_p= 3612.71676300578
##$SYMM= 0
##$S_DEV= 0
##$TDeff= 16384
##$TDoff= 0
##$TI= <>
##$TILT= no
##$TM1= 0
##$TM2= 0
##$TOPLEV= 0
##$USERP1= <user>
##$USERP2= <user>
##$USERP3= <user>
##$USERP4= <user>
##$USERP5= <user>
##$WDW= 1
##$XDIM= 16384
##$YMAX_p= 378935858
##$YMIN_p= -485954
$$ End of Bruker specific parameters
$$ ---------------------------------
##NTUPLES= NMR SPECTRUM
##VAR_NAME=  FREQUENCY,     SPECTRUM/REAL,   SPECTRUM/IMAG
##SYMBOL=    X,             R,               I
##VAR_TYPE=  INDEPENDENT,   DEPENDENT,       DEPENDENT
##VAR_FORM=  AFFN,          ASDF,            ASDF
##VAR_DIM=   16384,         16384,           16384
##UNITS=     HZ,            ARBITRARY UNITS, ARBITRARY UNITS
##FACTOR=    0.220516191357247, 1,           1
##FIRST=     3097.18202358194, 0,            0
##LAST=      -515.534739423843, 0,           0
##MIN=       -515.534739423843, -485954,     0
##MAX=       3097.18202358194, 378935858,    0
$$ Real data points
##PAGE= N=1
##DATA TABLE= (X++(R..R)), XYDATA
$$ [...]
7559E46579L9972K0214j21518l7512o4272j09396L2674j6592o6888j4727M0241
7548B48775m9745K4597M0002k3893J13757j3064r7071J3689K2096l3213N8680
7537C04610P5073J0148L2431o3776l6752m962J50777n6620j13115o298n4772J04484
7525C41228N3239m3938j31831n5177m7432Q2846Q2629m2861o9178j06105Q6609
7514A50029O5156l0907l3173K4468M0636M1735o8030N9601M3894J27139n9562
7503C60986l2486j39309n3107M5635j9840Q9073j98750N2094P1582N2490O5992
7492B94360p3064m2139J7850k2195J0371Q1366R9293j556p984R402j18870m0715
7480B06119J1071n130l1455K8150L6209m3424o450J25675J4176p1516J621n7519
$$ plain form
7559 546579 586551 606765 485247 447735 383463 274067 306741 290149 223261 208534 248775
7548 248775 199030 223627 263629 239736 353493 340429 243358 257047 279143 245930 304610
7537 304610 379683 389831 422262 358486 321734 316772 467549 410929 297814 291516 236744 341228
7525 341228 394467 350529 218698 163521 116089 198935 281564 238703 169525 63420 150029
7514 150029 215185 184278 151105 175573 216209 257944 189914 249515 293409 420548 360986
7503 360986 328500 189191 136084 181719 161879 250952 52202 104296 175878 228368 294360
7492 294360 221296 179157 197007 174812 185183 266549 365842 364286 356302 365704 246834 206119
7480 206119 217190 212060 180605 208755 244964 201540 195090 320765 334941 263425 265046 207527
7468B07527P0368n3114n5306j3239R002j3260L8578Q6648p059J13548L8567r6259
7456C26001N7361n989M30p4971K9722l909m4969J04232Q5432j6602j53179J7358
7444C20917m8900j32955P6487K3036r772K4793K8151L6038l7741q4963j18997
7433G6094l7943J11770O8288l4383N6253m3824R2564O4817k9592n7724m8741N8086
7421B75665j03540m1897J29780J05156j31434m0785Q6863J084o237J24208P200
7410D06063o1968r5341l7003R5544P0302n4797l4997J25821m2063j47997L4687
7399B58251R0954M9511m7318p5186J08938O2658n2612m9175L935l8839r57M8867
7387C59027Q5329J23538q6700j36067j6939n3209N0648L6789M8776J33414L953
$$ plain form
7468 207527 277895 224781 169475 156236 165238 151978 190556 277204 270145 383693 422260 326001
7456 326001 383362 377373 377803 302832 332554 328645 283676 387908 473340 456738 303559 320917
7444 320917 272017 139062 215549 238585 228813 253606 281757 317795 280054 195091 76094
7433 76094 38151 149921 218209 183826 240079 196255 288819 353636 324044 266320 217579 275665
7421 275665 172125 130228 260008 365164 233730 192945 279808 280892 274655 398863 406063
7410 406063 344095 248754 211751 307295 377597 322800 287803 413624 371561 223564 258251
7399 258251 349205 398716 351398 276212 385150 447808 395196 346021 349956 311117 310160 359027
7387 359027 444356 567894 481194 345127 328188 274979 325627 362416 411192 544606 548559
7376E48559l1674l0340q9926o1752N8789l9220J06704j4438l1164p03K139J3366
7364D30340p389j3742j7165l0220o5889O9655K5868P001K9250l7565K9351M331
7352D23826q0399l1591n379J22829K8142p4006p7600K313O4942r114O1580L6477
7340D62020j51741J11465j2392p7434L2777j4859L4125o3743n3406J51995q9333
7329C29474R0913N478j40157l4177p2213J70520O7142L7297O0189q140j31211
7318C75115K6794J1897m5580O5410k1326j45729J00344R2755l3158J45955j3627
7307E58850K2000q4069l5770N8274N3846j67149j20092l7449J25580Q00m2849
7296C31972K633J23271J12618o1784L9239p5571N345N7281o7940r5824K22326
$$ plain form
7376 548559 516885 486545 396619 334867 393656 354436 461140 446702 415538 414835 416974 430340
7364 430340 422951 409209 392044 361824 295935 365590 391458 398459 427709 390144 419495 423826
7352 423826 343427 311836 306457 429286 457428 383422 305822 308135 373077 363963 425543 462020
7340 462020 310279 421744 409352 331918 364695 349836 383961 320218 266812 418807 329474
7329 329474 420387 425865 285708 251531 179318 349838 416980 454277 514466 506326 375115
7318 375115 401909 413806 368226 433636 412310 266581 366925 459680 426522 572477 558850
7307 558850 580850 496781 461011 519285 573131 405982 285890 248441 374021 374821 331972
7296 331972 334605 457876 570494 508710 547949 472378 477723 535004 467064 371240 593566
7285E93566N1020R5137J6404k80417N0078M0977m6053n5289j6827m2470Q3529
7274D89655Q823p6773r042L343P6086O8768L8106q2498p3208J7755J8311Q9543
7262E68869q6165o9332M1576p2655p097K4685l5039J10106M1244l1008P1501K4591
7250E81276K306q3445P2279r5874p7001L6432K7658O7681M9905j17921J21060
7239E84356N7424l9777l3836l5619L8249N3598l922M8499k3998q740m1227L6843
7227F31850q0997J3295J9779j5799j6984j6004j1398J27075k9909o0065J16700
7216F77543J3859j00789M5180R1703L1297N6499j02689j36658R246j3336k779
7205E69076O9662J15324O5392j34663o3010M5886l0547m4293N7618o6173J685
$$ plain form
7285 593566 644586 739723 756127 475710 525788 566765 520712 465423 448596 406126 489655
7274 489655 498478 421705 412663 416006 492092 560860 598966 516468 443260 461015 479326 568869
7262 568869 482704 413372 454948 382293 375196 399881 364842 474948 516192 485184 556685 581276
7250 581276 583582 500137 572416 476542 399541 435973 463631 531312 581217 463296 584356
7239 584356 641780 602003 568167 532548 570797 624395 620473 668972 644974 636234 595007 631850
7227 631850 550853 564148 583927 568128 551144 535140 523742 650817 620908 560843 677543
7216 677543 691402 590613 635793 727496 758793 815292 712603 575945 585191 571855 569076
7205 569076 638738 754062 819454 684791 621781 667667 637120 592827 650445 584272 585957
7194E85957Q1538J03195L9005n7263N1191N2097o2324M3834p5201J06473R2079
7183I60581Q563N2134O6014l3958K444o2203R8307r56l9531J50037R8935j04085
7171A196282O0462P5834r9690J25393r420P4858m805N1579j2270J36987J75474
7160A770684J2212J02657J20938O4630N160J84395m5001J05624R8578J43422J58070
7149B721369J45951J07228P0433L1372K16287J75160n4763R8141Q9083N2909Q5579
7138C738749m0364l4274l3004J17251k9263j67757K4142j08543j32205l2951q4837
7127C216944j85773q8505j65781o4958j2495j89223o3520j51346j4401j2674o4483
7116B203785o6961L6737j02683j49331q590P047O0595l919p2630J55706M0562
$$ plain form
7194 585957 667495 770690 809695 752432 803623 855720 793396 837230 762029 868502 960581
7183 960581 969144 1021278 1087292 1053334 1055778 993575 1091882 1090926 1051395 1201432 1300367 1196282
7171 1196282 1256744 1332578 1232888 1358281 1348861 1423719 1418914 1470493 1458223 1595210 1770684
7160 1770684 1782896 1885553 2006491 2071121 2076281 2260676 2215675 2321299 2419877 2563299 2721369
7149 2721369 2867320 2974548 3044981 3076353 3292640 3467800 3413037 3511178 3600261 3653170 3738749
7138 3738749 3698385 3664111 3631107 3748358 3719095 3551338 3575480 3466937 3334732 3301781 3216944
7127 3216944 3031171 2942666 2776885 2711927 2699432 2510209 2446689 2295343 2280942 2268268 2203785
7116 2203785 2136824 2173561 2070878 1921547 1912957 1920004 1980599 1976680 1904050 2059756 2100318
7105B100318k86471R119J23281N7199J11906p7218M5042J28662r204j12824l1887
7094B057923J369j4527j45744p1973l1809q365Q901j99934j4653l5333j4094j31053
7082A400708q3515j06643J6266r2344N4164q5099n0603R7105J1655l9074O1189
7071A183809m6667Q779j2886n772o3931O5642j12048M953l7219L4395L6768j17544
7059I38279N6579L1837Q5398j33339m6988L3247Q4520p3192P6012m9463q4492
7048I18398M2863Q0544O6620l3532Q1628J13257l7255q0058L7630j56170k4396
7037A009529k9782J52876P4261j48548L9586l6254J7610K02610r1910O5612k2273
7026A233317j11048K5341N9095k8209L2708Q8867q9067o892j27163M8785j5931
$$ plain form
7105 2100318 1813847 1822966 1946247 2003446 2115352 2038134 2083176 2211838 2202634 2089810 2057923
7094 2057923 2059292 2044765 1899021 1827048 1795239 1786874 1795775 1595841 1581188 1545855 1531761 1400708
7082 1400708 1317193 1210550 1226816 1134472 1188636 1103537 1052934 1150039 1161694 1122620 1183809
7071 1183809 1137142 1145921 1133035 1127263 1063332 1128974 1016926 1021879 984660 1019055 1055823 938279
7059 938279 994858 1026695 1112093 978754 931766 965013 1049533 976341 1052353 1002890 918398
7048 918398 961261 1041805 1108425 1074893 1156521 1269778 1232523 1152465 1190095 1033925 1009529
7037 1009529 979747 1132623 1206884 1058336 1097922 1061668 1079278 1281888 1189978 1255590 1233317
7026 1233317 1122269 1147610 1206705 1178496 1211204 1300071 1211004 1204112 1076949 1125734 1109803
7015A109803j57593k5459R8927R4280o8002r17N3828R6585m4033j37692J12616
7004A132343M2895J31336K2644o6489O3719j11221l0156K5626J0105J22426j1100
6993A332128k2496j13765J7044O8389N6243K07583J16516m3378L6021O7129J36886
6982A858300o659j34484k2346O1933j22727M5349J0018m4480J63929R3701m8157
6971A854377r8711l5966k5791p5578j38189q9656l1041j18077J2380p8502l1824
6960A143422j05892k3893L8971K8533r8222R2012r1796m8145j13313J6789R9031
6949I37497k2970M9160j7373J0901J48746j04693p1667q5205J2464J17065J06801
6938A080726L7275p6682p4460O724R8981J5984k6598M2630R2273k5205J58059
$$ plain form
7015 1109803 952210 926751 1025678 1119958 1051956 1051039 1104867 1201452 1157419 1019727 1132343
7004 1132343 1175238 1306574 1329218 1262729 1326448 1215227 1185071 1210697 1220802 1343228 1332128
6993 1332128 1309632 1195867 1212911 1281300 1337543 1545126 1661642 1618264 1654285 1721414 1858300
6982 1858300 1851641 1717157 1694811 1756744 1634017 1679366 1689384 1644904 1808833 1902534 1854377
6971 1854377 1755666 1719700 1693909 1618331 1480142 1390486 1359445 1241368 1253748 1175246 1143422
6960 1143422 1037530 1013637 1052608 1081141 982919 1074931 983135 934990 821677 838466 937497
6949 937497 914527 963687 946314 957215 1105961 1001268 929601 844396 856860 973925 1080726
6938 1080726 1118001 1041319 966859 973583 1072564 1088548 1061950 1104580 1196853 1171648 1329707
6927A329707J15679J00921J13948k1452M0628J38017l1729N0580p7963j07580
6917A650756q8901K6146O8175J26342p1596R6338J6587K705j33273r6572j32187
6906A464520j45472N974p2194q6583N0616j59560j09074M5737J39027n2649l1941
6895A048401l042j63525k256P1785n6963N4810Q0624q6782l0705l5615P74R3697
6883I71203k8481J03449j52337l0511N8801j5287K6161q1782M2616N9216m6236
6872I06812l0246R7666J00551l02118j12283J37212J28836j1996n7105O3761J5602
6861I36692k4506r1434l409R4628r6505r4566K9202J27575K2918l4843J17991
6850I83743j4357r7380j22170J35177J08458M7144p6120N8078j9043j751Q677
$$ plain form
6927 1329707 1445386 1546307 1660255 1638803 1679431 1817448 1785719 1836299 1758336 1650756
6917 1650756 1561855 1588001 1656176 1782518 1710922 1807260 1823847 1826552 1693279 1596707 1464520
6906 1464520 1319048 1325022 1252828 1166245 1216861 1057301 948227 993964 1132991 1080342 1048401
6895 1048401 1045359 881834 879578 951363 894400 949210 1029834 943052 912347 876732 877506 971203
6883 971203 942722 1046171 893834 863323 922124 906837 932998 851216 893832 953048 906812
6872 906812 876566 974232 1074783 772665 660382 797594 926430 914434 857329 921090 936692
6861 936692 912186 820752 817343 911971 815466 720900 750102 877677 900595 865752 983743
6850 983743 969386 872006 749836 885013 993471 1040615 964495 1022573 1003530 1001779 1010456
6839A010456J6138o6691J1180J3615K6051N7445j24119k5807m2539O6877J7418
6828I60024r6738P515p456J58645J06703p2994p1080m7098p544J08613J1369p2600
6816I77359j15961P8338p6005L4538P9467j7817o0870J9668P3409n7712l2885
6805I01529O8018R2626J2648n4160l5979o4040K0561q1498l1155N7857J13868
6794A000275J47787J4319o4587m6587Q2169M3040R1264O2523p8102n1582J11287
6783A311806r8922j5842j00343Q8865P6079l6566J5231l7659l0319K5055p5240
6772A122145j02540O5047J9647M9455n1457j7628j25701K2884J04019J05518r3903
6761A097486R9343j20137m6822R6357N2440L7735L6822R6884L0593j4878L7963
$$ plain form
6839 1010456 1026594 959903 971083 984698 1010749 1068194 944075 918268 875729 942606 960024
6828 960024 863286 870801 863345 1021990 1128693 1055699 984619 937521 929977 1038590 1049959 977359
6816 977359 861398 939736 863731 898269 977736 959919 899049 918717 992126 934414 901529
6805 901529 969547 1062173 1074821 1020661 984682 920642 941203 859705 828550 886407 1000275
6794 1000275 1148062 1162381 1097794 1051207 1133376 1176416 1267680 1330203 1252101 1200519 1311806
6783 1311806 1212884 1197042 1096699 1185564 1261643 1225077 1240308 1202649 1172330 1197385 1122145
6772 1122145 1019605 1084652 1104299 1153754 1102297 1084669 958968 981852 1085871 1191389 1097486
6761 1097486 1196829 1076692 1029870 1126227 1178667 1216402 1253224 1350108 1380701 1365823 1403786
6750A403786K0809n0355N8444M1173R7269r4960m0218M5190J21205l4251R0725
6739A658817J5752O4845J87817l5079N1437J32161M2617J80769P4767j03142m9987
6728B220774m3009P34q5383J10084J96462j05175M0477N6875m3877J08505N6715
6717B513182m1353j26482j22244r3262N0185P0118l4037Q6271R2097J38438J29931
6706B662844R7380J56869N7451K1349n7632n8182j90750j74725Q5908m8615k8238
6695B523659K04280J28889r587p6948j34781o2104k26754o2711q3994M8784k49721
6684A999012n5224R8398k6762k00253q7921j9609R0708M8361j02118j7132p2793
6673A654667J59591L9772o6471M2467K8761M6237Q5571M1440o9106k9595o6835
$$ plain form
6750 1403786 1424595 1374240 1432684 1473857 1571126 1476166 1435948 1481138 1602343 1568092 1658817
6739 1658817 1674569 1739414 1927231 1892152 1943589 2075750 2118367 2299136 2373903 2270761 2220774
6728 2220774 2177765 2178499 2093116 2203200 2399662 2294487 2334964 2391839 2347962 2456467 2513182
6717 2513182 2471829 2345347 2223103 2129841 2180026 2250144 2216107 2302378 2394475 2532913 2662844
6706 2662844 2760224 2917093 2974544 2995893 2938261 2880079 2689329 2514604 2600512 2551897 2523659
6695 2523659 2727939 2856828 2847241 2770293 2635512 2573408 2346654 2283943 2199949 2248733 1999012
6684 1999012 1943788 2042186 2015424 1815171 1727250 1707641 1798349 1846710 1744592 1727460 1654667
6673 1654667 1814258 1854030 1787559 1830026 1858787 1905024 1990595 2032035 1962929 1933334 1866499
6662A866499O9087J19366j09182O9101n7635p6861p7500n7576L1435k4251j01559
6651A650924P3868m9291O1827O0310k757O1746n0229L7j0669n2280J39045M8813
6639A931344l4914r2162J06295n3679j06335J26633l6509K2764j2076r5825O649
6628A762185Q921q2255o8440P2369k4139j71760n3551l330M3431J03314J2098
6617A598843L8990R8445q7272N1509P6216n7593P8122Q5499j53099j1102Q1405
6606A799963K7845m658p8457N2366O2064m3640q847J36125P0333j13796P0262
6595A969560K1176p2431Q9668R9693P6575j29064K4200J06335J14427J05734M4364
6584B450237j34741p5126L9019J37132J12172J43076k637K3744J63308n5756o0684
$$ plain form
6662 1866499 1935586 2054952 1945770 2014871 1957236 1880375 1802875 1745299 1776734 1752483 1650924
6651 1650924 1724792 1675501 1737328 1797638 1794881 1856627 1806398 1806435 1795766 1743486 1882531 1931344
6639 1931344 1896430 1804268 1910563 1856884 1750549 1877182 1840673 1863437 1851361 1755536 1762185
6628 1762185 1771106 1688851 1620411 1692780 1668641 1496881 1443330 1440000 1483431 1586745 1598843
6617 1598843 1637833 1736278 1649006 1700515 1776731 1719138 1797260 1882759 1729660 1718558 1799963
6606 1799963 1827808 1823150 1744693 1797059 1859123 1815483 1806636 1942761 2013094 1899298 1969560
6595 1969560 1990736 1918305 2007973 2107666 2184241 2055177 2079377 2185712 2300139 2405873 2450237
6584 2450237 2315496 2240370 2279389 2416521 2528693 2671769 2669132 2692876 2856184 2800428 2739744
6573B739744O8445N4912k202J41251J26457Q7470j36908q5323L5629Q5393K1113
6562C135981P6032P7465J78450P3980K19391J50323K796J89078L53135L07218
6552D763849L19632L46848L54670L78498L19306J22213L2495M7101l58650k12473
6542F113489l16246l51074j59651k02272j95298j92176q8453j60663j16418j00150
6532D231088q4820q8021j60968j35874r7779R4289j80939j71928k2987m4445j48548
6521C189068j7820j90695k6015O1903L7180P5808j4985j4709o8449N1467L6479
6510C119232j67201k0496j3169k9419q4479M7215L1892j14006j03023N4321N8629
6499B779496P9255O7636j83202J3696k0796K3756P5397J49411k06248K4237J4931
$$ plain form
6573 2739744 2808189 2863101 2860899 3002150 3128607 3216077 3079169 2993846 3029475 3114868 3135981
6562 3135981 3212013 3289478 3467928 3541908 3761299 3911622 3914418 4103496 4456631 4763849
6552 4763849 5083481 5430329 5784999 6163497 6482803 6605016 6637511 6684612 6325962 6113489
6542 6113489 5797243 5446169 5286518 5084246 4888948 4696772 4608319 4447656 4331238 4231088
6532 4231088 4146268 4058247 3897279 3761405 3663626 3757915 3576976 3405048 3382061 3337616 3189068
6521 3189068 3171248 2980553 2954538 3016441 3053621 3129429 3114444 3099735 3031286 3082753 3119232
6510 3119232 2952031 2931535 2918366 2888947 2804468 2851683 2883575 2769569 2666546 2720867 2779496
6499 2779496 2858751 2926387 2743185 2756881 2736085 2759841 2835238 2984649 2778401 2802638 2817569
6488B817569J64928Q8486m717k1815K274M5315j74851Q2508O3977k9011m7247
6477B987416J24121J3172O633N0373N7045K66957P448j27821J11863j17590P1651
6466C451268R4299Q6257O5431j18563N4153m5956l2017K2532J18658o8879L7086
6455C664269K15299j50858J33524Q58k1620R3804K516J6022J17977M3104J01411
6444D216306L7603N6545J80702l0691M8431J5459m7551r3578J11185P5322L631
6433D573364l3205K38327k9859P4022M7065N7672Q7333Q3095K1433k3957J37386
6422E232676l2374m7508n5703N3567P9806Q3402K5009Q9771Q7808Q5292J24242
6411E725988P4513R8614J24566J05103J484Q8110K1723J68400K32672K5974k2723
$$ plain form
6488 2817569 2982497 3070983 3066266 3044451 3046725 3092040 2917189 2999697 3063674 3034663 2987416
6477 2987416 3111537 3124709 3131342 3181715 3238760 3505717 3513165 3385344 3497207 3379617 3451268
6466 3451268 3545567 3631824 3697255 3578692 3632845 3586889 3554872 3577404 3696062 3627183 3664269
6455 3664269 3879568 3728710 3862234 3863092 3841472 3935276 3937792 3953814 4071791 4114895 4216306
6444 4216306 4253909 4310454 4491156 4460465 4508896 4524355 4476804 4383226 4494411 4569733 4573364
6433 4573364 4540159 4778486 4748627 4822649 4869714 4927386 5014719 5097814 5119247 5095290 5232676
6422 5232676 5200302 5152794 5097091 5150658 5230464 5313866 5338875 5428646 5516454 5601746 5725988
6411 5725988 5800501 5899115 6023681 6128784 6130268 6218378 6240101 6408501 6641173 6667147 6644424
6400F644424M5786J29987O8531j54336K6979J16108l0525M4037J52464J82958
6390G226413J91001J17724K22638J82699J20262J79324K55630J51916L25318K52915
6380I225840K90539K32147R4552L95518L66389L83594L21518M12053M27325M29557
6370A2579032N16291M96379N92662P12676P99088P46801Q74614J107978J091928
6361A9517449J319901J549901J650640J559826J753424J689919J415365J244577
6353C1701002R25706R48365J096156J109609J262732J506220J692322J605524
6345D1847636J555838J185473J058264R52305Q99827J091272J313033J545856
6337E1449504J484577J362501J404774J227021J445369J605153K309108L075139
$$ plain form
6400 6644424 6690210 6820197 6888728 6734392 6761371 6877479 6846954 6890991 7043455 7226413
6390 7226413 7417414 7535138 7757776 7940475 8060737 8240061 8495691 8647607 8972925 9225840
6380 9225840 9516379 9748526 9843078 10238596 10604985 10988579 11310097 11722150 12149475 12579032
6370 12579032 13095323 13591702 14184364 14897040 15696128 16442929 17317543 18425521 19517449
6361 19517449 20837350 22387251 24037891 25597717 27351141 29041060 30456425 31701002
6353 31701002 32626708 33575073 34671229 35780838 37043570 38549790 40242112 41847636
6345 41847636 43403474 44588947 45647211 46599516 47499343 48590615 49903648 51449504
6337 51449504 52934081 54296582 55701356 56928377 58373746 59978899 62288007 65363146
6329F5363146L948503M858118N803675O028702O083074N628414M423139K732482
6321A04869253M92387j909054l802038m647531m550759l703392k638777j579972
6313H2530117l41722P45967J940039K948689L752279M536432N285793N556122
6305A06953716N157975M245021K383959N74783j173021k883654m365648n609186
6297A05283945o315579o290252n567940m960424l812216l168615k492692j607183
6289G1069044j252560n52438L0180R77076J686945K231436L104590M029652M837800
6280H6161725N585120N781834N972393N574799M518209K787812R92123j071693
6272A16302322k416378l610354m722725n143745n013509m348897l486372k713040
$$ plain form
6329 65363146 69311649 74169767 79973442 86002144 92085218 97713632 102136771 104869253
6321 104869253 105361640 103452586 99650548 95003017 90452258 86748866 84110089 82530117
6313 82530117 82188395 82934362 84874401 87823090 91575369 96111801 101397594 106953716
6305 106953716 112111691 116356712 118740671 119315454 118142433 115258779 110893131 105283945
6297 105283945 98968366 92678114 87110174 82149750 78337534 75168919 72676227 71069044
6289 71069044 69816484 69264046 69294226 70271302 71958247 74189683 77294273 81323925 86161725
6280 86161725 91746845 97528679 103501072 109075871 113594080 116381892 117374015 116302322
6272 116302322 113885944 110275590 105552865 100409120 95395611 91046714 87560342 84847302
6264H4847302j735530o45126N40643J666696K416407L125227L615742L471526
6256I7302887K871803J540105j9070k137992m018566n271254n652778n450454
6248G9164681m881958m139786l443031k682709k167299j997444j681706j533261
6240E6637487j538115j631675j644889j585407j390311j152540j089863j052896
6232D5551791j101438j287320j360110j587826j462446j384467j298351j043103
6224C5026730j070780q40859r94792j202363j298338j534807j752901j631012
6216B4700878j592713j397070j520451j160335r71709r71452p65973q04242p75583
6207A4741350n92439m98773n68313n34725l98708l74943l62084l88012l90704
$$ plain form
6264 84847302 83111772 82466646 83007289 84673985 87090392 90215619 93831361 97302887
6256 97302887 100174690 101714795 101695725 99557733 95539167 90267913 84615135 79164681
6248 79164681 74282723 70142937 66699906 64017197 61849898 59852454 58170748 56637487
6240 56637487 55099372 53467697 51822808 50237401 48847090 47694550 46604687 45551791
6232 45551791 44450353 43163033 41802923 40215097 38752651 37368184 36069833 35026730
6224 35026730 33955950 33115091 32120299 30917936 29619598 28084791 26331890 24700878
6216 24700878 23108165 21711095 20190644 19030309 18058600 17087148 16321175 15516933 14741350
6207 14741350 14148911 13650138 13081825 12547100 12148392 11773449 11411365 11023353 10632649
6198A0632649k81566j35243j78789j95894j40795k42576k23527r5430k89936j24462
6188H724431k70548j73777j23712j18658k03106k38291j85549k01810j05304j18956
6178F984720n2091l0785j56588j65826J4618o9034j89006j27805l7604j19977
6168F050622j49357j09471k5746j13237q4692L1305l8449k10293o6540r168O0815
6157E335789m956O6249p9426j09660k4768o5382p3378j54602j883l2980r9713
6146D755290j47415k56706k64845j8524j08233l6011j4946k16399k1468j25003
6136C545740j59998j09904j5344j4920K6715j05276m5409j9490r1260j3605k7739
6125B969510m7667m3174j14540j02536J00996j64679m2519j9745r4263P3089k6572
$$ plain form
6198 10632649 10351083 10215840 10037051 9841157 9700362 9457786 9234259 9138829 8848893 8724431
6188 8724431 8453883 8280106 8156394 8037736 7834630 7596339 7410790 7208980 7103676 6984720
6178 6984720 6932629 6901844 6745256 6579430 6594048 6525014 6336008 6208203 6170599 6050622
6168 6050622 5901265 5791794 5766048 5652811 5568119 5599424 5560975 5350682 5284142 5274974 5335789
6157 5335789 5330833 5397082 5317656 5207996 5183228 5117846 5044468 4889866 4887983 4855003 4755290
6146 4755290 4607875 4351169 4086324 4067800 3959567 3923556 3908610 3692211 3670743 3545740
6136 3545740 3385742 3275838 3260494 3245574 3272289 3167013 3121604 3102114 3010854 2997249 2969510
6125 2969510 2921843 2878669 2764129 2661593 2762589 2597910 2555391 2535646 2441383 2514472 2487900
6114B487900j34431m2773p2657j2821J04859M2615j8498n8615j49476R7641Q8156
6103B331900K6315p3582j28002N4096L7792r2568l8106q2220o4227O7700l4543
6092B004555p8882j8715P8574o5661r3725K1536P7701q5140l3536m0171j32757
6081A633779J14654p2811k5616J02667J10797j303p1702j00754J24164Q8258m8970
6070A853163p4893k1571p7883L3939o142j6492J95795m56j94923l3311o2352J07046
6058A701920J25684J4107M8880M618M8603r8666O4547J14258K9519j3798l8097
6047B001575p2868J70506o686o0429r0296n2274Q4801O6353p6795L8103M0232
6036B042222j640j4895j45075m5894Q3616n7503M2210n7976P77N170o0688J08739
$$ plain form
6114 2487900 2353469 2310696 2238039 2225218 2330077 2372692 2354194 2295579 2146103 2243744 2331900
6103 2331900 2358215 2284633 2156631 2210727 2248519 2155951 2117845 2035625 1971398 2039098 2004555
6092 2004555 1925673 1906958 1985532 1919871 1826146 1847682 1925383 1840243 1806707 1766536 1633779
6081 1633779 1748433 1675622 1650006 1752673 1863470 1862167 1790465 1689711 1813875 1902133 1853163
6070 1853163 1778270 1756699 1678816 1712755 1706613 1690121 1885916 1885460 1690537 1657226 1594874 1701920
6058 1701920 1827604 1841711 1890591 1895209 1943812 1845146 1909693 2023951 2053470 2039672 2001575
6047 2001575 1928707 2099213 2092527 2032098 1941802 1889528 1974329 2040682 1963887 2001990 2042222
6036 2042222 2040582 2025687 1880612 1834718 1918334 1860831 1903041 1845065 1845842 1851012 1790324 1899063
6024A899063O2390O0113j2030N3867K12887P1937j6575O4116Q588N0596J34452
6013B589404j8039J0748J1079K3795o9359P6875J17211l5907K8208n1454k3694
6002B658867p0884J0425M3706J8183O1780j37607J8420J18053j19165K030J69024
5991B772832K6562p8952J25032J59823P8244R5418Q8028R4249J56718J81386J45908
5980C845248J42711Q1603R5099K4524j3087J18130K43998R6821O1740J53932L75608
5969E226327K20454O1481L20252J64243K6001J99769l7646j66110j67182k68381
5959E579208k66706j96952j32972j96839j26046k09119j21892l1209k30577j10902
5949C955994q3622j40939n7755n5158k20231r5772N2237q9290l4498J4533J24529
$$ plain form
6024 1899063 1961453 2021566 2009536 2063403 2276290 2348227 2331652 2395768 2404356 2454952 2589404
6013 2589404 2571365 2582113 2593192 2616987 2547628 2624503 2741714 2705807 2734015 2682561 2658867
6002 2658867 2587983 2598408 2642114 2660297 2722077 2584470 2602890 2720943 2601778 2603808 2772832
5991 2772832 2799394 2720442 2845474 3005297 3083541 3178959 3266987 3361236 3517954 3699340 3845248
5980 3845248 3987959 4069562 4164661 4189185 4176098 4294228 4538226 4635047 4696787 4850719 5226327
5969 5226327 5446781 5508262 5828514 5992757 6018758 6218527 6180881 6014771 5847589 5579208
5959 5579208 5312502 5115550 4982578 4785739 4659693 4450574 4328682 4297473 4066896 3955994
5949 3955994 3872372 3731433 3673678 3618520 3398289 3302517 3354754 3265464 3230966 3245499 3370028
5938C370028j04332q4791n8243j17358j6053l8335j56322m7501o6055O5681K8587
5927B775306m971l1857p9882Q249n5534o3223K475n6063N1211P0202J00360j5435
5915B700838m3899o1837J69307M4939r6154O7068P340J12175O6585J18219J26890
5904C211471Q4558n9620J5313R3974k9326J17582M1415L601J56940O1585k110
5893C695383Q146J13385o104o9832p9612Q149j08466j48096j76987J31912Q190
5882C376068L5461r3528n8378Q672o9779P7543k09004p8494m0949N4400J5167
5871C017179r7729k6270Q8245n4429L6309k08808M60n2634j24880L1808k5058
5860B584193J20414M3807o691n2380m5809O8203j4261n6958o1773j06900L8733
$$ plain form
5938 3370028 3265696 3180905 3122662 3005304 2989251 2950916 2794594 2747093 2681038 2746719 2775306
5927 2775306 2770335 2738478 2658596 2666845 2611311 2548088 2550563 2494500 2545711 2615913 2716273 2700838
5915 2700838 2656939 2595102 2764409 2809348 2713194 2780262 2787602 2899777 2966362 3084581 3211471
5904 3211471 3296029 3236409 3251722 3345696 3316370 3433952 3475367 3478968 3635908 3697493 3695383
5893 3695383 3703529 3816914 3810810 3740978 3661366 3669515 3561049 3412953 3235966 3367878 3376068
5882 3376068 3411529 3318001 3259623 3268295 3198516 3276059 3067055 2988561 2947612 3002012 3017179
5871 3017179 2919450 2893180 2981425 2926996 2963305 2754497 2754957 2702323 2577443 2609251 2584193
5860 2584193 2704607 2748414 2741723 2689343 2643534 2711737 2697476 2640518 2578745 2471845 2510578
5849B510578k61k5833K8319J04572J66775j97592j01668K7197J4900j3988J22662
5838B635661N6931m1086p1894O8741m9768q3036J8166P6983q696R7811M3010k0550
5826B722273L9211k7910K00504m9924j64036k0872O1967J16825J38234M2258O0930
5815C119460n2589N9300L6725J9944J9966R0638p5691j8328P058K7119J6120r0604
5803C159118r0021L6953p2980k01105j6159m7617J30555J97923j64669l3686p1804
5792B826508m0861L6140J11675m6595O6590p6308j5476K289R462J9682J22878
5781C015984j09370L870J51543M9082j01302N3772O7763J6758J44327m556N5323
5770C343194M0573k4254p188J04604J267n6455K9590M6008k3919m028R1072K2557
$$ plain form
5849 2510578 2510317 2484484 2512803 2617375 2784150 2586558 2484890 2512087 2526987 2512999 2635661
5838 2635661 2692592 2651506 2579612 2648353 2598585 2515549 2533715 2610698 2602002 2699813 2742823 2722273
5826 2722273 2761484 2733574 2934078 2884154 2720118 2699246 2761213 2878038 3016272 3058530 3119460
5815 3119460 3066871 3126171 3162896 3182840 3202806 3293444 3217753 3199425 3206483 3233602 3249722 3159118
5803 3159118 3069097 3106050 3033070 2831965 2815806 2768189 2898744 3096667 2931998 2898312 2826508
5792 2826508 2785647 2821787 2933462 2886867 2953457 2877149 2861673 2863962 2873424 2893106 3015984
5781 3015984 2906614 2910484 3062027 3111109 3009807 3063579 3131342 3148100 3292427 3287871 3343194
5770 3343194 3383767 3359513 3352325 3456929 3458196 3401741 3431331 3477339 3453420 3449392 3540464 3563021
5758C563021O5417J06768j03634R4847K8947Q3440J70283J7346p6996J1002j64407
5747C796034J12071J02933L7506Q9967r5473L7781J44229L6355R2908q4921P1460
5736D340850N7789k970J2816K5662J65624O5904J56164J98514L1531k0920m8649
5725D982315K52932n1823j49920L6791k07423J9305O5710O264p960j6885M5159
5714D974465n9271K5269J03314K2513q5558J56167J4951P895j9657p7297J94988
5703E257779n319J12075K9203M8531J62888O8430J65983J4170M1499O5437K9852
5692E990528N2212o181J32897J06857J54830J36920l5646o1127n100M1741p6639
5681F431292j11636O1727m1791N687R9343K4949P2179J3712K03710m863l0445
$$ plain form
5758 3563021 3628438 3735206 3631572 3726419 3755366 3838806 4009089 4026435 3949439 3960441 3796034
5747 3796034 3908105 4011038 4048544 4138511 4043038 4080819 4225048 4261403 4354311 4269390 4340850
5736 4340850 4398639 4395669 4408485 4434147 4599771 4665675 4821839 5020353 5051884 5030964 4982315
5725 4982315 5235247 5183424 5033504 5070295 4862872 4882177 4947887 4954151 4946191 4929306 4974465
5714 4974465 4915194 4940463 5043777 5066290 4980732 5136899 5151850 5159745 5140088 5062791 5257779
5703 5257779 5252460 5364535 5393738 5442269 5605157 5673587 5839570 5853740 5895239 5960676 5990528
5692 5990528 6042740 6036559 6169456 6276313 6431143 6568063 6532417 6471290 6466190 6507931 6431292
5681 6431292 6319656 6381383 6339592 6345279 6444622 6469571 6541750 6555462 6759172 6754309 6723864
5670F723864J52148M6633K09319J43820J25520J29538J85639K61055K45748M00202
5660H623486K76854K06401M00787K86019K83133M17641L6205j20199J65707J67988
5650A0744022r3476l9038l2996M8111K33196J75064J33368L52911J79648Q9378
5640A1790188M45598L00693J27198M19130L74579L89507N30188M91918O09455
5631A5478454N59051O90837R66701Q19830P92665J023865J110128J004100R06481
5622B3352112J008342R02466Q59568Q07217J122704J513527J581257J701854J733594
5613C4582641J922090K245562K354926K870507L108554L527112L726037M266347
5605E8603776M844771N267466O031600O808626P488938Q257649R055385R626399
$$ plain form
5670 6723864 6876012 6922645 7131964 7275784 7401304 7530842 7716481 7977536 8223284 8623486
5660 8623486 8900340 9106741 9507528 9793547 10076680 10494321 10530526 10410327 10576034 10744022
5650 10744022 10650546 10611508 10578512 10626623 10859819 11034883 11168251 11521162 11700810 11790188
5640 11790188 12235786 12536479 12663677 13082807 13457386 13846893 14377081 14868999 15478454
5631 15478454 16037505 16728342 17695043 18514873 19307538 20331403 21441531 22445631 23352112
5622 23352112 24360454 25262920 26122488 26929705 28052409 29565936 31147193 32849047 34582641
5613 34582641 36504731 38750293 41105219 43975726 47084280 50611392 54337429 58603776
5605 58603776 63448547 68716013 74747613 81556239 89045177 97302826 106358211 115984610
5597A15984610J0038141J0346356J0337520R695352Q739221P429375N428374K877124
5589A80876073K64418k213312m539408o160131p100549p754360q273181q812736
5581A36286814r112653r154568r090318q781529q183064p567741o802267o212942
5573G1381732n607991n161949m614276m100935l678558l399808k944553k626698
5565C9246964k446039k172164j866377j753234j553399j284322j170621j158689
5557B5842119j042654j044684q82259q14996q53046p90461r48665q36957o47337
5548A7981060o07953n99033o64990o34195n57362l91363l96798m29871m43914
5539A3255581m82285l88672k75085l88336m15233l29651m33036l33237j87898
$$ plain form
5597 115984610 126022751 136369107 146706627 156401979 165141200 172570575 177998949 180876073
5589 180876073 181140491 178927179 174387771 168227640 161127091 153372731 145099550 136286814
5581 136286814 127174161 118019593 108929275 100147746 91964682 84396941 77594674 71381732
5573 71381732 65773741 60611792 55997516 51896581 48218023 44818215 41873662 39246964
5565 39246964 36800925 34628761 32762384 31009150 29455751 28171429 27000808 25842119
5557 25842119 24799465 23754781 22872522 22057526 21204480 20414019 19465354 18628397 17981060
5548 17981060 17373107 16774074 16109084 15474889 14917527 14526164 14129366 13699495 13255581
5539 13255581 12773296 12384624 12109539 11721203 11305970 10976319 10543283 10210046 10022148
5530A0022148k05552l27672j97197l73352k01475j85158j98052k27304j87588
5521G918798j96172j91606m0032k07419k41292j18634j16874k2280j00981r7048
5511F586460j86685j4695l4848q4966O2640p0334j14083j32272j77517j33498
5501E700202k3950J19562J0510p1497l36093j59007P9643q5500j14893j7497j40840
5490D960640k05642r3721o4437p7929K5588j04910k03763r164m1117j18787o6497
5479D000261K0266q3129j33896r8999k832o0385M960q2907K77j78075P7889q1386
5467C382044R2386K048q9152q079J7502M088r1341p0955j23918L4602n3584j5934
5455C079707K7437m163q331j04071l3387K6554O8860m2111K3653R1927l6083p5510
$$ plain form
5530 10022148 9816596 9488924 9291727 8918375 8716900 8531742 8333690 8106386 7918798
5521 7918798 7722626 7531020 7490988 7283569 7042277 6923643 6806769 6784489 6683508 6586460
5511 6586460 6399775 6385080 6350232 6265266 6327906 6257572 6143489 6011217 5833700 5700202
5501 5700202 5676252 5795814 5806324 5734827 5398734 5239727 5319370 5233870 5118977 5101480 4960640
5490 4960640 4754998 4661277 4596840 4518911 4544499 4439589 4235826 4226662 4185545 4066758 4000261
5479 4000261 4020527 3937398 3803502 3704503 3701671 3641286 3646246 3563339 3563616 3385541 3463430 3382044
5467 3382044 3474430 3476478 3387326 3379247 3396749 3400837 3309496 3238541 3114623 3149225 3095641 3079707
5455 3079707 3107144 3102981 3094650 2990579 2957192 2983746 3052606 3010495 3034148 3126075 3089992 3014482
5443C014482p290k2503J56314M766l526O6430o603l0126l0183K5946j8184q3968
5431C065555k8236n967L7726N8640K9170R1954n4477l3639O0833K0772K9763M2507
5419C314601O8450l6380R1259J62206l6412P5436j36506J35537p5570J25325O2064
5408C750010J43023K91934J80896K46830K16562J17587K53040j7642j06569l42805
5398D732866k68055j38728l76388k12672q1716p7800k10966m4848q7055q3031
5388C151607k3521p2219p1553O5163O1160j30291j51834l1593k3678O6611j05664
5377B734188k4804r3607o7800n7650J16358j329K909P4875m5478q3669j07131
5366B446862J1487L3398j394K9036k9871j57394l7289P3196q7203J02485k4867
$$ plain form
5443 3014482 3007192 2984689 3141003 3145769 3142243 3208673 3202070 3171944 3141761 3167707 3149523 3065555
5431 3065555 3037319 3031352 3069078 3127718 3156888 3248842 3194365 3160726 3221559 3242331 3272094 3314601
5419 3314601 3383051 3346671 3437930 3600136 3563724 3639160 3502654 3638191 3562621 3687946 3750010
5408 3750010 3893033 4184967 4365863 4612693 4829255 4946842 5199882 5182240 5075671 4732866
5398 4732866 4464811 4326083 3949695 3737023 3655307 3577507 3366541 3321693 3234638 3151607
5388 3151607 3128086 3055867 2984314 3049477 3110637 2980346 2828512 2796919 2773241 2839852 2734188
5377 2734188 2709384 2615777 2547977 2490327 2606685 2605356 2608265 2683140 2637662 2553993 2446862
5366 2446862 2458349 2491747 2490353 2519389 2489518 2332124 2294835 2368031 2280828 2383313 2358446
5355B358446J2845r4312j92478Q197J18477J06910n0552l4955l4845O8216o5642
5344B200307p9784K4291O8748L1853m580j25614m1201k7526n7726J25314Q5035
5333B199117n4326O5880j95527J6539K5253o9017J07803J92408O0432j54073M2197
5322B236686O3016r7112J22429M9675Q142J5416j33776m2989J65294n0126Q0008
5311B416663P2461l8347N281j54755M8192M7081j0129p8196J2663M6636J4314
5300B381864M7568k3352J16961Q4633q3664k4895M6491j9171k6029J26310J37965
5289B764681N7280L8378K27776m3587n1267q523O2651n1668q134K0551O635J30997
5277C145770j77506m1004n7802j29959r069j20051M7552K58778Q378j08948k07042
$$ plain form
5355 2358446 2371291 2276979 2084501 2092698 2211175 2318085 2267533 2232578 2197733 2265949 2200307
5344 2200307 2120523 2144814 2213562 2245415 2240835 2115221 2074020 2046494 1988768 2114082 2199117
5333 2199117 2144791 2210671 2015144 2031683 2056936 1987919 2095722 2288130 2348562 2194489 2236686
5322 2236686 2299702 2202590 2325019 2374694 2382836 2398252 2264476 2221487 2386781 2336655 2416663
5311 2416663 2489124 2450777 2456058 2301303 2349495 2396576 2386447 2308251 2320914 2367550 2381864
5300 2381864 2429432 2406080 2523041 2607674 2524010 2499115 2545606 2526435 2500406 2626716 2764681
5289 2764681 2821961 2860339 3088115 3044528 2993261 2984738 3047389 2995721 2987587 3008138 3014773 3145770
5277 3145770 2968264 2927260 2869458 2739499 2730430 2610379 2657931 2916709 2925087 2816139 2609097
5266B609097m8753J24807M3660j45047r3258l4966K6319J4224j70742M8713J15020
5255B489074j3133q023J11659n3405K00222J32320n1102j6015J08922Q9490J3206
5244C003215P6350J34557k9222n9807P6649J29170J18702O3959J91067J09870
5234C814510R5234p462M2213m5725m5042r4047P072j11981j22317j05699N9369
5223C486125L0451q683K08304L65p0111L858J49825J70848N9753L3788k7980o8552
5211C967991J21752K45138Q3855O9267K9968R9971Q5737L1462n7896k5417J6374
5200D668202K6191Q8137j01431L5404Q256J13789j1999R8082P3669O6866J11656
5189E176822n9102J44245l3897J9303R1852o332j26926k6670j0925q6431o1004
$$ plain form
5266 2609097 2560344 2685151 2728811 2583764 2490506 2455540 2481859 2496083 2325341 2374054 2489074
5255 2489074 2475941 2467918 2579577 2526172 2726394 2858714 2807612 2791597 2900519 2990009 3003215
5244 3003215 3079565 3214122 3184900 3125093 3201742 3330912 3449614 3513573 3704640 3814510
5234 3814510 3909744 3902282 3944495 3898770 3853728 3759681 3766753 3654772 3532455 3426756 3486125
5223 3486125 3516576 3507893 3716197 3716562 3646451 3650309 3800134 3970982 4030735 4064523 4036543 3967991
5211 3967991 4089743 4334881 4418736 4488003 4517971 4617942 4703679 4735141 4677245 4651828 4668202
5200 4668202 4694393 4782530 4681099 4716503 4724759 4838548 4826549 4924631 4998300 5065166 5176822
5189 5176822 5117720 5261965 5228068 5247371 5339223 5332891 5205965 5179295 5168370 5081939 5020935
5178E020935l3732N6975m5809J4993j40422J0786O3081k6947p331R9888P5713
5167E088130J70199J03282P1696J98506J30807J59835J87197Q8768J33151J04938
5157F436509O4069N5909K75399J87903J33277J99656K15873J13294q9551P5549
5147G667887J48615k7635j69186q6495j22000j27475o6148L7655r056n2191J02809
5136G296780K45635J68290J55363J93984K17150L65844M38447L07690L27477P33981
5126A0450641O32588O46312L67239K56490J32928m3173j58841k03161k2394Q0167
5116A2138796L18322L64650M08292P42058R59508Q28822Q87038P27005N52836
5107A7927327K8526p16420j217940j267029j258468q52525p08205n18075m63572
$$ plain form
5178 5020935 4987203 5044178 4998369 5013362 4872940 4883726 4946807 4919860 4912529 5012417 5088130
5167 5088130 5258329 5361611 5433307 5631813 5762620 5922455 6109652 6198420 6331571 6436509
5157 6436509 6500578 6556487 6831886 7019789 7153066 7352722 7568595 7681889 7592338 7667887
5147 7667887 7816502 7788867 7619681 7533186 7411186 7283711 7217563 7255218 7246162 7193971 7296780
5136 7296780 7542415 7710705 7866068 8060052 8277202 8643046 9081493 9389183 9716660 10450641
5126 10450641 11083229 11729541 12096780 12353270 12486198 12443025 12284184 12081023 12058629 12138796
5116 12138796 12457118 12821768 13230060 13972118 14931626 15760448 16647486 17374491 17927327
5107 17927327 17955853 17239433 16021493 14754464 13495996 12643471 11935266 11417191 10953619
5098A0953619m37241l12878l51003m50834k01683k40681q2533J4558k75067j29142
5088H487115k529k07536j6721j00009r8297K987k2737n7391m0011j09769p2964
5077G762138N7212j66194o3332k1623N108q4598j20133j17572Q624j09527O6154
5066G216257O4571j11082j07381p5872r564m9213N0737j6593l8077L435L828R22
5054F931968O1736O4521P4448Q5776j832k6830J11632J54051J3898O1996m008
5043G527356m9737l5628j9592j0053J01226j6683J02811Q0886P7688K10448j4653
5032G954069P3259N6699J35014O8627R1563Q2325K52909J94584J34907K34759
5022I278715L02139K16953K61385L09163L01679K99065K39030J91572J7050j73620
$$ plain form
5098 10953619 10516378 10203500 9852497 9401663 9199980 8959299 8876766 8891324 8616257 8487115
5088 8487115 8484586 8277050 8260329 8160320 8062023 8065010 8042273 7984882 7944871 7835102 7762138
5077 7762138 7819350 7653156 7589824 7568201 7573309 7488711 7368578 7251006 7259630 7150103 7216257
5066 7216257 7280828 7169746 7062365 6986493 6976929 6927716 6978453 6961860 6923783 6927218 6931046 6931968
5054 6931968 6993704 7058225 7132673 7218449 7216617 7189787 7301419 7455470 7469368 7531364 7527356
5043 7527356 7477619 7441991 7422399 7412346 7513572 7496889 7599700 7680586 7758274 7968722 7954069
5032 7954069 8027328 8084027 8219041 8287668 8379231 8461556 8714465 8909049 9043956 9278715
5022 9278715 9580854 9797807 10059192 10368355 10670034 10969099 11208129 11399701 11416751 11243131
5012A1243131K3775l5895P8901K59608P4716K55345J55244L01816K55288L04923
5002A2916852L64439J46626K06379O2136L6795J25833m7599J18476O8648M8694
4992A4047279m5778l7428K85989L45530K00325J44642Q1401K43341K37530J96246
4982A5699077L52302M54607M05430M42466M62897M69408N68573M67444M84709
4973A9806913N30994N05245N95241N28442N40117O19712N90001N64698O07118
4964B4888481P33931O38276O48939P32367Q61297R68208Q12807Q59538Q59946
4955C2003790R83529J053820J270518J277511J420850J686731J622062J925524
4947D3244335K008901J995609K198470K181130K353464K458006K760790L024394
$$ plain form
5012 11243131 11266906 11231011 11309912 11569520 11644236 11899581 12054825 12356641 12611929 12916852
5002 12916852 13281291 13427917 13634296 13696432 13733227 13859060 13811461 13929937 13998585 14047279
4992 14047279 14001501 13964073 14250062 14595592 14795917 14940559 15021960 15265301 15502831 15699077
4982 15699077 16051379 16505986 16911416 17353882 17816779 18286187 18854760 19322204 19806913
4973 19806913 20337907 20843152 21438393 21966835 22506952 23126664 23716665 24281363 24888481
4964 24888481 25622412 26260688 26909627 27641994 28503291 29471499 30284306 31143844 32003790
4955 32003790 32987319 34041139 35311657 36589168 38010018 39696749 41318811 43244335
4947 43244335 45253236 47248845 49447315 51628445 53981909 56439915 59200705 62225099
4939F2225099L264667L612902M141826M442754M784117N319956O033859O410190
4931A00235370O885134P399740P889859Q665996R285403J0196089J1225976J2187818
4923A73971385J3165945J4105675J4829796J5116678J5159441J5045847J4284437
4916B75679204J2896292J0764285P561267L952010n6927m005125p346850r723774
4908B89720382j1725735j2965373j3780175j4639924j5206013j5757451j5756689
4901A89889022j5288883j4321722j3139107j1700479j0454478r233417q241702
4894A07509234p220888o458319n746284m933106m330175l716410l371166l006884
4886F8726002k647094k313900k072108k045263k077243k004149j853740j887353
$$ plain form
4939 62225099 65489766 69102668 73244494 77687248 82471365 87791321 93825180 100235370
4931 100235370 107120504 114520244 122410103 131076099 140361502 150557591 161783567 173971385
4923 173971385 187137330 201243005 216072801 231189479 246348920 261394767 275679204
4916 275679204 288575496 299339781 306901048 310853058 310796131 306791006 299444156 289720382
4908 289720382 277994647 265029274 251249099 236609175 221403162 205645711 189889022
4901 189889022 174600139 160278417 147139310 135438831 124984353 115750936 107509234
4894 107509234 100288346 93830027 88083743 83150637 78820462 75104052 71732886 68726002
4886 68726002 66078908 63765008 61692900 59647637 57570394 55566245 53712505 51825152
4878E1825152j793912j698952j697067j571454j324040j279168r81614r73149
4870D0505796p47675o18126n71326k34260k87048m26828l6098p5999J36056K43865
4860C7888357L61971O24985M66132N30623O86105O62504O57911M58767L41540
4851D2678895K44570p0835m14271m90971q71675r90850j207781j205731j233727
4842C6437624j423370j385509j156431j170196j075844j214510j176743j138815
4834B6696206j003967j016248r61681q65258r22413o84444o28256n88825n44613
4825A9480501n34430m59839m66423m14908k72674m00230k09112k79001k63450
4816A6180434l4768k23702k83559l03401r9164j90442j97744K8304m1463J18104
$$ plain form
4878 51825152 50031240 48332288 46635221 45063767 43739727 42460559 41478945 40505796
4870 40505796 39758121 39139995 38568669 38334409 38047361 37620533 37584435 37508436 37644492 37888357
4860 37888357 38250328 38875313 39341445 39872068 40558173 41220677 41878588 42337355 42678895
4851 42678895 42923465 42852630 42438359 41947388 41075713 40084863 38877082 37671351 36437624
4842 36437624 35014254 33628745 32472314 31302118 30226274 29011764 27835021 26696206
4834 26696206 25692239 24675991 23714310 22849052 21926639 21242195 20613939 20025114 19480501
4825 19480501 18946071 18486232 18019809 17604901 17332227 16931997 16722885 16443884 16180434
4816 16180434 16145666 15921964 15638405 15335004 15235840 15045398 14847654 14875958 14834495 14952599
4806A4952599J2462q0567m6884n9478n0949m97q3546p6231j31959M0618M4434
4795A4520002J63115n3440r4980M0452J50467k4036R6712J95220P9629k2560l9125
4784A5011456o8829K29603J67188J40684n6847R6995M1974J730J88214m272q2346
4773A5665550n1962J38146J80042n5181J70672K13228m5646R6432J09700J99000
4763A6619981K06095O8119O5601K83768M16127K13660L04218K04209K72910L40967
4753A8995655M07808L60325L73144K50607L26056L77779O05974M96327M37651
4744B2631326M57991N25176N31780O03864N75111P23338P27725P33480J083054
4735B8592845J035715J071452J186712J267961J369877J472438J639132J905897
$$ plain form
4806 14952599 14965061 14884494 14837610 14778132 14727183 14726686 14643140 14566909 14434950 14475568 14520002
4795 14520002 14683117 14629677 14534697 14575149 14725616 14701580 14798292 14993512 15073141 15050581 15011456
4784 15011456 14942627 15172230 15339418 15480102 15423255 15520250 15562224 15563954 15752168 15747896 15665550
4773 15665550 15613588 15751734 15931776 15876595 16047267 16260495 16214849 16311281 16420981 16619981
4763 16619981 16826076 16894195 16959796 17243564 17659691 17873351 18177569 18381778 18654688 18995655
4753 18995655 19403463 19763788 20136932 20387539 20713595 21091374 21697348 22193675 22631326
4744 22631326 23089317 23614493 24146273 24750137 25325248 26048586 26776311 27509791 28592845
4735 28592845 29628560 30700012 31886724 33154685 34524562 35997000 37636132 39542029
4727C9542029K046438K098630K203160K468083K831844L211047L542308M175139
4719F2118678M645327N247305N862985O172127P002099P915504Q862538J0380115
4711A18206678J2529763J5550482K0152080K5822578L1818344L3622908L4111071
4704B91813904L4677269K8847607J9434755M162323j6260364l5107733l9899501
4697B87668260l5345618k8955828k3393264j9882820j6676154j4177999j2119705
4690A37116872j0914058j0290568q871313p166453n939575m934854m429427l848601
4682H0722023l150514k756115k256760j727109j452002r91407n72941l67794j5314
4673F7432067K58441L43071M95037P54233J203892J430297J808099K193561K827658
$$ plain form
4727 39542029 41588467 43687097 45890257 48358340 51190184 54401231 57943539 62118678
4719 62118678 66764005 72011310 77874295 84046422 91048521 98964025 107826563 118206678
4711 118206678 130736441 146286923 166439003 192261581 224079925 257702833 291813904
4704 291813904 326491173 355338780 374773535 378935858 362675494 327567761 287668260
4697 287668260 252322642 223366814 199973550 180090730 163414576 149236577 137116872
4690 137116872 126202814 115912246 107040933 99874480 93934905 89000051 84570624 80722023
4682 80722023 77571509 74815394 72558634 70831525 69379523 68388116 67815175 67447381 67432067
4673 67432067 67690508 68033579 68528616 69282849 70486741 71917038 73725137 75918698 78746356
4664G8746356L118439L443687L998918M771643N194313N617146O346264P067000
4656A18303766P650863Q936561J0526567J2335444J5021653J8591094K2364733
4649B13730681K5338197K6754054K6869702K5209856K0312055J1713171M55683
4642C50383399j1815367k2185872k6917128k6415940k3479759k0016893j6872893
4635B02679547j4379348j2247867j0690157r913935r371800q907439q736225q515219
4627A19917557q009658p020819o323246o056911n388381m800654m210088l739788
4619G4368012l357776k995807l027155k619046k402284k448298k287967k000669
4611E3229010j845579j626320j496643j487482j392710j445835j397728j255556
$$ plain form
4664 78746356 81864795 85308482 89307400 94079043 99273356 104890502 111236766 118303766
4656 118303766 125954629 134891190 145417757 157753201 172774854 191365948 213730681
4649 213730681 239068878 265822932 292692634 317902490 338214545 349927716 350383399
4642 350383399 338568032 316382160 289465032 263049092 239569333 219552440 202679547
4635 202679547 188300199 176052332 165362175 155448240 146076440 137169001 128432776 119917557
4627 119917557 111907899 104887080 98563834 92506923 87118542 82317888 78107800 74368012
4619 74368012 71010236 68014429 64987274 62368228 59965944 57517646 55229679 53229010
4611 53229010 51383431 49757111 48260468 46772986 45380276 43934441 42536713 41281157
4603D1281157j257987j195324j074119j018121q47343q60808p14242q62955p59876
4594C2690382p50843q17812p90022p25264o71602o25836m04390l72508l00998
4585B7231107k96480k03044k59547k71908k86695n69003l75044l60847m83143
4576B4125396n67603k81662l02744l81995m84280k53266k46313j98220l14984
4567B1094329l38367m2714j13699j36178K5865Q4237j32578j00516j1987q4319
4557B0244073j53219k5209k07549m22406k69466n24742n92138n40862n31019m51317
4547A6526146l06240l03428j10149j26405k56625j54617j03130N8414R8436J31590
4537A5453992R7674L36316L64909K84578M19046L80552M80192N53165M40872N25176
$$ plain form
4603 41281157 40023170 38827846 37753727 36735606 35888263 35027455 34313213 33450258 32690382
4594 32690382 31939539 31121727 30331705 29606441 28934839 28309003 27904613 27532105 27231107
4585 27231107 26934627 26731583 26472036 26200128 25913433 25344430 24969386 24608539 24125396
4576 24125396 23557793 23276131 22973387 22591392 22107112 21853846 21607533 21409313 21094329
4567 21094329 20755962 20713248 20599549 20463371 20489236 20573473 20440895 20340379 20328392 20244073
4557 20244073 20090854 20065645 19858096 19435690 19166224 18641482 18049344 17508482 16977463 16526146
4547 16526146 16219906 15916478 15806329 15679924 15423299 15268682 15165552 15223966 15322402 15453992
4537 15453992 15551666 15887982 16252891 16537469 16956515 17337067 17817259 18370424 18811296 19336472
4527A9336472N29507M70244M35353M44631M29766J51617l8793k53404n14336m58901
4517B0532156m19884l51467j85900j82956N6651K69361K12740L61483Q18914J132694
4507B2243792J276982J726541K031440K127932K110330K030629J367236P63982
4499C5678864l46321j412484k274987k896478k812493k425175k058152j660208
4491A9792566j500492j517009j174529r03195r64562q76903q23090o58602o49357
4482A0724827m96461n20533n39514m76472l86684l62085k78014k49241j55776
4473G260047j18861k10482j25703j03300k61919l0605m1236O7097J79476m0053
4463F574461R8188J8384N8365L4672J6873p2259J9257m6930l02229j44608K3767
$$ plain form
4527 19336472 19865979 20336223 20771576 21216207 21645973 21797590 21758797 21505393 20991057 20532156
4517 20532156 20112272 19760805 19574905 19391949 19448600 19717961 19930701 20292184 21111098 22243792
4507 22243792 23520774 25247315 27278755 29406687 31517017 33547646 34914882 35678864
4499 35678864 35332543 33920059 31645072 28748594 25936101 23510926 21452774 19792566
4491 19792566 18292074 16775065 15600536 14697341 13732779 12855876 12032786 11374184 10724827
4482 10724827 10228366 9707833 9168319 8691847 8305163 7943078 7665064 7415823 7260047
4473 7260047 7141186 6930704 6805001 6701701 6439782 6409177 6367941 6435038 6614514 6574461
4463 6574461 6672649 6691033 6749398 6784070 6800943 6728684 6747941 6701011 6398782 6254174 6277941
4452F277941q5549J10998k430j20915M2939m3905r1588j1613j54713j54078p1920
4441E695167j91978k64916l26008p6610p7906j09202N4354o7194q103j30084m6937
4430D450583J05990q920P3456j14439o5000m4354o1050P7062N8480J63538j75035
4419D460311J4556N6643K9023m0830p0093j61029J6207N7830q575J6411j71483
4408D198971m9365m1047q3263o6772q3805j35088q3444o9507j65797j18383M2195
4397C344695j94197k3889Q584j53766L2793J04211J93846J28231R4043J92499
4387C727050R9017J81072K65095m2954p9054r4981k30874j88004j18492k01990
4377C315885q7281j5545j80086k35246j10216l6042j50148l8149n6242J6578p8398
$$ plain form
4452 6277941 6192392 6303390 6300960 6180045 6222984 6179079 6087491 6075878 5921165 5767087 5695167
4441 5695167 5503189 5238273 4912265 4835655 4757749 4648547 4702901 4635707 4627604 4497520 4450583
4430 4450583 4556573 4547653 4621109 4506670 4441670 4397316 4336266 4413328 4471808 4635346 4460311
4419 4460311 4474867 4531510 4560533 4519703 4449610 4288581 4304788 4362618 4354043 4370454 4198971
4408 4198971 4149606 4108559 4025296 3958524 3874719 3739631 3656187 3586680 3420883 3302500 3344695
4397 3344695 3150498 3126609 3135193 2981427 3014220 3118431 3312277 3440508 3534551 3727050
4387 3727050 3826067 4007139 4272234 4229280 4150226 4055245 3824371 3636367 3517875 3315885
4377 3315885 3228604 3213059 3032973 2797727 2687511 2651469 2501321 2463172 2406930 2423508 2345110
4366B345110j09494q5969J06040q112p4287o7269J01165J11310K9608J76933N4682
4355B579717j05741Q1425j1604j18289O766k6562o0968p8448m0503O7562J28009
4344B421364Q2047K00945M9169J157j05430J16182p9538j40077k04743j79010
4334B162066p9082j55040q0134l591J8432j76372m0537r4344p6990n5134j59346
4323A259928k9438o7158J10300m1159j76723o2953o4376p7602J5504j11664m928
4312G49731P4696o7349M0941L7568n5694j9436P5464p0270J07099j06762N7413
4301H23401J41009M6593j7925l6659j1555J21391l3405l7633M0861q9433l1471
4290I15174l3257k3452l7573P6376j43175j11466o8820O726M9649q2004p3434
$$ plain form
4366 2345110 2235616 2149647 2255687 2247575 2173288 2106019 2207184 2318494 2348102 2525035 2579717
4355 2579717 2473976 2555401 2543797 2425508 2432274 2405712 2344744 2266296 2225793 2293355 2421364
4344 2421364 2503411 2704356 2753525 2754682 2649252 2765434 2685896 2545819 2341076 2162066
4334 2162066 2082984 1927944 1847810 1844219 1862651 1686279 1645742 1551398 1474408 1419274 1259928
4323 1259928 1230490 1163332 1273632 1232473 1055750 992797 928421 850819 866323 754659 749731
4312 749731 824427 757078 798019 835587 779893 760457 835921 765651 872750 765988 823401
4301 823401 964410 1011003 993078 956419 944864 1066255 1032850 995217 1036078 946645 915174
4290 915174 881917 858465 820892 897268 754093 642627 573807 580533 630182 548178 474744
4279D74744L9492K6438J3835M0214k6026j42591R4262k3885j87127n8838k1950
4268B28568n6119N0309J5270m8693j1956J68064q3598o3513m3398j29970R8606
4257A23570K5069r9378L262J03903O4849o6312j69398P7013J0191J9372N7054
4246A49195n3145m7296k0930J29401N0315L1972N7467j50160j00567Q6899P2065
4235B05216j62836j9188Q6387J63402j37145P1206m0231k6273R8342M7642M9619
4224C36141L6434J723j3148Q1802L0158Q3731R2406m7996J7256R6384q1295Q4983
4212G18579M3561k5215K2186l7952l7245r7127j19131P5745p3092L2197L1332
4201E33838j04855J0508P6731k9200r662J14196N1765M3715l6610r3692p4176
$$ plain form
4279 474744 514236 540674 554509 594723 568697 426106 520368 496483 309356 250518 228568
4268 228568 172449 222758 238028 189335 177379 345443 261845 198332 154934 24964 123570
4257 123570 148639 49261 52523 156426 221275 154963 -14435 62578 72769 92141 149195
4246 149195 96050 48754 27824 157225 207540 239512 296979 146819 46252 133151 205216
4235 205216 42380 23192 109579 272981 135836 207042 166811 140538 238880 286522 336141
4224 336141 372575 374298 361150 442952 473110 556841 649247 601251 618507 714891 633596 718579
4212 718579 762140 736925 759111 721159 683914 586787 467656 543401 470309 502506 533838
4201 533838 428983 439491 516222 487022 477360 591556 643321 687036 650426 556734 482558
4190D82558M6101j0287L8755P0546L8130R3674Q7937Q4743m704O8385J62056P7664
4178A235558J24699p886l2838j08402p4876R183R6152r2338k41742J79225J34808
4167A221543J3269L5777Q4728O4446p4629J20433Q2154M3689J72201Q1052J53248
4156A997911O0826J38651K2141J41215J10905j21241j22648J5057j58273j97821
4146A886723m2768N5094n8452k21681k1599j09294n7708R2828K7402J04K3743
4135A574392j0086r5334M1174J64166J07453l5977j40032O9687O5179O1290M5652
4124A847564M3980l6917k1789J00824l1414n8887J53032K2291j63336o551n9163
4113A789634J37300J08706l8471j70229j42578j76976r3022M9169j66079Q545
$$ plain form
4190 482558 528659 518372 557127 627673 665803 759477 847414 932157 927453 995838 1157894 1235558
4178 1235558 1360257 1352371 1319533 1211131 1136255 1145438 1241590 1149252 907510 1086735 1221543
4167 1221543 1234812 1270589 1355317 1419763 1345134 1465567 1547721 1591410 1763611 1844663 1997911
4156 1997911 2058737 2197388 2219529 2360744 2471649 2350408 2227760 2242817 2084544 1886723
4146 1886723 1843955 1899049 1840597 1618916 1597317 1488023 1430315 1523143 1550545 1550649 1574392
4135 1574392 1564306 1468972 1510146 1674312 1781765 1745788 1605756 1675443 1740622 1801912 1847564
4124 1847564 1891544 1854627 1832838 1933662 1902248 1843361 1996393 2018684 1855348 1848797 1789634
4113 1789634 1926934 2035640 1997169 1826940 1684362 1507386 1414364 1463533 1297454 1305999
4103A305999O739p8878j0700J04856q6372j2817R2525q30J25827J04919j41710
4092A409558k6645j10601J9755n2216m8837N2340m9626l9455r5594P5163j05273
4081A028569J28893m8888q8202m5124p3137J23193L0827K1856k8794p1712l8729
4070I38752J06776J24464k6624k5430P0162N1620j03414O0222J00112J8440l4771
4059A280309k7618r9219l7817J15595r8421p3302j8061l1021j40889L4422J08618
4048A012596j5135o8406l6809K652K04516J79508m4166j3670l1685M5683M2380
4037A277464Q9648m5903l4023Q484R868J68091n6214l9676m8866K061j3258o5900
4025A251776j9964J2045J48893J26850N0885J3606l7899O4382R4952j4695o2837
$$ plain form
4103 1305999 1312738 1233860 1223160 1328016 1241644 1228827 1321352 1320522 1446349 1551268 1409558
4092 1409558 1382913 1272312 1292067 1239851 1191014 1243354 1193728 1154273 1058679 1133842 1028569
4081 1028569 1157462 1108574 1020372 975248 902111 1025304 1056131 1077987 1049193 977481 938752
4070 938752 1045528 1169992 1143368 1117938 1188100 1239720 1136306 1196528 1296640 1315080 1280309
4059 1280309 1252691 1153472 1115655 1231250 1132829 1059527 1041466 1010445 869556 903978 1012596
4048 1012596 997461 929055 892246 894898 1099414 1278922 1234756 1221086 1189401 1235084 1277464
4037 1277464 1367112 1321209 1287186 1295670 1305538 1473629 1417415 1377739 1328873 1330934 1317676 1251776
4025 1251776 1231812 1243857 1392750 1519600 1570485 1584091 1546192 1610574 1705526 1690831 1627994
4014A627994P1765J01448l8808K4309J45874P0113J54389P4935l1601m4455j14832
4003B041131k5550j16263p2956j40573k3060J882o3271j60680J26656K2732P5965
3992A666013O5546j2366j81661p343l9921k12478p8920N7216J8968O8241j97135
3981A146160p5559K10795r2573j3961K9735Q1977n2920n5773N813o430k05974
3970I71290j17584K7678j5710q5790n1743j00935j9928P6420Q1876j25387n5509
3959E84678J2570R0447n6321J3395o4806k1093n424O1642J03259P8979j6524p0210
3947G10592o7152J68895o3899J0997l7487M8928J43607j65986n0022n221J12276
3936H05528n4030J7597m998J11898r226J7271j04487j04420M1918J05673O3247
$$ plain form
4014 1627994 1699759 1801207 1762399 1786708 1932582 2002695 2157084 2232019 2200418 2155963 2041131
4003 2041131 2015581 1899318 1826362 1685789 1662729 1664611 1601340 1440660 1567316 1590048 1666013
3992 1666013 1731559 1719193 1537532 1530189 1490268 1277790 1198870 1256086 1275054 1343295 1146160
3981 1146160 1070601 1281396 1188823 1174862 1204597 1286574 1233654 1177881 1183694 1177264 971290
3970 971290 853706 881384 865674 779884 728141 627206 607278 683698 765574 640187 584678
3959 584678 597248 687695 631374 644769 579963 558870 553446 615088 718347 797326 780802 710592
3947 710592 643440 812335 748436 759433 721946 770874 914481 748495 698473 693252 805528
3936 805528 751498 769095 764097 875995 866769 884040 779553 675133 717051 822724 885971
3925H85971j7446j7063L1305Q8497j9024m7846J0993k2931m461K20549J1168j10507
3913A009205k9241O1057O3375k434o4085k8529J06988k4504K2825J44594M0383
3902A299634j37003j37962J67590Q7738n5410L1326r4104J07968j5031P3827J08298
3891A436871k5120K8651q3977j04985M6886R2873Q6777P5775j11713L897J05550
3880A551485Q3559j68623m6178J19332K6042N1215m3013p5382o7266Q733O0706
3869A500610J7659j02390N5725J23518J2988L6252l9210m4842p2707m0956k6120
3858A420527J54433K0305J40748j22143o9781Q4391n9765Q8082l3775J1751o290
3847A628483K7291p104R1053J633j95642L1133J71874n9782R0657j06310p8371
$$ plain form
3925 885971 868525 851462 882767 971264 952240 904394 915387 892456 887995 1108544 1119712 1009205
3913 1009205 979964 1041021 1104396 1101962 1037877 1009348 1116336 1091832 1114657 1259251 1299634
3902 1299634 1162631 1024669 1192259 1279997 1224587 1255913 1161809 1269777 1254746 1328573 1436871
3891 1436871 1411751 1440402 1356425 1251440 1298326 1391199 1477976 1553751 1442038 1445935 1551485
3880 1551485 1635044 1466421 1420243 1539575 1565617 1616832 1573819 1498437 1431171 1439904 1500610
3869 1500610 1518269 1415879 1471604 1595122 1608110 1644362 1605152 1560310 1487603 1446647 1420527
3858 1420527 1574960 1595265 1736013 1613870 1544089 1628480 1568715 1656797 1623022 1634773 1628483
3847 1628483 1655774 1648670 1739723 1741356 1545714 1576847 1748721 1688939 1779596 1673286 1594915
3836A594915p3762N901O8211M7752n0792O8946j3107n8257K1947r0035M5820O7307
3824A634846k4214j55443k9628J16836J09391K4065o0234l0054P812R3813L5728
3813A722918Q2351M0608j36088J646J5640r000m4690p5784Q962N2637P8798r2877
3801A645121q3373m3400m5424q074J28244M1424j21575M7531j00236R652K3366
3790A493256l191p0327o4250Q3895J12453P9837n583r5874k5266J28903J34703
3779A768556r5477M7195R9672Q2276q1834J0258O2348k6344j1586q6896Q3809
3768A851977J50265J3145j1537J8370j08603k926L0776J02033o3579Q2263L5893
3757B098077p1297j6260n3790K1071J2120L4791k1493M5152O7380Q3236M1533
$$ plain form
3836 1594915 1521153 1527054 1595265 1643017 1592225 1661171 1648064 1589807 1611754 1521719 1567539 1634846
3824 1634846 1610632 1455189 1425561 1542397 1651788 1675853 1615619 1585565 1593377 1687190 1722918
3813 1722918 1805269 1845877 1709789 1711435 1727075 1718075 1673385 1597601 1606563 1659200 1737998 1645121
3801 1645121 1561748 1518348 1472924 1464850 1593094 1634518 1512943 1560474 1460238 1469890 1493256
3790 1493256 1490065 1419738 1355488 1439383 1551836 1631673 1626090 1530216 1504950 1633853 1768556
3779 1768556 1673079 1720274 1819946 1902222 1820388 1830646 1892994 1866650 1855064 1768168 1851977
3768 1851977 2002242 2015387 2003850 2022220 1913617 1910691 1941467 2043500 1979921 2062184 2098077
3757 2098077 2026780 2010520 1956730 1977801 1989921 2024712 2003219 2048371 2115751 2198987 2240520
3746B240520Q6579K8362p5954J16251O1219R0724J33626O5391Q813J1905N0897
3735B818333j54892p2947M2545R6842L9419J0005j05662l5641k0900r7928q5097
3724B434077r1276K3401l8140j05076Q7515J27445Q4924q9423l6056J32571L2207
3713B562169m2408o2444m6400m0861J66502J32235J58823O2538j0884j00168q1607
3702B697495M0150j68135p0972q6366l6406j4077m6641k0930R1962J19201N6182
3691B561463r9144k10140k6223O8655J6130r1680o8348n1537j2154Q4751k4077
3680B147696K3407q315j07223J436J17738L5355q692m3217j25362m3313O3911
3669B053421L7489p4317Q832J3705l695j24813j3752K12860K0337j2501J0303
$$ plain form
3746 2240520 2327099 2355461 2279507 2395758 2456977 2547701 2681327 2746718 2755531 2767436 2818333
3735 2818333 2663441 2590494 2633039 2729881 2769300 2779305 2673643 2638002 2617102 2519174 2434077
3724 2434077 2342801 2366202 2328062 2222986 2310501 2437946 2522870 2433447 2397391 2529962 2562169
3713 2562169 2519761 2457317 2410917 2370056 2536558 2668793 2827616 2890154 2879270 2779102 2697495
3702 2697495 2737645 2569510 2498538 2412172 2375766 2361689 2315048 2294118 2386080 2505281 2561463
3691 2561463 2462319 2252179 2225956 2294611 2310741 2219061 2150713 2099176 2087022 2171773 2147696
3680 2147696 2171103 2162788 2055565 2057001 2174739 2210094 2201402 2158185 2032823 1989510 2053421
3669 2053421 2090910 2016593 2025425 2039130 2035435 1910622 1896870 2109730 2130067 2117566 2127869
3658B127869j9353R6338r2318n2683K128J13373p097l9656Q5540o3674L1445L4854
3646B216766r2862J0314J07007o9084N335J8776P0871n1138R744J9942O3151M201
3634B313023J17418j3499j49245N2457p0122O4560J19188j9179k8815L0824m5265
3623B371345o7940O2460P7098O982P6716j9982j7476O7170J77843K3331j10747
3612B646800j11506J02403N5298K2727K0320j2726j53793K0673O6948J46179N2248
3601B855571m8983K5104Q1269K4524o0314k3693N7197K1320L2821l1607J5229
3590B948438L9775P5270N5046n4466J38863K7698R6379K04102L0341q8061J50864
3579C624249J40264k3309j3155O3242j5826j4681m3308J50526N0301q1965J31993
$$ plain form
3658 2127869 2108516 2204854 2112536 2059853 2061981 2175354 2168257 2128601 2214141 2150467 2181912 2216766
3646 2216766 2123904 2134218 2241225 2172141 2177476 2196252 2267123 2215985 2225729 2245671 2308822 2313023
3634 2313023 2430441 2416942 2267697 2320154 2250032 2314592 2433780 2414601 2385786 2416610 2371345
3623 2371345 2303405 2365865 2442963 2449945 2526661 2506679 2489203 2556373 2734216 2757547 2646800
3612 2646800 2535294 2637697 2692995 2715722 2736042 2723316 2569523 2590196 2657144 2803323 2855571
3601 2855571 2806588 2831692 2912961 2937485 2877171 2853478 2910675 2931995 2964816 2933209 2948438
3590 2948438 2988213 3063483 3118529 3064063 3202926 3230624 3327003 3531105 3561446 3473385 3624249
3579 3624249 3764513 3741204 3728049 3791291 3775465 3760784 3717476 3868002 3918303 3836338 3968331
3568C968331R2209p7227P260Q6840j9076O516m7289N8251J96278N4410m5320Q3705
3556D364888L5285K3305J60553J50725P0306J5488Q6174N8048m7651K02220K7573
3545E146914m0301K09922J86601O0924Q7415J19402K8530J03321J45217Q9097
3535F137042J53636K91511K00308L5995k0902N5023J06944J31992J62434J67094
3525G421077O5946J83561j4017K45922K22003P2770J34394J06880K23411J74511
3515H836458Q4905J93219L9290J51661L16404K72833K72972K72435L41674K06721
3505A0988572L42051K85748K74896K98954L56323L28669K91812L49499L22740
3496A3839264K76344L37921L38815L28520K10127N45405O63179N94626O09900
$$ plain form
3568 3968331 4060540 3983313 3990573 4077413 4058337 4064853 4017564 4075815 4272093 4326503 4281183 4364888
3556 4364888 4400173 4423478 4584031 4734756 4805062 4820550 4906724 4964772 4917121 5119341 5146914
3545 5146914 5106613 5316535 5503136 5564060 5651475 5770877 5799407 5902728 6047945 6137042
3535 6137042 6290678 6582189 6782497 6818492 6797590 6852613 6959557 7091549 7253983 7421077
3525 7421077 7487023 7670584 7656567 7902489 8124492 8197262 8331656 8438536 8661947 8836458
3515 8836458 8921363 9114582 9153872 9305533 9621937 9894770 10167742 10440177 10781851 10988572
3505 10988572 11330623 11616371 11891267 12190221 12546544 12875213 13167025 13516524 13839264
3496 13839264 14115608 14453529 14792344 15120864 15330991 15876396 16539575 17134201 17744101
3487A7744101O52261P28370P06229R00143R60301J076405J119843J125503J133482
3478B6146638J240534J313933J315079J163842J138675J042187P04278N33953
3470C4599119J88762l27484k66545n93872p97734j106925r75012r81214r10033
3461B8829062r15007r92715q44472q68779o31386o29985p40464o42192l83806
3452B2180256m21555m52872k99769l10361k64467m6777K0044j92326j0402n2320
3442B0149451j19241q7990m81266o11887o01168n96960m67265l23923m20463l36686
3432A6102602k83485l49506l42308l19082l24168k22840k81373k13399p4632j65536
3422A3526273k14194r0043n8614q8321n9712J40976J89949L57604M48557M01789
$$ plain form
3487 17744101 18396362 19124732 19830961 20731104 21691405 22767810 23887653 25013156 26146638
3478 26146638 27387172 28701105 30016184 31180026 32318701 33360888 34065166 34599119
3470 34599119 34787881 34460397 34193852 33599980 32802246 31695321 30720309 29739095 28829062
3461 28829062 27914055 26921340 26076868 25208089 24576703 23946718 23206254 22564062 22180256
3452 22180256 21758701 21305829 21006060 20695699 20431232 20384455 20404499 20212173 20201771 20149451
3442 20149451 20030210 19942220 19460954 18849067 18247899 17650939 17183674 16859751 16439288 16102602
3432 16102602 15819117 15469611 15127303 14808221 14484053 14261213 13979840 13766441 13691809 13526273
3422 13526273 13312079 13222036 13163422 13075101 13015389 13156365 13346314 13703918 14152475 14554264
3412A4554264M16015J73164J34838O6790n53103o97844p69051q24719m25382m24682
3402A1650290m84206m36808k90913j11327l08058j88083k70063k58207j11926
3393I190699j10080k22336N8358l6430j01028o3942N9316P4834m3501J8875K15794
3382I040559J12028J85655K00758J57296n9992m2050k60675l94337l44697m42252
3372H152293k57508k71568j39437k19423j75441j69301j85765o9310q5299j18025
3362F461216p0901k7461j62397j44779L4254j2800j42414l56513q1038L7534j57159
3351E377542j5434j8420m7134j21327k7857l0739p4782m1102R401j57223q7821
3340D765104j6335j1655l9087m4261O8512k2049O8314j27201o1387K1999o672
$$ plain form
3412 14554264 14970279 15143443 15278281 15345071 14791968 14094124 13325073 12500354 12074972 11650290
3402 11650290 11166084 10729276 10438363 10327036 10018978 9830895 9560832 9302625 9190699
3393 9190699 9080619 8858283 8916641 8880211 8779183 8715241 8774557 8849391 8805890 8824765 9040559
3382 9040559 9152587 9338242 9539000 9696296 9636304 9594254 9333579 8939242 8594545 8152293
3372 8152293 7894785 7623217 7483780 7264357 7088916 6919615 6733850 6664540 6579241 6461216
3362 6461216 6390315 6362854 6200457 6055678 6089932 6077132 5934718 5578205 5497167 5534701 5377542
3351 5377542 5362108 5343688 5296554 5175227 5147370 5116631 5041849 5000747 5010148 4852925 4765104
3340 4765104 4748769 4737114 4698027 4653766 4722278 4700229 4768543 4641342 4579955 4601954 4595282
3329D595282R6935j3374j77786J20569m4717p3840j80795j6874m0485K078J37321
3318D404314k3503j87244j9628m3702m1098L059L2175j39356J8269o3242n7106
3307C882938J8843K6820p4185l0316n0262q6832p1155M8937K1174K905O9188l2892
3295C725163j6454j6994J0796M7314j15162o6698L0726n7495p2459m3199M4746
3284C470284j63882M7796l3350O5628j9999o9841M2371O3362N3266l6315M9734
3273C469054L8507J8743j1822j09945j0162N6783P454j66971j50337j16333o7945
3262B957026q0937P1118N9469j12361n5N4182l6563j14481O4348l3462k8503j888
3250B797893J517Q0705j24880m9418J04353J03885M127N3631P3864j4193n4917
$$ plain form
3329 4595282 4692217 4678843 4501057 4621626 4576909 4503069 4322274 4305400 4264915 4266993 4404314
3318 4404314 4380811 4193567 4173939 4130237 4089139 4092198 4124373 3985017 4003286 3940044 3882938
3307 3882938 3901781 3928601 3854416 3824100 3773838 3687006 3615851 3664788 3685962 3688867 3758055 3725163
3295 3725163 3708709 3691715 3702511 3749825 3634663 3567965 3598691 3541196 3468737 3425538 3470284
3284 3470284 3306402 3354198 3320848 3386476 3366477 3296636 3339007 3402369 3455635 3419320 3469054
3273 3469054 3507561 3526304 3514482 3404537 3394375 3451158 3458612 3291641 3141304 3024971 2957026
3262 2957026 2876089 2947207 3006676 2894315 2894260 2948442 2911879 2797398 2861746 2828284 2799781 2797893
3250 2797893 2799410 2880115 2755235 2705817 2810170 2914055 2918182 2971813 3045677 3031484 2976567
3239B976567K635p1435n8955M244P248o1506L1744K6669m5094j12176j06296O3201
3227B656846J08454l3418j59396M4536N6023Q9978M404j9800M2667k3769P2030
3216B838555j5586K823j01197Q0414j0327q4305J68125R0051k3993J11719K4715
3205C080994M0579J1921n3677m875O913K2770O2105K3791O5288P493J05925L897
3193C373124L7630P8066j24307J45532M2733q9904l365J9165R2557J30199N5977
3182C757407J9602r056J61030J19527J48376P8084O4989N0187J02921J63999Q4714
3171D741780J06395J54149R8273L2486K73528K13590Q0130K86619J88034J65293
3161F340277J72184J16092M7940J93278K50580J57758J83579J27561J53984J07288
$$ plain form
3239 2976567 2979202 2907767 2848812 2853056 2860304 2798798 2830542 2857211 2812117 2699941 2593645 2656846
3227 2656846 2765300 2731882 2572486 2617022 2673045 2763023 2767427 2747627 2790294 2766525 2838555
3216 2838555 2822969 2825792 2724595 2805009 2794682 2710377 2878502 2968553 2944560 3056279 3080994
3205 3080994 3121573 3133494 3079817 3074942 3081855 3104625 3166730 3190521 3255809 3263302 3369227 3373124
3193 3373124 3410754 3488820 3364513 3510045 3552778 3462874 3459509 3478674 3571231 3701430 3757407
3182 3757407 3777009 3767953 3928983 4048510 4196886 4274970 4339959 4390146 4493067 4657066 4741780
3171 4741780 4848175 5002324 5100597 5133083 5406611 5620201 5700331 5986950 6174984 6340277
3161 6340277 6512461 6628553 6676493 6869771 7120351 7278109 7461688 7589249 7743233 7850521
3151G850521R1051L6148J17240K62294J18930J46014K42511K06232J93234K21699
3141I485874J29431L34025M59962M20904M47300M70187L53076K95152N87770K37984
3131A3221665K48687M26985L44730J14883p7742n8488k43884j98944j98985k51438
3121A3327469j73653j17974m2351m026L537J12563j566J16678J07475L64397K78482
3110A3971031K37998K77368J64205J99239K52821J97463N2397J47719P6329J5158
3100A5591728j96119j46554k50005k74826m35585m01856l25081m28274l78132
3091A2755296k96119l81934l17421j07046q367j68058j95610M6901l7841o9106
3081A1220695r8990o5478j67803k27810j51159j22100j96938l20130k72656l54511
$$ plain form
3151 7850521 7941572 7977720 8094960 8357254 8476184 8622198 8864709 9070941 9264175 9485874
3141 9485874 9615305 9949330 10409292 10830196 11277496 11747683 12100759 12395911 12983681 13221665
3131 13221665 13470352 13897337 14242067 14356950 14279208 14220720 13976836 13777892 13578907 13327469
3121 13327469 13153816 13035842 12993491 12989465 12993002 13105565 13103999 13220677 13328152 13692549 13971031
3110 13971031 14209029 14486397 14650602 14849841 15102662 15300125 15352522 15500241 15576570 15591728
3100 15591728 15395609 15249055 14999050 14724224 14288639 13886783 13561702 13133428 12755296
3091 12755296 12459177 12077243 11759822 11652776 11644409 11476351 11280741 11327642 11289801 11220695
3081 11220695 11121705 11056227 10888424 10660614 10509455 10387355 10190417 9870287 9597631 9243120
3071I243120k61571l32217m14412k81949k76630m11858l06871k16942j97951j65785
3061F376934l07584j88709j94965k03212k53825j77609l6535j25787j87262k07009
3051D494437j16531O2813k9613j81366j29265j20775j09709j48635j71053J2233
3041C562536l3734j71510j35793j65830j05307j91642l129j5951j03475m0709
3031B595456p4933n3372n8071q6219j61570k3793j68108L0838k8009j1980j44840
3020A815399R387J86488n7814q7566L0181J244m2806k0881j79821k0842m8324
3009A584645n088J31106k3639r9465j10895m6926r5695R0464p8517o2016o4637
2998A219337n5620q4968m3987J01963l5939p4918M3691j5321l554o213R861j6213
$$ plain form
3071 9243120 8981549 8649332 8234920 7952971 7676341 7264483 6957612 6740670 6542719 6376934
3061 6376934 6069350 5880641 5685676 5482464 5228639 5051030 5014495 4888708 4701446 4494437
3051 4494437 4377906 4440719 4411106 4229740 4100475 3979700 3869991 3721356 3550303 3562536
3041 3562536 3528802 3357292 3221499 3055669 2950362 2758720 2755591 2739640 2636165 2595456
3031 2595456 2520523 2467151 2409080 2322861 2161291 2137498 1969390 2000228 1972219 1960239 1815399
3020 1815399 1824786 2011274 1953460 1865894 1896075 1897319 1854513 1833632 1653811 1632969 1584645
3009 1584645 1579557 1710663 1687024 1587559 1476664 1429738 1334043 1424507 1345990 1283974 1219337
2998 1219337 1163717 1078749 1034762 1136725 1100786 1025868 1069559 1054238 1050684 1044471 1054332 1038119
2986A038119j05108J5005j48551M2243J3364M4813K5850o564j7726R5310j38190
2975H58565j7757N810j01158n1613K1131j12369o9958j0276Q8325L7127r2983
2964E54844o9437J6146l8183q9757R9264p1435j9719O6893L8991K4624n6870o0618
2952C94743M7966K2241m2817N3o980J1272j28232R3564k8224O5805m6393r3427
2940B89571Q943j3941O7059J07445o1648j47076N7619j37368M0483J51130o8061
2929B94156q2460o2493J9650K7011K4429O2934R0150N6541p7523L0813j1200q8609
2917B83399j154M5738m9449l5364q6355n7864n4872M132Q30K0815K9684J41544
2905B41084n0773j24232n4499O6972r56K5556J04563l0332l4098M5401L8894J7909
$$ plain form
2986 1038119 933011 948016 799465 841708 855072 899885 925735 919171 901445 996755 858565
2975 858565 840808 846618 745460 693847 714978 602609 532651 522375 610700 647827 554844
2964 554844 485407 501553 463370 373613 472877 401442 381723 448616 487607 512231 455361 394743
2952 394743 442709 464950 422133 422186 415206 426478 298246 391810 363586 429391 382998 289571
2940 289571 298514 284573 351632 459077 397429 250353 307972 170604 211087 362217 294156
2929 294156 211696 149203 168853 195864 220293 283227 373377 429918 352395 383208 372008 283399
2917 283399 282245 327983 278534 243170 156815 98951 44079 48211 49041 69856 99540 241084
2905 241084 190311 66079 11580 78552 77596 103152 207715 177383 143285 188686 227580 245489
2893B45489j7367K8154j18754l3799k692m339r2652M9950Q5889r1452P6275M5888
2881A70590O1782n3358m8249N506K3019p5064m3045M2923O3885m6265J7717K9700
2869A49141n0241J13649j05177l0750r990K0811J977J20472k448j43668K533n4350
2857A1959J5320K5562j06040j07J8580m9281J33836l3803R6363O4561q9777r0354
2845c181K31481Q9015k02238j09383M1592j18934o8642J14956J52277n3008Q348
2834H2283k5686j00917M6214o1936K7129J8441J52578m035j46638Q3522j3714
2823E7241l8834K5507J9070j70j4494J6662O6411r9545j7029M3336o8086L4950
2811B5019L684n4370P6346J74639j9254l1089J865Q1239q8872k7420j62719K5465
$$ plain form
2893 245489 228122 256276 137522 103723 101031 96692 4040 53990 139879 48427 124702 170590
2881 170590 232372 179014 130765 136271 159290 84226 41181 84104 147989 101724 119441 149141
2869 149141 98900 212549 107372 76622 66632 87443 89420 209892 207444 63776 66309 11959
2857 11959 27279 52841 -53199 -53306 -34726 -84007 49829 16026 112389 176950 87173 -3181
2845 -3181 228300 317315 115077 5694 47286 -71648 -140290 -25334 126943 73935 82283
2834 82283 56597 -44320 1894 -60042 -32913 -14472 138106 134071 -12567 70955 57241
2823 57241 18407 43914 62984 62814 48320 64982 131393 31848 14819 58155 -9931 25019
2811 25019 28703 -25667 50679 225318 206064 174975 176840 258079 169207 141787 -20932 4533
2799D533M9041m6805o7704M9389J17944n309r387N0268q190j25882J16396j5669
2787A08625j17774P0425m2698j8135L0229j31037N0675O511Q820k2019o8903p9236
2775b04517J19301r011j3475O0396j1977O5141j35205Q2636q9877R357J10753
2764a6478m0334K01986q4k27601r2903J5744k8506J00719O0019J6904p6109M5670
2752d0973N029o0716r6804o9464J48100K07425J1204r9368k2157J1120O6708l0354
2740B9750q2353m1042J26940p8757M4780l8027j17103P2318l178k9353R073P3494
2728c3458m2172j6249N7722r1105q9698Q4274j5185K6572l0j061k1894J49319
2716G035k8780n0752j03295K565J03107j25078k7861P2563K2511J2207M2310l4285
$$ plain form
2799 4533 53574 6769 -60935 -11546 106398 101089 91702 141970 133780 7898 124294 108625
2787 108625 -9149 61276 18578 443 30672 -100365 -49690 -43179 -34359 -56378 -125281 -204517
2775 -204517 -85216 -94227 -107702 -47306 -59283 5858 -129347 -46711 -136588 -127231 -16478
2764 -16478 -56812 145174 145090 -82511 -175414 -159670 -188176 -87457 -27438 -10534 -86643 -40973
2752 -40973 -35944 -96660 -193464 -262928 -114828 92597 103801 4433 -17724 -6604 60104 29750
2740 29750 -52603 -93645 33295 -45462 -682 -38709 -155812 -83494 -86672 -116025 -106952 -33458
2728 -33458 -75630 -91879 -34157 -125262 -214960 -130686 -145871 -119299 -119329 -120390 -142284 7035
2716 7035 -21745 -72497 -175792 -173227 -70120 -195198 -223059 -150496 -127985 -115778 -73468 -107753
2704a07753n8473M6528O6092L8703n9773P1303O503j53579M4188l3551N7073L9219
2692d3520j22195r7906Q2276O5937o7677L4563J26513r4746n721Q4173M8375k2203
2680a2131o9417k8376m8926o2917j2415J68240J29473k05818n4386J37280l8365
2669i7758j16585l3647P1428O4475N2706L5618Q2249n5695r5641l6274J18483
2658a0641K0186L003j34391k2076N4636j37571N3741p6511N4962P6636l4250p8196
2646b30472K693M7721J62222O4250J6227p5574m3533k5104J1741J6314k8227J89762
2634A08020Q8703j78086j03232Q8328O8501o5705r6475m6370L0108J16844n6763
2623d6127j68864K9184K6596N7537j8046P8087o291o8783j19143l2264J31682
$$ plain form
2704 -107753 -166226 -119698 -53606 -14903 -74676 -3373 3130 -150449 -106261 -139812 -82739 -43520
2692 -43520 -165715 -263621 -181345 -115408 -183085 -148522 -22009 -116755 -122476 -38303 10072 -12131
2680 -12131 -81548 -109924 -158850 -221767 -234182 -65942 63531 -142287 -196673 -59393 -97758
2669 -97758 -214343 -247990 -176562 -112087 -59381 -23763 58486 2791 -92850 -129124 -10641
2658 -10641 9545 12548 -121843 -143919 -89283 -226854 -173113 -249624 -194662 -118026 -152276 -230472
2646 -230472 -227779 -180058 -17836 46414 62641 -12933 -56466 -81570 -69829 -53515 -81742 108020
2634 108020 196723 18637 -84595 3733 72234 6529 -89946 -136316 -106208 10636 -46127
2623 -46127 -214991 -185807 -159211 -101674 -119720 -41633 -47924 -116707 -235850 -268114 -136432
2612a36432j13830J71720J43822j3570j11309j20321j08441J56832O7257J7398
2602d6874O2639j5777M0571J29479Q8730m7605o3936j56534P7031J37098n9077
2591A45745j31828P414l7624r7161Q8520P0568m9749j0023r0484p3493q802J54477
2579c2440m3256n0985R530l9395K4439j13134N5070O7544K3927k5694Q7110j74628
2567b11912N9086O1462k4679J09351K7920q9132o9543k7848j1493K1519N8841
2556i6428K2891o4137O1581l3956N672Q2266k2788j33815N1057J6431O4239K2411
2544b4576L0988j35625N5071J37921q1828r7319N8189n7945j4545P7472J9928
2533c2269K8104n8347r8763o5700J09419M7149O5711n5417K4019J25748j67515
$$ plain form
2612 -136432 -250262 -78542 65280 51710 -59599 -179920 -288361 -131529 -64272 -46874
2602 -46874 15765 -12 40559 170038 258768 211163 147227 -9307 67724 204822 145745
2591 145745 13917 21331 -16293 -113454 -24934 45634 -4115 -14138 -104622 -178115 -186917 -32440
2579 -32440 -75696 -126681 -117151 -156546 -132107 -245241 -190171 -122627 -98700 -124394 -37284 -211912
2567 -211912 -152826 -91364 -116043 -6692 21228 -67904 -137447 -165295 -176788 -155269 -96428
2556 -96428 -73537 -137674 -76093 -110049 -104377 -22111 -44899 -178714 -127657 -111226 -46987 -24576
2544 -24576 6412 -129213 -74142 63779 -18049 -115368 -57179 -115124 -129669 -52197 -32269
2533 -32269 -4165 -62512 -161275 -226975 -117556 -70407 -4696 -60113 -36094 89654 -77861
2522g7861q3574J32350q3856L5848R5724p1530n0069J54782r275l0895R8748M6575
2510A56967n7658n3205n6243L5198l9414k7786N9832n9107N8237P1016J9442p7483
2498B9796o3304J0293R655J4723R6334Q142K8457r2898j05303J41020k3243O9451
2486A23123o5457J08953O8829r3315r1040M0605M2466N3559l5640o2779K9519
2475A18823K505l0282j7395q509j0541j32900O8220J30171J04064l7011r3065
2464I4080j2494k8799J36458M3111k9995p8903n699j53411J9419K1563J14700
2453A20030r1225K4417O9135J40405j5081j21568J3920r9292k4396P1911j4394
2442G3862R6127l9324q7106R9927J3138p4020q6706J25413J95907p7425m6436
$$ plain form
2522 -77861 -161435 -29085 -112941 -77093 18631 -52899 -102968 51814 42539 11644 110392 156967
2510 156967 99309 46104 -10139 25059 -14355 -42141 17691 -41416 16821 87837 107279 29796
2498 29796 -33508 -23215 -13560 1163 97497 105639 134096 41198 -64105 76915 53672 123123
2486 123123 57666 166619 235448 142133 51093 91698 134164 187723 152083 89304 118823
2475 118823 121328 91046 73651 65142 54601 -78299 -10079 120092 224156 187145 94080
2464 94080 81586 52787 189245 232356 202361 123458 117759 -35652 -16233 5330 120030
2453 120030 28805 53222 122357 262762 247681 126113 140033 40741 16345 88256 73862
2442 73862 169989 130665 43559 143486 156624 82604 -4102 121311 317218 239793 193357
2431A93357m1071Q2702q9634n1463J00488J13634l7104L8350N5169n4246k9685
2420B80497J09445j3458N448q4580j3886J11489P4560l3555j45107n2256M9430
2409B88027J78620L0958j28395k2826Q8197n7167J34610j01124J57252J1253o5290
2398E14115L2188Q857L6350M8917j02350J0154R7518R6312J3175n9810J02227
2387G97653J7948p905J65995J09219m8362O1624j72712O6683K06240m5546K7030
2376A177867j4974M7739R1464J89701N0462M7599j2106Q0631L12005J38226J43101
2365B251715J19330P4111K51757K26368J57968J48116K74574J57219K91408K72885
2355D225451L07837K25077L96651K93025L58891O07623N90096P27869Q17900R36376
$$ plain form
2431 193357 152286 234988 145354 93891 194379 308013 270909 309259 364428 310182 280497
2420 280497 389942 376484 381932 297352 283466 394955 469515 435960 290853 238597 288027
2409 288027 466647 497605 369210 346384 434581 377414 512024 410900 568152 579405 514115
2398 514115 546303 555160 591510 640427 538077 548231 645749 742061 755236 695426 797653
2387 797653 815601 807696 973691 1082910 1034548 1096172 923460 990143 1196383 1150837 1177867
2376 1177867 1162893 1210632 1302096 1491797 1542259 1589858 1577752 1658383 1970388 2108614 2251715
2365 2251715 2371045 2445156 2696913 2923281 3081249 3229365 3503939 3661158 3952566 4225451
2355 4225451 4533288 4758365 5155016 5448041 5806932 6414555 7004651 7732520 8550420 9486796
2345I486796P79734Q15663R03114R91620J230115J342474J893753K415497L075418
2336B2934184M169067M725481M582189N241434N474318L904817J645156q48192
2328E1828454l929745o429406n860465m669185l575641l145586k625932k105023
2320A9487471j750375j532771j484315j328201j132966r32014q02700q68550r05232
2311H750347p80350o73359m62422n84508m29398l85180l90273k24159k49094k38312
2301D333292k31015k91878j25325j17383l82871p1485n3260j45679j35592j41652
2291B637152j35420j84362r7117L1644l10035r4022j8536m8966m0206n7572o4523
2280A618037j06895L5293j86020O3680j77547m0726Q7673j58955p5491o718m9215
$$ plain form
2345 9486796 10266530 11082193 11985307 12976927 14207042 15549516 17443269 19858766 22934184
2336 22934184 27103251 31828732 36410921 41652355 47126673 51031490 52676646 51828454
2328 51828454 47898709 41469303 35608838 30939653 27364012 24218426 21592494 19487471
2320 19487471 17737096 16204325 14720010 13391809 12258843 11326829 10524129 9655579 8750347
2311 8750347 7969997 7296638 6834216 6249708 5820310 5435130 5044857 4820698 4571604 4333292
2301 4333292 4102277 3810399 3685074 3567691 3184820 3113335 3060075 2914396 2778804 2637152
2291 2637152 2501732 2317370 2220253 2251897 1941862 1847840 1829304 1780338 1740132 1682560 1618037
2280 1618037 1511142 1546435 1360415 1424095 1246548 1205822 1293495 1134540 1059049 1052331 1003116
2269A003116j86027P4725M8286J7796j15507o1781O759l5328J13029j40579j06252
2258F18237J04219l6579j11669Q1337r0817l9751r363J16464p6490j01347Q2819
2247E37060M245m6099j42539K8038r1823R3568L6347k6450r749K8576j99889P2005
2235B83290K24355j45720K0326O1240r3294o2303o4213j09381k2083L3566N9345
2224A85128K3376J77236k12709j12651K132J60160q1258k5763R3895P8516O6442
2213C54504j2995J23723j97135r8684m433j06633l3511J61131m1214j86881n1110
2202i3238K0203j2749k0782K01957L1885k35494Q5805M2359n3222J56059K3750
2191A46533O4030o1254p1658j16170J28171n3298o3631m0911p9385J8385p689
$$ plain form
2269 1003116 817089 891814 940100 957896 842389 780608 787367 752039 865068 724489 618237
2258 618237 722456 685877 574208 655545 564728 524977 515614 632078 555588 454241 537060
2247 537060 541305 495206 352667 380705 288882 382450 418797 392347 382598 411174 211285 283290
2235 283290 507645 361925 382251 443491 350197 287894 223681 114300 92217 125783 185128
2224 185128 208504 385740 173031 60380 62512 222672 141414 115651 209546 288062 354504
2213 354504 341509 465232 268097 169413 164980 58347 24836 185967 144753 -42128 -93238
2202 -93238 -73035 -85784 -106566 95391 127276 -108218 -22413 19946 -33276 122783 146533
2191 146533 210563 149309 77651 -38519 89652 36354 -27277 -68188 -147573 -129188 -136877
2180a36877K12923n0827l9901J2146l9599N9181R3095n3777r605p5071O2021Q9610
2168A23319q540j78704j14390Q1982N6006Q9024r66j42719Q4126j683L1654j07007
2156h7898j20094k6044J03654R3604j00692n0698P4832P148p4310m1619J1527
2145b10590R4664K8359K2270j40233P9044J07584J04456K3674j44643p0667l9794
2134a45876Q2202L321j2516M4622n8166J56563j2459j40846N6759k4319L5391
2123a5324j35447l4579O7936N8455Q5621j28676m5841L131J45327O2117j77346
2112a14626j29570L9080o572q580Q8412K4647n7833n7697m970J89696k5229j300
2100f4542M8606Q3232l4174l5576r0719l9816K4719l725Q6184k9827j37348j6800
$$ plain form
2180 -136877 76046 25219 -14682 -2536 -42135 17046 110141 56364 46759 -28312 33709 123319
2168 123319 114779 -63925 -178315 -96333 -40327 48697 47731 -94988 -10862 -12545 19109 -87898
2156 -87898 -207992 -234036 -130382 -36778 -137470 -188168 -113336 -106188 -180498 -222117 -210590
2145 -210590 -115926 -87567 -65297 -205530 -126486 -18902 85554 109228 -35415 -106082 -145876
2134 -145876 -63674 -60353 -72869 -28247 -86413 70150 57691 -83155 -26396 -50715 -15324
2123 -15324 -150771 -185350 -117414 -58959 26662 -102014 -147855 -144724 603 62720 -114626
2112 -114626 -244196 -205116 -211688 -220268 -131856 -107209 -165042 -222739 -227709 -38013 -63242 -64542
2100 -64542 -15936 67296 33122 -2454 -93173 -132989 -108270 -111995 -25811 -55638 -192986 -209786
2088b09786L0995q8699J97959J32466n0917j6356k0527N046N6789O055o9091M0747
2076A4681R901M7852R347r6192L5769r8794J1692J04775j7998k8502J5023k201
2064E353K24256j14863K3927O4399j37571M0988n9757P2900l3857j16285K5266
2053e244N0304N7195K1467K4421m6866j08144j35687R4609R1266l306j09883k7386
2041i7254r0663J14516P9785M1122p0284r0775J54550L142j50107o5688k4911
2030a96567M7275J26497k7761k0099o0433R1932q4549k5418P0092L8848M5544
2019E361m1097l0648k9468R1101M1559p2035j26373k1891l2897q439J02703O9763
2007e2361N3922j0405q2582j2078j8548j72115N0376N6581J70014n6204J74R5368
$$ plain form
2088 -209786 -178791 -267490 -69531 62935 12018 -4338 -24865 -19819 36970 43025 -26066 14681
2076 14681 24582 72434 81781 -14411 21358 -77436 -65744 39031 21033 -7469 7554 5353
2064 5353 229609 114746 138673 203072 65501 106489 46732 119632 85775 -30510 -5244
2053 -5244 45060 102255 123722 148143 101277 -6867 -142554 -47945 43321 40015 -69868 -97254
2041 -97254 -187917 -73401 6384 47506 -22778 -113553 40997 44139 -105968 -171656 -196567
2030 -196567 -149292 -22795 -50556 -70655 -131088 -39156 -123705 -149123 -79031 -40183 5361
2019 5361 -35736 -66384 -95852 -4751 36808 -35227 -161600 -183491 -216388 -224827 -122124 -52361
2007 -52361 1561 -8844 -91426 -103504 -122052 -294167 -243791 -187210 -17196 -73400 -73226 22142
1995B2142o1221n3572j9231l7057J1325n4533J13326Q0882n25n5148O6471L1732
1983D4591l9365R161q9522o6194L3207k4310M4046k515m3044J08947q1019O5213
1971d0804p3585J1815o0540j27647M4315k1447N9799Q5003m9216J26969J35429
1960I0091m6039o2951k0079r024o8417R991p2986M0719O7878l1853M4709j948
1948e9909m8728J33313l1477o3043j1101n1071J94881n801r2305K4969L402J7473
1936A0603j00343n2647O0194n5765p3779R1020J08634M9295n5677n8348q267J56911
1924G1831l3222k0562Q2084k18490L8251L1323P414m3778L1920P2997j12710n1329
1912a44271Q7028Q1537M462j48306r3554K925J09707l4522L281P7080m1388M3099
$$ plain form
1995 22142 -39079 -92651 -111882 -148939 -137614 -192147 -78821 2061 1536 -53612 12859 44591
1983 44591 5226 14387 -75135 -141329 -108122 -132432 -88386 -90901 -133945 -24998 -106017 -40804
1971 -40804 -114389 -102574 -163114 -290761 -246446 -267893 -208094 -123091 -172307 -45338 90091
1960 90091 44052 -18899 -38978 -48002 -116419 -106428 -179414 -138695 -70817 -102670 -57961 -59909
1948 -59909 -108637 24676 -6801 -69844 -80945 -132016 62865 57064 -35241 -10272 -6870 10603
1936 10603 -89740 -142387 -82193 -137958 -211737 -120717 -12083 37212 -18465 -76813 -85080 71831
1924 71831 38609 18047 100131 -118359 -80108 -48785 -41371 -85149 -53229 19768 -92942 -144271
1912 -144271 -57243 24294 28756 -119550 -213104 -210179 -100472 -134994 -131713 -54633 -96021 -52922
1900e2922J27740l0020j27280l227p1968N6974o457M1793n5169o5133J09842L3590
1888d2237j45315j40904m2169K5106M9118j7398J97721q7665L7337J04448j5873
1877g7831O0427P8089J786j64302p9407J09225j32831J6670Q8572j3577M9175
1866f4004p8373J3541Q2712m498L2117l2873o0372J2172N7793r1462m8657K1682
1854a60222j19662J02717O599L9600L0631m5978j0967K4771K9370J41858O2357
1843A01074q5459q1403K7748l0896R765J02823l4199j03633o1587r7039J04347
1832a48459k2435L370L9478j04919J79446M0923l103P0145L1638q7554o6311K5925
1820d1856Q325j210m0855L8135m7394J13174j04039j1586j3221j24971J11888
$$ plain form
1900 -52922 74818 44798 -82482 -85709 -157677 -100703 -107160 -65367 -120536 -185669 -75827 -42237
1888 -42237 -187552 -328456 -370625 -345519 -296401 -313799 -116078 -203743 -166406 -61958 -77831
1877 -77831 -17404 60685 62471 -101831 -181238 -72013 -204844 -188174 -99602 -113179 -64004
1866 -64004 -142377 -128836 -46124 -50622 -18505 -51378 -111750 -99578 -41785 -133247 -181904 -160222
1854 -160222 -279884 -177167 -170568 -130968 -100337 -146315 -157282 -132511 -103141 38717 101074
1843 101074 15615 -65788 -38040 -68936 -59171 43652 9453 -94180 -155767 -252806 -148459
1832 -148459 -170894 -167524 -128046 -232965 -53519 -12596 -15699 54446 86084 -1470 -67781 -41856
1820 -41856 -33531 -34741 -75596 -37461 -84855 28319 -75720 -87306 -100527 -225498 -113610
1809a13610J25989o7712m5137k3104j6449M4574J13731q1573l9092L4447l6648
1798a04584k6476j67792K21421O8178j03905o0524k2754Q1253J6144j6577n2134
1787a67750O4760J04123m3994k9450k1439m8488k9420j6797J50652M2507l1495
1776b6791j3672N5426q488j63074J43787J0212L3620n4089n9442R9833n9928q5617
1764a28223Q373j0670N3457J5938J0341p8892J3676M0807O7281K2924q1978q3436
1752a50402R9503M0176N0253l2061p8289l4130p395J57316j9806l1613l7007Q085
1740c5370N2138j7393j20922k9504M9914K6268Q2875J29602q3043r4504K5285
1729a4654j04245L8508R457r1312Q9784m3334o5182K5279J2447P0666q237N8924
$$ plain form
1809 -113610 12379 -55333 -100470 -123574 -140023 -95449 18282 -63291 -102383 -67936 -104584
1798 -104584 -131060 -298852 -77431 -9253 -113158 -173682 -196436 -115183 -99039 -115616 -167750
1787 -167750 -102990 1133 -42861 -72311 -93750 -142238 -171658 -188455 -37803 4704 -26791
1776 -26791 -40463 14963 6475 -156599 -12812 -2600 31020 -23069 -82511 17322 -42606 -128223
1764 -128223 -119850 -130520 -77063 -61125 -50784 -129676 -116000 -75193 -7912 15012 -66966 -150402
1752 -150402 -50899 -10723 39530 7469 -70820 -104950 -112345 44971 25165 -6448 -43455 -35370
1740 -35370 16768 -625 -121547 -151051 -101137 -74869 8006 137608 54565 -39939 -14654
1729 -14654 -118899 -80391 -70934 -162246 -72462 -115796 -180978 -155699 -143252 -72586 -80823 -21899
1717b1899L1452j08794M2492M3656l3694K301q264k5580J27049J1564R36j55477
1705i4258o1235P6914n0745Q7783p4144P9705R5181m873o2686p2046k648p1132
1693a54184K6217J19034Q7888l2524n1034J04614o7041r8953N5598q7518j2265
1682a10168L1822J82309m217M2245j39997r9832K7755j4654R5800r4555n4904
1671a38396Q0228p0046P6385m1683J62783j01714k38275K38290R0286P108R523
1660G4489j14419l4567m4750k3105Q7253L8874M4225r1586J0547p2853J19356
1649f536N0129o8236j4505o5460L3261M119Q4431N8899j56532K2957Q0623j14905
1637i1755N4318n1556r5060N4592O4998K1607m6192J3070j09679k8066M2007P049
$$ plain form
1717 -21899 9553 -99241 -56749 -13093 -46787 -44486 -52750 -78330 48719 60283 61219 -94258
1705 -94258 -155493 -78579 -129324 -41541 -115685 -35980 59201 54328 -8358 -80404 -83052 -154184
1693 -154184 -127967 -8933 78955 46431 -4603 100011 32970 -65983 -10385 -97903 -110168
1682 -110168 -78346 103963 99746 141991 1994 -97838 -70083 -84737 11063 -83492 -138396
1671 -138396 -58168 -128214 -51829 -93512 69271 -32443 -270718 -32428 57858 64966 74489
1660 74489 -39930 -74497 -119247 -142352 -55099 -16225 28000 -63586 -53039 -125892 -6536
1649 -6536 43593 -24643 -39148 -104608 -71347 -67228 17203 76102 -80430 -57473 23150 -91755
1637 -91755 -37437 -88993 -184053 -129461 -64463 -42856 -89048 -75978 -185657 -213723 -171716 -164667
1625a64667R7089J00146j45181j8530J55816r6782q2487J05477K1516N6971L765
1614C3133k6338p2882l469L3923K4554l2464l0103q6929j1821Q2050O6309L2590
1602H553k8890k2764k5685r7215J3505N2545M2004m9820o9770J64009J00427p9471
1590G428j1995k9458j6390J3714k645q874M692M0940o8525L7456K1047R199J14737
1577A11326J5154p9051N6878L4907j74136j24772J07752O3961q5575M3741L2613
1566B798o2929O8092N9249r2442k9415l2136J8842O8612n3676P2466p6095p3171
1554a29805l2298n0764J8973J75248J18873m4960p6627P004m669j4209j3431J51586
1542A04921r0646j54460P3398k5040j29861j22620P8808k0877J67173K8408q8979
$$ plain form
1625 -164667 -67578 32568 -112613 -131143 24673 -72109 -154596 -49119 -27603 29368 33133
1614 33133 6795 -66087 -69556 -35633 -11079 -43543 -73646 -160575 -172396 -90346 -24037 8553
1602 8553 -20337 -43101 -68786 -166001 -152496 -99951 -57947 -107767 -177537 -13528 86899 7428
1590 7428 -4567 -34025 -50415 -36701 -39346 -48220 -43528 -2588 -71113 -33657 -12610 -3411 111326
1577 111326 126480 47429 104307 139214 -34922 -159694 -51942 12019 -73556 -29815 2798
1566 2798 -60131 7961 67210 -25232 -54647 -86783 -67941 671 -53005 19461 -56634 -129805
1554 -129805 -162103 -212867 -193894 -18646 100227 55267 -21360 -14356 -19025 -33234 -46665 104921
1542 104921 14275 -140185 -66787 -91827 -221688 -344308 -265500 -286377 -119204 -90796 -179775
$$ [...]
##END NTUPLES=NMR SPECTRUM
##END=
