##TITLE=1H_DE-80H_X3
 200.13MHz, d2o
 8 sc
 
 19ns.26.2.2025
##JCAMPDX= 6.0         $$ Bruker NMR JCAMP-DX V2.0
##DATA TYPE= NMR SPECTRUM
##DATA CLASS= NTUPLES
##ORIGIN= UXNMR, Bruker Analytische Messtechnik GmbH
##OWNER= pz
$$ XWIN-NMR		Version 3.5
$$ Wed Oct  1 10:15:47 2025 Russian Standard Time (UT+4h)  Yarkov@DPX200
##.OBSERVE FREQUENCY= 200.1313
##.OBSERVE NUCLEUS= ^1H
##.ACQUISITION MODE= SIMULTANEOUS
##.ACQUISITION SCHEME= undefined
##.AVERAGES= 8
##.DIGITISER RES= 18
##SPECTROMETER/DATA SYSTEM= spect
##.PULSE SEQUENCE= zg30
##.SOLVENT NAME= DMSO
##.SHIFT REFERENCE= (INTERNAL, DMSO, 0, 15.4924)
##AUDIT TRAIL= $$ (NUMBER, WHEN, WHO, WHERE, WHAT)
$$ ##TITLE= Audit trail, XWIN-NMR		Version 3.5
$$ ##JCAMPDX= 5.01
$$ ##ORIGIN= Bruker BioSpin GmbH
$$ ##OWNER= Yarkov
$$ C:/Bruker/XWIN-NMR/data/yarkov2/nmr/H-C/1/pdata/1/auditp.txt
$$ ##AUDIT TRAIL=  $$ (NUMBER, WHEN, WHO, WHERE, WHAT)
(   1,<2025-10-01 10:14:58.98 +0400>,<Yarkov>,<DPX200>,
      <created by zg, POWCHK disabled, PULCHK disabled
       configuration hash MD5:
       00 E9 B6 7A A2 85 ED C7 34 08 36 98 17 FE 4E 26
       data hash MD5: 16K
       65 45 AA 68 91 4D 09 7F 0A 20 F0 29 44 7F B4 CF>)
(   2,<2025-10-01 10:15:05.79 +0400>,<Yarkov>,<DPX200>,
      <Start of raw data processing
       efp BC_mod = 2 LB = 0.25 FT_mod = 6 PKNL = 1 PHC0 = -2078.854 PHC1 = 16.19097 SI = 16K 
       data hash MD5: 16K
       3C 26 93 61 DB E1 01 65 8A C8 EB 55 33 23 A3 54>)
(   3,<2025-10-01 10:15:09.79 +0400>,<Yarkov>,<DPX200>,
      <abs ABSG = 5 
       data hash MD5: 16K
       F9 DC CC B7 4F 2B DA DA 05 CB 20 95 05 1B 6E 31>)
$$ ##END=
$$ 
$$ hash MD5
$$ CC EF 6F 42 2D 3A 52 6C 3A D1 21 16 DB 6F DF 56
##$RELAX= 
##$RELAX= 
##$RELAX= 
##$RELAX= 
##$RELAX= 
##$RELAX= 
$$ Bruker specific parameters
$$ --------------------------
##$DU= <C:/Bruker/XWIN-NMR>
##$EXPNO= 1
##$NAME= <H-C>
##$PROCNO= 1
##$TYPE= <nmr>
##$USER= <yarkov2>
##$AMP= (0..31)
100 100 100 100 100 100 100 100 100 100 100 100 100 100 100 100 100 100 
100 100 100 100 100 100 100 100 100 100 100 100 100 100 
##$AQSEQ= 0
##$AQ_mod= 1
##$AUNM= <au_zg>
##$AUTOPOS= <>
##$BF1= 200.13
##$BF2= 200.13
##$BF3= 200.13
##$BF4= 200.13
##$BF5= 200.13
##$BF6= 200.13
##$BF7= 200.13
##$BF8= 200.13
##$BYTORDA= 1
##$CFDGTYP= 0
##$CFRGTYP= 5
##$CHEMSTR= <none>
##$CNST= (0..31)
1 1 145 1 1 1 1 1 1 1 1 1 1 1 1 1 1 1 1 1 1 1 1 1 1 1 1 1 1 1 1 1 
##$CPDPRG= <>
##$CPDPRG1= <>
##$CPDPRG2= <>
##$CPDPRG3= <>
##$CPDPRG4= <mlev>
##$CPDPRG5= <mlev>
##$CPDPRG6= <mlev>
##$CPDPRG7= <mlev>
##$CPDPRG8= <mlev>
##$CPDPRGB= <>
##$CPDPRGT= <>
##$D= (0..31)
0 0.7 0 0 0 0 0 0 0 0 0 0.03 0 0 0 0 0 0 0 0 0 0 0 0 0 0 0 0 0 0 0 0 
##$DATE= 1759299298
##$DBL= (0..7)
120 120 120 120 120 120 120 120 
##$DBP= (0..7)
150 150 150 150 150 150 150 150 
##$DBP07= 0
##$DBPNAM0= <>
##$DBPNAM1= <>
##$DBPNAM2= <>
##$DBPNAM3= <>
##$DBPNAM4= <>
##$DBPNAM5= <>
##$DBPNAM6= <>
##$DBPNAM7= <>
##$DBPOAL= (0..7)
0.5 0.5 0.5 0.5 0.5 0.5 0.5 0.5 
##$DBPOFFS= (0..7)
0 0 0 0 0 0 0 0 
##$DE= 6
$$ [...]
##$SUBNAM3= <"">
##$SUBNAM4= <"">
##$SUBNAM5= <"">
##$SUBNAM6= <"">
##$SUBNAM7= <"">
##$SUBNAM8= <"">
##$SUBNAM9= <"">
##$SW= 18.0517328524113
##$SWIBOX= (0..15)
0 0 2 0 0 0 0 0 0 0 0 0 0 0 0 0 
##$SW_h= 3612.71676300578
##$TD= 16384
##$TD0= 1
##$TE= 0
##$TE2= 300
##$TE3= 300
##$TEG= 300
##$TL= (0..7)
0 120 120 120 120 120 120 120 
##$TP= (0..7)
150 150 150 150 150 150 150 150 
##$TP07= 0
##$TPNAME0= <>
##$TPNAME1= <>
##$TPNAME2= <>
##$TPNAME3= <>
##$TPNAME4= <>
##$TPNAME5= <>
##$TPNAME6= <>
##$TPNAME7= <>
##$TPOAL= (0..7)
0.5 0.5 0.5 0.5 0.5 0.5 0.5 0.5 
##$TPOFFS= (0..7)
0 0 0 0 0 0 0 0 
##$TUNHIN= 0
##$TUNHOUT= 0
##$TUNXOUT= 0
##$USERA1= <user>
##$USERA2= <user>
##$USERA3= <user>
##$USERA4= <user>
##$USERA5= <user>
##$V9= 5
##$VALIST= <valist>
##$VCLIST= <CCCCCCCCCCCCCCC>
##$VD= 0
##$VDLIST= <DDDDDDDDDDDDDDD>
##$VPLIST= <PPPPPPPPPPPPPPP>
##$VTLIST= <TTTTTTTTTTTTTTT>
##$WBST= 1024
##$WBSW= 4
##$XGAIN= (0..3)
0 0 0 0 
##$XL= 0
##$YL= 0
##$YMAX_a= 159367
##$YMIN_a= -111876
##$ZGOPTNS= <>
##$ZL1= 120
##$ZL2= 120
##$ZL3= 120
##$ZL4= 120
##$ABSF1= 15.56178
##$ABSF2= -2.490071
##$ABSG= 5
##$ABSL= 3
##$ALPHA= 0
##$AQORDER= 0
##$ASSFAC= 0
##$ASSFACI= 0
##$ASSFACX= 0
##$ASSWID= 0
##$AUNMP= <proc_1d>
##$AZFE= 0.1
##$AZFW= 0.1
##$BCFW= 0
##$BC_mod= 2
##$BYTORDP= 0
##$COROFFS= 0
##$CY= -3
##$DATMOD= 1
##$DC= 0
##$DFILT= <>
##$DTYPP= 0
##$F1P= 0
##$F2P= 0
##$FCOR= 1
##$FTSIZE= 16384
##$FT_mod= 6
##$GAMMA= 0
##$GB= 0
##$INTBC= 1
##$INTSCL= 3.241238e-09
##$ISEN= 128
##$LB= 0.25
##$LEV0= 0
##$LPBIN= 0
##$MAXI= 10000
##$MC2= 0
##$MEAN= 0
##$ME_mod= 0
##$MI= 1.114404
##$NCOEF= 0
##$NC_proc= -7
##$NLEV= 6
##$NOISF1= 3.799351
##$NOISF2= 2.8
##$NSP= 0
##$NTH_PI= 0
##$NZP= 0
##$OFFSET= 15.49237
##$PC= 1
##$PHC0= -2078.854
##$PHC1= 16.19097
##$PH_mod= 1
##$PKNL= yes
##$PPARMOD= 0
##$PSCAL= 0
##$PSIGN= 0
##$REVERSE= no
##$SF= 200.130005868436
##$SI= 16384
##$SIGF1= 3
##$SIGF2= 2
##$SINO= 0.751879
##$SIOLD= 32768
##$SREGLST= <19F.Aceton>
##$SSB= 0
##$STSI= 16384
##$STSR= 0
##$SW_p= 3612.71676300578
##$SYMM= 0
##$S_DEV= 0
##$TDeff= 16384
##$TDoff= 0
##$TI= <>
##$TILT= no
##$TM1= 0
##$TM2= 0
##$TOPLEV= 0
##$USERP1= <user>
##$USERP2= <user>
##$USERP3= <user>
##$USERP4= <user>
##$USERP5= <user>
##$WDW= 1
##$XDIM= 16384
##$YMAX_p= 296915059
##$YMIN_p= -1061654
$$ End of Bruker specific parameters
$$ ---------------------------------
##NTUPLES= NMR SPECTRUM
##VAR_NAME=  FREQUENCY,     SPECTRUM/REAL,   SPECTRUM/IMAG
##SYMBOL=    X,             R,               I
##VAR_TYPE=  INDEPENDENT,   DEPENDENT,       DEPENDENT
##VAR_FORM=  AFFN,          ASDF,            ASDF
##VAR_DIM=   16384,         16384,           16384
##UNITS=     HZ,            ARBITRARY UNITS, ARBITRARY UNITS
##FACTOR=    0.220516191357247, 1,           1
##FIRST=     3100.4880293296, 0,             0
##LAST=      -512.228733676181, 0,           0
##MIN=       -512.228733676181, -1061654,    0
##MAX=       3100.4880293296, 296915059,     0
$$ Real data points
##PAGE= N=1
##DATA TABLE= (X++(R..R)), XYDATA
$$ [...]
10467 -66369 -122406 -72573 32467 59745 60376 -24290 -23654 23882 76502 107724 -27279 -111096
10455 -111096 -12179 79383 -37978 -65509 -57937 -54976 70975 133565 46227 -33005 -75235
10444 -75235 -99117 -100212 55838 178308 89798 63356 231928 215755 201160 113231 45816
10433 45816 97322 48720 85346 147821 152365 31668 25742 198814 120144 142882 113216 60858
10421 60858 99064 100330 77923 135593 25225 -86091 29562 142528 178166 87778 64247
10410 64247 -8535 37288 97213 177479 163280 13465 108925 204426 327786 367786 260426
10399 260426 170853 16550 -52163 -59026 -32659 110305 155905 77849 -38209 -108625 -70414
10388 -70414 -37510 -71996 -75905 -21977 14950 105189 46649 14838 168669 27528 -72643
10377 -72643 -105204 -22157 26139 16816 140303 165688 34000 -15582 -58665 -95558 -44731
10366 -44731 18682 82330 22725 -38738 -79468 -83051 -5285 -60988 -43913 98885 143317 132983
10354 132983 152989 229265 131526 125128 122761 72672 2301 -100824 -19071 22029 24099 -103131
10342 -103131 -105940 30746 42422 36503 61997 104913 30287 5866 44851 70895 102669 -14809
10330 -14809 -5370 -3643 -108053 -112554 -3283 27848 71289 113216 13 -32868 -86188 -63406
10318 -63406 -40757 16794 27680 125200 141275 88937 59872 150639 70854 -1850 -5002 63871
10306 63871 127552 102817 93008 137485 150355 83705 20879 112721 85887 75580 22732 -77078
10294 -77078 31014 40685 99060 160503 112823 165529 170888 48226 86091 51970 1418 18360
10282 18360 123569 -19227 30017 104130 -31750 11315 190543 142453 179993 296714 218133
10271 218133 173425 4995 -1516 -42021 -91352 -80583 -84114 60919 -22215 -15348 -34205 -90419
10259 -90419 37239 149324 108415 145586 122065 133686 185079 200875 56164 -49921 -69483
10248 -69483 -28979 60451 122809 4700 47942 166120 187145 254421 26663 74326 52183
10237 52183 -123792 18855 204653 206438 206099 234554 237475 158857 242199 164117 162527 201963
10225 201963 189372 209752 13987 50887 74443 41808 81960 -39218 15220 2142 218453
10214 218453 249778 86631 138758 150267 131022 129771 -28962 22172 13392 48789 134356
10203 134356 80272 67125 24540 103728 83252 56955 87998 106084 30093 153557 218012
10192 218012 134923 19068 61832 114473 139716 244731 340642 246897 284711 302463 317576
10181 317576 349578 313304 266760 294523 301612 120323 192575 185888 171268 15065 114918
10170 114918 207698 216946 218198 63275 52637 83022 145453 118065 176692 99335 78383 55470
10158 55470 199134 346016 150734 125651 120650 47405 51838 86570 82309 345931 283365
10147 283365 130546 75256 126425 198983 134084 141450 89163 88068 -10200 45340 -2012 36081
10135 36081 137080 133422 145068 27423 10934 81908 57428 97915 126450 85654 55432
10124 55432 203662 129129 258041 265900 250563 281324 287744 308943 283937 308100 374383 292364
10112 292364 215905 326253 286851 270942 234277 222791 262151 178756 223423 263581 225618
10101 225618 185082 163331 224619 266705 283869 62617 156835 144618 65582 78142 209427
10090 209427 211434 222020 387312 377039 392771 367908 233181 133866 203352 172153 194274
10079 194274 209743 198383 227383 180946 190687 155165 162236 169632 227054 368883 407071 345137
10067 345137 258544 160078 138423 218756 242270 167124 248994 250116 285011 285978 209856 419862
10055 419862 421002 288776 188881 273418 155695 186697 239273 293672 101194 6762 148214
10044 148214 227347 221789 154861 102449 21896 148046 214921 301561 291337 106141 92758
10033 92758 93502 64149 191747 246488 308214 338026 280406 162541 71935 127987 204664 125259
10021 125259 52046 151211 325631 272457 227898 148225 281618 294963 281921 307205 331056
10010 331056 340174 432063 335246 185437 103474 78595 80008 57620 109862 158459 85795 130810
9998 130810 237882 306222 204939 191217 219755 221831 117662 256061 318624 303638 310278
9987 310278 325829 323387 372506 397991 259830 328958 453076 321783 245065 320849 341916
9976 341916 252733 241922 332240 266638 262159 320476 313988 247923 290328 235338 220305 126346
9964 126346 227062 244638 242881 146825 234843 278362 216340 197875 177709 222673 124366 103623
9952 103623 128616 198165 191248 148916 331687 323955 336248 339520 421455 373605 327243 324849
9940 324849 335203 454968 538811 440761 348482 433089 504200 558786 547782 370307 458591
9929 458591 565480 435168 448503 546283 686131 767801 617711 526141 454353 571522 562638
9918 562638 601982 603482 537757 707665 859613 738571 618637 719162 780472 745868 723211
9907 723211 780716 931283 917969 777744 839983 1031520 998309 950118 1040706 1136000 1248499
9896 1248499 1115682 1234783 1299290 1382474 1431550 1463227 1468939 1508554 1687522 1684924 1764316
9885 1764316 1599726 1527714 1596455 1685471 1674737 1590821 1590536 1617422 1500100 1341052 1412990
9874 1412990 1240566 1217246 1159360 1118480 1039521 928021 1028389 1142397 1138652 974177 917897
9863 917897 912355 987049 1056242 969824 968523 1004159 940895 825855 934382 985484 898132 834950
9851 834950 804536 766018 721390 712893 684209 572261 566776 584055 598209 532209 502491 628761
9839 628761 569457 662741 681885 682015 622212 493252 429226 446594 512127 432908 369091 416463
9827 416463 393166 276236 311081 431132 467249 496295 663031 570875 565401 579025 560486
9816 560486 520815 505090 375859 501096 385397 368964 512483 390594 415054 482771 436252
9805 436252 375580 370511 378020 268919 283321 304515 375845 426140 425223 328195 127062 118280
9793 118280 92779 166510 299185 244465 238346 274021 294047 314154 334568 397804 348584 241449
9781 241449 105411 98269 188756 173695 246225 168547 63599 84056 160761 215366 142543
9770 142543 234403 246131 248721 375638 466165 434426 409327 471486 369970 255983 307571
9759 307571 261733 294237 220125 252952 326845 395723 329429 261944 260773 257767 403075 433701
9747 433701 378283 354734 171594 261784 305118 305356 379270 417127 430714 432934 394526 327763
9735 327763 142035 209378 214400 201945 241173 356557 278971 153086 186554 249406 262610
9724 262610 242834 253274 237927 360201 466837 471832 455804 528039 555316 585032 366762
9713 366762 377902 387479 459281 504596 448720 404885 319919 427108 527291 434417 375608
9702 375608 479850 402200 413060 565393 610340 542384 481082 382489 506671 638020 645728
9691 645728 690241 593212 630044 630898 589635 715558 745202 699144 549885 598962 671384 630776
9679 630776 555551 499051 538813 588576 580808 574955 419567 408443 571785 620589 617124 668542
9667 668542 601363 695555 637394 667925 670292 643569 788224 749389 641815 595809 633446
9656 633446 575946 611972 685803 832307 728637 805022 909245 1023620 1084104 1007994 1079140
9645 1079140 954125 889122 877264 904430 886805 831629 820324 870932 794966 758207 959675
9634 959675 928660 923828 907655 860816 725986 790352 750143 878425 912290 967153 954193
9623 954193 944312 844869 803458 821223 914931 976326 824031 709288 758909 683465 708004
9612 708004 796506 734568 811836 879230 875856 1031042 1028355 1155717 1113987 1034806 1054563 1030869
9600 1030869 1135600 1188403 1134036 998983 908949 834113 893722 938383 872406 872164 886345
9589 886345 867450 846783 842612 975414 944524 825824 775449 660312 656559 811144 808627
9578 808627 594065 549080 625846 713759 846612 747925 616441 531554 513653 570414 670618
9567 670618 682544 596803 542819 669199 575052 505150 490600 603699 630254 600590 646095
9556 646095 546178 436284 455147 545021 635103 469729 441417 513822 604315 657906 599305
9545 599305 634405 688593 615386 587096 545213 721427 664850 654282 765043 788222 769212
9534 769212 694307 797476 731067 853375 912092 906153 894795 814444 884571 728858 729205 784762
9522 784762 843387 820503 706621 882904 820928 616843 703745 643519 573626 586300 594635
9511 594635 637361 721686 629767 669487 655922 665861 802964 729593 742262 723902 692773 725438
9499 725438 667319 631056 700473 662696 611799 630053 554633 658416 678845 684360 771932 738231
9487 738231 663423 687009 759723 648693 661004 691294 742736 748895 751630 709949 565317 549225
9475 549225 689302 785378 640634 629322 751879 745040 758294 743329 777805 708959 785011
9464 785011 716579 712143 635938 568984 701823 696659 645324 773627 612382 574939 619908
9453 619908 550719 651828 644103 610636 577719 535646 477002 446077 555144 595780 605316 524752
9441 524752 604206 755891 745691 771425 699473 704789 639194 691043 760715 664441 499064
9430 499064 522720 592841 647022 725221 759905 743191 685584 796801 748988 737468 747230 785442
9418 785442 769476 808211 970029 956850 916728 856717 808143 774051 833341 930725 877378
9407 877378 977170 1042607 1096380 1095573 1134312 1132842 1076111 1213898 1331667 1307482 1393327 1356994
9395 1356994 1189053 1353506 1250635 1014184 952844 976609 787795 840577 826367 812744
9385 812744 899030 924909 848998 794860 710647 732427 810524 756061 844405 828274 775599 782133
9373 782133 822592 865647 786211 810194 792196 600675 694029 729392 827522 812093 856615
9362 856615 843242 812993 852534 873560 854767 692631 724078 828874 979984 862588 786450
9351 786450 850371 831944 893557 1023668 1032298 965954 966605 880115 825561 779758 862549 963251
9339 963251 942853 901098 1002681 882317 851822 911180 864973 789158 688944 678006 732363
9328 732363 716060 796325 888546 947409 973815 873122 699242 608182 866771 918260 811606
9317 811606 810501 858527 920907 855058 865823 886885 787880 880781 788814 779003 830781 790147
9305 790147 774610 791004 820006 747444 792224 837548 921460 743790 631731 766939 888764
9294 888764 855349 724560 817146 804666 682364 708847 849590 852509 870539 1007690 895694
9283 895694 753139 904956 887647 964321 909196 941074 977751 977267 839322 876399 872609 885910
9271 885910 895839 969326 923080 958827 1042746 889908 856510 913160 936759 920781 1071356
9260 1071356 968360 995201 1047947 1024298 972621 973861 971480 1030517 1156469 1019805 896330
9249 896330 977783 1075879 978199 971357 944377 906033 997692 978650 1084632 1145185 1121124 1106611
9237 1106611 1181046 998078 988532 1008193 1087020 1176144 1088916 1075047 1141644 1047969 1045603 1219159
9225 1219159 1125233 1128429 1200044 1162007 1137791 1293998 1324779 1178249 1151973 1152112 1200814 1354509
9213 1354509 1232348 1044632 986972 1175186 1216922 1035198 1098695 1259516 1150294 1171027
9203 1171027 1172393 1103553 1139008 1176502 1288404 1271002 1280681 1372396 1476059 1477462 1598722
9192 1598722 1574905 1415430 1215415 1309759 1333775 1301798 1338320 1369304 1401473 1312916 1428350
9181 1428350 1560119 1543528 1517081 1387529 1301906 1423545 1327967 1247191 1247268 1293690 1407158
9170 1407158 1361389 1337729 1482419 1429630 1314668 1311221 1203480 1256877 1314392 1384765 1378480
9159 1378480 1356400 1367365 1328171 1376643 1346506 1343290 1438534 1432991 1376935 1282815 1349867 1370979
9147 1370979 1444967 1533571 1543992 1371252 1368670 1388302 1344323 1278796 1378736 1471274 1536689
9136 1536689 1609335 1407549 1408545 1518957 1509636 1628084 1626573 1507065 1642062 1621712 1601583
9125 1601583 1645409 1608690 1594948 1602295 1627429 1601294 1545790 1571689 1705557 1814669 1849232
9114 1849232 1869107 1746477 1843139 1883207 1757523 1783874 1871894 1803698 1723604 1733084 1688250
9103 1688250 1763292 1883056 1871990 1982329 1873313 1876765 1949931 1937842 1949275 1954225 1967340
9092 1967340 1979441 1882587 1823189 1982125 2119595 2231638 2178624 2138868 2172891 2259286 2288221
9081 2288221 2172360 1999530 2052241 2212328 2240740 2247192 2272519 2433485 2486728 2393733 2359211
9070 2359211 2428517 2554229 2420102 2427566 2407264 2364224 2429396 2530283 2709624 2677372 2674800
9059 2674800 2645340 2776848 2762631 2841248 2717180 2685674 2746917 2734219 2762928 2736488 2701084
9048 2701084 2690783 2831554 2957787 2884869 2824729 2720141 2739745 2823035 2799695 2964981 3024734
9037 3024734 3027304 2988832 2966126 2903604 2892528 2945936 2910870 2861627 2951530 3128389 3058902
9026 3058902 2988740 3112422 3161871 3048841 2994430 3115761 3247231 3155552 3176736 3334688
9016 3334688 3487335 3478874 3355465 3250657 3311198 3404910 3391361 3472463 3427781 3289452 3362127
9005 3362127 3446891 3575957 3644805 3817026 3672169 3573718 3752116 3724069 3791495 3732194 3875518
8994 3875518 4035524 4205524 4164404 4140787 4225905 4232761 4328785 4338285 4448592 4614909 4629730
8983 4629730 4673255 4784479 4898209 5087743 5161629 5315222 5352872 5350213 5592187 5867938
8973 5867938 6063862 6120650 6201131 6338691 6426310 6686953 6943070 7107801 7445184 7620531
8963 7620531 7760577 8031316 8229056 8376768 8700623 8970262 9275532 9562812 9867716 10284866
8953 10284866 10717256 11096854 11544242 11985802 12567629 13258190 14042513 14625986 15399516
8944 15399516 16215121 17338166 18579729 19844731 20889075 22186554 23801517 25558445
8936 25558445 27638560 30047143 32556285 35674826 39402895 44255192 50352163 58467035
8928 58467035 67651793 76929346 84451121 87872231 85632521 80567556 77195701 73334212
8920 73334212 65383544 56850518 50734717 46071904 42610652 39657920 37094315 34923170
8912 34923170 33445000 32215436 31392029 30501743 29692090 28872991 28013710 27060491 25973669
8903 25973669 24715808 23736627 22716276 21862348 20889966 20110838 19396804 19120253 19051543
8894 19051543 19160181 19163751 19349795 19554994 19975794 20571939 21228579 21844861 22557117 23350263
8884 23350263 24134956 24921514 25522103 26090144 26333690 26460119 26428856 26197087 26098578 25762290
8874 25762290 25187583 24718173 24615629 24518658 24547165 25025973 25708727 26476917 27246438 27735895
8864 27735895 27817011 27620412 27420479 26749729 25773280 24699339 23847851 23060619 22389727
8855 22389727 21884331 21418409 21046098 20596478 20345383 20182866 20078402 20007138 20159087 20632492
8845 20632492 21397450 22254355 22898173 23359272 23550348 23338530 22935688 22304527 21499745
8836 21499745 20860413 20148757 19560683 19169523 18964291 18937743 19063118 19553399 20316266 21173057
8826 21173057 21961323 22637768 23039818 23381936 23313500 22809981 21904488 21133560 20158061 19307285
8816 19307285 18319756 17386946 16554080 15820425 15047833 14278360 13623380 13076584 12635520
8807 12635520 12257654 11816761 11420540 11269152 11107831 10945010 10618380 10434401 10284844
8798 10284844 10048568 9999935 10004924 9988392 9791874 9558390 9425206 9254732 9215383 9167404
8788 9167404 9147051 9093164 9088255 9158542 9084608 9208131 9296307 9256850 9286177 9371983 9402359
8777 9402359 9458479 9425285 9569956 9652802 9881134 9981516 10053062 10214622 10183811 10223547 10257904
8766 10257904 10373566 10708665 10915680 11088102 11478796 11718271 11966417 12412628 12627189
8757 12627189 13055136 13509524 14054152 14779499 15492742 16369293 17170875 17862907 18705814
8748 18705814 19299967 19568925 19751298 19796649 19740761 19569833 19558622 19655909 20094018 20542020
8738 20542020 20936299 21118917 20969717 20641114 20283790 19664296 18751895 17919476 17142340
8729 17142340 16073055 15427693 14994580 14627431 14181184 13957745 13741489 13608069 13590450
8720 13590450 13602399 13651313 13761743 13970207 14060171 14382224 14795184 15253665 15743349 16437500
8710 16437500 17125471 17812975 18683790 19496517 20064177 20379741 20335877 20256492 20018589 19728466
8700 19728466 19642033 19483012 19412958 19763786 19972852 20154819 20237996 20023880 19460437 18669145
8690 18669145 17708009 16791636 16086877 15050513 14074531 13380610 12853151 12410518 11968978
8681 11968978 11634354 11405338 11205536 11123486 10995010 10787351 10587354 10392012 10368864 10359024
8671 10359024 10330359 10301859 10259529 10289176 10329499 10387480 10231931 10130307 10106289 10058335 9973624
8660 9973624 10008803 9936249 9927890 9910903 10028789 10099376 10051588 10067968 10257906 10345368 10479938
8649 10479938 10741165 10975826 11065728 11357179 11975186 12396861 13052614 13743824 14234478 14708921
8639 14708921 14856618 14788839 14575773 14380495 14040687 13835326 13927267 13895898 13999633 14186378
8629 14186378 14274153 14214356 14019214 13797273 13378915 13070796 12639752 12084022 11671503 11454484
8619 11454484 11222616 11061591 11010884 10996915 10990533 11184077 11317031 11420323 11888550 12242875
8609 12242875 12500773 12764888 13104450 13616226 14213294 14801347 15740763 16848930 17892717
8600 17892717 18802168 19630524 19829975 19900147 19669729 19451272 18877454 18269241 17933573 17739056
8590 17739056 17835372 17830307 17617185 17445735 17146846 16435927 15840043 15080898 14284097 13511758
8580 13511758 12740510 12042042 11590100 11204880 10523155 10297378 10164206 10131262 9968259 10017339
8570 10017339 9793482 9760945 9892416 9844736 9918915 10234574 10574102 10757192 11022310 11353924
8560 11353924 11933600 12465897 12754646 12826935 12764108 12734691 12678995 12585973 12346999 12161224
8550 12161224 12145486 12058705 12053628 12037833 11837500 11453635 10916980 10586905 10279650 9757965
8540 9757965 9322662 8859130 8538293 8169576 7884191 7697548 7521337 7406040 7354353 7014108
8530 7014108 6993124 7027480 6897703 6894712 6908666 6935100 6947412 7127756 7397568 7370603 7323910
8519 7323910 7529560 7690811 7657555 7715799 7844318 8071052 8264056 8288617 8342556 8503494
8509 8503494 8783013 9037261 9301827 9554249 9781385 9998706 10346653 10686908 11090335 11325667
8499 11325667 11185586 11297124 11206322 10984869 10509964 10086065 9834963 9481316 8987386 8849201
8489 8849201 8868014 9104701 9360416 9624977 9834345 10164814 10317698 10430566 10417136 10346264
8479 10346264 10086943 9468985 8936973 8623668 8359213 7888233 7710012 7572785 7439354
8470 7439354 7381902 7343738 7462930 7581853 8038527 8329407 8667498 9059515 9307620 9720871
8460 9720871 9942447 10160667 10183235 9948892 9707182 9383897 9051847 8624203 8322672 8041085
8450 8041085 7713099 7620277 7533462 7668052 7722444 7965244 8046525 8023871 7970454 7787124 7408524
8439 7408524 7020601 6520313 6324541 5889075 5466402 5349184 5263420 5250174 5259723 5126146
8429 5126146 5075871 4715233 4594317 4464881 4139458 3756711 3348397 3155734 2962512 2782045
8419 2782045 2664922 2489153 2381700 2330255 2198265 2104357 2081193 1994027 1856711 1711243
8409 1711243 1865668 1898687 1833255 1856893 1938444 1990729 1988632 2037001 2172044 2420389 2665280
8398 2665280 2876844 3066966 3333345 3412335 3414803 3209128 2973414 2876626 2673531 2261580
8388 2261580 2252646 2075667 1918694 1821928 1757314 1788937 1754642 1627629 1700867 1703548 1731870
8377 1731870 1809193 1912670 1957301 2048328 2268359 2380257 2675083 2999339 3256440 3274901
8367 3274901 3000955 2926674 2711042 2555479 2343918 1959239 1789087 1524453 1368967 1247105
8357 1247105 1090405 1048507 1134132 1062755 963051 838599 867928 776345 737154 720634 601088
8346 601088 732031 694674 646879 596182 664463 577016 600290 492247 410616 458255 455997
8335 455997 425248 339927 169742 273387 460573 473787 496512 395627 436173 424641 413763
8324 413763 509677 494049 478357 383543 267431 257516 208398 315468 408375 434037 440598 438194
8312 438194 464248 351174 399773 442041 276843 389401 422092 422721 528888 505704 545510
8301 545510 418148 338051 320286 318567 400815 342920 299262 348685 307910 227431 291173 262617
8289 262617 173340 132789 166438 163890 204166 208010 317143 350723 265825 253214 357381 365953
8277 365953 424311 411117 437754 497835 506923 613316 731679 772584 715410 617351 593025
8266 593025 655676 735960 833520 834837 963396 1038820 955664 1014101 1077763 1019544 1107198 1101066
8254 1101066 1060528 1124205 1134173 1048967 965204 973690 861730 741147 592596 586629 784772
8243 784772 841681 897491 771953 764720 785434 906652 971370 1060876 1154515 1174208 1227514
8232 1227514 1259556 1179067 1212888 1288248 1441530 1433314 1287459 1281357 1348571 1450466 1367251
8221 1367251 1186750 1054806 1018269 795582 726301 714268 779031 609349 567393 460637
8211 460637 373636 429844 608918 535377 458881 388320 418838 408660 512694 459086 426914
8200 426914 400965 362077 235684 330185 489288 539936 600289 1308527 95654 -1061654
8190 -1061654 -335699 -243573 -140674 -198478 -165665 -176385 -8020 11480 60732 -869 15878
8179 15878 19233 6132 -135897 43822 138011 242970 61354 21237 2545 105827 125411
8168 125411 212714 217503 -16180 -120596 -17026 155321 94989 -6488 -9324 -15452 22580
8157 22580 -15554 10957 -114047 -88105 30027 60509 85530 6969 63654 44645 89432
8146 89432 158629 245686 65105 -24892 -97721 -103821 -22283 60639 34875 -73671 128123
8135 128123 128633 33557 18801 11549 12946 -124389 -81834 6340 -11944 -103413 -180953 -108916
8123 -108916 79353 163503 125871 8632 31574 15738 -60057 -151880 -144430 -55593 53061
8112 53061 82181 -71675 -138022 -167845 -171001 -117199 -64554 -37011 -77477 -12847 -120807 -37044
8100 -37044 17984 -46277 -107036 -99752 -32239 -33322 -120174 -244691 -304479 -267148 -226334 -118245
8088 -118245 -19577 38948 119086 150295 52876 86005 80456 18023 33723 -83870 -38887 -86984
8076 -86984 11015 7661 95742 74112 126803 115195 39303 67365 86380 21512 -4189 -53782
8064 -53782 -124183 -49430 90048 39650 17022 1104 -23612 -10295 110713 85299 -18605
8053 -18605 -20591 -72984 -46638 85096 120640 94286 -53392 -200204 -206826 -177173 -129504 -117122
8041 -117122 51154 3200 32241 79494 81776 -55009 -106048 -257956 -140552 -23047 123629
8030 123629 -2963 1944 23616 117890 161223 27558 -43539 -27044 32395 109871 85606
8019 85606 73271 96910 90004 99529 -13159 -91687 -54805 -935 129853 91483 72758 45688
8007 45688 23318 25288 18253 -25718 41890 117845 -25729 -73078 -82023 -81403 -64637 -150014 -12985
7994 -12985 18226 -80587 9567 55774 119017 124625 91146 -16884 68882 48570 -9913 28572
7982 28572 -24632 -40674 43692 -25659 -63417 47387 -25101 -79394 -12845 26998 32705 -111720
7970 -111720 -123005 -99343 -84383 -30674 102025 -66430 17727 -58147 35368 119720 52112
7959 52112 -118174 -169638 -68540 -140248 -216661 -93063 -112719 -212908 -153360 -78766 -105874
7948 -105874 -41952 -22796 -100694 -115096 7694 -56314 -157038 -203051 -21825 -16219 -118779
7937 -118779 -133026 -85226 6201 51572 39490 -34683 -150161 -144030 21056 126896 26969
7926 26969 -48473 1311 58379 33759 -59689 -48909 62763 -28007 -75627 -39038 -20231 -60356
7914 -60356 -92157 26469 87471 71728 -42950 -66571 -70891 -102922 -176452 -107046 -33183 -41618
7902 -41618 -30359 26382 -20455 -20567 -54176 61812 -63202 -50510 -128524 -12274 33242 127582
7890 127582 91284 102336 99314 74373 97135 107339 -95976 -144568 -6647 7089 55492
7879 55492 30436 59210 121539 -147108 -124480 39047 61775 -31013 -52175 -47409 -120749 24122
7867 24122 -88871 -50407 -32627 -125057 -176 12079 -24476 20175 104881 40278 136048
7856 136048 43047 -101114 61888 -96727 -37590 45574 87813 135282 61656 -21395 -179299
7845 -179299 -16410 122649 20403 -117937 -26123 46338 -108266 13906 59959 19978
7835 19978 -73631 11479 153827 199246 182733 140927 163152 270635 283035 148175 117586
7824 117586 118481 227674 262343 29893 59166 36290 80733 18651 32946 145912 198946
7813 198946 126376 69653 134849 69646 17787 345415 614647 335287 188774 216585 211947
7802 211947 227740 198455 209759 159208 180254 292953 160003 112808 143556 148924 273885
7791 273885 309716 298923 242755 195349 252145 217892 257644 341184 284516 228585 181636 219020
7779 219020 251150 141953 239268 356927 353726 276738 310038 289445 272618 288994 242505
7768 242505 245486 309397 286042 247481 199836 308728 305682 365076 421701 365877 363223 336316
7756 336316 197922 175824 285551 390772 549576 431580 373019 385004 448414 325424
7746 325424 377225 464499 383829 354275 426753 364070 423957 468760 456952 360143 270343 271953
7734 271953 332024 395408 490326 425290 351266 439931 454877 492606 564567 497128 585109 676067
7722 676067 537937 474120 451771 457174 504926 522605 426925 368667 468230 368096 403032
7711 403032 536442 442421 505620 404204 343045 389771 401038 336198 402865 371683 308682
7700 308682 376795 345042 414231 569873 466655 369461 312943 309472 330330 374114 360983
7689 360983 299783 363759 386637 379932 377741 352564 364943 313244 236662 301051 335706 223151
7677 223151 148102 197310 195102 139024 85444 165062 206065 204653 184911 246227 307402 287364
7665 287364 185122 185696 194938 237542 292364 264756 191766 278683 391403 378557 238928 142565
7653 142565 13080 95298 160853 61697 192780 200601 84113 19510 191908 219198 151871
7642 151871 117228 206099 166154 216266 201718 237529 111883 195137 272989 -59373 8851
7631 8851 188949 101394 163219 272167 356942 120534 150468 268185 258705 174045 168257 268966
7619 268966 185037 181076 322156 242826 350196 396894 371408 315618 232940 433394 446445
7608 446445 433882 400774 373772 506838 519083 465619 527954 424551 569371 401324 341032
7597 341032 328360 351678 507899 410130 449041 494973 349511 358992 531286 544405 595989
7586 595989 553645 470423 475186 569730 662044 615644 686996 726839 825896 692089 802006
7575 802006 771932 687574 665845 539505 505413 587835 673467 684542 721583 733971 686731
7564 686731 552766 581034 606054 572533 579775 661910 649187 583801 565177 486120 358528
7553 358528 247312 484429 494454 389457 576911 580086 462007 368096 519471 522094 545637
7542 545637 507711 430351 556583 517402 484479 486693 516158 460485 551322 562428 375697
7531 375697 465056 450410 406332 532644 569089 408320 513046 379257 220095 404577
7521 404577 452469 506690 426868 421448 389294 404833 235391 289444 303546 224501 335008
7510 335008 315267 336044 469588 528489 537271 351452 232520 287724 310423 373610 231290
7499 231290 272774 350908 294895 384659 369343 424948 468885 317526 323020 536482 661961
7488 661961 535378 391018 318186 247827 221931 434016 382672 310727 201759 243018 361918
7477 361918 466089 419531 388695 373588 342816 477952 417112 438016 372433 320040 340759
7466 340759 252919 240268 316261 358419 328462 401529 390614 243637 253067 180153 250309 352515
7454 352515 310613 327686 399187 458696 299956 380945 385600 303387 575542 653666 556845
7443 556845 427409 414291 477292 548738 486473 358112 378921 337111 209550 267678 391155
7432 391155 225417 227674 403018 369384 449851 566354 422894 399361 400420 381416 364087
7421 364087 381823 444451 418549 515613 483774 377464 390538 325915 427124 444742 424638
7410 424638 332774 383207 456768 569661 637606 527483 553159 598148 627052 563478 557359
7399 557359 538079 687829 958204 875252 840938 835854 820707 869655 905105 779521 753430
7388 753430 867532 788721 745584 661761 640248 671162 725822 626907 641214 612677 522113
7377 522113 545589 505783 487121 576318 553264 531593 601163 500712 559438 392805 403350
7366 403350 452963 516520 579074 531525 493756 448623 505743 403641 403754 488917 522128 562586
7354 562586 585189 654165 750551 618735 723916 703042 652588 546592 585576 625277 645403
7343 645403 637618 522409 556228 458577 345266 540701 487818 455476 506096 527339 573316
7332 573316 547936 476952 460878 551533 656017 544330 481053 622134 621456 562495 542324
7321 542324 509790 555331 637415 593294 574760 645076 629913 582452 694999 707906 728662
7310 728662 618931 595804 644238 727448 839461 716341 684616 601997 500447 583831 584168
7299 584168 608254 653928 702963 609130 545015 565927 644485 574797 557343 713303 855867
7288 855867 798816 688289 563016 654624 674980 587276 691217 695859 729114 823738 900971
7277 900971 818777 843832 843465 798947 798835 766606 683192 733390 847429 891182 765000 744926
7265 744926 781446 810425 823235 736139 676701 656709 622248 689631 778749 795689 836207 807897
7253 807897 924255 910601 901944 968416 908886 917689 874204 869935 996576 1054905 901429 794538
7241 794538 774336 825386 1001785 881030 881057 950286 910753 889013 818545 895433 906339 788141
7229 788141 908309 1024390 1061308 915560 941489 1010200 959231 888154 894325 950080 1122244
7218 1122244 1144947 984187 957656 1064297 1136343 1127840 1185688 1193633 1215688 1186195 1044005
7207 1044005 1162828 1362920 1339501 1181671 1321445 1311505 1417685 1447222 1328527 1311554
7197 1311554 1408347 1580563 1681943 1774311 1774534 1737387 1724076 1827739 1738165 1812793 1836129
7186 1836129 1914694 1970952 2092853 2152315 2302581 2340931 2436748 2474868 2522269 2524841 2547136
7175 2547136 2605787 2763998 2880014 2952775 3105954 3137949 3214053 3399306 3476827 3560648 3671545
7164 3671545 3760633 4038982 4433912 4424773 4606447 4797123 4889749 5259535 5490184 5637702
7154 5637702 5925828 6238072 6487879 6675972 6945726 7439556 7887722 8156182 8393250 8643820
7144 8643820 8888996 9129795 9294739 9452061 9502257 9428567 9478536 9345476 9318465 9192727
7134 9192727 8908451 8799168 8506755 8241223 7976738 7699244 7353400 7191348 6877998 6591263
7124 6591263 6277600 5843495 5614866 5517554 5281287 5126729 4905536 4644197 4335302 4215899
7114 4215899 4096763 4078395 3930130 3795769 3672634 3710752 3743441 3575194 3492804 3570811
7104 3570811 3500564 3419615 3441980 3485252 3452035 3388831 3288551 3151847 3155154 3227072 2991675
7093 2991675 2782455 2743869 2604223 2453681 2429448 2441536 2212453 2159656 2037115 1981547
7083 1981547 1913863 1865780 1843558 1784176 1859753 1781585 1638341 1583284 1517506 1565759 1643558
7072 1643558 1680167 1512655 1456603 1473227 1407121 1446536 1501092 1462134 1436983 1512098 1506007
7061 1506007 1429471 1511196 1536106 1619169 1578478 1657006 1674948 1620413 1658185 1603797 1629766
7050 1629766 1587086 1558785 1584771 1546622 1498904 1304659 1249809 1290070 1259704 1230520 1344408
7039 1344408 1316880 1167348 1258338 1272833 1201181 1135174 1248037 1348329 1369545 1255036 1105291
7028 1105291 1118194 1149466 1274987 1338644 1373590 1371168 1436791 1389536 1323230 1334966 1459716
7017 1459716 1548897 1656353 1553791 1588657 1763604 1712877 1595207 1657149 1657068 1683482 1680773
7006 1680773 1797219 1884661 1898492 1970266 1872868 1946892 2066731 2133744 2109228 2164586 2303881
6995 2303881 2398948 2414561 2554995 2705288 3013859 3270476 3486906 3783028 4173685 4175344
6985 4175344 4137861 4271455 4181278 3949691 3771002 3731958 3897532 4068900 4151687 4259280
6975 4259280 4349804 4311067 4099960 3836737 3752275 3554956 3091015 2912600 2787100 2596006
6965 2596006 2363002 2191944 2045180 1953414 2110709 1900784 1796902 1735909 1768001 1794257
6955 1794257 1635910 1700814 1766291 1712974 1780531 1826531 1798745 1734149 1817816 1787379 1791493
6944 1791493 1982773 1938733 1984687 1991598 1957840 2028891 2060586 2102728 2206423 2274296 2484946
6933 2484946 2599206 2760443 2839465 2919086 3212252 3560092 3866918 4053123 4318047 4364105
6923 4364105 4335424 4270364 4064942 3973202 3875972 4023205 4149845 4032169 4291423 4399190
6913 4399190 4318761 4126894 3950711 3739111 3650598 3402122 3157985 2849796 2618426 2382488
6903 2382488 2092194 2027259 2050105 2072343 2075652 1958283 1959362 1961384 1901511 1983680 1905347 1892584
6891 1892584 1885769 1853120 1711758 1703766 1831231 1966316 1906136 1797225 1650782 1805816 1692379
6880 1692379 1630953 1594965 1638153 1510822 1517224 1584429 1628756 1565526 1493859 1577101 1605969
6869 1605969 1606075 1764844 1700908 1619352 1729689 1528894 1695104 1592693 1605619 1686709 1706727
6858 1706727 1684280 1745361 1805560 1773301 1759047 1750561 1715179 1735042 1791118 1750162 1723909 1660521
6846 1660521 1709704 1848368 1751888 1803956 1860379 1610614 1619451 1524470 1524911 1645679 1707569
6835 1707569 1612274 1632564 1861860 1811050 1688999 1683445 1677408 1730222 1729344 1699012 1529108 1484459
6823 1484459 1475505 1570688 1500101 1578661 1672884 1726745 1652788 1563324 1643088 1772806 1586225
6812 1586225 1450967 1384296 1388750 1456974 1404082 1462118 1487355 1540319 1638216 1581615 1414510
6801 1414510 1571583 1728069 1785938 1557244 1461896 1542490 1735259 1713688 1675165 1621267 1625464
6790 1625464 1704751 1645513 1599806 1670190 1633826 1630617 1601355 1638967 1701993 1737354 1789567 1725635
6778 1725635 1669290 1710490 1657123 1654654 1678003 1841895 1835658 1874663 1890775 1839095 1712286
6767 1712286 1759611 1656914 1699175 1948504 1763868 1773169 1939018 1917834 1954329 2002141 2033015
6756 2033015 2067452 2114129 2245499 2305697 2253120 2346516 2489706 2534524 2646055 2784835 2928319
6745 2928319 3226142 3425203 3520478 3587655 3898886 4294397 4617941 4927873 5240958 5499300
6735 5499300 5418538 5392572 5283632 5341615 5276213 5059785 4954564 5142177 5492645 5702395
6725 5702395 5894612 6122191 6105656 6018807 5993744 5928809 5742320 5561844 5432676 5433497 5397446
6714 5397446 5524036 5643168 5989718 6203648 6224836 6202045 6121369 6079821 5979905 5807745
6704 5807745 5559300 5419252 5495633 5577896 5608276 5597199 5578344 5630096 5467308 5403315 5215806
6693 5215806 4923780 4453459 4168359 4063781 3920892 3671826 3421748 3161404 3116283 3195853
6683 3195853 3111197 3170292 3054646 2941898 2780558 2678644 2669650 2745960 2853325 2856272 2837485
6672 2837485 2835828 2683432 2719816 2746011 2637406 2640323 2629437 2490835 2402799 2511065 2497115
6661 2497115 2523167 2403360 2354479 2546333 2476713 2457528 2379161 2386654 2400236 2532064 2574794
6650 2574794 2523836 2602768 2506435 2520167 2500703 2532223 2494323 2543717 2594119 2509579 2443458
6639 2443458 2394819 2442830 2577530 2624761 2525175 2558903 2515850 2364869 2488161 2476138 2403020
6628 2403020 2307676 2367937 2526714 2671492 2702257 2747873 2649012 2633207 2613049 2523947 2564275
6617 2564275 2515510 2716392 2770956 2672297 2709116 2802595 2706123 2608003 2580110 2717157 2722587
6606 2722587 2737437 2822439 2788678 2854651 2952727 3054966 2896592 2881953 2805124 2765853 2789195
6595 2789195 2717203 2974245 2900691 2792744 2865604 2977800 3055197 3173147 3243157 3194269 3235639
6584 3235639 3124101 3346086 3480986 3557312 3543938 3602921 3805225 3979634 4054031 4007009
6574 4007009 3896201 3867305 3994818 4265467 4408627 4362570 4297663 4334966 4534979 4658933
6564 4658933 4750385 4905999 5140667 5329822 5478743 5672331 6173385 6511547 6948992 7505134
6554 7505134 7907012 8181971 8465526 8662303 8498673 8485064 8204383 7933183 7653426 7247978
6544 7247978 6908196 6655004 6493141 6199135 6045645 5997721 5900908 5690033 5608472 5385080
6534 5385080 5149742 5068057 5157232 5031222 4948063 4707116 4517720 4406510 4344138 4295357
6524 4295357 4130146 4156199 4261286 4233624 4102673 4213864 4240034 4112229 4044968 3972182
6514 3972182 4137292 4047505 3880750 3862738 4036699 4077130 3926387 3921060 3922045 3974772 3895718
6503 3895718 3816116 3812992 3867328 3957828 3976837 3918998 3963750 3914331 3999836 4068857 3964075
6492 3964075 4024357 4107971 3999783 4005331 4156575 4151433 4193229 4218177 4170393 4277989 4385115
6481 4385115 4300930 4406924 4341336 4415687 4513736 4533598 4488675 4545356 4696451 4675056 4866999
6470 4866999 4832102 4875904 4968178 5133303 5170363 5127195 5075506 5296356 5455417 5449939 5635468
6459 5635468 6030501 6078046 6043774 6037831 6079601 6267547 6338872 6483285 6534665 6525648 6503729
6448 6503729 6672130 6910027 7041965 7012693 7031917 7108604 7350846 7749367 7828982 7828535 7732395
6437 7732395 8052630 8152802 8383708 8544181 8579196 8784665 9011282 9258792 9535783 9747405
6427 9747405 9969159 10322405 10551697 10903866 11257847 11714316 11860923 12202595 12655279 12982670
6417 12982670 13386729 13805163 14266222 14882556 15412266 15821465 16397945 17011378 17790470
6408 17790470 18416445 19107947 19862517 20826839 21879596 22982302 24278621 25645174 27148162
6399 27148162 28914225 30830606 33048275 35374917 38041234 40739050 43736361 47035057
6391 47035057 50777999 55102090 60133433 65765630 72036174 79545087 89495974 102126449
6383 102126449 118535602 138216811 158713307 176983409 187912751 187896132 178234569 168571632
6375 168571632 160192716 145661194 125945299 109361573 96691715 86907710 78751658
6368 78751658 71256397 64907436 59862630 55723419 52243947 49151840 46634270 44530456
6360 44530456 42769055 41136573 39584265 38322630 37269912 36221588 35306630 34458633
6352 34458633 33657497 33172465 32934455 32499865 32175360 31998283 31775812 31684199 31665485 31830975
6342 31830975 32153682 32681714 33681582 34943420 36530967 38187577 39910078 41576029 42523667
6333 42523667 42731869 42275508 41500337 40286737 38907708 37538106 36154080 35081168 34408003
6324 34408003 34111650 34150437 34676515 35666381 36826774 38349876 40080743 41704933 43170914
6315 43170914 44228292 44704737 44781013 44071867 42613151 40729091 39045307 37113619 35180447
6306 35180447 33189605 31587582 30423479 29662128 28958296 28514153 28393675 28572274 28972204
6297 28972204 29681977 30657002 31945075 33376499 35116783 37036126 38875172 40334143
6289 40334143 41302799 42082606 42123650 41841990 40899353 39430404 37899393 36280435 34510518
6280 34510518 32973479 31820485 30733164 29905327 29552600 29624381 29982744 30891627 31956972
6271 31956972 33262567 34217825 34996751 35074838 34622606 33473278 31977729 30402894 28629639
6262 28629639 26747550 25033049 23597360 22372752 21473260 20659801 20153140 19611286 19209541
6253 19209541 18709290 18141851 17695478 17267107 16909652 16659471 16350266 15924197 15529021
6244 15529021 14993470 14570629 13930518 13202035 12810212 12504553 12079583 11841844 11523680
6235 11523680 11010757 10528773 10061521 9603821 9135036 8663875 8114761 7729040 7285212
6226 7285212 7047684 6796348 6492913 6225693 6123675 5791966 5554564 5382019 5202461 5119355
6216 5119355 5029940 4994874 5054057 4932732 4717071 4701913 4651956 4583795 4573572 4492271 4359558
6205 4359558 4220671 4173065 4159544 4088191 4059052 4116496 4313455 4332291 4332198 4295506 4323528 4407610
6193 4407610 4456460 4459870 4422211 4448599 4481167 4312891 4247976 4368075 4132118 4289701 4338420
6182 4338420 4378238 4420826 4364912 4299234 4423624 4427532 4274566 4236083 4227983 4201649 4389405
6171 4389405 4225842 4131221 4115702 4094554 4159737 4235166 4032564 4079918 4020444 3931004 3877067
6160 3877067 3753313 3761026 3703750 3629981 3575967 3649730 3675862 3599862 3559450 3524471 3545964
6149 3545964 3561788 3284086 3132007 3063288 3010410 2867228 2693823 2566591 2491364 2317778
6139 2317778 2283500 2394435 2371599 2198251 2172593 2168752 2170382 2175706 2044119 1996842 2056653
6128 2056653 1900828 1753056 1771398 1903503 1886201 1679579 1659797 1683942 1578131 1636785
6118 1636785 1830962 1651480 1628400 1683185 1633807 1658500 1645492 1785411 1732383 1706954 1703250
6107 1703250 1723593 1691610 1834549 1733816 1726552 1824753 1884561 1787282 1669079 1821575 1822560
6096 1822560 1795433 1664304 1588677 1637282 1704648 1936542 1888906 1987461 2018878 1884605 1784237
6085 1784237 1722630 1793096 1942672 2202005 2116242 1985580 1941640 1908058 1923991 1950058 2008766
6074 2008766 2048842 2039429 2029431 2109255 2115311 2230435 2351089 2447458 2242111 2322467 2444941
6063 2444941 2681331 2720232 2752668 2765880 2978885 3061751 3079888 3287063 3206063 3135689 3062405
6052 3062405 3003192 3137381 3062544 3044571 3172196 3098095 2968578 2892379 2833341 2837801 2924488
6041 2924488 2994393 2981817 3036166 3054484 3013714 3085637 3043312 3105027 3144052 3136537 3124595 3305427
6029 3305427 3284388 3253261 3351536 3461796 3568880 3448392 3436432 3532365 3492079 3367869 3612678
6018 3612678 3841443 3711947 3763660 3920071 4092145 3956312 3954304 3853087 3938847 3786781
6008 3786781 3653966 3627847 3715037 3779534 3746889 3712998 3534194 3530936 3692720 3693265 3717610
5997 3717610 3688455 3786204 3800763 3820572 3891512 3978010 4011025 4142731 4280265 4361757 4517051
5986 4517051 4569941 4711789 4771340 4951739 4839353 4809178 4997420 5060425 5320809 5365446
5976 5365446 5381691 5625754 5734479 5880198 6274930 6535386 6877895 7325403 7846104 8129451
5966 8129451 8422262 8696353 8856302 8747702 8559051 8437134 8116182 7790210 7371526 6985874
5956 6985874 6704728 6410161 6141474 5996770 5817812 5608325 5431836 5291829 5186333 5161395
5946 5161395 5102451 5079230 4855845 4875835 4864074 4954858 4914873 4915149 4850149 4782210 4752522 4682054
5934 4682054 4761675 4883596 4923274 5005715 5131272 5085035 5144937 5151952 5321370 5137941 5084807
5923 5084807 5257893 5307057 5306564 5265598 5086387 5052073 5105784 5007577 4879424 4966035 4910017
5912 4910017 4817655 4857843 4900285 4868253 4834390 4773905 4806665 4869332 4927635 4817569 4663239
5901 4663239 4688769 4700646 4717434 4654469 4548092 4328734 4329143 4380401 4396984 4449024 4402914
5890 4402914 4289079 4360241 4327927 4277743 4358875 4343149 4153954 4108979 4070419 4103193 4105710
5879 4105710 4013611 3967325 4005115 3965625 3902719 3939094 3836442 3720159 3723513 3642298 3695883
5868 3695883 3646488 3581812 3414634 3382770 3460786 3456193 3409079 3418228 3316273 3355547 3387769
5857 3387769 3386010 3512044 3472024 3453872 3402109 3302746 3302942 3218928 3349238 3363854 3414357 3401445
5845 3401445 3291494 3212543 3276562 3293571 3365376 3354376 3294019 3434901 3366919 3313358 3291650
5834 3291650 3375143 3397347 3414075 3548815 3713375 3756876 3756522 3870984 3904438 3831819 3817131
5823 3817131 3961893 4012022 4116712 4281288 4235563 4149693 4017531 4020701 3991180 4043376 3992602
5812 3992602 4002887 3990310 3853074 3814081 3710909 3851765 3887918 3626525 3613529 3606398 3577412
5801 3577412 3414226 3299727 3422311 3496819 3584477 3596971 3511054 3561440 3410147 3444977 3616458
5790 3616458 3591485 3425405 3392647 3545550 3470330 3486989 3536656 3526983 3544042 3530487 3555042
5779 3555042 3712132 3690584 3545617 3484016 3498166 3591119 3680229 3767860 3671661 3617931 3556790
5768 3556790 3651930 3741148 3773676 3731850 3754565 3709964 3863602 3931647 3919282 3834099 3970335
5757 3970335 3979595 3806224 3928670 3899966 3967515 3945784 3874393 3874236 3969187 3916919 3824918 3938834
5745 3938834 3845473 3855746 3941297 3975789 4117907 4066295 4141800 4274914 4261883 4336415 4374219
5734 4374219 4488978 4450118 4645858 4713728 4778517 4747268 4884257 5024551 5012566 5093995 5146640
5723 5146640 5258376 5276891 5406936 5509649 5504079 5473197 5658346 5676130 5526489 5516283 5639485
5712 5639485 5669562 5653357 5580216 5422391 5337487 5280246 5260884 5331439 5421144 5548026 5599422
5701 5599422 5482327 5346279 5465627 5640305 5681576 5735511 5832504 5887597 6009779 6249253
5691 6249253 6301671 6460908 6634269 6771465 7007247 7143246 7172702 7122781 7022198 6936352
5681 6936352 6872953 6783273 6669662 6436155 6426583 6464086 6453908 6376071 6388744 6462913 6450199
5670 6450199 6278757 6398203 6451726 6400556 6437032 6533628 6616541 6717397 6831740 6952620
5660 6952620 7041620 7236612 7482037 7731773 7961810 8083971 8186496 8374364 8369698 8341725
5650 8341725 8545016 8433567 8207068 8196685 8098575 7996369 7969378 7994243 8057804 8155622 8336240
5639 8336240 8423001 8442180 8610588 8731926 8879525 9102240 9313782 9388478 9790941 10197484
5629 10197484 10425058 10660221 11106563 11431252 11707666 12177966 12612562 12994833 13282885
5620 13282885 13596667 14013742 14471026 14973696 15436750 16030157 16588173 17273312 17951337
5611 17951337 18662447 19495362 20504083 21606359 22582714 23836978 25182376 26614234 28273637
5602 28273637 29975246 31808328 34091337 36475351 39104188 41878131 44957532 48211267
5594 48211267 51499915 54733118 57971729 60984218 63679491 65754993 66911667 67369678
5586 67369678 67136269 66142668 64569669 62386605 59836770 57025389 54002065 50757759
5578 50757759 47539530 44517671 41610998 38740906 36028786 33615321 31318071 29367928
5570 29367928 27583799 25932436 24445756 23061288 21873948 20692351 19725516 18817867
5562 18817867 18059414 17205364 16453600 15651410 15024617 14682232 14253218 13806494 13406509
5553 13406509 12879803 12496812 12282017 11950645 11602250 11287996 10935713 10628923 10334385
5544 10334385 9963213 9640520 9486724 9210225 8989063 8802017 8617271 8325617 8108200
5535 8108200 7899429 7685532 7512796 7332048 7037569 6815615 6642690 6682078 6657893 6418202
5525 6418202 6238562 6127441 6106396 6023675 5910306 5723794 5635903 5526764 5401169 5301741
5515 5301741 5344876 5185232 5113833 5012430 5173872 5277158 5176854 5057794 4901321 4953144
5505 4953144 5100683 4894080 4863520 4885022 4872050 4663385 4716704 4778716 4639959 4671731 4531196
5494 4531196 4486649 4367801 4337715 4438122 4590933 4450843 4354784 4461864 4289451 4278746
5484 4278746 4302997 4217224 4138773 4200357 4152034 4075501 4014343 3981081 3908258 3820781 3880333
5473 3880333 3834357 3962839 3810204 3765814 3825816 3731759 3763662 3753076 3716697 3689318 3551886
5462 3551886 3570161 3596952 3581958 3760602 3856126 3724547 3739167 3676935 3692663 3833125 3940874
5451 3940874 4160688 4166422 4140454 4299796 4595345 5013351 5279512 5488423 5672340 5768532
5441 5768532 5744953 5640205 5704311 5724028 5616576 5404707 5303532 5129941 5157908 5140599
5431 5140599 5023403 5075002 4974754 4963495 4990433 5039534 5120721 5071287 5038811 5036889 5041429
5420 5041429 5054529 5341754 5492112 5543902 5683920 5812939 5915736 5830539 5805577 5859827
5410 5859827 5729109 5634593 5572653 5555988 5403512 5318911 5212788 5002528 4873603 4701943
5400 4701943 4603220 4597580 4564711 4538065 4454680 4457533 4400636 4183413 4329852 4539491 4386660
5389 4386660 4193430 4190478 4240366 4413437 4292688 4254549 4398411 4369211 4429761 4498430 4564258
5378 4564258 4572400 4673240 4768994 4941963 5002980 4940733 4875448 5033334 5006822 5011843 5111608
5367 5111608 4965628 4960190 4960982 4980705 4846480 4751475 4823324 4809389 4750271 4693591 4530336
5356 4530336 4451814 4362801 4410674 4507085 4470335 4186052 4235186 4332786 4273012 4343199 4349125
5345 4349125 4262617 4029376 4006065 3981978 3977311 4015617 3944220 3864709 3811706 3805939 3790020 3842849
5333 3842849 3777077 3882229 3948658 3828723 3729076 3777495 3758990 3782404 3868631 3889912 4042131
5322 4042131 4117313 4037586 4114525 4309321 4274748 4238582 4221138 4185741 4275885 4210487 4181217
5311 4181217 4240939 4265983 4236857 4206970 4208767 4211000 4240887 4263100 4183045 4081130 4048861 4040839
5299 4040839 4112965 4212438 4228105 4222811 4231542 4198145 4274370 4328213 4379402 4461865 4482496 4458523
5287 4458523 4437625 4524109 4549452 4679709 4652366 4653202 4702979 4816853 4883351 4905082 4942923
5276 4942923 4919982 5163422 5210695 5331046 5333750 5283604 5331740 5472945 5497951 5618926 5700494
5265 5700494 5820802 5806561 5759346 5933907 6123881 6287375 6241000 6367608 6494394 6550906
5255 6550906 6470471 6519090 6563681 6692650 6825320 6967499 7092593 7260162 7345892 7365023
5245 7365023 7447682 7311876 7190398 7234022 7097499 7019029 7051833 7070192 6997986 7006328 6885222
5234 6885222 6854113 6887485 7031612 7125847 7312044 7405327 7492322 7592313 7571009 7591522 7680591
5223 7680591 7839208 7874787 7995096 8113049 8272637 8381693 8614338 8801948 8975094 9118056
5213 9118056 9507911 9816840 10127862 10383147 10602257 10729509 11067812 11406727 11664680 11709119
5203 11709119 11693571 11789422 11957990 12123858 12224758 12421949 12571846 12734369 12970303 13372603
5193 13372603 13511107 13623200 13801065 13753175 13926189 14144244 14188961 14353627 14411706 14558432
5183 14558432 14546752 14601704 14969367 15143565 15382795 15688642 16032671 16559688 17053296 17581166
5173 17581166 18131420 18637995 19337366 20049790 20732319 21667882 22482629 23373644 24352277
5164 24352277 25223622 26199731 27132612 28269300 29493561 30807399 32160652 33500404 34823317
5155 34823317 36385258 37957305 39583732 41054930 42832521 44542192 46464182 48384708
5147 48384708 50745845 53234652 56158364 59340288 63210128 67412468 71866927 76801927
5139 76801927 82645300 89428082 97332026 106423430 116788979 128906491 144461256 164055360
5131 164055360 189380310 219613615 251024694 279292455 296455948 296915059 282876572
5124 282876572 268725607 257400935 236530084 208644919 186290510 169631340 156637527
5117 156637527 144284403 131018230 118339946 108460152 99732915 90296976 81436559 74303453
5109 74303453 68248595 62972998 57949576 53389936 49472443 46144472 43300054 40672144
5101 40672144 38361703 36167932 34255298 32702561 31100017 29742971 28480612 27380190
5093 27380190 26137993 25216416 24268659 23422118 22524620 21848422 21352862 20601756 19994734
5084 19994734 19438469 18914730 18293845 17819649 17283314 16919105 16553561 16281416 16015901
5075 16015901 15685517 15454948 15178335 15039697 14828621 14609190 14482461 14190324 13921514
5066 13921514 13667655 13502520 13282400 13060314 12943792 12930846 12961194 12852028 12906440 13003253
5056 13003253 12961516 13047141 12901934 12733319 12523852 12281599 12139089 11835916 11532099 11350534
5046 11350534 11225891 11084102 10816913 10770970 10791991 10662320 10537535 10528279 10293872 10334645
5036 10334645 10479667 10527989 10534201 10451140 10312752 10415840 10423796 10393662 10537754 10623838 10644890
5025 10644890 10732212 10707618 10708572 10618220 10536682 10315621 10157460 10224706 10346409 10398118 10551245
5014 10551245 10743017 10780739 10959138 11190210 11455918 11637809 11942897 12085191 12255977 12623157
5004 12623157 12950684 13200265 13452030 13826410 14043402 14590251 15208624 15641822 16291031
4995 16291031 16875851 17089170 16990828 16665512 16387114 16297362 15863160 15411173 15223830 14907055
4985 14907055 14871564 14663874 14580578 14678738 14977824 15123364 15099065 15173081 15443688 15674695
4975 15674695 15929106 16114320 16484192 16797419 16977398 17161890 17497259 17816977 18063597
4966 18063597 18515582 18927543 19181821 19698660 20101093 20327208 20575538 20833347 21101595
4957 21101595 21498211 22017045 22355389 22792467 23252197 23789874 24379614 24991108 25741006
4948 25741006 26578131 27440275 28493913 29464269 30535527 31687601 32983798 34292170 35711290
4939 35711290 37113200 38722452 40552100 42619677 44761847 46719678 48837302 51310389
4931 51310389 53842871 56578868 59349824 62408413 65672825 69248051 72999414 76893607
4923 76893607 80918896 85187177 89591721 93989736 98158395 102029779 105105220 107359289
4915 107359289 108528582 108793271 108005880 105968714 103325474 100418418 97269592 93977516
4907 93977516 90400900 86801098 83149047 79222601 75414321 71698119 67842104 64245052
4899 64245052 60765852 57610406 54845650 52350539 50210168 48427566 46776356 45325895
4891 45325895 44059719 42807937 41447868 40297924 39256797 38060172 36804435 35546470
4883 35546470 34612075 33406194 32408405 31395487 30259146 29257416 28261367 27396990 26545009
4874 26545009 25652533 24967076 24215167 23545080 22988763 22442318 22067087 21737617 21398569
4865 21398569 21253544 21150164 21112740 21263189 21268272 21161202 21135696 21180774 21384130 21562758
4855 21562758 21839833 22175432 22543229 22975749 23479340 23797386 23955821 24085514 24116492 23995967
4845 23995967 23675667 23148623 22522907 21983915 21308024 20719736 20112837 19618240 19305409
4836 19305409 18764020 18462079 18143570 17900011 17774373 17551044 17132951 16630029 16217543
4827 16217543 15798705 15252577 14656263 14090029 13666525 13164464 12938529 12735836 12469556
4818 12469556 12063865 11912667 11833103 11844065 11846623 11830633 11870552 11920911 12030371 12102122 12246930
4807 12246930 12263110 12100945 11993386 11954069 11661110 11657040 11587234 11500494 11536797 11415610 11377354
4796 11377354 11322834 11368021 11407079 11395734 11452638 11441160 11650146 11825836 11999306 12100050
4786 12100050 12359560 12489480 12589211 12496657 12446484 12423037 12316635 12229677 12158434 12109445 12093845
4775 12093845 12101513 12104922 12084811 12129764 12149853 12159770 12190287 12151639 12362569 12491764 12656134
4764 12656134 12761301 12844138 13103996 13218020 13295835 13461528 13593289 13848629 14078789 14204313
4754 14204313 14335576 14360184 14639417 14756948 14903205 15184854 15460446 15716233 15959994 16282449
4744 16282449 16554505 17024262 17392464 17667918 18070965 18636803 19085587 19765156 20555035
4735 20555035 21257667 22052088 23035525 24134069 25434971 26819970 28475578 30247721 32117663
4726 32117663 34264307 36642768 39264436 42344842 45902372 49941578 54586056 60444984
4718 60444984 68050240 77670048 89661766 102554366 114802058 123662463 126541395 122753220
4710 122753220 116337282 111057484 103348181 91569259 80281320 71531285 64517198 58826271
4702 58826271 53593031 49076676 45554626 42733692 40241763 38195049 36458528 35033867
4694 35033867 33801443 32753705 31752913 30777052 30175625 29696964 29238821 28946244 28855622
4685 28855622 28918429 29169975 29385490 29773647 30183616 30475070 30817976 31139863 31284456 31393296
4675 31393296 31514057 31676802 31913351 32229580 32472043 32854113 33418038 34119011 34983549
4666 34983549 36156157 37630164 39380678 41384700 43347955 45438663 47507428 49132243
4658 49132243 50833194 52609859 53936327 55479487 57309960 59077865 61402268 64344325
4650 64344325 67689287 71859987 76850501 82975437 90194028 98973050 108805406 118800982
4642 118800982 127915673 134410483 137179565 136085071 132560778 127830894 121295924 113251350
4634 113251350 104826071 96988719 90186109 84578541 79884756 75631338 71847107 68492895
4626 68492895 65526894 62678276 59860338 57345767 55035032 52921289 51046302 49319425
4618 49319425 47778893 46076676 44561238 42879661 41112594 39465973 37953109 36441307
4610 36441307 35059738 33779778 32531095 31585177 30550597 29563343 28642899 27631878 26580495
4601 26580495 25675705 24799981 23848328 23023975 22287886 21665426 21135133 20565064 20131505
4592 20131505 19834903 19336965 19078424 18891649 18737489 18774409 18802391 18936683 18870015 18851607
4582 18851607 19021158 18955561 18799216 18613131 18523791 18411664 18470864 18346153 18414033 18369876
4572 18369876 18422982 18624848 18645604 18700577 19152721 19738732 20245571 20910476 21410009 21769296
4562 21769296 21834263 21508390 21047175 20561413 19792041 19018535 18210180 17499568 17063057 16629381
4552 16629381 16228795 15991144 15757347 15510440 15500815 15708350 15691595 15805176 15864006 16129202
4542 16129202 16593428 16968426 17360708 18106124 18803497 19453571 20232139 20942335 21666606
4533 21666606 22481104 23424117 24126353 24908707 25615237 26465664 27388975 28408567 29412172
4524 29412172 30356021 31524376 32672155 33645935 34314818 34964257 35412456 35814360 36162159
4515 36162159 36402625 36713535 37123257 37733467 38814121 40252384 42199990 44595977 47513253
4506 47513253 51015230 55350708 60489626 66441870 72525476 78126720 81902192 82927685
4498 82927685 81052553 77220727 72957938 67742769 61288052 54650733 48865693 44056915
4490 44056915 39910949 36180128 33110476 30546445 28245620 26174649 24318463 22790660
4482 22790660 21501613 20199160 18936029 17955153 17080377 16239503 15665728 15079911 14569963
4473 14569963 14084203 13716916 13352349 13198577 12936776 12738906 12761979 12753182 12924943 13214389
4463 13214389 13627129 13900919 14127694 14452342 14597672 14554238 14401129 14000079 13516130 12951548
4453 12951548 12581482 12118506 11798933 11580345 11389526 11521290 11589194 11508942 11430712 11568690
4443 11568690 11488062 11093535 10858471 10552797 10124777 9717872 9445312 9224638 8833947 8457730
4433 8457730 8193449 8026702 8026938 8049585 8083372 8042992 8093076 8071584 8166678 8206791 8064043
4422 8064043 8061733 8140214 8104498 7949593 7860013 7745664 7556126 7280944 7122746 7092998 6962424
4411 6962424 6847388 6667308 6545750 6483255 6575934 6744367 6598487 6706838 6696560 6700114
4401 6700114 6535874 6322028 5964262 5796401 5708925 5718665 5496743 5333027 5198763 4973753
4391 4973753 4746241 4606298 4499751 4486073 4483294 4400384 4454980 4442615 4340155 4301010 4275777
4380 4275777 4071017 3985334 3935056 3863744 3867500 3851892 3773485 3765266 3775369 3645238 3680659
4369 3680659 3728625 3711263 3887247 3995311 4055155 4158274 4170002 4254650 4255480 4010695 3955974
4358 3955974 4006663 3917508 3804637 3511515 3269461 3208729 3150049 3233337 3043256 2913709
4348 2913709 2934236 2768738 2671223 2580244 2539163 2570890 2601686 2501884 2421914 2487121 2584641
4337 2584641 2469229 2434300 2550708 2428820 2460790 2324847 2218442 2327552 2438264 2199800
4327 2199800 2048230 2026964 2024234 2007851 1928928 2003202 1971751 1970827 1936683 1731415 1794345 1837727
4315 1837727 1829858 1653768 1581733 1536143 1515077 1512742 1582956 1599221 1491974 1353504 1322928
4304 1322928 1234940 1223613 1366113 1407401 1337641 1409370 1539841 1639043 1725788 1848011 1755213
4293 1755213 1628871 1721306 1668642 1532330 1584854 1632019 1541573 1367086 1124213 1196904 1150066
4282 1150066 1105058 1210960 1231297 1243116 1261465 1235294 1078117 940935 1010504 1000478 968209
4271 968209 943080 961158 1054946 1181572 921731 807549 711959 648166 716674 845547 901243
4260 901243 933762 1029206 1172487 1019471 900321 951754 896764 910920 1050298 1151089 1079896
4249 1079896 1084602 1122201 1252911 1390254 1592626 1484895 1402983 1392484 1373155 1448924 1427379
4238 1427379 1518299 1605832 1521311 1505075 1411112 1465698 1627168 1742924 1612159 1628652 1622997
4227 1622997 1706110 1774124 1866965 1815986 1926152 2140360 2202403 2343536 2370015 2372047 2350883
4216 2350883 2302666 2241816 2125101 2013366 1967466 1946025 1917495 1831702 1829763 1980493 2054160
4205 2054160 2051792 1906486 1835120 1936069 1959195 2035353 2004421 2106391 2172227 2201498 2279484
4194 2279484 2355915 2352982 2468012 2634286 2806509 2862988 3115852 3240827 3373721 3550714
4184 3550714 3635939 3832247 3857402 3757805 3721540 3790675 3750714 3479495 3586367 3657876 3550854
4173 3550854 3490677 3493963 3561623 3653905 3794400 4009908 4181628 4438949 4716100 5054181
4163 5054181 5483591 5807927 6034407 6346274 6492829 6626969 6449663 6316769 6236963 6059185
4153 6059185 5670168 5285329 5028456 4776183 4523403 4293837 4069876 3940368 3876142 3771446
4143 3771446 3838791 3882513 3974554 4101022 4359468 4496064 4501274 4534447 4625963 4637326 4525352
4132 4525352 4483538 4535092 4486503 4514857 4601072 4662306 4773616 4791727 4838205 4863896 4942655
4121 4942655 5007915 4933145 4874344 4823149 4583353 4472705 4362420 4095319 3965539 3973293 3811987
4110 3811987 3675093 3677216 3563090 3549735 3518196 3609298 3742384 3731636 3600119 3610132 3601424
4099 3601424 3642632 3602403 3579924 3350323 3182429 2944574 2882413 2784003 2550086 2309416
4089 2309416 2387553 2348129 2283725 2185638 2128064 2138772 2116626 2060450 2245017 2322342 2222708
4078 2222708 2265731 2150060 2186608 2398738 2417779 2298842 2358225 2502562 2555144 2588816 2680002
4067 2680002 2707058 2663935 2637674 2490563 2418380 2458179 2348110 2123594 2049634 1933344 1819060
4056 1819060 1756497 1726345 1501505 1510172 1500072 1293628 1145028 1167983 1218150 1206082 1399427
4045 1399427 1419198 1496701 1467999 1348964 1312460 1360637 1463611 1460071 1338522 1347119 1410570
4034 1410570 1491747 1428321 1353866 1371087 1416683 1409276 1381340 1371346 1425526 1338563 1333730 1353603
4022 1353603 1504062 1506707 1561652 1568772 1522930 1470848 1477675 1541390 1534369 1558643 1574131 1582076
4010 1582076 1509639 1602175 1820959 1862367 1906212 1998072 2004417 1869229 1897340 1773213 1613874
3999 1613874 1521992 1532396 1441374 1297407 1343384 1459478 1424155 1528647 1582420 1576398 1430834
3988 1430834 1402668 1315873 1136830 1198395 1196679 1144888 1126832 1147154 1017497 1060486 1061604
3977 1061604 1046024 912978 886350 824346 796528 835325 819705 871925 902251 889719 775787
3966 775787 676170 662774 587599 581337 578444 568443 528124 512190 496946 552498 562956 553619
3954 553619 731763 728343 672237 474799 580616 659086 528334 502084 468018 568314 550061
3943 550061 659654 504576 526149 564794 513492 577189 502091 615168 610890 599221 548818
3932 548818 620377 677106 888579 997840 875972 884676 981265 913366 923734 1158064 1281397
3921 1281397 1385438 1420335 1545026 1723076 1772899 1816065 1853798 1783807 1923141 2036884
3911 2036884 2146161 2343898 2467471 2631344 2695388 2677223 2797181 2825558 2772648 2741420
3901 2741420 2543250 2355958 2362880 2296328 2161082 2054521 1989676 1868318 1769185 1905643
3891 1905643 1970198 1968743 1975786 1943363 1951381 2125412 2205892 2142447 2249733 2287244 2489757
3880 2489757 2595055 2669895 2665909 2644733 2966051 3030849 2956944 2945014 2925783 2813515 2704850
3869 2704850 2615554 2487622 2340091 2247987 2082821 1953334 1690908 1553734 1645031 1572450
3859 1572450 1456982 1427034 1530902 1355830 1291327 1274983 1290964 1354071 1262230 1230446 1254721
3848 1254721 1148514 1107341 1235023 1225974 1168971 1191415 1171777 1199811 1191245 1201106 1136064 892119
3836 892119 827507 913602 921187 975212 954648 1012515 1004523 948414 939066 913194 955884 940541
3824 940541 871025 988361 1071112 1034483 959573 965578 948862 867903 769420 847944 913921 798363
3812 798363 771150 900540 866428 887892 870178 843952 898044 906838 888206 839374 811755 892966
3800 892966 983595 1048694 938100 914040 950876 797086 805921 796880 779500 715633 752949 883952
3788 883952 930122 787153 796324 865528 843014 857374 829458 825130 955479 892558 831108 771731
3776 771731 883488 998815 1016134 960408 1070443 983251 957391 1062539 1034376 1085378 1052004
3765 1052004 1058406 1025499 915963 1007439 868990 784086 812555 848556 878195 887136 823411
3754 823411 809048 867169 948199 912183 825126 870193 829291 867696 963387 936870 887924 917406
3742 917406 1087807 987624 1069393 1178320 1068413 909323 1014778 1127955 1009750 916510
3732 916510 890308 889700 896573 883245 887186 844527 659823 774301 805882 900534 1001873 973789
3720 973789 928857 1049156 1017142 1070871 1083408 936293 969162 1125539 1031268 1010491 962769
3709 962769 926900 988027 938277 965254 1032425 954099 810307 877759 873157 943833 834467
3698 834467 827305 922695 874524 902320 913945 885902 841507 923588 875654 903259 963108 991070
3686 991070 844672 881184 994216 989403 955386 1000887 936746 905074 894914 881954 998642
3675 998642 934695 885678 975394 860744 695050 680991 627771 758173 716948 739897 962103
3664 962103 903404 940913 968478 978059 1092580 1039797 964533 882802 874848 970731 997366 901069
3652 901069 890262 1012309 1013270 945012 1081512 1241997 1361364 1334202 1214048 1163169 1255505
3641 1255505 1360583 1362423 1213140 1173834 1101374 958160 1023272 1108190 1136913 1036075 966380
3630 966380 1021661 1194354 1100021 1052049 1027532 1032726 1112689 1183843 1184443 1169025 1191411 1166806
3618 1166806 1280517 1283929 1415966 1523115 1504432 1708800 1800876 1734616 1620868 1640592 1832580
3607 1832580 1879822 1707801 1552085 1570878 1526817 1337974 1204505 1281735 1311228 1265720 1195995
3596 1195995 1305094 1429648 1464762 1493444 1444611 1286263 1248737 1275090 1263879 1340712 1334439
3585 1334439 1339505 1383606 1362247 1312216 1489777 1638476 1440777 1386297 1526283 1518770 1589828
3574 1589828 1847101 1792403 1722765 1629797 1549578 1503252 1316599 1268868 1420534 1524975 1466220
3563 1466220 1454164 1302382 1513005 1614772 1493408 1503089 1659620 1796130 1778024 1658827
3553 1658827 1580272 1613684 1777844 1805146 1795148 1825954 1761123 1769414 1866576 2036151 2129903
3542 2129903 2171785 2087224 1968435 2079082 2215385 2278178 2351556 2377740 2319425 2426867 2433071
3531 2433071 2531721 2624673 2615021 2604177 2560587 2543672 2547839 2816656 2962538 3002345 2963599
3520 2963599 3029454 2889480 2869966 3042286 3086543 3138066 3254661 3290482 3414218 3470987 3516604
3509 3516604 3597766 3753936 3830395 4010217 4147607 4253907 4383661 4490160 4617260 4686975
3499 4686975 4618227 4806202 4853741 4867211 4953262 4858306 4928330 5083120 5127409 5115844 5287310
3488 5287310 5308627 5450546 5585797 5675974 5784014 5979792 6185804 6394453 6500216 6721912
3478 6721912 7000441 7345616 7687950 8075669 8637055 9093491 9558804 10029148 10552583 11111441
3468 11111441 11556056 11916224 12550791 13104705 13351046 13610682 13619063 13324941 13077421 12819828
3458 12819828 12515725 12107977 11708417 11174887 10715624 10300649 9952564 9558568 9202545
3449 9202545 8921463 8722956 8602273 8318975 8098955 8017533 7871763 7858980 7680668 7553493
3439 7553493 7662885 7698925 7577853 7637052 7940181 8074341 8490784 8869623 9115161 9011613
3429 9011613 8675932 8451474 8239618 7930135 7470428 6912100 6604859 6300317 6075737 5822735
3419 5822735 5581754 5466166 5230016 5110904 5095226 4859857 4895101 4677208 4490892 4506495
3409 4506495 4424373 4243203 4166779 4257918 4275133 4351920 4439832 4579217 4771849 4756547 4810991
3398 4810991 4885710 4746267 4563554 4412221 4213828 4040146 3845314 3548080 3548580 3421891
3388 3421891 3324836 3373877 3302175 3039724 2970237 2899007 2758462 2819994 2762108 2862476 2793290
3377 2793290 2665259 2546263 2509190 2437847 2321273 2187946 2216349 2144537 2197465 2267041 2191120
3366 2191120 2080962 2044450 2131447 2031232 1974697 1959024 1983235 1875097 1904752 1943391 1969559
3355 1969559 1801062 1866921 1725301 1597396 1784014 1800756 1781622 1668236 1684723 1724553
3345 1724553 1774143 1834684 1794763 1601015 1458791 1608167 1685235 1474165 1447807 1481147 1574707
3334 1574707 1608349 1514760 1555946 1519242 1557266 1455252 1402435 1382915 1475655 1426975 1478045
3323 1478045 1359781 1427420 1512296 1318891 1247632 1395652 1334712 1311456 1220174 1226130 1203997
3312 1203997 1271182 1171857 1059484 1095280 1078567 1210634 1151536 1327260 1313851 1159828 1077488
3301 1077488 1184138 1151001 1194023 1176187 1113930 1169690 1204325 1074844 1073582 1148956 1158571
3290 1158571 1137003 1098450 971062 1061459 1192098 1198212 1102806 980322 1058490 1251560 1285199
3279 1285199 1190065 1144488 958444 1009886 1002092 888279 955503 916173 898040 978494 972437
3268 972437 957957 888548 824495 930355 890635 832070 781435 844905 810763 873593 945435
3257 945435 915122 930253 845935 857547 745128 660149 728868 716934 830574 828756 787481
3246 787481 660351 616179 790666 815270 904620 760146 788615 719533 599885 599823 605032 559344
3234 559344 608251 625281 620854 681858 741991 772468 711725 715501 626904 597373 607569 583534
3222 583534 726956 780007 828002 721452 726873 735797 793139 826966 753265 868106 921087
3211 921087 798714 802491 910560 998750 951569 869906 986517 1051223 987245 952243 1046808
3200 1046808 1059780 1062608 1072136 1136350 1027557 1060037 1146281 1195309 1111420 1133522 1075463 1089383
3188 1089383 1281327 1131038 1005728 1004872 1032219 1053675 1030423 1059507 1134532 1273749 1211732
3177 1211732 1218159 1193529 1233998 1330554 1352986 1334745 1348442 1392803 1446302 1650867 1659083 1519394
3165 1519394 1484827 1717534 1905637 1928910 1969732 1889801 1817361 1802637 1952383 1910939 1897982
3154 1897982 2000011 2173383 2125391 2080133 2243286 2271290 2398982 2475955 2388437 2534515
3144 2534515 2689315 2695671 2663323 2718232 2730033 2816949 2958668 2942413 3100820 3272226 3328809
3133 3328809 3351585 3315728 3483305 3760354 3976394 4004154 4023128 4270491 4315361 4357178 4649396
3122 4649396 4667701 4702656 4760117 4752002 4647159 4436649 4478736 4424521 4471915 4499272 4296346
3111 4296346 4146777 4157376 4122076 4261023 4362492 4468055 4301222 4457326 4607183 4560266
3101 4560266 4676668 4846135 4838358 4928476 5032574 5072989 5108202 5145199 5082467 4973919 4938535
3090 4938535 4728407 4686884 4538823 4334301 4306552 4177910 4118646 3961408 3779139 3713649
3080 3713649 3710337 3551543 3585776 3702163 3728967 3681024 3587827 3646386 3513603 3502729 3421558
3069 3421558 3393346 3327181 3125850 2907644 2798351 2685541 2566185 2516997 2428414 2319949
3059 2319949 2257016 2207749 2027916 1998200 1992003 1825448 1704017 1723499 1638278 1470553 1399451
3048 1399451 1501334 1515925 1475209 1320110 1306105 1351749 1275804 1139730 985467 1069058 1102961
3037 1102961 1122797 1040843 913724 828624 885550 783406 725463 720284 695541 829053 838726
3026 838726 678462 554753 615290 526584 467343 677850 763671 603714 717485 627087 470790
3015 470790 504448 469056 480570 474782 468761 270759 334480 372182 428935 382562 336807 239752
3003 239752 279478 385795 222982 294449 346580 353699 276880 373234 428464 305953 220539
2992 220539 266271 177048 250628 287085 147502 168795 215221 235284 240588 214122 89641
2981 89641 207921 246695 204800 111095 -24208 60261 77061 -7502 205369 393127 384818
2970 384818 171596 93993 96607 307487 275603 55475 16064 -26314 -30326 7533 56091
2959 56091 106295 50119 97245 44701 105421 144530 40966 -12306 1289 22018 130706
2948 130706 140326 15250 -57168 -142301 9467 157815 66293 -102508 69125 1728 -165293
2937 -165293 -35400 -94884 -79831 23577 54553 29093 -101951 -71497 -63683 -50771 -151733
2926 -151733 -164128 -60268 54998 -72004 -173478 -137976 -173479 -107139 -113416 -65739 8472
2915 8472 -116053 -138051 -186031 -87183 -24446 89506 44437 -76889 -215133 -149493 -58284
2904 -58284 -56542 -94217 -55094 -74000 -51571 -9561 -102591 -49148 -51499 -73313 -142386 -118648
2892 -118648 66906 20589 -42795 -54933 -172023 -269418 -161322 -15653 -107409 7645 -101798
2881 -101798 -145255 -252207 -260029 -190338 1697 -105747 -166357 -94196 -101260 -13962 -40260
2870 -40260 -98379 -98004 -148204 -189018 -75628 -45790 -176990 -136771 -120975 -238773 -208014 -186808
2858 -186808 -44211 35802 56877 -39374 -110361 -46221 -77708 -121719 -129908 -113595 -71482 -95643
2846 -95643 -62638 -43398 -144897 -53032 68600 82297 14650 -29035 37584 -44131 -62467
2835 -62467 -110666 -34065 14530 51853 55012 44475 -79169 -127846 -101254 -134307 -153404 -41158
2823 -41158 -236819 -189931 -133964 -116556 -98932 -186298 -178466 -229787 -276743 -174111 -165615 -237578
2811 -237578 -44349 -87256 -66097 -77381 -8024 -150678 -183338 -158892 -90166 -3069 82701
2800 82701 33302 -51739 -140365 -231055 -123607 -126327 -7185 12229 -252895 -299050 -166683
2789 -166683 -184759 -209420 -160883 -73760 39850 20215 8897 40206 -50321 -88443 -184195
2778 -184195 -186600 -111028 -45340 32161 -133927 -74911 -5511 -97539 -130088 -68129 -22029 -10691
2766 -10691 -29258 17379 -63129 -27307 55523 -74436 -167903 -189096 -71886 -83289 -241577
2755 -241577 -167569 -29621 -125088 -160816 -189665 -189198 -178506 -152358 -64713 -55478 -263669 -225549
2743 -225549 -107262 -40624 -22386 79364 122817 -76245 -153656 -76022 -15072 -40497 -75745
2732 -75745 -30375 -55804 -195151 -117991 -181396 -161296 -128540 -30101 -101738 -153126 -51644
2721 -51644 -23732 3408 -59685 -26546 -117846 -76345 -20366 44817 18236 41866 34054 37822
2709 37822 7934 -28199 26532 25688 -42790 -19861 47135 -9030 -21340 -79332 10631 -62452
2697 -62452 -252679 -195393 -63834 -27648 -110526 -166996 -171557 -162472 -60042 -11237 -70225 -103862
2685 -103862 -87547 -61406 -85963 -137058 -115011 -147349 -131092 -187399 -109788 61069 -48607
2674 -48607 -24696 -62045 -12952 -56622 -239128 -177545 -148539 -225300 -167530 -78191 -50982 -56539
2662 -56539 -140042 -42485 14081 3897 -30761 -158884 -85304 105009 -46307 -181333 -145046
2651 -145046 -75591 -105973 -144160 -38075 -35873 -166103 -159629 -82848 -89198 -149482 -119786 -55946
2639 -55946 48142 159584 136462 39166 -11452 2100 -29219 -1844 48982 12794 -85519
2628 -85519 -40870 -87746 -60952 -102425 -125197 -1370 -17897 18321 -48044 30347 136817
2617 136817 157929 80026 -87076 -84152 1542 147494 174931 -51707 -79079 -57851 60942
2606 60942 20236 -13299 -146092 -91052 105950 124820 118486 39626 140177 133082 200188 201388
2594 201388 87873 17899 39920 101992 216765 242979 193420 179678 260824 290506 265005
2583 265005 198603 223027 174433 76870 60615 198901 193334 82671 25449 149946 263550
2572 263550 296617 252129 139469 148291 126176 -36291 -61293 -71879 32902 138433 137079
2561 137079 80882 69029 -9530 31501 -10333 -42658 47620 102612 47775 -64127 -2110
2550 -2110 62238 7888 -73891 -31185 26598 148841 117857 84263 117566 119211 72419 152221
2538 152221 48087 2989 98276 45281 66399 95610 108532 27581 -3894 -148284 -198800
2527 -198800 -113547 37921 77802 29223 43578 111189 151664 29031 50489 51311 49185 87233
2515 87233 184079 197260 83285 5741 -13861 24913 134068 63735 58817 21791 58185 38931
2503 38931 46575 47004 66638 -75089 -73568 10810 -53327 -23198 85158 200909 279914 148983
2491 148983 147512 97173 93703 185502 247034 293661 290324 112560 111014 180023 146159 65857
2479 65857 82101 190400 177460 154185 90630 80581 198361 219934 207162 365752 286212
2468 286212 190099 140666 289066 285589 109551 51981 131563 317210 293513 360255 381572
2457 381572 361559 399903 230546 175298 109331 188256 198910 270905 313342 326414 242176
2446 242176 119623 129577 258603 392917 311896 235167 189213 267118 211026 220486 196074
2435 196074 198414 368778 447152 304061 211795 278834 180278 193738 226090 290416 382766
2424 382766 324905 254807 214873 405104 417729 356438 392757 337962 403388 379881 348523
2413 348523 400252 442729 381543 432686 524376 561698 653349 648668 423003 409103 466517 462677
2401 462677 494964 548152 598833 603552 687845 557941 382259 488635 519982 653767 647298
2390 647298 739274 820400 932227 948861 948868 907727 938227 822524 852711 824132 838912 959114
2378 959114 1150309 1255999 1169977 1303460 1317431 1360474 1383968 1518140 1492863 1486857 1780305
2367 1780305 1920083 2004367 2056959 2061675 2174307 2330313 2432014 2608924 2776654 2985882
2357 2985882 3210539 3182871 3482420 3651581 3787289 4054079 4301417 4553658 4976232 5300532
2347 5300532 5712324 6104714 6509927 7106047 7642319 8387704 9147219 10072652 11038293 11923352
2337 11923352 12830460 13753242 14793774 16117152 17680639 19185299 21115096 23601980
2329 23601980 27031293 31582520 37458853 43671509 50121350 55062356 56820860 54746885
2321 54746885 51228896 49016950 45808884 39689810 33745690 29250481 25811046 23230940
2313 23230940 20696469 18527238 16733454 15442586 14164548 12896186 11849181 10907689
2305 10907689 10204749 9457588 8510000 7837392 7179285 6547245 5958630 5565353 5141164
2296 5141164 4830744 4439565 4100046 3922729 3765405 3442061 3262161 3176846 3000765 2783710
2286 2783710 2590800 2362196 2338022 2228080 1981939 1973180 1892874 1776767 1663489 1553512
2276 1553512 1600379 1500082 1433151 1356362 1309143 1290560 1320874 1240263 1117270 1145433 1122360
2265 1122360 1151133 1171744 1072036 842723 790077 787852 720852 763213 756483 734312 575753
2254 575753 597480 664454 603490 544934 415377 479907 455294 472794 503293 383255 373177
2243 373177 446538 432397 479743 368384 302713 265654 304524 343018 391642 360024 345391
2232 345391 272406 295140 175460 122777 115249 141302 359023 318477 248372 188645 260321
2221 260321 330989 355093 339939 231700 36630 59691 216495 106599 103231 236279 211356
2210 211356 122893 113234 183817 257357 229205 181767 160808 123244 84422 67844 92535 29644
2198 29644 13167 43954 51938 -15601 49878 11123 -20800 -157534 -155096 -121069 -211649 -193365
2186 -193365 -133297 -166622 -92704 -153722 -91135 11257 -18171 85524 -45071 -110777 -79516
2175 -79516 -145083 -59627 -112506 -48765 19698 -35548 -56387 -57546 -24860 -104389 -58601 28122
2163 28122 105582 51407 74194 34302 58398 38892 37600 135570 88775 4818 74451 82477
2151 82477 -16716 -25015 -59371 -173334 -43891 138483 7350 23288 90714 338 -88651
2140 -88651 -125757 -133489 -136655 -193590 -140416 -42857 -79181 -59779 -79508 -168887 -159103 -91379
2128 -91379 -25968 -60478 -10456 -3908 -190944 -124731 30923 53735 -26359 -86260 -10280 -29017
2116 -29017 -23386 73858 67227 96761 -14499 -44655 2693 60713 70652 -12429 -148943 -56165
2104 -56165 46089 92940 73761 -32558 -90128 13443 -82347 -165459 -183850 -187827 -74195
2093 -74195 -136695 -87729 -49186 -175263 -125705 -58181 -96005 -92437 -67077 32349 56677 158577
2081 158577 34858 -182504 -134845 -123896 -142177 -126408 -146952 -116465 -52138 -18272 -148744
2070 -148744 -125110 -30517 -75774 77554 148286 -32670 -43610 -10761 -65268 17217 123512
2059 123512 85599 121976 161837 241400 191613 204910 161781 179992 304973 141401 29798
2048 29798 13156 25577 78724 -29650 -10890 -39185 91258 135109 188001 127506 168345
2037 168345 109674 -81529 -37007 -37642 65275 7632 -54375 -79828 -178847 -218651 -137758 -50505
2025 -50505 -24989 -102502 -195047 -172835 -137448 -147965 -212656 -172158 -61917 -184316 -105940
2014 -105940 -138793 -167863 -215916 -149849 -173243 -153892 -98192 -47343 -55564 -97652 -215512 -238278
2002 -238278 -122554 -22104 170 -55281 -133843 -275628 -119481 37577 3582 -52244 -127311
1991 -127311 -258808 -170075 -174091 -152934 -160948 -197294 -155310 -158609 -99697 -128569 -83038 -183732
1979 -183732 -232806 -196511 -149024 -92220 -132064 -133052 -111750 -193922 -180069 -103346 -3336 40
1967 40 -82397 76221 -10004 -35502 -78851 -83218 -81773 -26935 114657 62830 -63193 -16299
1955 -16299 92008 -41726 -42734 32733 22239 57767 128713 -10388 -6542 -13384 -51132 21649
1943 21649 -44418 -124676 -95952 -127688 -174174 -124534 -131695 -68062 -39521 -43835 30628 36776
1931 36776 -15419 -30323 13510 36076 45949 91494 -69338 -57642 9027 70127 -53959 35731
1919 35731 27324 13220 80110 -2194 -66111 -112696 -135426 -195440 -53746 -56172 -239791 -252711
1907 -252711 -129989 -264270 -320634 -222747 -201542 -293059 -46559 15022 -20699 36866 45221
1896 45221 30567 -45220 75815 -25239 -58118 -101026 -3793 -2867 -183772 -97598 -57579 -132261
1884 -132261 -121454 -110467 -45206 -156311 -166599 -193033 -238176 -205643 -216238 -114037 -94269
1873 -94269 -152394 -179046 -128740 -145999 -47627 34833 -9605 55597 126881 37198 112674 236131
1861 236131 69814 -125014 -107729 -159530 -315567 -188550 15470 -64712 -187833 -117261
1851 -117261 177435 59432 22927 84694 90879 -67238 -32469 173703 194294 49592 53021
1840 53021 105456 -31733 -37470 -41030 -90977 -89416 -91221 -68751 -119530 21456 44402 -134354
1828 -134354 -3284 -62072 -31246 148126 56947 5807 -89947 -56039 16415 -101665 -160014
1817 -160014 -243829 -223940 -259859 -102892 -77829 87927 173769 -11782 -41673 -167844 -147401
1806 -147401 -209318 -205261 -67100 -91634 -18100 25446 -57942 9146 107644 -39376 -47808 -79464
1794 -79464 -187247 -29642 75156 -92090 -29128 22898 -57050 -150446 -81972 131557 -53087
1783 -53087 -121775 -80453 64763 20427 15586 -31633 -31709 25119 -7353 -69448 -67373 -1419 -10657
1770 -10657 37859 121166 56523 -54221 -46984 -8133 73596 23667 72160 -86432 -132384 -149641
1758 -149641 -119501 -47866 60084 121849 83660 -113751 -76572 -154137 -128807 -71473 -62184
1747 -62184 -45219 -130594 6734 -44022 -137693 -151927 -137495 -71916 -25498 36752 -4347 -57845
1735 -57845 -69108 -8035 4349 64034 840 -12680 -48736 23019 81734 -38619 -50221 -130261
1723 -130261 -9084 -82511 -79376 85118 -58040 -193688 -167524 -68828 -53298 -102863 8480
1712 8480 103055 35933 1917 46949 -109651 -108034 -186288 -69960 4324 -125641 -114918 -127775
1700 -127775 -257704 -126864 117673 100145 45 59816 126920 20627 -89988 68949
1690 68949 13875 36634 66045 33844 19873 -85586 -62881 89018 16871 10212 74128 24242
1678 24242 57295 47842 -3599 -19363 -84688 -125044 -85059 -75826 -62108 -83900 -49823 -3689
1666 -3689 -29705 -64744 -78283 -38787 -61935 -167574 -120987 -84404 -120860 -143613 -122516 -28810
1654 -28810 43407 -131443 -185685 -61790 -75854 -90217 -78469 -46016 -18634 -60599 -86161
1643 -86161 -146903 -58083 45660 13219 39573 -47452 -108465 -796 -75586 30255 52595
1632 52595 72498 -40630 -79614 -96280 -92720 -164297 -196798 -124409 -104059 -45179 112485 124684
1620 124684 21093 -53017 -173142 -231794 -203438 37945 95768 -7895 -72285 -137639 -78916
1609 -78916 64946 45466 -78466 -113634 -56543 4503 22722 -1814 -66271 -111327 -95548
1598 -95548 -41382 11108 -76521 -90554 -125861 -152972 -74940 -145490 -134566 -142402 -224599 -83614
1586 -83614 -112947 -160958 -76412 -118998 -70886 36840 -69959 -39723 -23523 -81644 -51340
1575 -51340 -31095 -37170 -15464 36394 64548 26421 66290 -10747 -164199 -85480 -33262 -24306
1563 -24306 97741 136416 114678 138981 -60560 -123274 -20753 18648 90621 -23316 -24227
1552 -24227 -5732 14879 7122 -49049 -102041 -99752 60034 71905 -106551 56949 -41178 -165977
1540 -165977 -194485 -66587 35284 -126349 -78165 -167851 -166546 -7581 39923 80243 -19895
1529 -19895 -98120 -84879 -141836 -123588 -74078 22767 8845 -118831 -129037 -143213 -82284 75610
1517 75610 -50234 17427 50629 -102651 -162290 -5106 118517 147053 85553 -6961 -66262
1506 -66262 16804 -86272 -167994 -101478 -48708 21814 95501 -973 -95073 -94011 -202320 -131143
1494 -131143 -74428 -141617 -46970 -66070 -49178 -57293 -11803 -121829 -74290 39538 -99394
1483 -99394 -93644 -58595 -41153 -135842 -100388 -29803 -101766 -91927 -121251 -17902 34566 13435
1471 13435 -55907 -58816 77684 100782 105159 -41533 -11385 65426 -1320 -74456 -66959 -55386
1459 -55386 78884 38087 -42017 26217 92629 16423 -161248 -71960 -1500 -72887 26223
1448 26223 123203 39959 -2237 187679 160202 -88869 -173934 -56602 -27533 18451 68017
1437 68017 16984 -122467 -34820 66078 112703 31428 -10620 -63946 -52451 -42707 -66866 28967
1425 28967 -39099 -1283 22151 -89773 33143 97016 -27104 98324 140457 98940 -34848
1414 -34848 -4069 46635 106656 53700 43685 67131 -10295 -24767 -174274 -26299 -24331 -112993
1402 -112993 -110776 -18245 60034 94841 -42302 23351 -55204 -111282 -112007 -103775 -115584 -42797
1390 -42797 95216 93906 143329 19148 -64370 38800 134370 46417 -125100 -170960 -67095
1379 -67095 -174192 -133958 -17016 -8618 -51623 -31799 35767 23311 -23197 -69457 -163089 -207352
1367 -207352 -159132 -44151 -71686 -32249 -1017 -47300 -21130 96594 -9779 -32485 -33180
1356 -33180 -69639 -172407 -121716 30022 58421 156953 46122 -38026 -17890 -228246 -270391
1345 -270391 -154454 -144354 -70148 37610 85173 163574 4719 -45528 -135351 -144785 -179476
1334 -179476 -109877 -109438 -16218 -14824 -161524 -184840 -40988 17552 86835 139028 80773 123358
1322 123358 49581 176782 137312 -83224 38197 62687 -34272 -39184 -26947 -11122 -5773
1311 -5773 42746 -59434 51420 -84534 -60125 -23856 -68114 -55363 -76423 14524 32483
1300 32483 -69820 -56959 -26158 57852 41916 119663 19295 -141510 -155911 -29492 12412
1289 12412 -79191 -34795 -95342 -132339 -72084 22968 30794 -2631 97718 5397 -196082 -221589
1277 -221589 -138113 -20526 84338 64492 22133 66551 51179 -28536 -61597 -164422 -94213
1266 -94213 -198 -104496 -65470 57120 142435 152182 20748 -6942 38489 101166 24189
1255 24189 -39934 26452 19631 25203 101062 98806 27434 -26937 82526 149209 117064 39831
1243 39831 -71133 -65846 -13228 -35337 41674 168789 -3683 -181217 -171512 -52180 -34394
1232 -34394 -7194 -28259 -119417 -26521 -1826 -57515 19700 -18758 -58519 -657 3699 81495
1220 81495 -11443 -76977 -85714 -33081 -114516 -256875 36109 111376 -22630 -81755 90296
1209 90296 115023 45904 -2510 -174186 -149010 59998 51062 39794 -54165 -75870 44003
1198 44003 20602 -58266 -169631 -147541 -68989 -188655 24564 83651 12655 -79689 -104918
1187 -104918 -37304 -52999 -85683 -5135 4162 -15517 -43138 -67993 19435 107778 103605 161918
1175 161918 215441 160329 32521 45447 158174 1262 -117452 -68317 56921 -25068 4103
1164 4103 8531 46657 -48660 17613 -35948 -55158 101531 182430 168947 140795 81904 72041
1152 72041 119490 64485 59534 187153 120634 99382 68530 135872 42910 -51871 60862 -57556
1140 -57556 -12397 56454 -67387 -177146 -35710 85486 20495 -81635 -67203 131993 139408
1129 139408 108364 81800 -78936 10950 41848 125582 148263 72999 45062 -59753 -94832
1118 -94832 -59589 -44610 -26386 -124583 -68792 -61274 -9689 71129 -64403 -138286 -100834 36978
1106 36978 19667 58562 82543 -61203 10870 17427 -37461 -41126 26498 50328 23734 72947
1094 72947 -43686 -72380 -98610 -102223 -151000 -108211 -68110 3313 273089 183140 168992 109799
1082 109799 -37786 -174096 -139248 56233 184351 178075 135967 22022 -75958 -44956 31193
1071 31193 71840 246782 259563 163655 29649 -58256 -86915 44562 44070 -108314 27254
1060 27254 112846 91545 61545 -11399 -77146 -44027 -17592 -65 30084 190722 203344 134112
1048 134112 72173 42175 -86016 -200801 -101229 15487 634 -88747 -91453 -1951 -10702
1037 -10702 117719 4101 -89686 -40169 30173 119544 68509 103676 23432 -2200 62924
1026 62924 111079 191890 78786 38786 4879 65446 16641 2897 -107027 56594 108297
1015 108297 -63662 -1411 72922 129568 104970 11418 62526 43443 76401 112439 54059
1004 54059 18146 74207 100556 7699 184855 74836 48243 29882 -14561 97438 93498
993 93498 69048 -106061 -42661 102950 17956 5800 -49455 -114035 -147066 127972 87822
982 87822 -78324 -90395 -1838 -44224 75088 -10390 -114130 -2559 82199 84347 -34397
971 -34397 -16715 30310 118040 191894 327045 177097 14678 -2457 80342 121316 229029
960 229029 169207 44766 -21995 37436 44682 -25687 -63007 -171028 -122840 -12327 58305
949 58305 78401 69896 78526 84380 41297 -10309 59601 116540 156388 50980 63042 41942
937 41942 -47937 -13327 -119835 -62290 -49533 43039 -47193 -176003 -106989 -69098 -73455 -167298
925 -167298 -72116 117560 34361 66936 95424 -59481 33790 50029 49405 94924 92929 -793
913 -793 32306 71275 80437 181133 177812 66482 26290 -13579 -102765 71483 142140 258837
901 258837 114417 31529 9600 10352 -24396 101713 46185 -37692 71436 37589 -79217
890 -79217 81902 10160 12269 131989 42509 -15879 67158 15089 -66741 -8521 49411 63660
878 63660 66077 20026 50737 35700 -6799 -21717 -41114 118761 -39738 -121105 -37405 42529
866 42529 22680 68606 -70953 32632 -20437 108258 77616 118139 70390 3670 52008
855 52008 175670 235435 186264 -25403 -9949 -11258 -83294 -133301 -144545 -13691 -1264 85097
843 85097 161182 225046 96082 1232 102859 97674 9780 71098 38892 106402 141666 6512
831 6512 -74990 17394 27903 159448 112866 -46199 -27190 -42280 -59325 -3740 -12704 24775
819 24775 40396 -42967 -31332 -91789 -131340 -53007 -136 42680 104957 163795 162094 69745
807 69745 -35998 -43620 -18358 75852 107585 175688 100206 27147 117166 109129 -1776 65717
795 65717 84003 96320 106069 -25431 -31812 -8271 98121 26846 -122636 61477 113976 90370
783 90370 64160 2033 -66774 -45105 42464 30159 36656 28075 73325 39520 -69193 -75060
771 -75060 52470 91893 503 -1323 109412 110511 69378 -78199 -40725 -70434 4694 68855
759 68855 49242 12616 36074 93812 -59605 -72076 12828 7736 -27700 41873 76064 42359
747 42359 41249 148746 170987 67410 42309 110374 84245 20960 74664 36184 95734 92078
735 92078 54298 103242 -50056 25307 47804 54024 26319 113827 114366 35126 114766 13057
723 13057 -167972 -120327 160 -123684 -207821 -180664 96984 252674 130451 61386 162526
712 162526 89124 -15914 -46923 -32935 153036 241963 154355 72093 -37916 41843 162430
701 162430 105350 75137 89752 25864 -109855 -36805 -58360 -54188 25122 20506 -23817 114202
689 114202 -25797 -75116 -16702 49721 96846 99445 97801 68845 79239 64788 49860 4196
677 4196 -39592 -24280 -27696 124269 13767 -76084 -101456 -135410 -9605 36245 56470 118863
665 118863 88322 21936 44516 -55867 10696 3545 15675 97674 138603 86934 99170 3838
653 3838 -56135 -48680 -115075 -98286 -67344 -45521 -25520 17866 4002 -69288 66642 83060
641 83060 -24729 41605 27286 91870 72331 38352 -13937 53016 94581 -38316 55716 115256
629 115256 184931 92000 42582 2474 15162 49756 100461 125487 7505 10247 126365 122905
617 122905 120054 97914 139999 17072 53762 120623 91218 67866 46187 -48198 -12803 87488
605 87488 75845 60445 -40239 86363 40181 -59208 -148420 -137949 -117568 24380 28078 -88650
593 -88650 -15946 3578 39191 -34683 -168958 -105472 -69347 -72073 -25977 -68571 -90637 -80306
581 -80306 -22853 25375 76204 -13411 -74878 -5843 -38834 -103399 -102728 -18857 891 36100
569 36100 -68075 -225996 -197763 -94676 50988 41415 -26405 7281 90734 61845 121411
558 121411 40880 63607 129775 74406 25275 -18762 -23595 -28514 -75484 -75949 8944 51777 -69533
545 -69533 -50897 -40894 -43679 127105 141521 96615 66898 20494 -82079 -106638 -148617 -160465
533 -160465 -137388 -76269 -43964 24838 117035 125991 -72028 -153340 -84313 -94243 -117023 -92076
521 -92076 -59924 135891 160025 85830 -66953 -42576 -73070 -140360 -31944 55572 -9830
510 -9830 -125212 -151905 24262 122833 93835 7238 -75796 10934 79565 27874 -40218 -18677
498 -18677 33575 147988 72835 -38358 -40023 72930 -22615 -59561 -2423 -32688 64143 154700
486 154700 97347 153246 56564 -33934 114331 119336 -17178 -23277 20125 -61739 14189 82713
474 82713 6887 4883 79210 2542 155131 228172 68712 36219 14740 -79146 -62313 19647
462 19647 118608 92546 35956 34975 15327 173067 184559 17020 33734 55107 -38666 22874
450 22874 80576 65597 -7475 -42621 -3850 56785 -15313 -112166 -126373 -59687 -100931 22603
438 22603 215047 269322 210177 137389 32150 -155407 -78038 -18629 71077 -49108 -89600
427 -89600 -12613 -176756 -130549 7581 55188 43418 -27377 153944 119105 107719 212645
416 212645 141653 155076 27162 70583 28151 23443 57055 -17595 6134 -61287 -74202 54894
404 54894 38956 11291 -41188 -131908 -25863 -31393 70805 41408 -111075 -77894 -140223 -103546
392 -103546 -11260 -12024 -123246 -6310 -111315 -49248 -89708 -114519 3836 10245 52414 126402
380 126402 204898 147326 58912 12480 -14984 43063 120228 272 -78528 -114514 -16575 79636
368 79636 76089 13398 69483 320 -83299 -54594 -13930 -55187 13368 56342 -56770 -2513
356 -2513 52863 -15898 -111302 -27397 -144557 -127742 101116 206458 213630 53271 -66577
345 -66577 -3959 77413 52647 -26465 -7930 41097 -6761 -4014 85976 145580 -65321 -58176
333 -58176 -110546 -84197 -115778 -182621 -181238 -85646 -225838 -167208 -67099 -34196 47388 -88982
321 -88982 -5599 31690 -10833 -54047 -73154 -90449 -82136 -123448 57491 -51514 60245 25310
309 25310 -64661 -40943 -71797 89318 108765 76089 73662 32701 71999 103438 59197 1697
297 1697 -109905 -82758 -20472 27099 -13762 -22102 3812 6407 98835 81852 -76621 -91793
285 -91793 -78169 -38139 -148844 -80247 -77094 -38132 55129 -13431 -111747 -180139 -12816 -35543
273 -35543 -14715 -96639 -90616 88224 88419 30427 15950 21114 95500 67388 -118760 -158044
261 -158044 -189595 -105503 -81195 -10664 42594 -13982 -133149 -131199 -133140 -132520 -15495 -12271
249 -12271 -27159 13446 -48568 3541 27347 89435 116780 31377 58743 -4785 -118722 -127121
237 -127121 -51774 38560 135045 33774 -141907 -17435 -6410 -4411 -50407 -62658 4983
226 4983 74088 4712 -111424 -24786 92793 99313 -74106 -167780 -227436 -143909 -178486 -98766
214 -98766 -95907 -131401 13632 138645 -15333 28316 34169 -138815 -163577 -65723 -28183 -36257
202 -36257 -49902 15757 1813 -4414 65421 80840 -12113 -109198 -97643 -213411 -121576 -18076
190 -18076 -1257 2852 97078 47211 -40961 -55454 41703 28475 -115875 16789 -94292 -202116
178 -202116 -216841 -111474 16738 184209 76675 -105428 -34132 110721 7982 31978
168 31978 28980 -100909 -144160 -52774 -30516 -93045 -1091 102034 -24058 -182021 -66314
157 -66314 -82951 18860 34631 635 -57952 -118648 -21976 43068 46290 77913 -12890 13830
145 13830 -137544 -80821 87038 95180 -9848 -3936 32722 -27235 1825 77628 49649 11982
133 11982 -54518 12022 -62734 -62057 -98470 -120717 -7254 -17539 24341 30040 -16160 -109530
121 -109530 -93576 -71231 75973 55637 -24140 -45413 -39783 -70463 23680 -5919 -39164 -80199
109 -80199 -83740 -107218 -17465 29239 -97031 -19435 -2054 -47190 -64866 -76332 -79061 -5852
97 -5852 -83618 -84546 -9907 -30479 -35419 -100910 -71662 143233 64635 -26749 -34911 -74092 -87549
84 -87549 88944 61342 -13259 -48251 -189886 -167526 -107091 25306 -74851 -96701 -74433
73 -74433 25588 66040 69738 -29584 -124336 -89810 -165727 -66748 -61293 -54147 -126919 -200821 -68614
60 -68614 -107963 -127286 -74859 -59131 -14982 117464 58785 69061 52769 39835 18072 46050
48 46050 54980 -36418 32425 20539 -135625 -208388 -132549 -42672 -88837 -66744 -64841 -58118 -56344
35 -56344 -42699 52644 25399 -86055 -107306 -48275 -75073 -104431 -156693 -109219 -71035 23599
23 23599 14082 45916 -187005 -156689 -154235 -147087 -56918 15461 70098 117131 -4228 -74721
11 -74721 -58399 -112563 -71617 -109723 -85295 -95783 29077 36822 32560 51056 90039
0 90039
$$ Imaginary data points
##PAGE= N=2
##DATA TABLE= (X++(I..I)), XYDATA
16383 -908702 -859369 -815629 -798507 -760978 -681555 -740292 -636459 -582261 -661657 -740679 -667996
16372 -667996 -608069 -580230 -561656 -557386 -574892 -594622 -531907 -445618 -383116 -328369 -374673 -406383
16360 -406383 -282198 -290450 -358268 -296014 -294953 -265053 -226121 -240103 -152441 -174981 -236258 -198325
16348 -198325 -126295 -178241 -190886 -74899 -44748 -44073 -56394 -122046 -120456 -56178 -21301 -43256
16336 -43256 -47672 404 34578 164450 200828 138545 76741 104805 192626 236708 200163 193820
16324 193820 234416 228131 244207 292542 268823 264332 282404 396240 333753 373481 399620 299324
16312 299324 345579 410145 424281 451743 444279 364212 336408 433379 415027 396295 552059
16301 552059 688536 699632 567129 525953 547100 673167 817158 811197 709062 646083 606154
16290 606154 594422 697918 715998 694278 786805 778801 780679 813336 840025 882254 920922 903414
16278 903414 1023957 1045322 1081905 1069228 1022527 975350 871893 999330 1188950 1173945 1155885
16267 1155885 1100652 1043775 1010858 929391 1083270 1047183 1059942 1062720 1110822 1209468 1224600
16256 1224600 1189261 1107998 1209937 1179288 1171733 1213659 1199248 1155836 1131016 1194753 1370830
16245 1370830 1358815 1321075 1278932 1194678 1247643 1322981 1422345 1422417 1359165 1406928 1513984 1456266
16233 1456266 1421346 1375473 1351535 1317330 1445517 1468935 1422026 1513221 1432723 1446176 1387070
16222 1387070 1478846 1584073 1554753 1566076 1527465 1475997 1440968 1480473 1460306 1440497 1480722
16211 1480722 1428408 1508205 1380339 1424864 1518967 1701002 1718327 1509601 1495582 1504209 1546932
16200 1546932 1587021 1539127 1603253 1621673 1559522 1618990 1675836 1589627 1483805 1766396 1714869
16189 1714869 1687524 1765421 1572185 1615049 1762244 1825289 1733806 1716024 1769831 1841730 1861843
16178 1861843 1804039 1731000 1702115 1750681 1738997 1794594 1652418 1662662 1735063 1925186 1895316
16167 1895316 1814088 1778080 1738864 1756474 1803159 1766876 1891179 1908135 1921462 1826569 1785411
16156 1785411 1790068 1934428 1965745 1864265 1965619 1953078 1923461 1921945 1876506 1939968 2025705
16145 2025705 2012027 1958714 1844390 1948201 1920634 1919375 1929760 1856646 1843754 1809149 1808642
16134 1808642 1871984 1787359 1786451 1822107 1870885 1928806 1905452 1904249 1897384 1898234 1846465 1824005
16122 1824005 1894897 2087633 2005362 1989511 1971961 1911854 2032004 1890799 1953966 2047350 2000460
16111 2000460 2069606 2194065 2069513 2053521 2041471 1867935 1955413 2166478 2135720 2011078
16101 2011078 2039857 2020299 1866667 1906127 1935721 1889035 2024844 2023660 1865260 1941050 1978657
16090 1978657 2032697 1987851 2024740 2031363 2028223 2067613 1961083 2023898 2078416 2101061 2090161
$$ [...]
##END NTUPLES=NMR SPECTRUM
##END=
