##TITLE=1H_DE-80H_X3
 200.13MHz, d2o
 8 sc
 
 19ns.26.2.2025
##JCAMPDX= 6.0         $$ Bruker NMR JCAMP-DX V2.0
##DATA TYPE= NMR SPECTRUM
##DATA CLASS= NTUPLES
##ORIGIN= UXNMR, Bruker Analytische Messtechnik GmbH
##OWNER= pz
$$ XWIN-NMR		Version 3.5
$$ Fri Oct 17 15:16:16 2025 Russian Standard Time (UT+4h)  Yarkov@DPX200
##.OBSERVE FREQUENCY= 200.1313
##.OBSERVE NUCLEUS= ^1H
##.ACQUISITION MODE= SIMULTANEOUS
##.ACQUISITION SCHEME= undefined
##.AVERAGES= 8
##.DIGITISER RES= 18
##SPECTROMETER/DATA SYSTEM= spect
##.PULSE SEQUENCE= zg30
##.SOLVENT NAME= CDCl3
##.SHIFT REFERENCE= (INTERNAL, CDCl3, 0, 15.4924)
##AUDIT TRAIL= $$ (NUMBER, WHEN, WHO, WHERE, WHAT)
$$ ##TITLE= Audit trail, XWIN-NMR		Version 3.5
$$ ##JCAMPDX= 5.01
$$ ##ORIGIN= Bruker BioSpin GmbH
$$ ##OWNER= Yarkov
$$ C:/Bruker/XWIN-NMR/data/yarkov2/nmr/H-C/1/pdata/1/auditp.txt
$$ ##AUDIT TRAIL=  $$ (NUMBER, WHEN, WHO, WHERE, WHAT)
(   1,<2025-10-17 15:15:29.28 +0400>,<Yarkov>,<DPX200>,
      <created by zg, POWCHK disabled, PULCHK disabled
       configuration hash MD5:
       00 E9 B6 7A A2 85 ED C7 34 08 36 98 17 FE 4E 26
       data hash MD5: 16K
       FC ED 78 63 3E CA 4B 09 90 99 8C A1 85 B7 33 60>)
(   2,<2025-10-17 15:15:33.90 +0400>,<Yarkov>,<DPX200>,
      <Start of raw data processing
       efp BC_mod = 2 LB = 0.25 FT_mod = 6 PKNL = 1 PHC0 = -3354.005 PHC1 = 9.132312 SI = 16K 
       data hash MD5: 16K
       73 CD F2 68 23 ED F9 FA 5B EC D7 E8 BE 37 56 49>)
$$ ##END=
$$ 
$$ hash MD5
$$ 72 16 98 BD C4 DA 68 83 F5 B0 AA 57 09 D2 69 0A
##$RELAX= 
##$RELAX= 
##$RELAX= 
##$RELAX= 
##$RELAX= 
##$RELAX= 
$$ Bruker specific parameters
$$ --------------------------
##$DU= <C:/Bruker/XWIN-NMR>
##$EXPNO= 1
##$NAME= <H-C>
##$PROCNO= 1
##$TYPE= <nmr>
##$USER= <yarkov2>
##$AMP= (0..31)
100 100 100 100 100 100 100 100 100 100 100 100 100 100 100 100 100 100 
100 100 100 100 100 100 100 100 100 100 100 100 100 100 
##$AQSEQ= 0
##$AQ_mod= 1
##$AUNM= <au_zg>
##$AUTOPOS= <>
##$BF1= 200.13
##$BF2= 200.13
##$BF3= 200.13
##$BF4= 200.13
##$BF5= 200.13
##$BF6= 200.13
##$BF7= 200.13
##$BF8= 200.13
##$BYTORDA= 1
##$CFDGTYP= 0
##$CFRGTYP= 5
##$CHEMSTR= <none>
##$CNST= (0..31)
1 1 145 1 1 1 1 1 1 1 1 1 1 1 1 1 1 1 1 1 1 1 1 1 1 1 1 1 1 1 1 1 
##$CPDPRG= <>
##$CPDPRG1= <>
##$CPDPRG2= <>
##$CPDPRG3= <>
##$CPDPRG4= <mlev>
##$CPDPRG5= <mlev>
##$CPDPRG6= <mlev>
##$CPDPRG7= <mlev>
##$CPDPRG8= <mlev>
##$CPDPRGB= <>
##$CPDPRGT= <>
##$D= (0..31)
0 0.7 0 0 0 0 0 0 0 0 0 0.03 0 0 0 0 0 0 0 0 0 0 0 0 0 0 0 0 0 0 0 0 
##$DATE= 1760699728
##$DBL= (0..7)
120 120 120 120 120 120 120 120 
##$DBP= (0..7)
150 150 150 150 150 150 150 150 
##$DBP07= 0
##$DBPNAM0= <>
##$DBPNAM1= <>
##$DBPNAM2= <>
##$DBPNAM3= <>
##$DBPNAM4= <>
##$DBPNAM5= <>
##$DBPNAM6= <>
##$DBPNAM7= <>
##$DBPOAL= (0..7)
0.5 0.5 0.5 0.5 0.5 0.5 0.5 0.5 
##$DBPOFFS= (0..7)
0 0 0 0 0 0 0 0 
##$DE= 6
##$DECBNUC= <off>
##$DECIM= 32
##$DECNUC= <off>
##$DECSTAT= 4
##$DIGMOD= 1
##$DIGTYP= 9
##$DL= (0..7)
0 120 120 120 120 120 120 120 
##$DP= (0..7)
$$ [...]
##$SUBNAM2= <"">
##$SUBNAM3= <"">
##$SUBNAM4= <"">
##$SUBNAM5= <"">
##$SUBNAM6= <"">
##$SUBNAM7= <"">
##$SUBNAM8= <"">
##$SUBNAM9= <"">
##$SW= 18.0517328524113
##$SWIBOX= (0..15)
0 0 2 0 0 0 0 0 0 0 0 0 0 0 0 0 
##$SW_h= 3612.71676300578
##$TD= 16384
##$TD0= 1
##$TE= 0
##$TE2= 300
##$TE3= 300
##$TEG= 300
##$TL= (0..7)
0 120 120 120 120 120 120 120 
##$TP= (0..7)
150 150 150 150 150 150 150 150 
##$TP07= 0
##$TPNAME0= <>
##$TPNAME1= <>
##$TPNAME2= <>
##$TPNAME3= <>
##$TPNAME4= <>
##$TPNAME5= <>
##$TPNAME6= <>
##$TPNAME7= <>
##$TPOAL= (0..7)
0.5 0.5 0.5 0.5 0.5 0.5 0.5 0.5 
##$TPOFFS= (0..7)
0 0 0 0 0 0 0 0 
##$TUNHIN= 0
##$TUNHOUT= 0
##$TUNXOUT= 0
##$USERA1= <user>
##$USERA2= <user>
##$USERA3= <user>
##$USERA4= <user>
##$USERA5= <user>
##$V9= 5
##$VALIST= <valist>
##$VCLIST= <CCCCCCCCCCCCCCC>
##$VD= 0
##$VDLIST= <DDDDDDDDDDDDDDD>
##$VPLIST= <PPPPPPPPPPPPPPP>
##$VTLIST= <TTTTTTTTTTTTTTT>
##$WBST= 1024
##$WBSW= 4
##$XGAIN= (0..3)
0 0 0 0 
##$XL= 0
##$YL= 0
##$YMAX_a= 202219
##$YMIN_a= -332267
##$ZGOPTNS= <>
##$ZL1= 120
##$ZL2= 120
##$ZL3= 120
##$ZL4= 120
##$ABSF1= 0
##$ABSF2= 0
##$ABSG= 0
##$ABSL= 0
##$ALPHA= 0
##$AQORDER= 0
##$ASSFAC= 0
##$ASSFACI= 0
##$ASSFACX= 0
##$ASSWID= 0
##$AUNMP= <proc_1d>
##$AZFE= 0.1
##$AZFW= 0.1
##$BCFW= 0
##$BC_mod= 2
##$BYTORDP= 0
##$COROFFS= 0
##$CY= -3
##$DATMOD= 1
##$DC= 0
##$DFILT= <>
##$DTYPP= 0
##$F1P= 0
##$F2P= 0
##$FCOR= 1
##$FTSIZE= 16384
##$FT_mod= 6
##$GAMMA= 0
##$GB= 0
##$INTBC= 1
##$INTSCL= 3.241238e-09
##$ISEN= 128
##$LB= 0.25
##$LEV0= 0
##$LPBIN= 0
##$MAXI= 10000
##$MC2= 0
##$MEAN= 0
##$ME_mod= 0
##$MI= 1.114404
##$NCOEF= 0
##$NC_proc= -6
##$NLEV= 6
##$NOISF1= 3.799351
##$NOISF2= 2.8
##$NSP= 0
##$NTH_PI= 0
##$NZP= 0
##$OFFSET= 15.49237
##$PC= 1
##$PHC0= -3354.005
##$PHC1= 9.132312
##$PH_mod= 1
##$PKNL= yes
##$PPARMOD= 0
##$PSCAL= 0
##$PSIGN= 0
##$REVERSE= no
##$SF= 200.13000586896
##$SI= 16384
##$SIGF1= 3
##$SIGF2= 2
##$SINO= 0.751879
##$SIOLD= 32768
##$SREGLST= <19F.Aceton>
##$SSB= 0
##$STSI= 16384
##$STSR= 0
##$SW_p= 3612.71676300578
##$SYMM= 0
##$S_DEV= 0
##$TDeff= 16384
##$TDoff= 0
##$TI= <>
##$TILT= no
##$TM1= 0
##$TM2= 0
##$TOPLEV= 0
##$USERP1= <user>
##$USERP2= <user>
##$USERP3= <user>
##$USERP4= <user>
##$USERP5= <user>
##$WDW= 1
##$XDIM= 16384
##$YMAX_p= 325203181
##$YMIN_p= -530416
$$ End of Bruker specific parameters
$$ ---------------------------------
##NTUPLES= NMR SPECTRUM
##VAR_NAME=  FREQUENCY,     SPECTRUM/REAL,   SPECTRUM/IMAG
##SYMBOL=    X,             R,               I
##VAR_TYPE=  INDEPENDENT,   DEPENDENT,       DEPENDENT
##VAR_FORM=  AFFN,          ASDF,            ASDF
##VAR_DIM=   16384,         16384,           16384
##UNITS=     HZ,            ARBITRARY UNITS, ARBITRARY UNITS
##FACTOR=    0.220516191357247, 1,           1
##FIRST=     3100.48802933772, 0,            0
##LAST=      -512.228733668062, 0,           0
##MIN=       -512.228733668062, -530416,     0
##MAX=       3100.48802933772, 325203181,    0
$$ Real data points
##PAGE= N=1
##DATA TABLE= (X++(R..R)), XYDATA
$$ [...]
$$ plain form
8199 738821 780462 718289 636891 671183 686845 686819 734627 30317 230877 568179 559392 680640
8187 680640 653133 624439 580147 749807 652943 512310 418033 554520 544286 566505 556635
8176 556635 696837 682518 606941 649981 644234 643003 696091 690789 583877 697140 784317 616965
8164 616965 627220 544128 512885 512109 507492 503195 399755 585931 606653 670443 593799 565724
8152 565724 682664 786524 737148 644706 591314 481554 585225 514376 535596 571650 620975
8141 620975 689817 531384 489892 534118 555221 526346 613262 600477 475753 522378 441230
8130 441230 405164 539523 600521 497944 409909 404024 478614 449087 356904 359676 440934 478133
8118 478133 299600 345619 444974 497337 437370 517935 595051 563602 508366 506085 469995 407393
$$ packed form
8199G38821M1641o2173q1398L4292J5662k6M7808p04310K00560L37302q787J21248
8187F80640k7507k8694m4292J69660r6864j40633r4277J36487j0234K2219r870
8176E56635J40202j4319p5577M3040n747j231N3088n302j06912J13263Q7177j67352
8164F16965J0255q3092l1243p76m617m297j03440J86176K0722O3790p6644k8075
8152E65724J16940J03860m9376r2442n3392j09760J03671p0849K1220L6054M9325
8141F20975O8842j58433m1492M4226K1103k8875Q6916j2785j24724M6625q1148
8130D41230l6066J34359O0998j02577q8035n885P4590k9527r2183K772Q1258L7199
8118D78133j78533M6019R9355N2363n9967Q0565P7116l1449n5236k281l6090o2602
$$ plain form
8106 407393 428985 429526 488344 452760 464659 384057 427175 449378 393901 441119 365347 364317
8094 364317 421163 530974 421362 370581 358024 291206 272964 337306 338057 398202 360675 380043
8082 380043 415048 292408 317756 386064 360875 280040 306828 423634 466085 538783 512736
8071 512736 571024 452082 386067 402225 344856 285272 260814 436380 459658 456181 360728
8060 360728 266010 360946 432773 322648 302511 249317 324295 319565 338822 399779 359924 263105
8048 263105 202779 198631 158789 253823 268033 254256 305831 284426 357154 352594 317433 347687
8036 347687 392823 264798 367231 270432 304941 371752 351387 202545 223224 426152 483467
8025 483467 329314 218715 287403 343293 275997 335081 454845 449995 384482 284554 190690
$$ packed form
8106D07393K1592N41N8818l5584J1899q0602M3118K2203n5477M7218p5772j030
8094C64317N6846J09811j09612n0781j2557o6818j8242O4342P51O0145l7527J9368
8082C80043L5005j22640K5348O8308k5189q0835K6788J16806M2451P2698k6047
8071E12736N8288j18942o6015J6158n7369n9584k4458J75566K3278l477r5453
8060C60728r4718R4936P1827j10125k0137n3194P4978m730J9257O0957l9855r6819
8048B63105o0326m148l9842R5034J4210j3777N1575k1405P2728m560l5161L0254
8036C47687M5136j28025J02433r6799L4509O6811k0365j48842K0679K02928N7315
8025D83467j54153j10599O8688N5890o7296N9084J19764m850o5513r9928r3864
$$ plain form
8014 190690 156422 182209 359445 280032 279378 307221 175498 369048 437661 432225 308085
8003 308085 298808 301642 229335 199050 167045 176160 225829 191997 299820 328358 316007 378343
7991 378343 212524 199824 290377 267960 275713 330407 313890 457217 435312 343028 346180 407226
7979 407226 500372 418135 301439 280010 311693 174287 79590 273798 360852 221621 376393
7968 376393 303557 284216 307976 387328 470806 398042 318064 341474 344690 374910 316640 297505
7956 297505 351801 330318 297609 346009 311619 219915 163680 281929 338292 383411 361116
7945 361116 310482 262942 256600 174181 219627 200219 163046 185033 205281 253181 306735 315331
7933 315331 275017 294793 285850 392753 421025 383541 265347 265488 317940 249843 169362 215477
$$ packed form
8014A90690l4268K5787J77236p9413o54K7843j31723J93550O8613n436j24140
8003C08085r277K834p2307l0285l2005R115M9669l3832J07823K8538j2351O2336
7991C78343j65819j2700R0553k2417P753N4694j6517J43327k1905r2284L152O1046
7979D07226R3146q2237j16696k1429L1683j37406r4697J94208Q7054j39231J54772
7968C76393p2836j9341K3760P9352Q3478p2764p9978K3410L216L0220n8270j9135
7956B97505N4296k1483l2709M8400l4390r1704n6235J18249N6363M5119k2295
7945C61116n0634m7540o342q2419M5446j9408l7173K1987K0248M7900N3554Q596
7933C15331m0314J9776q943J06903K8272l7484j18194J41N2452o8097q0481M6115
$$ plain form
7921 215477 284439 350895 354453 210468 218781 204061 263248 199216 197692 158061 10141 19888
7909 19888 301547 431653 366362 265079 190296 91698 5785 190264 158718 129481 146061
7898 146061 233397 264631 228543 112895 39868 65292 189142 262568 184046 134515 195316
7887 195316 341363 316544 249061 247998 295868 216132 247228 227606 253479 301135 139322
7876 139322 189094 161329 58914 74206 181795 219229 294056 321298 263394 268511 349456
7865 349456 250798 205924 230912 294290 68032 70954 249861 308914 346597 357476 351433 252923
7853 252923 249585 132689 131401 221024 222032 225725 185364 90064 149997 429310 440011 363014
7841 363014 314916 305777 302686 370102 170910 287264 270427 293779 379100 351478 310108 372264
$$ packed form
7921B15477O8962O6456L558j43985Q313j4720N9187o4032j524l9631j47920R747
7909A9888K81659J30106o5291j01283p4783r8598q5913J84479l1546k9237J6580
7898A46061Q7336L1234l6088j15648p3027K5424J23850P3426p8522m9531O0801
7887A95316J46047k4819o7483j063M7870p9736L1096j9622K5873M7656j61813
7876A39322M9772k7765j02415J5292J07589L7434P4827K7242n7904N117Q0945
7865C49456r8658m4874K4988O3378k26258K922J78907N9053L7683J0879o043r8510
7853B52923l338j16896j288Q9623J008L693m0361r5300N9933K79313J0701p6997
7841C63014m8098r139l091O7416j99192J16354j6837K3352Q5321k7622m1370O2156
$$ plain form
7829 372264 424088 422583 526493 468882 388189 412952 457886 401339 259737 278302 252002
7818 252002 333811 346147 318756 328386 284711 254585 433692 403704 352291 342745 392522 451413
7806 451413 122636 107966 239655 281226 296602 287399 237098 370465 288263 306705 321438
7795 321438 297391 254610 178523 224368 425658 386805 415726 326998 403179 394678 499611
7784 499611 407887 294851 282251 266565 298310 216195 303030 228714 163419 178773 222348
7773 222348 393309 290381 301179 374726 405132 225757 332310 453658 412390 386353 231976
7762 231976 206450 339555 415707 372612 308260 267899 398913 443645 562468 602002 573260
7751 573260 524222 496048 495478 464378 431651 388344 439673 435900 516572 581303 478899 483694
$$ packed form
7829C72264N1824j505J03910n7611q0693K4763M4934n6547j41602J8565k6300
7818B52002Q1809J2336k7391R630m3675l0126J79107k9988n1413r546M9777N8891
7806D51413l28777j4670J31689M1571J5376r203n0301J33367q2202J8442J4733
7795C21438k4047m2781p6087M5845K01290l8853K8921q8728P6181q501J04933
7784D99611r1724j13036j2600j5686L1745q2115Q6835p4316o5295J5354M3575
7773B22348J70961j02928J0798P3547L0406j79375J06553J21348m1268k6037j54377
7762B31976k5526J33105P6152m3095o4352m0361J31014M4732J18823L9534k8742
7751E73260m9038k8174n70l1100l2727m3307N1329l773Q0672O4731j02404M795
$$ plain form
7739 483694 276290 193162 285215 320559 351179 340267 408028 460999 510194 350458 352967
7728 352967 444605 327329 429168 509309 544949 597148 567322 400432 418151 417264 443296
7717 443296 507902 575233 567384 511842 408206 316906 396640 388493 370514 344329 492536 633622
7705 633622 572572 494660 497122 552033 500061 537238 451398 318822 356393 434844 484334 483660
7693 483660 400847 376366 310837 396851 417047 297251 365891 445192 514452 390604 430485
7682 430485 367434 385427 334704 196006 170260 243816 284831 276515 256943 115479 228837
7671 228837 181106 350932 397390 385909 449697 354245 365827 272125 192285 214702 271298
7660 271298 293611 355917 339174 392795 333019 191517 236428 354841 261030 172871 219012
$$ packed form
7739D83694k07404q3128R2053L5344L0620j0912O7761N2971M9195j59736K509
7728C52967R1638j17276J01839Q0141L5640N2199k9826j66890J7719q87K6032
7717D43296O4606O7331p849n5542j03636r1300P9734q147j7979k6185J48207J41086
7705F33622o1050p7912K462N4911n1972L7177q5840j32576L7571P8451M9490o74
7693D83660q2813k4481o5529Q6014K0196j19796O8640P9301O9260j23848L9881
7682D30485o3051J7993n0723j38698k5746P3556M1015q316j9572j41464J13358
7671B28837m7731J69826M6458j1481O3788r5452J1582r3702p9840K2417N6596
7660B71298K2313O2306j6743N3621n9776j41502M4911J18413r3811q8159M6141
$$ plain form
7649 219012 255690 220789 108124 180309 225364 215039 251890 280673 319847 311067 278965 279096
7637 279096 339776 464278 412526 389276 253890 163903 144094 214076 265332 317940 393581
7626 393581 385442 193123 210928 261726 124370 126643 150166 190247 215241 155879 217668 340581
7614 340581 360255 298122 328963 311121 241713 232933 306954 367599 209061 219018 311545 318270
7602 318270 384297 368140 355863 343053 298108 297700 356246 316801 430565 566433 507652 448078
7590 448078 252915 163575 266016 301947 313081 397130 379990 475118 515760 414767 391443
7579 391443 530972 498134 542553 633432 638861 397857 366270 487521 468123 642549 637475
7568 637475 544071 533114 492732 510052 559684 505929 576717 544061 524539 544648 495911 484061
$$ packed form
7649B19012L6678l4901j12665P2185M5055j0325L6851K8783L9174q780l2102J31
7637B79096O0680J24502n1752k3250j35386q9987j9809O9982N1256N2608P5641
7626C93581q139j92319J7805N0798j37356K273K3523M0081K4994n9362O1789J22913
7614C40581J9674o2133L0841j7842o9408q780P4021O0645j58538R957R2527O725
7602C18270O6027j6157j2277j2810m4945m08N8546l9445J13764J35868n8781n9574
7590D48078j95163q9340J02441L5931J1134Q4049j7140R5128M0642j00993k3324
7579C91443J39529l2838M4419R0879N429k41004l1587J21251j9398J74426n074
7568F37475r3404j0957m0382J7320M9632n3755P0788l2656j9522K0109m8737j1850
$$ plain form
7556 484061 517249 543036 429172 436201 422131 305178 304429 335987 342766 325020 444593 484613
7544 484613 503682 486303 474439 476742 440618 483681 471235 419765 399601 541319 490292 428384
7532 428384 376613 484018 455831 461248 359684 413380 397691 401898 348948 248228 295455
7521 295455 304723 344271 314267 285987 314085 251474 407837 523049 398879 364381 283756
7510 283756 336704 436417 402657 328456 304559 273819 427978 278870 290117 341087 327141
7499 327141 358857 274057 272524 293447 268929 203163 203663 229114 286380 162899 214163 286972
7487 286972 359842 436814 441380 358118 188186 214802 267727 232533 158050 307433 266652
7476 266652 377585 310850 265837 220136 247086 310982 299481 308481 264805 181171 202788 318110
$$ packed form
7556D84061L3188K5787j13864P029j4070j16953p49L1558O779j7746J19573M0020
7544D84613J9069j7379j1864K303l6124M3063j2446n1470k0164J41718n1027o1908
7532D28384n1771J07405k8187N417j01564N3696j5689M207n2950j00720M7227
7521B95455R268L9548l0004k8280K8098o2611J56363J15212j24170l4498q0625
7510B83756N2948R9713l3760p4201k3897l0740J54159j49108J1247N0970j3946
7499C27141L1716q4800j533K0923k4518o5766N00K5451N7266j23481N1264P2809
7487B86972P2870P6972M566q3262j69932K6616N2925l5194p4483J49383m0781
7476B66652J10933o6735m5013m5701K6950O3896j1501R000m3676q3634K1617J15322
$$ plain form
7464 318110 419439 361953 316860 175573 209956 219094 192215 219305 122470 245182 202929
7453 202929 214178 320137 359957 371909 388588 349976 310047 320024 364401 317133 306414 271249
7441 271249 322332 370278 390889 282031 251637 410471 317603 265387 340907 269961 304621
7430 304621 359524 351537 292229 230865 316392 338669 281096 255283 218481 182634 150034 291196
7418 291196 439520 400618 325320 358691 298549 264087 309316 434386 413979 433398 437936
7407 437936 425867 433692 360761 309533 440257 343872 188012 334347 404608 513620 472190
7396 472190 488474 566079 482082 564030 665296 575123 492286 383010 392269 441294 329705
7385 329705 347955 514150 431576 432569 320551 259772 369405 321876 371002 427795 321855
$$ packed form
7464C18110J01329n7486m5093j41287L4383R138k6879K7090r6835J22712m2253
7453B02929J1249J05959L9820J1952J6679l8612l9929R977M4377m7268j0719l5165
7441B71249N1083M7946K0611j08858l0394J58834r2868n2216P5520p0946L4660
7430C04621N4903p987n9308o1364Q5527K2277n7573k5813l6802l5847l2600J41162
7418B91196J48324l8902p5298L3371o0142l4462M5229J25070k0407J9419M538
7407D37936j2069P825p2931n1228J30724r6385j55860J46335P0261J09012m1430
7396D72190J6284P7605q3997Q1948J01266r0173q2837j09276R259M9025j11589
7385C29705J8250J66195q2574R93j12018o0779J09633m7529M9126N6793j05940
$$ plain form
7374 321855 351206 389705 368861 355501 341122 369378 396259 419781 318328 303839 221593
7363 221593 247114 302479 244306 186791 193228 203613 175858 256520 253234 308273 272956 252110
7351 252110 123114 160081 235668 196393 240754 291799 255076 152973 196955 326459 234512
7340 234512 327841 409134 181534 227179 314306 298520 336746 286060 234784 281575 239684
7329 239684 351811 365921 288251 201500 227921 213672 207788 338146 336198 376637 310411 373830
7317 373830 334774 273069 347134 363057 169035 191681 350716 312512 336978 357966 424327
7306 424327 430521 412078 377428 445215 433606 503624 402782 276891 306310 243910 350259
7295 350259 306221 359395 406584 346355 276135 332026 439811 374628 279779 217918 268444
$$ packed form
7374C21855K9351L8499k0844j3360j4379K8256K6881K3522j01453j4489q2246
7363B21593K5521N5365n8173n7515O437J0385k7755Q0662l286N5039l5317k0846
7351B52110j28996L6967P5587l9275M4361N1045l6723j02103M3982J29504r1947
7340B34512R3329Q1293k27600M5645Q7127j5786L8226n0686n1276M6791m1891
7329B39684J12127J4110p7670q6751K6421j4249n884J30358j948M0439o6226O3419
7317C73830l9056o1705P4065J5923j94022K2646J59035l8204K4466K0988O6361
7306D24327O194j8443l4650O7787j1609P0018j00842j25891K9419o2400J06349
7295C50259m4038N3174M7189o0229p0220N5891J07785o5183r4849o1861N0526
$$ plain form
7284 268444 257754 254804 335725 441871 402493 283809 284119 307547 305541 356608 305181 349646
7272 349646 393842 443661 436444 412581 334056 306039 394643 363357 322379 364843 381125 382385
7260 382385 419011 491328 480664 490291 499889 474615 444526 487665 594641 583340 521020 439427
7248 439427 520424 676076 740117 605729 564890 710944 639527 653571 734301 642488 659574
7237 659574 671218 656864 721673 844536 801778 611430 598973 613053 691164 697879 731218
7226 731218 702874 643750 633551 671417 575988 656561 682960 641367 650010 642741 714871 706471
7214 706471 820043 760038 795723 902838 919454 935952 844287 844534 950176 1010681 1177968
7203 1177968 1273019 1246130 1257511 1370536 1391458 1422198 1451161 1389076 1375569 1531309 1576605
$$ packed form
7284B68444j0690k950Q0921J06146l9378j18684L10K3428k006N1067n1427M4465
7272C49646M4196M9819p217k3863p8525k8017Q8604l1286m0978M2464J6282J260
7260C82385L6626P2317j0664R627R598k5274l0089M3139J06976j1301o2320q1593
7248D39427Q0997J55652O4041j34388m0839J46054p1417J4044Q0730r1813J7086
7237F59574J1644j4354O4809J22863m2758j90348j2457J4080P8111O715L3339
7226G31218k8344n9124j0199L7866r5429Q0573K6399m1593Q643p269P2130q400
7214G06471J13572o0005L5685J07115J6616J6498r1665K47J05642O0505J67287
7203A177968R5051k6889J1381J13025K0922L0740K8963o2085j3507J55740M5296
$$ plain form
7192 1576605 1589980 1641453 1735018 1852550 1959769 2023448 2179885 2256368 2450407 2653119
7182 2653119 2671903 2902608 3038029 3025610 3013492 3329619 3605913 3823558 3946984 4148318
7172 4148318 4524296 4690112 4827718 5095100 5375934 5654896 5829819 6089930 6384974 6479484
7162 6479484 6648082 6842303 7058416 7065439 7057908 7078776 7054975 6979269 6904572 6673940 6546222
7151 6546222 6367534 6188747 5891920 5606400 5505297 5267202 5204859 4905256 4619108 4499110
7141 4499110 4333030 4095804 3997928 3769159 3538324 3443747 3339321 3222733 3069427 2972469
7131 2972469 2807995 2815481 2728578 2621825 2477676 2380615 2285012 2150019 2061173 2099193 1955668
7120 1955668 1842168 1860808 1863224 1884552 1905041 1858110 1838967 1825879 1908427 1739602 1602764
$$ packed form
7192A576605J3375N1473R3565J17532J07219O3679J56437P6483J94039K02712
7182B653119J8784K30705J35421j2419j2118L16127K76294K17645J23426K01334
7172D148318L75978J65816J37606K67382K80834K78962J74923K60111K95044R4510
7162F479484J68598J94221K16113P023p531K0868k3801p5706p4697k30632j27718
7151F546222j78688j78787k96827k85520j01103k38095o2343k99603k86148j19998
7141D499110j66080k37226r7876k28769k30835r4577j04426j16588j53306r6958
7131B972469j64474P486q6903j06753j44149r7061r5603j34993q8846L8020j43525
7120A955668j13500J8640K416K1328K0489m6931j9143j3088Q2548j68825j36838
$$ plain form
7109 1602764 1643876 1695049 1774348 1850385 1787877 1623556 1682050 1708561 1684573 1611749 1520635
7098 1520635 1504963 1428628 1493459 1400258 1349394 1339032 1167855 1115049 1192331 1187865 1037006
7087 1037006 1154302 1093790 1050099 1056048 1081461 916773 850304 819274 782195 894898 972790
7076 972790 864047 778318 784483 885466 1044141 1017810 970172 998549 959908 973427 844918
7065 844918 999240 987955 994405 964309 930783 888447 962628 964886 893858 816082 747752 756966
7053 756966 767084 661110 691419 757301 755297 721185 708541 724569 595361 627237 687738
7042 687738 712376 701368 713094 702203 718493 647040 620231 665140 657865 552580 518631 502480
7030 502480 498932 530536 548079 587891 677621 697657 702913 570208 548978 557506 622809 601518
$$ packed form
7109A602764M1112N1173P9299P6037o2508j64321N8494K6511k3988p2824r1114
7098A520635j5672p6335O4831r3201n0864j0362j71177n2806P7282m466j50859
7087A037006J17296o0512m3691N949K5413j64688o6469l1030l7079J12703P7892
7076I72790j08743q5729O165J00983J58675k6331m7638K8377l8641J3519j28509
7065H44918J54322j1285O450l0096l3526m2336P4181K258p1028p7776o8330R214
7053G56966J0118j05974L0309O5882k004l4112j2644J6028j29208L1876O0501
7042F87738K4638j1008J1726j0891J6290p1453k6809M4909p275j05285l3949j6151
7030E02480l548L1604J7543L9812Q9730K0036N256j32705k1230Q528O5303k1291
$$ plain form
7018 601518 638579 613160 689958 804086 839916 697353 862321 1011310 941701 919353 939741
7007 939741 873849 884536 1086760 1138398 1200946 1152763 1239788 1254598 1213309 1213029 1220204 1374759
6995 1374759 1507349 1658424 1737914 1864673 2255741 2498936 2700161 2968030 2929649 2826270
6985 2826270 2745684 2581758 2553550 2539577 2502854 2575737 2751105 2947992 3142992 3181767 3242328
6974 3242328 3000990 2689053 2526456 2347745 2219265 2045489 1833167 1490130 1383322 1413331
6964 1413331 1436662 1325046 1265496 1239953 1203799 1123265 1124877 1060079 943607 851125 798399
6953 798399 801506 852429 979187 922665 909618 837480 968715 1123392 1216877 1112898 1071780
6942 1071780 1087233 1088995 1075024 1045742 1188106 1203183 1327093 1465138 1468761 1469186 1716243
$$ packed form
7018F01518L7061k5419P6798J14128L5830j42563J64968J48989o9609k2348K0388
7007I39741o5892J0687K02224N1638O2548m8183Q7025J4810m1289k80P175J54555
6995A374759J32590J51075P9490J26759L91068K43195K01225K67869l8381j03379
6985B826270q0586j63926k8208j3973l6723P2883J75368J96887J95000L8775O0561
6974C242328k41338l11937j62597j78711j28480j73776k12322l43037j06808L0009
6964A413331K3331j11616n9550k5543l6154q0534J612o4798j16472r2482n2726
6953G98399L107N0923J26758n6522j3047p2138J31235J54677R3485j03979m1118
6942A071780J5453J762j3971k9282J42364J5077J23910J38045L623M25K47057
$$ plain form
6931 1716243 1950462 2265131 2403156 2539257 2651047 2717347 2863496 2619678 2490246 2542203
6921 2542203 2698340 2614866 2550424 2633123 2859432 3060836 2982709 2908723 2836914 2638285 2392031
6910 2392031 2073197 1932326 1968675 1838566 1776467 1735371 1508033 1409252 1329405 1265944 1175152
6899 1175152 1184989 1166892 1027039 971255 1013962 1135895 1118646 1205287 1100923 1039252 1037525
6888 1037525 1025267 998800 922537 779792 831835 906871 876190 860080 801077 816595 743029
6877 743029 759331 779037 699983 774012 782342 689029 687975 674289 770543 845530 783353 804324
6865 804324 871635 854767 752525 686962 574854 490789 638778 710603 678736 664725 650773
6854 650773 690493 743213 641166 611108 733705 773600 654279 726736 810850 797123 773206
$$ packed form
6931A716243K34219L14669J38025J36101J11790O6300J46149k43818j29432N1957
6921B542203J56137q3474o4442Q2699K26309K01404p8127p3986p1809j98629k46254
6910B392031l18834j40871L6349j30109o2099m1096k27338r8781p9847o3461r0792
6899A175152R837j8097j39853n5784M2707J21933j7249Q6641j04364o1671j727
6888A037525j2258k6467p6263j42745N2043P5036l0681j6110n9003J5518p3566
6877G43029J6302J9706p9054P4029Q330r3313j054j3686R6254P4987o2177K0971
6865H04324O7311j6868j02242o5563j12108q4065J47989P1825l1867j4011j3952
6854F50773L9720N2720j02047l0058J22597L9895j19321P2457Q4114j3727k3917
$$ plain form
6843 773206 748102 814712 908470 797321 795607 816481 778078 780692 752023 808330 731716 640108
6831 640108 533105 661520 584451 600674 682665 684681 699790 679295 762542 778242 781228 778484
6819 778484 726899 615385 634277 785119 730422 661489 680773 619675 560108 588901 518746
6808 518746 596383 582896 584767 568635 575503 593971 621101 613579 643859 587695 539396 625340
6796 625340 632612 697668 649060 683835 728441 870186 651143 599807 561994 560836 594418 665502
6784 665502 656097 637058 708916 758257 758727 616366 695335 723058 696332 726617 780115 698455
6772 698455 661278 721779 717915 676853 594495 777964 765286 838587 984116 874720 878046
6761 878046 926044 879813 896693 817790 965198 1159121 1128290 1072378 1090537 1085624 1055595
$$ packed form
6843G73206k5104O6610R3758j11149j714K0874l8403K614k8669N6307p6614r1608
6831F40108j07003J28415p7069J6223Q1991K016J5109k0495Q3247J5700K986k744
6819G78484n1585j11514J8892J50842n4697o8933J9284o1098n9567K8793p0155
6808E18746P7637j3487J871j6132O868J8468K7130p522L0280n6164m8299Q5944
6796F25340P272O5056m8608L4775M4606J41745k19043n1336l7813j158L3582P1084
6784F65502r405j9039P1858M9341M70j42361P8969K7723k6726L0285N3498q1660
6772F98455l7177O0501l864m1062q2358J83469j2678P3301J45529j09396L326
6761H78046M7998m6231J6880p8903J47408J93923l0831n5912J8159m913l0029
$$ plain form
6750 1055595 1254971 1227178 1344030 1468351 1531745 1748255 1872580 2163730 2566078 2699323
6740 2699323 2865636 3108297 3236171 3411364 3424571 3373734 3325006 3214321 3060358 3290755
6730 3290755 3383471 3417157 3572221 3743874 3978578 4090520 4099592 3899751 3642171 3438639
6720 3438639 3210182 3111584 3286829 3354253 3411982 3431356 3538086 3807038 4036879 4025978
6710 4025978 4001541 4001392 3788321 3660004 3578507 3527853 3561055 3652483 3739451 3684775 3640724
6699 3640724 3659855 3554539 3269112 2991964 2796075 2714964 2470566 2279438 2192885 2150976
6689 2150976 2091674 1985544 1842845 1796494 1792566 1572641 1592141 1511437 1515878 1403683 1451326
6678 1451326 1576719 1391070 1367519 1128234 1159710 1203673 1158257 1195950 1251023 1252923 1253075
$$ packed form
6750A055595J99376k7793J16852J24321O3394K16510J24325K91150M02348J33245
6740B699323J66313K42661J27874J75193J3207n0837m8728j10685j53963K30397
6730C290755R2716L3686J55064J71653K34704J11942R072j99841k57580k03532
6720C438639k28457r8598J75245O7424N7729J9374J06730K68952K29841j0901
6710D025978k4437j49k13071j28317q1497n0654L3202R1428Q6968n4676m4051
6699C640724J9131j05316k85427k77148j95889q1111k44398j91128q6553m1909
6689B150976n9302j06130j42699m6351l928k19925J9500q0704M441j12195M7643
6678A451326J25393j85649k3551k39285L1476M3963m5416L7693N5073J900J52
$$ plain form
6667 1253075 1160656 1260310 1321479 1283967 1171554 1296698 1229609 1201743 1247351 1318830 1366714
6656 1366714 1284672 1215324 1250670 1254856 1200943 1214019 1279731 1402171 1331469 1236899 1224703
6645 1224703 1208480 1109144 1202303 1210354 1230430 1251382 1199659 1299076 1389616 1360614 1273801 1244745
6633 1244745 1337113 1246111 1218699 1334033 1269250 1306212 1312914 1359508 1328198 1237776 1216027
6622 1216027 1232632 1183912 1205798 1132635 1097910 1203664 1185664 1250883 1254942 1287985 1315111
6611 1315111 1374256 1306331 1257072 1240118 1264642 1236290 1270949 1316028 1329095 1200431 1113115
6600 1113115 1179443 1214902 1106378 1212575 1337590 1288281 1316849 1357922 1489645 1401775 1413792
6589 1413792 1513952 1468984 1490581 1507904 1504404 1600841 1692081 1746434 1785100 1589721 1611549
$$ packed form
6667A253075r2419R9654O1169l7512j12413J25144o7089k7866M5608P1479M7884
6656A366714q2042o9348L5346M186n3913J3076O5712J22440p0702r4570j2196
6645A224703j6223r9336R3159Q051K0076K0952n1723R9417R0540k9002q6813k9056
6633A244745R2368r1002k7412J15334o4783L6962O702M6594l1310r0422k1749
6622A216027J6605m8720K1886p3163l4725J05754j8000O5219M059L3043K7126
6611A315111N9145o7925m9259j6954K4524k8352L4659M5079J3067j28664q7316
6600A113115O6328L5459j08524J06197J25015m9309K8568M1073J31723q7870J2017
6589A413792J00160m4968K1597J7323l500R6437R1240N4353L8666j95379K1828
$$ plain form
6578 1611549 1629460 1540806 1545648 1701522 1718793 1674592 1680744 1792970 1762523 1764098 1780150 1795662
6566 1795662 1822494 1864791 2040382 2221741 2327929 2275663 2318553 2582387 2844716 2983324
6556 2983324 3149702 3394847 3627723 3790124 3795530 3808878 3688259 3663485 3540475 3430022
6546 3430022 3296902 3160485 3006897 2986733 2982511 2951607 2819076 2657403 2635544 2659902 2617566
6535 2617566 2599352 2628890 2448545 2314306 2355265 2311383 2213477 2113467 2150186 2175967 2096201
6524 2096201 2082341 1994409 1983843 1940282 2128071 2209972 2281118 2108379 2114911 2097360 2110976
6513 2110976 2116773 2059555 2083794 2022425 2037623 2109133 2022486 2148888 2117354 1951718 1969659
6502 1969659 1982824 2006829 2150676 2317443 2237641 2110053 1928941 1889135 1863967 1869841 1954777
$$ packed form
6578A611549J7911q8654M842J55874J7271m4201O152J12226l0447J575J6052J5512
6566A795662K6832M2297J75591J81359J06188n2266M2890K63834K62329J38608
6556B983324J66378K45145K32876J62401N406J3348j20619k4774j23010j10453
6546C430022j33120j36417j53588k0164m222l0904j32531j61673k1859K4358m2336
6535B617566j8214K9538j80345j34239M0959m3882r7906j00010L6719K5781p9766
6524B096201j3860q7932j0566m3561J87789Q1901P1146j72739O532j7551J3616
6513B110976N797n7218K4239o1369J5198P1510q6647J26402l1534j65636J7941
6502A969659J3165K4005J43847J66767p9802j27588j81112l9806k5168N874Q4936
$$ plain form
6491 1954777 2077792 2044653 2059019 2070478 2115067 2181567 2199138 2306874 2301156 2397530 2410057
6480 2410057 2375005 2362766 2398934 2315807 2390415 2402614 2339197 2336951 2419596 2532207 2551226
6469 2551226 2708793 2764447 2691224 2635389 2702290 2714688 2755571 2879005 3001569 3052566 3246496
6458 3246496 3330079 3309415 3433181 3534230 3411160 3379413 3701301 3752258 3819729 3815742 3970132
6447 3970132 4104113 4315887 4296141 4463008 4660046 4860925 5047219 5121136 5303205 5415171
6437 5415171 5520537 5680025 5796494 5767955 5930160 6093610 6292777 6383136 6592514 6895067
6427 6895067 7192864 7464380 7570897 7680384 8015192 8364426 8684042 9042109 9463608 9931089
6417 9931089 10340026 10847119 11179776 11712287 12297331 12833994 13498691 14278125 14954387 15743158
$$ packed form
6491A954777J23015l3139J4366J1459M4589O6500J7571J07736n718R6374J2527
6480B410057l5052j2239L6168q3127P4608J2199o3417k246Q2645J12611J9019
6469B551226J57567N5654p3223n5835O6901J2398M0883J23434J22564N0997J93930
6458C246496Q3583k0664J23766J01049j23070l1747L21888N0957O7471l987J54390
6447C970132J33981K11774j9746J66867J97038K00879J86294P3917J82069J11966
6437E415171J05366J59488J16469k8539J62205J63450J99167R0359K09378L02553
6427F895067K97797K71516J06517J09487L34808L49234L19616L58067M21499M67481
6417I931089M08937N07093L32657N32511N85044N36663O64697P79434O76262P88771
$$ plain form
6407 15743158 16484234 17546230 18729775 19926401 21327982 22810068 24722017 26829495
6399 26829495 29422350 32584803 36089000 39866256 44107548 49080405 54939371 62251292
6391 62251292 71434964 82749214 96336132 113094410 130771296 149075293 170305772
6384 170305772 191997983 204999770 207919094 201994492 182311488 159321446 139393994
6377 139393994 122908735 109564644 98426518 89038375 81281961 74752680 68796239 63298887
6369 63298887 58479682 54433567 50832479 47517046 44483275 41767163 39306074 37257883
6361 37257883 35256182 33373121 31722915 30407899 29176448 28169081 27384890 26474705
6353 26474705 25661852 25009140 24248651 23649533 23193815 22768373 22407586 21986622 21531848
$$ packed form
6407A5743158P41076J061996J183545J196626J401581J482086J911949K107478
6399B6829495K592855L162453L504197L777256M241292M972857N858966P311921
6391F2251292R183672J1314250J3586918J6758278J7676886J8303997K1230479
6384A70305772K1692211J3001787K919324n924602j9683004k2990042j9927452
6377A39393994j6485259j3344091j1138126r388143p756414o529281n956441n497352
6369F3298887m819205m046115l601088l315433l033771k716112k461089k048191
6361C7257883k001701j883061j650206j315016j231451j007367p84191r10185
6353B6474705q12853o52712p60489n99118m55718m25442l60787m20964m54774
$$ plain form
6344 21531848 21281275 21046010 20969249 21065497 21233091 21458169 21861401 22293918 22662090 23071797
6334 23071797 23347428 23307791 23059392 22452560 21509831 20650485 20130906 19562776 19076128 18904205
6324 18904205 18904327 18904306 18990752 19368682 19966924 20622713 21273642 21850876 22391113 22799843 22902927
6313 22902927 22592743 22112543 21493729 20738245 19715050 18780978 17982136 17305477 16722875
6304 16722875 16333685 15991798 15826070 15749328 15775129 15850181 15997511 16432369 16875955 17397343
6294 17397343 18195530 18925263 19712975 20182184 20517468 20585351 20530473 20363165 19826726 19102278
6284 19102278 18300331 17471695 16779540 16337494 15916785 15501634 15154008 15149368 15292709 15431654
6274 15431654 15788632 16295474 16805450 17109062 17300660 17334247 16917862 16387647 15756564 14860550
$$ packed form
6344B1531848k50573k35265p6761R6248J67594K25078M03232M32517L68172M09707
6334B3071797K75631l9637k48399o06832r42729q59346n19579n68130m86648j71923
6324A8904205J22k1Q6446L77930N98242O55789O50929N77234N40237M08730J03084
6313B2902927l10184m80200o18814p55484j023195r34072p98842o76659n82602
6304A6722875l89190l41887j65728p6742K5801P5052J47330M34858M43586N21388
6294A7397343P98187P29733P87712M69209L35284O7883n4878j67308n36439p24448
6284A9102278q01947q28636o92155m42046m20709m15151l47626m640J43341J38945
6274A5431654L56978N06842N09976L03612J91598L3587m16385n30215o31083q96014
$$ plain form
6264 14860550 14104269 13386948 12782922 12262334 11773198 11411001 11121233 10890969 10703266
6255 10703266 10478175 10385686 10251261 9951093 9830593 9650173 9551050 9368858 9331945 9099874
6245 9099874 8741647 8406512 8273701 8071613 7740960 7631572 7458653 7416601 7338201 7151402
6235 7151402 6932512 6734637 6617492 6296747 5984602 5806729 5564728 5297158 5137118 5010123
6225 5010123 4894650 4751875 4693885 4616082 4443734 4259187 4341454 4369160 4296491 4227150 4270852
6214 4270852 4164222 4119314 4130647 4051026 4037454 4043049 3899388 3931179 3725916 3571738 3705307
6203 3705307 3642006 3726558 3698190 3647171 3663900 3686543 3701240 3757912 3641136 3718022 3641980
6192 3641980 3619010 3530858 3518300 3558142 3508493 3525529 3603535 3373403 3447828 3456210 3424330
$$ packed form
6264A4860550p56281p17321o04026n20588m89136l62197k89768k30264j87703
6255A0703266k25091r2489j34425l00168j20500j80420r9123j82192l6913k32071
6245I099874l58227l35135j32811k02088l30653j09388j72919m2052p8400j86799
6235G151402k18890j97875j17145l20745l12145j77873k42001k67570j60040j26995
6225E010123j15473j42775n7990p7803j72348j84547Q2267K7706p2669o9341M3702
6214D270852j06630m4908J1333p9621j3572N595j43661L1791k05263j54178J33569
6203C705307o3301Q4552k8368n1019J6729K2643J4697N6672j16776P6886p6042
6192C641980k2970q8152j2558L9842m9649J7036P8006k30132P4425Q382l1880
$$ plain form
6181 3424330 3440550 3419092 3356140 3279758 3308828 3319228 3322125 3289070 3287444 3278168 3223402 3186696
6169 3186696 3213681 3107235 3063439 2926494 3018063 3147531 3091196 3108171 3161862 3076858 3113197
6158 3113197 2968633 2890703 2954047 3026063 2991970 3019618 3066986 2959410 2813347 2777579 2789021
6147 2789021 2756190 2665570 2484731 2542152 2529744 2446856 2426503 2390809 2370486 2379642 2398344
6136 2398344 2298317 2300294 2298100 2316242 2052058 1979598 2039452 2056526 2131765 1927670 1810387
6125 1810387 1850116 1759082 1730692 1802171 1705800 1747446 1747012 1817702 1807113 1643843 1656792 1820154
6113 1820154 1792450 1756766 1752551 1859274 1800469 1745826 1721438 1629451 1833793 1912458 1859771
6102 1859771 1746388 1854677 1764596 1756475 1791552 1776335 1767421 1803407 1729222 1723523 1711673 1708449
$$ packed form
6181C424330J6220k1458o2952p6382K9070J0400K897l3055j626r276n4766l6706
6169C186696K6985j06446m3796j36945R1569J29468n6335J6975N3691q5004L6339
6158C113197j44564p7930O3344P2016l4093K7648M7368j07576j46063l5768J1442
6147B789021l2831r0620j80839N7421j2408q2888k0353l5694k0323R156J8702
6136B398344j00027J977k194J8142k64184p2460N9854J7074P5239k04095j17283
6125A810387L9729r1034k8390P1479r6371M1646m34P0690j0589j63270J2949J63362
6113A820154k7704l5684m215J06723n8805n4643k4388r1987K04342P8665n2687
6102A859771j13383J08289r0081q121L5077j5217q914L5986p4185n699j1850l224
$$ plain form
6090 1708449 1777668 1767998 1670430 1674692 1704806 1673912 1600948 1743992 1647994 1758087 1832932
6079 1832932 1884961 1897442 1856728 1821167 1881201 1911250 1882629 1915565 2006631 2060127 1968939
6068 1968939 1960249 2079688 2228150 2259598 2341983 2327270 2486743 2492390 2555186 2602281 2692492
6057 2692492 2821491 2769198 2700412 2600160 2574948 2491647 2340256 2413424 2395795 2422140 2317892
6046 2317892 2420352 2341884 2431854 2577084 2638293 2648431 2709707 2618995 2538498 2632763 2682317
6035 2682317 2608779 2499783 2531470 2643005 2555750 2545334 2629904 2721944 2865883 2933060 2832955
6024 2832955 2771708 2747683 2764592 2746969 2840382 2955597 2878453 2766746 2750278 2737762 2718007
6013 2718007 2650402 2536393 2619342 2592014 2598721 2635091 2553151 2577689 2663207 2572808 2405705
$$ packed form
6090A708449O9219r670r7568M262L0114l0894p2964J43044r5998J10093P4845
6079A832932N2029J2481m0714l5561O0034L0049k8621L2936R1066N3496r1188
6068A968939q690J19439J48462L1448Q2385j4713J59473N647O2796M7095R0211
6057B692492J28999n2293o8786j00252k5212q3301j51391P3168j7629K6345j04248
6046B317892J02460p8468Q9970J45230O1209J0138O1276r0712q0497R4265M9554
6035B682317p3538j08996L1687J11535q7255j0416Q4570R2040J43939O7177j00105
6024B832955o1247k4025J6909j7623R3413J15215p7144j11707j6468j2516j9755
6013B718007o7605j14009Q2949k7328O707L6370q1940K4538Q5518r0399j67103
$$ plain form
6002 2405705 2513978 2428453 2351828 2379359 2438547 2385094 2479667 2558520 2401557 2531360 2619498
5991 2619498 2601998 2626094 2667697 2743422 2858800 2845135 2790166 2740666 2785736 2951802 3108526
5980 3108526 3122967 3141506 3118515 3170790 3303399 3414726 3443904 3457863 3745268 3805824 3803331
5969 3803331 3854430 3982887 4213191 4348608 4327080 4218630 4229239 4248939 4052459 3908037
5959 3908037 3891589 3788736 3721365 3608388 3577268 3432917 3380441 3355606 3431338 3344207 3275465
5948 3275465 3301967 3317572 3246562 3143938 3120789 3109893 3086349 3124094 3155519 3185717 3186479 3205317
5936 3205317 3249873 3251991 3228761 3217789 3096098 3133410 3400419 3516990 3402811 3336082 3313867
5925 3313867 3270908 3372067 3344105 3287083 3280269 3257598 3313335 3284895 3093734 3096316 3116816
$$ packed form
6002B405705J08273q5525p6625K7531N9188n3453R4573P8853j56963J29803Q8138
5991B619498j7500K4096M1603P5725J15378j3665n4969m9500M5070J66066J56724
5980C108526J4441J8539k2991N2275J32609J11327K9178J3959K87405O0556k493
5969C803331N1099J28457K30304J35417k1528j08450J0609J9700j96480j44422
5959C908037j6448j02853o7371j12977l1120j44351n2476k4835P5732q7131o8742
5948C275465K6502J5605p1010j02624k3149j0896k3544L7745L1425L0198P62J8838
5936C205317M4556K118k3230j0972j21691L7312K67009J16571j14179o6729k2215
5925C313867m2959J01159k7962n7022o814k2671N5737k8440j91161K582K0500
$$ plain form
5914 3116816 2930236 3080484 2983884 2877640 2896367 2909381 2899360 3005702 3009109 3092917 3079584
5903 3079584 3035873 3216540 3324989 3340774 3374482 3449950 3341826 3382115 3414422 3323970 3393801
5892 3393801 3392907 3355404 3343843 3247679 3159641 3231500 3150442 3052281 3040894 3030400 2926765 2946531
5880 2946531 2857455 2714413 2830164 2898941 2806756 2802541 2682413 2385730 2509689 2675232
5870 2675232 2592938 2559070 2514397 2531270 2542365 2395193 2460959 2542431 2510205 2453683 2454205 2381483
5858 2381483 2386809 2292785 2244334 2224607 2274224 2159140 2172621 2220684 2206922 2254252 2360039
5847 2360039 2315774 2352141 2380762 2351501 2318388 2170538 2193774 2205573 2182053 2162680 2177172
5836 2177172 2159092 2108314 2037805 2145248 2335125 2269197 2208487 2274803 2437687 2506609 2499977
$$ packed form
5914C116816j86580J50248r6600j06244J8727J3014j0021J06342L407Q3808j3333
5903C079584m3711J80667J08449J5785L3708P5468j08124M0289L2307r0452O9831
5892C393801q94l7503j1561r6164q8038P1859q1058r8161j1387j0494j03635J9766
5880B946531q9076j43042J15751O8777r2185m215j20128k96683J23959J65543
5870B675232q2294l3868m4673J6873J1095j47172O5766Q1472l2226n6522N22p2722
5858B381483N326r4024m8451j9727M9617j15084J3481M8063j3762M7330J05787
5847B360039m4265L6367K8621k9261l3113j47850K3236J1799k3520j9373J4492
5836B177172j8080n0778p0509J07443J89877o5928o0710O6316J62884O8922o632
$$ plain form
5825 2499977 2452888 2466787 2441799 2406166 2475305 2593132 2591601 2716484 2755204 2713758 2693804
5814 2693804 2860334 2903611 2964005 2899782 2745857 2592740 2604742 2638720 2494230 2379168
5804 2379168 2358409 2355726 2345425 2361704 2315278 2321495 2275764 2252864 2158468 2220344 2262537 2224730
5792 2224730 2175919 2220198 2198433 2099417 2105192 2150718 2020344 2027649 2139438 2258457 2222095
5781 2222095 2200372 2129328 2216987 2267392 2303504 2406289 2302020 2410674 2406245 2406857 2357149
5770 2357149 2307236 2358808 2349141 2415372 2487288 2445013 2506228 2642746 2617791 2635831 2615543
5759 2615543 2609715 2610937 2666175 2673429 2709441 2678438 2481301 2452138 2436614 2385197 2528319 2698496
5747 2698496 2666583 2615162 2609783 2685012 2627550 2633085 2649112 2594460 2598382 2619713 2702937 2703602
$$ packed form
5825B499977m7089J3899k4988l5633O9139J17827j531J24883L8720m1446j9954
5814B693804J66530M3277O0394o4223j53925j53117J2002L3978j44490j15062
5804B379168k0759k683j0301J6279m6426O217m5731k2900r4396O1876M2193l7807
5792B224730m8811M4279k1765r9016N775M5526j30374P305J11789J19019l6362
5781B222095k1723p1044Q7659N0405L6112J02785j04269J08654m429O12m9708
5770B357149m9913N1572r667O6231P1916m2275O1215J36518k4955J8040k0288
5759B615543n828J222N5238P254L6012l1003j97137k9163j5524n1417J43122J70177
5747B698496l1913n1421n379P5229n7462N535J6027n4652L922K1331Q3224O65
$$ plain form
5735 2703602 2808320 2891808 2792918 2748754 2868588 3003672 3039471 3214557 3301630 3402462
5725 3402462 3514050 3404983 3481366 3458311 3455277 3471819 3324738 3220118 3155095 3227468 3190154
5714 3190154 3151024 3217905 3191247 3274662 3273960 3272013 3359119 3366068 3339260 3481459 3646653 3658834
5702 3658834 3698872 3695411 3921373 4023641 4149474 4313818 4463952 4570691 4623454 4831391
5692 4831391 4737435 4672226 4545182 4398337 4259501 4062303 4030052 4167588 4129518 4013887
5682 4013887 4148364 4145796 4064533 4022035 3954740 4037485 4041908 4003203 4014981 4058450 3943175
5671 3943175 3951997 4011805 4144241 4398563 4455884 4398922 4383873 4598164 4814685 4893096 5038434
5660 5038434 5153746 5181373 5016402 4921913 4843115 4839650 4738650 4738750 4827763 4806009 4795639
$$ packed form
5735B703602J04718Q3488r8890m4164J19834J35084L5799J75086Q7073J00832
5725C402462J11588j09067P6383k3055l034J6542j47081j04620o5023P2373l7314
5714C190154l9130O6881k6658Q3415p02j947Q7106O949k6808J42199J65194J2181
5702C658834M0038l461K25962J02268J25833J64344J50134J06739N2763K07937
5692D831391r3956o5209j27044j46845j38836j97198l2251J37536l8070j15631
5682D013887J34477k568q1263m2498o7295Q2745M423l8705J1778M3469j15275
5671C943175Q822N9808J32436K54322N7321n6962j5049K14291K16521P8411J45338
5660E038434J15312K7627j64971r4489p8798l465j01000J00Q9013k1754j0370
$$ plain form
5649 4795639 4850457 4893029 4896295 4947639 5087778 5022837 5078233 5250034 5405436 5460810 5574051
5638 5574051 5740419 5864980 5965913 6175372 6378327 6482670 6605692 6733643 6973283 7272515
5628 7272515 7653738 7726292 7828269 7894873 8277836 8693891 9032818 9395564 9808394 10244181
5618 10244181 10727469 11267915 11734768 12418413 13043038 13761546 14740943 15750450 16992826
5609 16992826 18168653 19597693 21122047 22767572 24568172 26510747 28620601 30848990
5601 30848990 33144680 35286918 37458403 39552492 41474317 43112837 44172441 44782256
5593 44782256 44907671 44451476 43676715 42597180 41184484 39514282 37618686 35671883 33859231
5584 33859231 32023016 30161880 28485070 26808506 25164542 23718858 22482391 21259675
$$ packed form
5649D795639N4818M2572L266N1344J40139o4941N5396J71801J55402N5374J13241
5638E574051J66368J24561J00933K09459K02955J04343J23022J27951K39640K99232
5628G272515L81223P2554J01977O6604L82963M16055L38927L62746M12830M35787
5618A0244181M83288N40446M66853O83645O24625P18508R79397J009507J242376
5609A6992826J175827J429040J524354J645525J800600J942575K109854K228389
5601C0848990K295690K142238K171485K094089J921825J638520J059604O09815
5593D4782256J25415m56195p74761j079535j412696j670202j895596j946803j812652
5584C3859231j836215j861136j676810j676564j643964j445684j236467j222716
$$ plain form
5576 21259675 20221220 19220315 18374653 17392784 16487402 15834329 15140151 14398043 13787507
5567 13787507 13314657 12897181 12584473 12088144 11614192 11223606 11006273 10656783 10263265
5558 10263265 10044781 9832748 9647430 9392806 9160338 8974697 8791980 8472920 8288749
5549 8288749 8029986 7664745 7454492 7382244 7321172 7212962 7011030 6829516 6629656 6424960
5539 6424960 6241899 6172233 6021032 5971715 5815475 5667283 5432250 5257927 5357287 5326958
5529 5326958 5284255 5140517 5090443 4973162 4818095 4772114 4629545 4498901 4424241 4323493
5519 4323493 4375111 4290690 4288502 4196815 4213662 4249443 4177224 4121341 4213531 4188753 4167777 4109096
5507 4109096 4072468 4042042 3933946 3889847 4027465 3851475 3851423 3939344 3709129 3640610 3748425
$$ packed form
5576B1259675j038455j000905q45662r81869r05382o53073o94178p42108o10536
5567A3787507m72850m17476l12708m96329m73952l90586k17333l49490l93518
5558A0263265k18484k12033j85318k54624k32468j85641j82717l19060j84171
5549H288749k58763l65241k10253p2248o1072j08210k01932j81514j99860k04696
5539F424960j83061o9666j51201m9317j56240j48192k35033j74323R9360l0329
5529E326958m2703j43738n0074j17281j55067m5981j42569j30644p4660j00748
5519D323493N1618q4421k188r1687J6847L5781p2219n5883R2190k4778k0976n8681
5507D109096l6628l0426j08096m4099J37618j75990n2Q7921k30215o8519J07815
$$ plain form
5496 3748425 3810551 3732605 3579208 3448255 3469897 3464493 3468689 3452669 3408118 3322717 3289572
5485 3289572 3279580 3272506 3293631 3343467 3314552 3314020 3283548 3192699 3206416 3203796 3141468 3199027
5473 3199027 3239694 3280542 3125484 3227581 3405882 3446423 3350220 3238410 3273381 3248103 3270951
5462 3270951 3452491 3724898 3707013 3782968 3961052 4184825 4340160 4603843 4620291 4743809
5452 4743809 4758606 4638619 4678411 4672101 4596572 4670048 4764313 4804968 4861228 4918357 4880767
5441 4880767 4671893 4547904 4386430 4253857 4004276 3950964 4002475 3936746 3802852 3811785
5431 3811785 3732178 3670927 3716041 3656010 3484299 3552664 3671596 3490075 3592063 3814917
5421 3814917 3988497 4028608 3993284 3926284 4091999 4243401 4304578 4359285 4456790 4556841 4552371
$$ packed form
5496C748425O2126p7946j53397j30953K1642n404M196j6020m4551q5401l3145
5485C289572r992p074K1125M9836k8915n32l0472r0849J3717k620o2328N7559
5473C199027M0667M0848j55058J02097J78301M0541r6203j11810L4971k5278K2848
5462C270951J81540K72407j7885P5955J78084K23773J55335K63683J6448J23518
5452D743809J4797j19987L9792o310p5529P3476R4265M0655N6260N7129l7590
5441D880767k08874j23989j61474j32573k49581n3312N1511o5729j33894Q933
5431C811785p9607o1251M5114o0031j71711O8365J18932j81521J01988K22854
5421C814917J73580M0111l5324o7000J65715J51402O1177N4707R7505J00051m470
$$ plain form
5410 4552371 4511755 4472123 4405955 4406600 4421316 4284643 4252307 4207935 4139801 4070255 3956405
5399 3956405 3708256 3597377 3561751 3476238 3453180 3422117 3282155 3260153 3358893 3357532 3247505
5388 3247505 3259961 3143206 3030153 3056731 2996814 3041699 3172279 3130260 2972352 2919435 2892792
5377 2892792 2934673 2963926 2993969 3038099 3018265 2912745 2912500 2955240 2899311 2842450 2921820 2952242
5365 2952242 2870026 2752441 2687353 2594708 2563548 2571191 2509851 2426061 2538194 2553497 2524943
5354 2524943 2533673 2486778 2483988 2452257 2497358 2414234 2282278 2260282 2337008 2382128 2431292 2405305
5342 2405305 2325969 2378606 2385969 2253110 2271293 2318115 2553051 2541337 2544769 2569362 2584020
5331 2584020 2422175 2533056 2737345 2853378 2759380 2803278 2760308 2761118 2804653 2825887 2938217
$$ packed form
5410D552371m0616l9632o6168O45J4716j36673l2336m4372o8134o9546j13850
5399C956405k48149j10879l5626q5513k3058l1063j39962k2002R8740j361j10027
5388C247505J2456j16755j13053K6578n9917M4885J30580m2019j57908n2917k6643
5377B892792M1881K9253L0043M4130j9834j05520k45M2740n5929n6861P9370L0422
5365B952242q2216j17585o5088r2645l1160P643o1340q3790J12133J5303k8554
5354B524943Q730m6895k790l1731M5101q3124j31956k1996P6726M5120M9164k5987
5342B405305p9336N2637P363j32859J8183M6822K34936j1714L432K4593J4658
5331B584020j61845J10881K04289J16033r3998M3898m2970Q10M3535K1234J12330
$$ plain form
5320 2938217 3014822 3041778 2904388 2823096 2807727 2809324 2794922 2715607 2577230 2593355 2610603
5309 2610603 2767294 2871895 2757228 2660476 2660419 2684049 2789508 2791355 2786038 2734201 2723459 2798343
5297 2798343 2831973 2843345 2884011 2870615 2909264 2961011 2949302 3020780 3001275 2952575 3067592
5286 3067592 3160685 3154606 3121633 2995750 3092382 3108459 2963658 2890494 2865899 2855243 2909825
5275 2909825 2938127 3018161 3061066 3017650 3163233 3237797 3284581 3267673 3264544 3372277 3553606
5264 3553606 3641381 3702094 3703842 3839709 3986925 4050063 3977451 4000246 4002264 3917921 3832738
5253 3832738 3867130 3947149 4055189 4194067 4163851 4196332 4286828 4288969 4329007 4373676 4315981
5242 4315981 4157781 4214121 4271886 4171845 4128255 4290121 4295645 4497119 4522347 4522181 4498605
$$ packed form
5320B938217P6605K6956j37390q1292j5369J597j4402p9315j38377J6125J7248
5309B610603J56691J04601j14667r6752n7K3630J05459J847n317n1837j0742P4884
5297B798343L3630J1372M0666j3396L8649N1747j1709P1478j9505m8700J15017
5286C067592R3093o079l2973j25883R6632J6077j44801p3164k4595j0656N4582
5275B909825K8302Q0034M2905m3416J45583P4564M6784j6908l129J07733J81329
5264C553606Q7775O0713J748J35867J47216O3138p2612K2795K018q4343q5183
5253C832738L4392Q0019J08040J38878l0216L2481R0496K141M0038M4669n7695
5242D315981j58200N6340N7765j00041m3590J61866N524K01474K5228j66k3576
$$ plain form
5231 4498605 4494711 4695155 4829146 4914536 4953164 4994190 5215135 5272707 5426049 5643822 5734830
5220 5734830 5989141 6057475 6240750 6452279 6558882 6635619 6828356 6823822 6788355 6858729 7072315
5209 7072315 7169848 7272049 7453301 7665508 7858801 7969208 8156393 8078568 8151372 8240216
5199 8240216 8208418 8174693 8089295 8104069 8192990 8242682 8333486 8365164 8481160 8761579 9035482
5188 9035482 9218097 9439394 9828579 10253274 10544313 10899841 11386926 11828992 12104433 12716154
5178 12716154 13376711 13869808 14449700 14906235 15389896 16046463 16618895 17165484 17572867
5169 17572867 18260094 18945870 19574774 20218619 20970885 21685693 22362281 22878479 23482526
5160 23482526 24263680 25185776 25984233 26713290 27443965 28490401 29861638 31244378 32620038
$$ packed form
5231D498605l894K00444J33991Q5390L8628M1026K20945N7572J53342K17773R1008
5220E734830K54311O8334J83275K11529J06603P6737J92737m534l5467P0374K13586
5209G072315R7533J02201J81252K12207J93293J10407J87185p7825P2804Q8844
5199H240216l1798l3725q5398J4774Q8921M9692R0804L1678J15996K80419K73903
5188I035482J82615K21297L89185M24695K91039L55528M87085M42066K75441O11721
5178A2716154O60557M93097N79892M56535M83661O56567N72432N46589M07383
5169A7572867O87227O85776O28904O43845P52266P14808O76588N16198O04047
5160B3482526P81154R22096P98457P29057P30675J046436J371237J382740J375660
$$ plain form
5151 32620038 34320033 36249476 38624000 41466465 44726159 48720547 53430557 58683663
5143 58683663 64612395 71484314 79067752 88156523 98999740 112489918 128947183 148702839
5135 148702839 173266233 200387208 227365629 258279763 291968188 317019106 325203181
5128 325203181 321600668 298004922 263314882 233032795 208053976 188448114 172554170
5121 172554170 160209888 149950523 140324898 130670091 120087838 109098541 99634862
5114 99634862 91325273 83941168 77353075 71818918 66662266 62224969 58150471 54232213
5106 54232213 50665537 47508918 44874002 42495040 40539230 38921016 37066464 35439116
5098 35439116 33887617 32580344 31333339 30137205 28903421 27769256 26701078 25718619
$$ packed form
5151C2620038J699995J929443K374524K842465L259694L994388M710010N253106
5143E8683663N928732O871919P583438R088771J0843217J3490178J6457265J9755656
5135A48702839K4563394K7120975K6978421L0914134L3688425K5050918Q184075
5128C25203181l602513k3595746l4690040l0282087k4978819j9605862j5893944
5121A72554170j2344282j0259365r625625r654807j0582253j0989297r463679
5114I9634862q309589p384105o588093n534157n156652m437297m074498l918258
5106E4232213l566676l156619k634916k378962j955810j618214j854552j627348
5098C5439116j551499j307273j247005j196134j233784j134165j068178r82459
$$ plain form
5090 25718619 24821812 24174195 23414102 22716601 21810621 20993847 20155042 19565686 18853929
5081 18853929 18351662 17910303 17422369 16980041 16490567 16059473 15670635 15270150 15086287
5072 15086287 14867161 14564522 14398401 14226196 14120202 13988102 13878249 13875277 13901442 13750844
5062 13750844 13717979 13843171 13712514 13571659 13413043 13191900 13010709 12798360 12505184 12280141
5052 12280141 12016805 11809532 11617133 11376180 11189566 11147886 10912500 10714540 10703309 10700492
5042 10700492 10668571 10581971 10564442 10448498 10354572 10304046 10220954 10133032 10041568 10062161 9999944
5031 9999944 10030237 9841978 9744301 9869609 9777067 9711663 9627423 9513038 9579352 9497097 9415582
5020 9415582 9478869 9478999 9468918 9470624 9467732 9627004 9663470 9626943 9643704 9728420 9914931 10070400
$$ packed form
5090B5718619q96807o47617p60093o97501r05980q16774q38805n89356p11757
5081A8853929n02267m41359m87934m42328m89474m31094l88838m00485j83863
5072A5086287k19126l02639j66121j72205j05994j32100j09853k972K6165j50598
5062A3750844l2865J25192j30657j40855j58616k21143j81191k12349k93176k25043
5052A2280141k63336k07273j92399k40953j86614m1680k35386j97960j1231k817
5042A0700492l1921q6600j7529j15944r3926n0526q3092q7922r1464K0593o2217
5031I999944L0293j88259r7677J25308r2542o5404q4240j14385O6314q2255q1515
5020I415582O3287J30j0081J706k892J59272L6466l6527J6761Q4716J86511J55469
$$ plain form
5008 10070400 10379811 10600217 10764049 10875870 10976529 11125793 11344735 11514962 11814522
4999 11814522 11991100 12297917 12534689 12436436 12510710 12425589 12166885 11780479 11492164 11242937
4989 11242937 11029341 10973966 10940001 10941777 10749528 10704163 10779739 10868395 11025697 11065758 10940147
4978 10940147 11053970 11064773 11154632 11385782 11448331 11459843 11437504 11377571 11562078 11573459 11692398
4967 11692398 11765875 11923364 12051560 12151120 12298169 12293224 12339973 12518569 12679014 12955077
4957 12955077 13082677 13304960 13567591 13721404 13998287 14261509 14516876 14834146 15222200
4948 15222200 15547150 15984409 16537693 17001713 17507503 18122205 18875934 19480203 20282247
4939 20282247 21226357 22083577 23017367 23887308 24992165 26148829 27369576 28627554 30222161
$$ packed form
5008A0070400L09411K20406J63832J11821J00659J49264K18942J70227K99560
4999A1814522J76578L06817K36772r8253P4274q5121k58704l86406k88315k49227
4989A1242937k13596n5375l3965J776j92249m5365P5576Q8656J57302M0061j25611
4978A0940147J13823J0803Q9859K31150O2549J1512k2339n9933J84507J1381J18939
4967A1692398P3477J57489J28196R9560J47049m945M6749J78596J60445K76063
4957A2955077J27600K22283K62631J53813K76883K63222K55367L17270L88054
4948A5222200L24950M37259N53284M64020N05790O14702P53729O04269Q02044
4939B0282247R44110Q57220R33790Q69941J104857J156664J220747J257978J594607
$$ plain form
4930 30222161 32005914 33807541 35742790 37848144 40182776 42636818 45070829 47599591
4922 47599591 49961903 52175066 54163813 55648968 56624638 57348227 57550156 57304134 56915892
4913 56915892 56218928 55650838 55144144 54359616 53406153 52511103 51509918 50354787 49118981
4904 49118981 47888449 46857463 45830925 44840315 43960761 43254259 42661251 42205459 41577915
4895 41577915 41196858 41021659 40970012 40948154 40872296 40795012 40661091 40614428 40492888 39981903
4885 39981903 39157190 38368829 37246932 35908579 34605671 33430284 32454057 31533010 30831767
4876 30831767 30389365 29992839 29718084 29609132 29390181 28986862 28839032 28535982 28102032
4867 28102032 27832113 27449982 27326936 27416123 27388633 27622939 27836255 27793418 27793344 27511894 27005183
$$ packed form
4930C0222161J783753J801627J935249K105354K334632K454042K434011K528762
4922D7599591K362312K213163J988747J485155R75670P23589K01929k46022l88242
4913E6915892o96964n68090n06694p84528r53463q95050j001185j155131j235806
4904D9118981j230532j030986j026538r90610q79554p06502n93008m55792o27544
4895D1577915l81057j75199n1647k1858p5858p7284j33921m6663j21540n10985
4885C9981903q24713p88361j121897j338353j302908j175387r76227r21047p01243
4876C0831767m42402l96526k74755j08952k18951m03319j47830l03050m33950
4867B8102032k69919l82131j23046Q9187k7490K34306K13316m2837p4k81450n06711
$$ plain form
4856 27005183 26315800 25110063 23870481 22770598 21735281 20749771 20014848 19138607 18379454
4847 18379454 17789979 17194486 16693230 16216473 15882365 15295666 14855464 14459385 14137988
4838 14137988 13902479 13571205 13138885 12879820 12615498 12370843 12144744 11877710 11607534
4829 11607534 11274667 11136883 11026592 10869861 10613855 10415333 10315296 10249944 10152482 10049634
4819 10049634 9916531 9927937 9937214 10065520 10164455 10251658 10345784 10330143 10367524 10384310 10172618
4808 10172618 9867172 9716104 9548288 9407074 9373520 9388408 9266794 9100228 9014148 9032829
4798 9032829 8982320 8909930 8922193 8958350 8721981 8694875 8742048 8731974 8805693 8837362 8810534
4787 8810534 8924242 8984676 8929312 8833165 8658334 8667942 8556962 8557133 8521370 8504027 8298054
$$ packed form
4856B7005183o89383j205737j239582j099883j035317r85510p34923q76241p59153
4847A8379454n89475n95493n01256m76757l34108n86699m40202l96079l21397
4838A4137988k35509l31274m32320k59065k64322k44655k26099k67034k70176
4829A1607534l32867j37784j10291j56731k56006j98522j00037o5352r7462j02848
4819A0049634j33103J1406R277J28306R8935Q7203R4126j5641L7381J6786k11692
4808A0172618l05446j51068j67816j41214l3554J4888j21614j66566q6080J8681
4798I032829n0509p2390J2263L6157k36369k7106M7173j0074P3719L1669k6828
4787H810534J13708O0434n5364r6147j74831R608j10980J71l5763j7343k05973
$$ plain form
4776 8298054 8364998 8517092 8375803 8259105 8242536 8232466 8116486 8100063 8094712 8190822 8276622
4765 8276622 8262142 8228436 8247081 8155168 8154609 8266565 8358728 8431299 8550503 8579363 8684053
4754 8684053 8585466 8660003 8724281 8790329 8824878 8707294 8880512 8911967 8844223 8968298 8961181
4743 8961181 9111692 9158106 9335307 9480629 9737851 9931233 10290116 10602175 10703550 11067739
4733 11067739 11544840 12025217 12543221 13252314 13879721 14738871 15686762 16705600 18015106
4724 18015106 19546958 21556840 23826323 26581322 30136874 34433431 38599936 43072086
4716 43072086 48423848 53067649 55459385 55625571 53395146 48395032 43369612 38889229
4708 38889229 35201940 32330876 30130418 28227334 26608290 25185060 23844111 22700654
$$ packed form
4776H298054O6944J52094j41289j16698j6569j0070j15980j6423n351R6110Q5800
4765H276622j4480l3706J8645r1913n59J11956R2163P2571J19204K8860J04690
4754H684053r8587P4537O4278O6048L4549j17584J73218L1455o7744J24075p117
4743H961181J50511M6414J77201J45322K57222J93382L58883L12059J01375L64189
4733A1067739M77101M80377N18004P09093O27407Q59150R47891J018838J309506
4724A8015106J531852K009882K269483K754999L555552M296557M166505M472150
4716D3072086N351762M643801K391736J66186k230425n000114n025420m480383
4708C8889229l687289k871064k200458j903084j619044j423230j340949j143457
$$ plain form
4700 22700654 21780901 20980119 20356846 19802251 19307510 18969603 18589281 18119933 17814905
4691 17814905 17668057 17609592 17516865 17672534 17790021 18139176 18503902 18875897 19270242 19752886
4681 19752886 20446084 20940530 21384272 21976191 22220329 22416875 22778210 23358499 23922264
4672 23922264 24581296 25562192 26495799 27478830 28486962 29145099 29540870 29929559 29878358
4663 29878358 29525876 29398542 29460427 29630091 30054797 30822471 32058595 33361038 34889572
4654 34889572 36780987 39036816 41622079 44667856 48294605 52620322 57697081 63373367
4646 63373367 69588407 76191975 82724850 88461257 92725969 95073938 94408185 91246706
4638 91246706 86304493 80340694 74195601 68748890 64062760 60281550 57014609 54457252
$$ packed form
4700B2700654r19753q00782o23273n54595m94741l37907l80322m69348l05028
4691A7814905j46848n8465r2727J55669J17487L49155L64726L71995L94345M82644
4681A9752886O93198M94446M43742N91919K44138J96546L61335N80289N63765
4672B3922264O59032R80896R33607R83031J008132O58137L95771L88689n1201
4663B9878358l52482j27334O1885J69664M24706P67674J236124J302443J528534
4654C4889572J891415K255829K585263L045777L626749M325717N076759N676286
4646F3373367O215040O603568O532875N736407M264712K347969o65753l161479
4638I1246706m942213n963799o145093n446711m686130l781210l266941k557357
$$ plain form
4630 54457252 52392248 50657062 49052795 47659678 46311736 44878277 43386851 41641344
4622 41641344 39855376 37894508 36059622 34214917 32610695 31399157 30225265 29351336
4614 29351336 28484025 27707307 26955717 26243609 25712398 24990447 24380532 23739034 23114256
4605 23114256 22581171 21954593 21300497 20773908 20394901 19824335 19159881 18675020 18416892
4596 18416892 18066951 17666081 17235821 16931970 16623169 16333025 16324389 16170155 16028180 16067941
4586 16067941 16185688 16164830 16356666 16610711 16941536 17135790 17423261 17686139 17865878 18105682
4576 18105682 18264905 18306677 18417932 18423716 18344904 18371822 18249880 18163895 17991242 17746483
4566 17746483 17574527 17600455 17593993 17539730 17350794 17042985 16779163 16461902 16031142 15539179
$$ packed form
4630E4457252k065004j735186j604267j393117j347942j433459j491426j745507
4622D1641344j785968j960868j834886j844705j604222j211538j173892q73929
4614B9351336q67311p76718p51590p12108n31211p21951o09915o41498o24778
4605B3114256n33085o26578o54096n26589l79007n70566o64454m84861k58128
4596A8416892l49941m00870m30260l03851l08801k90144q636j54234j41975L9761
4586A6067941J17747k0858J91836K54045L30825J94254K87471K62878J79739K39804
4576A8105682J59223M1772J11255N784p8812K6918j21942q5985j72653k44759
4566A7746483j71956K5928o462n4263j88936l07809k63822l17261m30760m91963
$$ plain form
4556 15539179 15273485 15070534 15072110 14821062 14496918 14535307 14484467 14602193 14839630 14952330
4546 14952330 15237398 15458759 15935312 16408126 16798457 17334831 17956945 18568694 19320290
4537 19320290 19971795 20457563 20886141 21217397 21485124 21571656 21529747 21796454 21908001 22149223
4527 22149223 22487564 22746234 23172396 23794166 24495547 25174977 26089511 26969660 27886919
4518 27886919 29078010 30326984 31752726 33647408 35800395 38467465 41766076 45793943
4510 45793943 50246186 54881934 59569008 64235654 67885080 69643740 68800498 65847681
4502 65847681 60893178 55367957 50356559 45911256 42181853 38983555 36184980 33861504
4494 33861504 31928572 29980663 28044091 26423996 24941201 23576053 22410357 21469703
$$ packed form
4556A5539179k65694k02951J576k51048l24144L8389n0840J17726K37437J12700
4546A4952330K85068K21361M76553M72814L90331N36374O22114O11749P51596
4537A9320290O51505M85768M28578L31256K67727Q6532m1909K66707J11547K41222
4527B2149223L38341K58670M26162O21770P01381O79430R14534Q80149R17259
4518B7886919J191091J248974J425742J894682K152987K667070L298611M027867
4510D5793943M452243M635748M687074M666646L649426J758660q43242k952817
4502F5847681m954503n525221n011398m445303l729403l198298k798575k323476
4494C3861504j932932j947909j936572j620095j482795j365148j165696r40654
$$ plain form
4486 21469703 20518368 19465172 18641426 17958582 17139990 16529660 15994445 15673897 15389500
4477 15389500 14964619 14689555 14495437 14238096 14133650 14005704 13807779 13696613 13752915 13914842
4467 13914842 14068722 14187952 14346604 14633753 14816634 14956046 14885022 14805134 14457340 14087423
4457 14087423 13862326 13750137 13479951 13212327 13074269 12967165 12762605 12643839 12720763 12790683
4447 12790683 12708848 12532849 12223370 11940075 11553737 11166550 10779349 10495002 10165257 9946923
4437 9946923 9849301 9767526 9552224 9503609 9478335 9341468 9344981 9402633 9477312 9517085 9578231
4426 9578231 9584351 9625201 9739340 9772224 9732852 9675019 9519880 9298668 9104899 8928093 8905457
4415 8905457 8716027 8504659 8487235 8410272 8405706 8266882 8228503 8320750 8135975 8090638 8057419
$$ packed form
4486B1469703r51335j053196q23746o82844q18592o10330n35215l20548k84397
4477A5389500m24881k75064j94118k57341j04446j27946j97925j11166N6302J61927
4467A3914842J53880J19230J58652K87149J82881J39412p1024p9888l47794l69917
4457A4087423k25097j12189k70186k67624j38058j07104k04560j18766P6924O9920
4447A2790683q1835j75999l09479k83295l86338l87187l87201k84347l29745k18334
4437I946923r7622q1775k15302m8615k5274j36867L513N7652P4679L9773O1146
4426I578231O120M0850J14139L2884l9372n7833j55139k21212j93769j76806k2636
4415H905457j89430k11368j7424p6963m566j38824l8379R2247j84775m5337l3219
$$ plain form
4404 8057419 7900332 7772923 7550047 7344582 7168733 7036401 6796499 6515370 6456605 6509615
4394 6509615 6332751 6203848 5935437 5789030 5797648 5763702 5792932 5680379 5687983 5571046 5529263
4383 5529263 5491052 5523783 5571391 5580423 5424578 5404276 5434982 5496863 5441345 5388110 5416148
4372 5416148 5354315 5377903 5206674 5087488 5186016 5277497 5139901 5218959 5247164 5219269 5066077
4361 5066077 5038358 4989470 4855938 4526889 4551499 4629546 4507872 4349405 4288868 4307204 4323949
4350 4323949 4276910 4236023 4099003 4028778 4043239 4077769 4064029 3948498 3944400 3806402 3881241
4339 3881241 3900619 3889223 3776593 3778738 3807062 3721031 3578880 3573771 3687031 3606905 3575983
4328 3575983 3625324 3515481 3478764 3496738 3423723 3308805 3376540 3486126 3358080 3391149 3378903
$$ packed form
4404H057419j57087j27409k22876k05465j75849j32332k39902k81129n8765N3010
4394F509615j76864j28903k68411j46407Q618l3946K9230j12553P604j16937m1783
4383E529263l8211L2731M7608R032j55845k0302L0706O1881n5518n3235K8038
4372E416148o1833K3588j71229j19186R8528R1481j37596P9058K8205k7895j53192
4361E066077k7719m8888j33532l29049K4610P8047j21674j58467o0537J8336J6745
4350D323949m7039m0887j37020p0225J4461L4530j3740j15531m098j37998P4839
4339C881241J9378j1396j12630K145K8324q6031j42151n109J13260q0126l0922
4328C575983M9341j09843l6717J7974p3015j14918O7735J09586j28046L3069j2246
$$ plain form
4317 3378903 3316979 3371785 3348022 3279629 3314610 3363980 3292086 3247916 3300625 3378426 3315408
4306 3315408 3288827 3410449 3540319 3726345 3800767 3986027 4161007 4428572 4650488 4857432
4296 4857432 5029749 5087155 5080375 4799846 4429050 4095499 3972494 3902834 3537266 3360142
4286 3360142 3319937 3294022 3331067 3260333 3178993 3133628 3072235 2983633 2852559 2637124 2585149
4275 2585149 2694123 2721880 2760977 2678445 2706164 2613887 2526216 2529663 2611313 2575325 2469503
4264 2469503 2484502 2480786 2426673 2370056 2405732 2449356 2464492 2400441 2375739 2486336 2482702 2382467
4252 2382467 2423990 2413720 2380991 2439013 2571683 2648874 2759408 2776103 2652764 2672006 2654284
4241 2654284 2687681 2725816 2664518 2757549 2847120 2984224 2960615 2920851 2911475 3000396 3029618
$$ packed form
4317C378903o1924N4806k3763o8393L4981M9370p1894m4170N2709P7801o3018
4306C315408k6581J21622J29870J86026P4422J85260J74980K67565K21916K06944
4296D857432J72317N7406o780k80529l70796l33551j23005o9660l65568j77124
4286C360142m0205k5915L7045p0734q1340m5365o1393q8602j31074k15435n1975
4275B585149J08974K7757L9097q2532K7719r2277q7671L447Q1650l5988j05822
4264B469503J4999l716n4113n6617L5676M3624J5136o4051k4702J10597l634j00235
4252B382467M1523j0270l2729N8022J32670P7191J10534J6695j23339J9242j7722
4241B654284L3397L8135o1298R3031Q9571J37104k3609l9764r376Q8921K9222
$$ plain form
4230 3029618 3072701 3130176 3075249 2860295 2975168 2894722 2892958 2834644 2798290 2759643 2815100
4219 2815100 2718050 2654989 2581397 2572659 2647316 2675144 2802206 2753122 2749387 2747526 2821142 2874577
4207 2874577 2778986 2735327 2929291 2999624 3255803 3249681 3317477 3618173 3694068 3777803 3857276
4196 3857276 3894630 4014324 4150402 4260724 4313416 4331990 4350827 4346439 4344824 4252512 4224929
4185 4224929 4164913 4071985 3929573 3808141 3801466 3881836 4086044 4179167 4161858 4301340 4518292
4174 4518292 4637312 4775961 5186767 5455506 5661309 5991919 6150357 6250633 6313653 6319769
4164 6319769 6276418 6266633 6034374 5867426 5714344 5451489 5213925 4897379 4646002 4628319
4154 4628319 4595494 4512506 4449467 4385286 4453430 4513386 4519311 4548867 4700405 4793243 4898447
$$ packed form
4230C029618M3083N7475n4927k14954J14873q0446j764n8314l6354l8647N5457
4219B815100r7050o3061p3592q738P4657K7828J27062m9084l735j861P3616N3435
4207B874577r5591m3659J93964P0333K56179o122O7796L00696P5895Q3735P9473
4196C857276L7354J19694J36078J10322N2692J8574J8837m388j615r2312k7583
4185D224929o0016r2928j42412j21432o675Q0370K04208R3123j7309J39482K16952
4174D518292J19020J38649M10806K68739K05803L30610J58438J00276O3020O116
4164F319769m3351r785k32259j66948j53082k62855k37564l16546k51377j7683
4154D628319l2825q2988o3039o4181O8144N9956N925K9556J51538R2838J05204
$$ plain form
4143 4898447 4804689 4838597 4809755 4703691 4789591 4897770 4900410 4776056 4850865 4858398 4877601
4132 4877601 4916614 4954495 4887973 4949835 4880632 4853874 4886967 4912716 4870990 4751277 4732261
4121 4732261 4621177 4544177 4505245 4488309 4512898 4427181 4344056 4326953 4398417 4344915 4304531
4110 4304531 4258760 4196873 4136762 4268611 4255552 4215966 4077780 3998658 3851511 3640958 3511240
4099 3511240 3410889 3256037 3084396 3082143 3139819 3220618 3036485 2831581 2815718 2819042 2981216
4088 2981216 2994691 2984708 2870782 2919374 2921561 3085700 3215402 3257575 3179795 3158076 3320652
4077 3320652 3363169 3438901 3468791 3535836 3461431 3402187 3356539 3344605 3193909 3128523 2970879
4066 2970879 2890493 2778394 2802740 2787166 2683263 2621136 2574604 2309582 2247586 2301830 2322159
$$ packed form
4143D898447r3758L3908k8842j06064Q5900J08179K640j24354P4809P533J9203
4132D877601L9013L7881o6522O1862o9203k6758L3093K5749m1726j19713j9016
4121D732261j11084p7000l8932j6936K4589q5717q3125j7103P1464n3502m0384
4110D304531m5771o1887o0111J31849j3059l9586j38186p9122j47147k10553j29718
4099C511240j00351j54852j71641k253N7676Q0799j84133k04904j5863L324J62174
4088B981216J3475r983j13926M8592K187J64139J29702M2173p7780k1719J62576
4077C320652M2517P5732K9890O7045p4405n9244m5648j1934j50696o5386j57644
4066B970879q0386j12099K4346j5574j03903o2127m6532k65022o1996N4244K0329
$$ plain form
4055 2322159 2157623 2193293 2247333 2160250 2157346 2132897 2155155 2148336 2084532 2144964 2228759 2215261
4043 2215261 2262488 2244281 2289938 2384677 2443441 2290312 2228087 2361745 2256778 2267805 2287085
4032 2287085 2320385 2233330 2178746 2130938 2092834 2049678 2094302 2095481 2150751 2200070 2091552
4021 2091552 2223450 2251251 2136114 2216006 2148098 2169571 2173759 2135500 2141525 2142596 2314958
4010 2314958 2379861 2519372 2474615 2377092 2460402 2573027 2296843 2294301 2256464 2138370 2246117
3999 2246117 2235301 2243469 2116463 2144570 2314812 2274498 2214128 2185767 2110256 2124678 2178595
3988 2178595 2087768 2067948 2021688 2100886 2022852 1914993 1959264 2039246 2184873 2139060 2200514
3977 2200514 2229978 2078310 2024863 2061619 2139702 2022350 1936075 1894184 1939675 1972219 1836202
$$ packed form
4055B322159j64536L5670N4040q7083k904k4449K2258o819o3804O0432Q3795j3498
4043B215261M7227j8207M5657R4739N8764j53129o2225J33658j04967J1027J9280
4032B287085L3300q7055n4584m7808l8104m3156M4624J179N5270M9319j08518
4021B091552J31898K7801j15137P9892o7908K1473M188l8259O025J071J72362
4010B314958O4903J39511m4757r7523Q3310J12625k76184k542l7837j18094J07747
3999B246117j0816Q168j27006K8107J70242m0314o0370k8361p5511J4422N3917
3988B178595r0827j9820m6260P9198p8034j07859M4271P9982J45627m5813O1454
3977B200514K9464j51668n3447L6756P8083j17352q6275m1891M5491L2544j36017
$$ plain form
3966 1836202 1898097 1948701 1946854 1901543 1889297 1686535 1627501 1729824 1814201 1747023 1846232
3955 1846232 1820180 1886012 1846222 1706928 1825250 1942634 1898778 1839004 1816605 1761697 1783127
3944 1783127 1788059 1838870 1976056 1930496 1964308 2015503 1957754 2070131 2001547 2060793 2151706
3933 2151706 2202001 2141084 2091665 2061510 2109359 2117900 2301749 2324115 2292236 2258683 2295178
3922 2295178 2294901 2363213 2455452 2506971 2575522 2692194 2761003 2801500 2823532 2897570 2948716 3058189
3910 3058189 3257008 3230719 3375162 3383797 3488954 3373431 3358343 3239924 3137671 3175063
3900 3175063 3247824 3212684 3130002 3162073 3145386 3106441 3112217 3165157 3028189 3010052 3001740 3080207
3888 3080207 3133465 3231584 3267862 3364027 3478168 3561342 3638832 3685705 3698343 3785150 3716125
$$ packed form
3966A836202O1895N0604j847m5311j2246k02762n9034J02323Q4377o7178R9209
3955A846232k6052O5832l9790j39294J18322J17384m3856n9774k2399n4908K1430
3944A783127M932N0811J37186m5560L3812N1195n7749J12377o8584N9246R0913
3933B151706N0295o0917m9419l0155M7849Q541J83849K2366l1879l3553L6495
3922B295178k77O8312R2239N1519O8551J16672O8809M0497K2032P4038N1146J09473
3910C058189J98819k6289J44443Q635J05157j15523j5088j18419j02253L7392
3900C175063P2761l5140q2682L2071j6687l8945N776N2940j36968j8137q312P8467
3888C080207N3258R8119L6278R6165J14141Q3174P7490M6873J2638Q6807o9025
$$ plain form
3877 3716125 3746516 3742174 3815879 3943006 3797806 3791260 3855350 3850296 3670588 3500591 3457628
3866 3457628 3338080 3329108 3314335 3325602 3294146 3234134 3133691 3141940 3021034 2994298 3049277
3855 3049277 3074036 2946469 2855845 2862201 2824862 2811020 2893957 2902353 2817396 2817833 2838591 2903756
3843 2903756 2811941 2826141 2833104 3020368 3008283 2984913 2953388 2911755 2863643 2877388 2881708 2833210
3831 2833210 2900917 2984384 3045785 2877316 2727764 2866195 2984904 3150386 3035074 3006911
3821 3006911 2966390 2965291 2832989 2739982 2883046 2799599 2737877 2789903 2818556 2687560 2750612
3810 2750612 2675728 2748538 2810279 2777868 2791916 2731826 2733551 2716144 2604756 2693669 2757769
3799 2757769 2590409 2643001 2658925 2615344 2463643 2501865 2648942 2663337 2662564 2658547 2655251 2650721
$$ packed form
3877C716125L0391m342P3705J27127j45200o546O4090n054j79708j69997m2963
3866C457628j19548q972j4773J1267l1456o0012j00443Q249j20906k6736N4979
3855C049277K4759j27567r0624O356l7339j3842Q2937Q396q4957M37K0758O5165
3843B903756r1815J4200O963J87264j2085k3370l1525m1633m8112J3745M320m8498
3831B833210O7707Q3467O1401j68469j49552J38431J18709J65482j15312k8163
3821C006911m0521j099j32302r3007J43064q3447o1722N2026K8653j30996O3052
3810B750612p4884P2810O1741l2411J4048o0090J725j7407j11388Q8913O4100
3799B757769j67360N2592J5924m3581j51701L8222J47077J4395p73m017l296m530
$$ plain form
3787 2650721 2493315 2571648 2578381 2677358 2656322 2641553 2603254 2640037 2574973 2546255 2592255
3776 2592255 2573994 2641282 2671339 2620143 2655633 2764587 2745081 2775068 2663634 2725770 2738665
3765 2738665 2771897 2720251 2662853 2635350 2585551 2680250 2674735 2671710 2810727 2730490 2872865
3754 2872865 2921520 2826740 2790294 2782790 2829304 2754302 2707493 2731727 2794360 2883550 2814264 2765656
3742 2765656 2837710 2858433 2763695 2820977 2849524 2799587 2825730 2864938 2920727 2975805 3125986
3731 3125986 3039218 2942561 2916664 2860594 2865955 2896609 2779658 2716225 2855345 3063256 3061254
3720 3061254 2997318 3098501 3025448 3034783 3109136 3053327 3091566 3068543 3054201 3056308 3004142 2909586
3708 2909586 2951831 3028373 3051068 3033702 2946956 3006414 2931366 2958333 2889572 2956803 2989830
$$ packed form
3787B650721j57406P8333O733R8977k1036j4769l8299L6783o5064k8718M6000
3776B592255j8261O7288L0057n1196L5490J08954j9506K9987j11434O2136J2895
3765B738665L3232n1646n7398k7503m9799R4699n515l025J39017q0237J42375
3754B872865M8655r4780l6446p504M6514p5002m6809K4234O2633Q9190o9286m8608
3742B765656P2054K0723r4738N7282K8547m9937K6143L9208N5789N5078J50181
3731C125986q6768r6657k5897n6070N361L0654j16951o3433J39120K07911k002
3720C061254o3936J01183p3053R335P4353n5809L8239k3023j4342K107n2166r4556
3708B909586M2245P6542K2695j7366q6746N9458p5048K6967o8761O7231L3027
$$ plain form
3697 2989830 2949414 3021201 3038821 2963334 3025862 3039591 2996318 2915971 2780852 2787510 3030750
3686 3030750 3063983 2996091 3139293 3059804 2934795 3042046 3029258 2967216 2963317 2972834 2996408
3675 2996408 3015138 2956681 3008558 3101653 3046718 3063108 3033172 2979092 2937572 2839329 2994234
3664 2994234 2992883 2913187 2919042 2886147 2865772 2995013 3043545 2871304 2963620 3010952 3055519
3653 3055519 3112992 3185447 3085490 3110303 3092817 3036432 3099446 3289825 3291941 3211562 3277433
3642 3277433 3271014 3345563 3482776 3412132 3272551 3264446 3163123 3163200 3277592 3267109 3347177 3329352
3630 3329352 3335247 3326350 3300186 3355094 3280381 3208529 3254867 3364454 3350541 3441366 3541874
3619 3541874 3564486 3584868 3639185 3655062 3623147 3743279 3825617 3727912 3692535 3663432 3586498
$$ packed form
3697B989830m0416P1787J7620p5487O2528J3729m3273q0347j35119O658K43240
3686C030750L3233o7892J43202p9489j25009J07251j2788o2042l899R517K3574
3675B996408J8730n8457N1877R3095n4935J6390k9936n4080m1520r8243J54905
3664B994234j351p9696N855l2895k0375J29241M8532j72241R2316M7332M4567
3653C055519N7473P2455r9957K4813j7486n6385O3014J90379K116q0379O5871
3642C277433o419P4549J37213p0644j39581q105j01323P7J14392j0483Q0068j7825
3630C329352N895q897k6164N4908p4713p1852M6338J09587j3913R0825J00508
3619C541874K2612K0382N4317J5877l1915J20132Q2338r7705l5377k9103p6934
$$ plain form
3608 3586498 3587274 3666426 3683911 3707627 3713050 3737837 3711300 3706974 3776826 3793626 3829385 3873408
3596 3873408 4040929 3962993 4013717 4045926 4110817 4158060 4124138 4133371 4161046 4222421 4309042
3585 4309042 4400678 4479641 4410430 4491969 4495197 4445954 4437332 4488698 4477404 4618803 4596957 4504038
3573 4504038 4651232 4714630 4650227 4652841 4690723 4793972 4932902 4924440 4830650 4831334 4946051
3562 4946051 5050704 5126165 5089388 5221167 5217442 5296101 5201267 5301530 5339826 5378053 5393061
3551 5393061 5511101 5619927 5749328 5751169 5766525 5870055 6090082 6166308 6134908 6233988 6334086
3540 6334086 6471100 6537571 6688214 6840449 6887229 7008176 7164704 7213149 7310416 7380663
3530 7380663 7542790 7555237 7716164 7905387 7987546 8145748 8422862 8610187 8656419 8659336
$$ packed form
3608C586498P76P9152J7485K3716N423K4787k6537m326O9852J6800L5759M4023
3596C873408J67521p7936N0724L2209O4891M7243l3922R233K7675O1375Q6621
3585D309042R1636P8963o9211Q1539L228m9243q622N1366j1294J41399k1846r2919
3573D504038J47194O3398o4403K614L7882J03249J38930q462r3790O84J14717
3562D946051J04653P5461l6777J31779l725P8659r4834J00263L8296L8227J5008
3551E393061J18040J08826J29401J841J5356J03530K20027P6226l1400R9080J00098
3540F334086J37014O6471J50643J52235M6780J20947J56528M8445R7267P0247
3530G380663J62127J2447J60927J89223Q2159J58202K77114J87325M6232K917
$$ plain form
3520 8659336 8830697 9074405 9179925 9340712 9619794 9769132 9891874 10162583 10350977 10542221
3510 10542221 10719838 10861243 11125672 11341508 11608030 11820931 11987499 12322649 12676001
3501 12676001 12863768 13028496 13401710 13482784 13676167 14200554 14609202 14817960 15174153 15559052
3491 15559052 16016473 16466244 16756587 17291901 17746876 18259535 18957595 19623072 20291711
3482 20291711 20990045 21919747 22866453 23826425 25028140 26280017 27625542 29086159 30602508
3473 30602508 32310084 34126531 35943281 37939026 39846139 41697638 43449913 44984357
3465 44984357 46104657 46855952 47201963 47099234 46703196 45803085 44696002 43418533 42030400
3456 42030400 40537637 39215009 38001640 36791032 35449575 34409398 33446237 32435906
$$ packed form
3520H659336J71361K43708J05520J60787K79082J49338J22742K70709J88394J91244
3510A0542221J77617J41405K64429K15836K66522K12901J66568L35150L53352
3501A2676001J87767J64728L73214Q1074J93383N24387M08648K08758L56193L84899
3491A5559052M57421M49771K90343N35314M54975N12659O98060O65477O68639
3482B0291711O98334R29702R46706R59972J201715J251877J345525J460617J516349
3473C0602508J707576J816447J816750J995745J907113J851499J752275J534444
3465D4984357J120300P51295L46011j02729l96038r00111j107083j277469j388133
3456D2030400j492763j322628j213369j210608j341457j040177r63161j010331
$$ plain form
3448 32435906 31535149 30712790 29952267 29234264 28714198 28193159 27753692 27398849 27150216
3439 27150216 26973991 26858603 26664723 26413531 26091393 25586856 25082994 24372040 23708616
3430 23708616 22988333 22281778 21788271 21346084 20929234 20343972 20013821 19631924 19239636
3421 19239636 18822211 18452210 18043200 17658143 17424346 17029685 16566921 16364666 16032577
3412 16032577 15631980 15544480 15379742 15184131 15108744 14916480 14784338 14643872 14468295 14356598
3402 14356598 14265249 14035436 13727938 13337057 13086642 12770208 12564273 12313000 12097815 11783425
3392 11783425 11521362 11454072 11266478 11067715 10987239 10846159 10675496 10650130 10536454 10325264
3382 10325264 10155472 10023932 9904120 9878612 9715713 9483503 9475815 9415069 9256780 9270873
$$ packed form
3448C2435906r00757q22359p60523p18003n20066n21039m39467l54843k48633
3439B7150216j76225j15388j93880k51192l22138n04537n03862p10954o63424
3430B3708616p20283p06555m93507m42187m16850n85262l30151l81897l92288
3421A9239636m17425l70001m09010l85057k33797l94661m62764k02255l32089
3412A6032577m00597q7500j64738j95611p5387j92264j32142j40466j75577j11697
3402A4356598r1349k29813l07498l90881k50415l16434k05935k51273k15185l14390
3392A1783425k62063o7290j87594j98763q0476j41080j70663k5366j13676k11190
3382A0325264j69792j31540j19812k5508j62899k32210p688o0746j58289J4093
$$ plain form
3372 9270873 9105153 9025911 8947444 8850479 8733358 8648121 8698087 8677382 8534050 8502642 8308322
3361 8308322 8281430 8160953 8028396 7920475 7844676 7735201 7657261 7735227 7856713 7729099
3351 7729099 7494102 7383212 7447493 7397283 7152439 7065063 7063286 7027375 7014707 6967637 6915484
3340 6915484 6990116 6912057 6969068 6844394 6711814 6814273 6635541 6613802 6641415 6489213
3330 6489213 6430560 6457927 6362025 6276655 6202554 6103201 6176109 6183139 6183222 6162436 6089639 6008412
3318 6008412 5969702 5924344 5841441 5753591 5731809 5774533 5854434 5733489 5660760 5656212 5761278
3307 5761278 5742584 5602776 5540553 5445644 5611714 5668834 5521323 5526432 5417959 5398892 5432162
3296 5432162 5438951 5339427 5219349 5188895 5194801 5140552 5106637 5065823 5080704 5085056 5191642 5179429
$$ packed form
3372I270873j65720p9242p8467r6965j17121q5237M9966k0705j43332l1408j94320
3361H308322k6892j20477j32557j07921p5799j09475p7940P7966J21486j27614
3351G729099k34997j10890O4281n0210k44844q7376j777l5911j2668m7070n2153
3340F915484P4632p8059N7011j24674j32580J02459j78732k1739K7613j52202
3330F489213n8653K7367r5902q5370p4101r9353P2908P030Q3k0786p2797q1227
3318F008412l8710m5358q2903q7850k1782M2724P9901j20945p2729m548J05066
3307E761278j8694j39808o2223r4909J66070N7120j47511N109j08473j9067L3270
3296E432162O789r9524j20078l0454N906n4249l3915m0814J4881M352J06586j2213
$$ plain form
3284 5179429 5040931 5004346 4938418 4969759 5005145 4967821 4919132 4868462 4808462 4705748 4756564
3273 4756564 4701650 4583459 4576816 4590134 4600549 4541924 4579331 4522435 4474051 4339033 4334469
3262 4334469 4417620 4461076 4423428 4331123 4300741 4169491 4109253 4354180 4271670 4102861 4114179
3251 4114179 4111227 3995764 3926013 4023623 3948059 3877808 3949433 3791973 3782343 3713942 3641677
3240 3641677 3724001 3824672 3755911 3741887 3753990 3630575 3712634 3736538 3666810 3654430 3656957
3229 3656957 3672352 3683277 3666855 3735967 3714800 3719655 3684619 3686883 3800656 3720345 3619613
3218 3619613 3710616 3751403 3734664 3811294 3777174 3729890 3868088 3850146 3833762 3992400 4038793
3207 4038793 4002590 4078841 4051548 4001777 4091775 4095647 4187947 4311263 4262454 4279615 4360605
$$ packed form
3284E179429j38498l6585o5928L1341L5386l7324m8689n0670o0000j02714N0816
3273D756564n4914j18191o643J3318J0415n8625L7407n6896m8384j35018m564
3262D334469Q3151M3456l7648r2305l0382j31250o0238K44927q2510j68809J1318
3251D114179k952j15463o9751R7610p5564p0251P1625j57460r630o8401p2265
3240C641677Q2324J00671o8761j4024J2103j23415Q2059K3904o9728j2380K527
3229C656957J5395J0925j6422O9112k1167M855l5036K264J13773q0311j00732
3218C619613R1003M0787j6739P6630l4120m7284J38198j7942j6384J58638M6393
3207D038793l6203P6251k7293m9771Q9998L872R2300J23316m8809J7161Q0990
$$ plain form
3196 4360605 4294828 4403957 4476986 4507761 4543981 4475849 4542976 4539222 4560597 4601074 4751496
3185 4751496 4709085 4743236 4868641 4818209 4908234 4968029 5017799 5063796 5187185 5256515 5346922
3174 5346922 5396853 5506888 5639799 5646220 5665365 5875660 6125848 6077718 6186651 6340964
3164 6340964 6522246 6830162 6963284 7045967 7223224 7262824 7650341 7903411 8238187 8409419
3154 8409419 8522407 8908101 9119418 9295427 9453078 9564003 9582444 9966639 10112313 10133973
3144 10133973 10232420 10417059 10620520 10845294 10911191 11084630 11463347 11557364 11958188 12388039
3134 12388039 12693381 13112450 13437424 14051441 14616704 15138591 15753774 16328587 17004029
3125 17004029 17593666 18106352 18535522 18820239 18971163 18972680 18726337 18563384 18162760 17723454
$$ packed form
3196D360605o5777J09129P3029L0775L6220o8132O7127l754K1375M0477J50422
3185D751496m2411L4151J25405n0432R0025N9795M9770M5997J23389O9330R0407
3174E346922M9931J10035J32911O421J9145K10295K50188m8130J08933J54313
3164F340964J81282L07916J33122Q2683J77257L9600L87517K53070L34776J71232
3154H409419J12988L85694K11317J76009J57651J10925J8441L84195J45674K1660
3144A0133973R8447J84639K03461K24774O5897J73439L78717R4017M00824M29851
3134A2388039L05342M19069L24974O14017N65263N21887O15183N74813O75442
3125A7004029N89637N12686M29170K84717J50924J517k46343j62953m00624m39306
$$ plain form
3115 17723454 17450950 17225187 16925585 16857396 16941874 16922074 16999599 17144586 17421242 17653650
3105 17653650 17806985 18197730 18577090 18917486 19263453 19706285 20054414 20286227 20429915
3096 20429915 20584405 20710797 20646624 20576454 20453273 20222308 19849525 19434420 18945314 18438684
3086 18438684 17908301 17472751 17146207 16661608 16409757 16084508 15850892 15690941 15565062
3077 15565062 15514559 15375657 15340118 15272311 15199316 15129297 14979650 14796303 14713340 14456113
3067 14456113 14094983 13738740 13404598 12835380 12361029 11927315 11545014 11049911 10701361
3058 10701361 10314087 10025851 9635017 9278824 9112919 8821326 8548638 8227680 8087051
3049 8087051 7912960 7715099 7684519 7391628 7172418 6913164 6813511 6527755 6452644 6288024
$$ packed form
3115A7723454k72504k25763k99602o8189Q4478j9800P7525J44987K76656K32408
3105A7653650J53335L90745L79360L40396L45967M42832L48129K31813J43688
3096B0429915J54490J26392o4173p0170j23181k30965l72783m15105m89106n06630
3086A8438684n30383m35550l26544m84599k51851l25249k33616j59951j25879
3077A5565062n0503j38902l5539o7807p2995p0019j49647j83347q2963k57227
3067A4456113l61130l56243l34142n69218m74351m33714l82301m95103l48550
3058A0701361l87274k88236l90834l56193j65905k91593k72688l20958j40629
3049H087051j74091j97861l0580k92891k19210k59254r9653k85756p5111j64620
$$ plain form
3039 6288024 6160925 6013138 5793433 5560472 5434767 5556504 5452610 5150780 5050438 5029295
3029 5029295 4826003 4764254 4662206 4563136 4348032 4190999 4129096 4023912 3954305 3864948
3019 3864948 3793493 3672528 3655739 3737196 3685549 3577013 3428451 3266780 3127368 3191213
3009 3191213 3172061 3235096 3273135 3254840 3197913 3201753 3107827 2922131 2830419 2877194 2918751
2998 2918751 2878796 2956630 2945198 2666382 2601330 2582250 2653146 2627345 2609118 2507392 2523901
2987 2523901 2382628 2279535 2279691 2322501 2342974 2204758 2147120 2171717 2131759 2127656 2137160 2130588
2975 2130588 2168288 2097774 2142933 2009520 1842527 1946658 1907181 1876178 1842613 1759191 1725846
2964 1725846 1758052 1851980 1794117 1719391 1568902 1528957 1602159 1543332 1684893 1686197 1588516
$$ packed form
3039F288024j27099j47787k19705k32961j25705J21737j03894l01830j00342k1143
3029E029295k03292o1749j02048r9070k15104j57033o1903j05184o9607q9357
3019C864948p1455j20965j6789Q1457n1647j08536j48562j61671j39412O3845
3009C191213j9152O3035L8039j8295n6927L840r3926j85696r1712M6775M1557
2998B918751l9955P7834j1432k78816o5052j9080P0896k5801j8227j01726J6509
2987B523901j41273j03093J56M2810K0473j38216n7638K4597l9958m103R504o572
2975B130588L7700p0514M5159j33413j66993J04131l9477l1003l3565q3422l3345
2964A725846L2206R3928n7863p4726j50489l9945P3202n8827J41561J304r7681
$$ plain form
2953 1588516 1605236 1549589 1474354 1569000 1531147 1495133 1435714 1421735 1377535 1448710 1291876
2942 1291876 1394016 1487615 1359637 1428452 1412208 1429784 1407181 1287403 1214414 1200408 1153841
2931 1153841 1148770 1156192 1191722 1024145 1026664 1013917 1082554 1183005 1172103 1127947 1037766 973873
2919 973873 970841 998945 1035146 1051398 1014625 977728 934883 1021134 1122819 1008267 1053458
2908 1053458 1025356 1052761 897582 919220 988589 917870 822966 880732 917765 851724 890890
2897 890890 963560 938536 886267 775096 787282 818351 892128 948145 852425 887566 872517
2886 872517 845962 833438 823680 841595 860466 849258 847925 883829 800570 731205 732410 725462
2874 725462 702833 841573 828406 717524 719438 670542 705016 701127 790762 770101 835248 903552
$$ packed form
2953A588516J6720n5647p5235R4646l7853l6014n9419j3979m4200P1175j56834
2942A291876J02140R3599j27978O8815j6244J7576k2603j19778p2989j4006m6567
2931A153841n071P422L5530j67577K519j2747O8637J00451j0902m4156r0181o3893
2919I73873l032K8104L6201J6252l6773l6897m2845Q6251J01685j14552M5191
2908A053458k8102K7405j55179K1638O9369p0719r4904N7766L7033o6041L9166
2897H90890P2670k5024n2269j11171J2186L1069P3777N6017r5720L5141j5049
2886H72517k6555j2524r758J7915J8871j1208j333L5904q3259o9365J205o948
2874G25462k2629J38740j3167j10882J914m8896L4474l889Q9635k0661O5147O8304
$$ plain form
2862 903552 762384 764596 706203 740502 647825 731329 850210 894555 855439 737227 732956
2851 732956 725515 827387 763620 669099 662777 718982 816298 864337 855351 757195 876550 812872
2839 812872 702772 643774 655707 747842 665114 625565 660460 702885 642190 793628 762606
2828 762606 682570 551015 548641 599070 636304 696779 618916 624787 554314 636949 658187 556253
2816 556253 518528 591695 529906 516326 557414 399942 434075 559634 450511 609775 674869
2805 674869 613186 747881 780881 703852 642044 644102 615705 619206 574872 672774 680514 598252
2793 598252 483451 577003 422376 504388 577862 558047 557811 596086 622298 454809 306920
2782 306920 384395 464839 495562 498608 504729 630995 709949 604345 591884 460404 392373
$$ packed form
2862I03552j41168K212n8393L4299r2677Q3504J18881M4345l9116j18212m271
2851G32956p441J01872o3767r4521o322N6205R7316M8039q986r8156J19355o3678
2839H12872j10100n8998J1933R2135q2728l9549L4895M2425o0695J51438l1022
2828G62606q0036j31555k374N0429L7234O0475p7863N871p0473Q2635K1238j01934
2816E56253l7725P3167o1789j3580M1088j57472L4133J25559j09123J59264O5094
2805F74869o1683J34695L3000p7029o1808K058k8397L501m4334R7902P740q2262
2793E98252j14801R3552j54627Q2012P3474j9815k36L8275K6212j67489j47889
2782C06920P7475Q0444L0723L046O121J26266P8954j05604j2461j31480o8031
$$ plain form
2771 392373 501752 448199 489761 540164 493700 503812 519878 506716 548940 507824 549809
2760 549809 465419 492516 429568 357164 366657 338280 413472 525620 605436 519270 448080 473188
2748 473188 385602 367572 479622 474938 416448 396525 489967 450720 493044 406143 415991 420109
2736 420109 436866 459282 356623 290229 237171 387728 557406 440515 478363 561782 533739
2725 533739 388541 464930 450158 357201 367710 399694 423596 427740 496333 330121 247840
2714 247840 194480 309157 293103 218945 289584 429319 328732 360284 402342 423462 407010
2703 407010 428786 354159 480091 476672 556797 546421 507021 363639 242235 326175 362820
2692 362820 395731 307704 308161 282905 187924 268365 291149 364010 368557 324136 282873 344054
$$ packed form
2771C92373J09379n3553M1562N0403m6464J0112J6066j3162M2224m1116M1985
2760E49809q4390K7097o2948p2404R493k8377P5192J12148P9816q6166p1190K5108
2748D73188q7586j8030J12050m684n8490j9923R3442l9247M2324q6901R848M118
2736D20109J6757K2416j02659o6394n3058J50557J69678j16891L7848Q3419k8043
2725E33739j45198P6389j4772r2957J0509L1984K3902M144O8593j66212q2281
2714B47840n3360J14677j6054p4158P0639J39735j00587L1552M2058K1120j6452
2703D07010K1776p4627J25932l419Q0125j0376l9400j43382j21404Q3940L6645
2692C62820L2911q8027M57k5256r4981Q0441K2784P2861M547m4421m1263O1181
$$ plain form
2680 344054 316511 308235 285051 238310 431333 347474 306046 321699 224097 359122 309263
2669 309263 241843 376534 443323 400788 242263 367496 391484 328243 381958 266427 53546
2658 53546 277722 291313 361412 294661 221342 106571 171240 236189 123976 76917 59907
2647 59907 57438 204930 273397 303471 283183 312847 138504 210159 339238 310251 315977 233171
2635 233171 258496 234261 290840 196197 214628 134149 108995 52088 235412 343341 343443 231074
2623 231074 220058 274107 316450 207840 205543 298336 328176 267736 235105 178922 209199 324692
2611 324692 219944 119390 121013 262132 251801 189775 238085 245094 179251 258933 299422
2600 299422 361931 345390 254288 293135 301625 427210 470038 255141 261172 334123 381060 493127
$$ packed form
2680C44054k7543q276k3184m6741J93023q3859m1428J5653r7602J35025m9859
2669C09263o7420J34691O6789m2535j58525J25233K3988o3241N3715j15531k12881
2658E3546K24176J3591P0099o6751p3319j14771O4669O4949j12213m7059j7010
2647E9907k469J47492O8467L0074k0288K9664j74343P1655J29079k8987N726q2806
2635B33171K5325k4235N6579r4643J8431q0479k5154n6907J83324J07929J02j12369
2623B31074j1016N4049M2343j08610k297R2793K9840o0440l2631n6183L0277J15493
2611C24692j04748j00554J623J41119j0331o2026M8310P009o5843P9682M0489
2600B99422O2509j6541r1102L8847Q490J25585M2828k14897O031P2951M6937J12067
$$ plain form
2588 493127 471251 455246 472924 372967 442658 380534 266976 324291 283082 185457 33308
2577 33308 161720 230845 302469 235380 173518 160790 168640 112505 216476 348922 311267
2566 311267 313615 221279 73265 164197 347422 261248 149533 180306 220260 230824 237625
2555 237625 322349 165979 25804 213594 143624 169103 252599 179261 126153 98774 148631
2544 148631 127718 6269 115137 175815 189940 113146 136200 217680 225800 201145 51578
2533 51578 125651 270562 175545 287354 363186 186755 -48465 119280 54946 31606 170186
2522 170186 189675 237426 206041 113754 30700 92567 120344 77725 36879 -77198 83640
2511 83640 23801 -13911 76143 170208 32929 51591 145658 52337 59807 215876 280862 194926
$$ packed form
2588D93127k1876j6005J7678r9957O9691o2124j13558N7315m1209r7625j52149
2577C3308J28412O9125P1624o7089o1862j2728P850n6135J03971J32446l7655
2566C11267K348r2336j48014R0932J83225q6174j11715L0773L9954J0564O801
2555B37625Q4724j56370j40175J87790o9970K5479Q3496p3338n3108k7379M9857
2544A48631k0913j21449J08868O0678J4125p6794K3054Q1480Q120k4655j49567
2533E1578P4073J44911r5017J11809P5832j76431k35220J67745o4334k3340J38580
2522A70186J9489M7751l1385r2287q3054O1867K7777m2619m0846j14077J60838
2511H3640n9839l7712R0054R4065j37279J8662R4067r3321P470J56069O4986q5936
$$ plain form
2499 194926 172347 250428 268274 309370 288900 249474 184042 274904 388329 322590 317388 335642
2487 335642 273355 382304 476283 282961 216773 172976 183295 246427 296861 254859 299319
2476 299319 335522 302782 396518 472158 295884 288783 281204 318370 267818 223800 144728 235209
2464 235209 320464 368597 348507 416472 304434 242629 298390 350643 206802 152997 281887
2453 281887 365384 438384 268464 264149 236548 128389 138249 272482 375573 268411 324363
2442 324363 311493 308476 272287 145297 214343 306446 270879 248452 252170 295202 234652 175663
2430 175663 168069 206024 284335 330557 253257 231124 125894 256020 424530 483204 487402
2419 487402 384094 320147 409830 461505 441565 518139 483350 412267 372357 401250 421877
$$ packed form
2499A94926k2579P8081J7846M1096k0470l9426o5432R0862J13425o5739n202J8254
2487C35642o2287J08949R3979j93322o6188m3797J0319O3132N0434m2002M4460
2476B99319L6203l2740R3736P5640j76274p101p579L7166n0552m4018p9072R0481
2464B35209Q5255M8133k0090O7965j12038o1805N5761N2253j43841n3805J28890
2453B81887Q3497P3000j69920m315k7601j08159R860J34233J03091j07162N5952
2442C24363j2870l017l6189j26990O9046R2103l5567k2427L718M3032o0550n8989
2430A75663p594L7955P8311M6222p7300k2133j05230J30126J68510N8674M198
2419D87402j03308o3947Q9683N1675j9940P6574l4789p1083l9910K8893K0627
$$ plain form
2408 421877 410873 332261 399141 349732 283563 391557 402565 405956 473150 445368 600367
2397 600367 546225 509616 663021 660661 684762 682429 700696 689805 816609 824389 674464 779904
2385 779904 931808 722474 662190 559197 751363 912415 869641 951695 970441 878811 927320
2374 927320 954770 1036428 1081453 1118730 1220695 1290297 1367368 1370713 1410387 1522321 1638156
2363 1638156 1599482 1688490 1812598 1916748 1995181 2194115 2250623 2441992 2576449 2603769
2353 2603769 2709855 2971028 3154536 3369499 3639297 3932355 4113248 4392832 4633168 5090551
2343 5090551 5588823 6080155 6686526 7341281 8181975 9039293 9877566 10797938 11727015 12939028
2333 12939028 14673839 16408604 18710127 21785943 25415825 29837487 34178898 39080552
$$ packed form
2408D21877j1004p8612O6880m9409o6169J07994J1008L391O7194k7782J54999
2397F00367n4142l6609J53405k360K4101k333J8267j0891J26804P780j49925J05440
2385G79904J51904k09334o0284j02993J92166J61052m2774Q2054J8746r1630M8509
2374I27320K7450Q1658M5025L7277J01965O9602P7071L345L9674J11934J15835
2363A638156l8674Q9008J24108J04150P8433J98934N6508J91369J34457K7320
2353B603769J06086K61173J83508K14963K69798K93058J80893K79584K40336M57383
2343E090551M98272M91332O06371O54755Q40694Q57318Q38273R20372R29077J212013
2333A2939028J734811J734765K301523L075816L629882M421662M341411M901654
$$ plain form
2325 39080552 44734943 49823166 51658737 51608203 48613824 42434938 36881047 32165580
2317 32165580 28450757 25480355 22852030 20777562 19165839 17659060 16240506 14961830
2309 14961830 13961579 13092257 12138498 11259178 10454077 9665055 8745398 8156887 7612976
2300 7612976 6998740 6584604 6159595 5767562 5435578 5244091 5078996 4784027 4545143 4274992
2290 4274992 3972176 3834565 3610145 3544974 3403821 3223251 3077531 2961933 2790774 2720869
2280 2720869 2685420 2531963 2326622 2277096 2250430 2101687 1884905 1942045 2083964 1962775
2270 1962775 1922488 1868412 1781870 1666958 1602146 1516222 1543677 1467843 1405671 1420177 1378181
2259 1378181 1427787 1480028 1486095 1314787 1196254 1223347 1247922 1256264 1241259 1066526 996166
$$ packed form
2325C9080552N654391N088223J835571n0534k994379o178886n553891m715467
2317C2165580l714823k970402k628325k074468j611723j506779j418554j278676
2309A4961830j000251q69322r53759q79320q05101p89022r19657n88511n43911
2300G612976o14236m14136m25009l92033l31984j91487j65095k94969k38884k70151
2290D274992l02816j37611k24420o5171j41153j80570j45720j15598j71159o9905
2280B720869l5449j53457k05341m9526k6666j48743k16782N7140J41919j21189
2270A962775m0287n4076q6542j14912o4812q5924K7455p5834o2172J4506m1996
2259A378181M9606N2241O067j71308j18533K7093K4575Q342j5005j74733p0360
$$ plain form
2248 996166 1047351 1098421 1062539 1062343 1042864 1039624 938602 982705 969002 933188 918651 909658
2236 909658 893128 930610 1034335 998394 826548 766153 736654 704006 623984 566720 668840
2225 668840 818214 813199 908978 868577 681315 629892 649935 608686 630686 620775 577663 585504
2213 585504 603663 507692 394428 395074 560398 529351 569503 557712 548246 644224 604249 616087
2201 616087 544178 457476 536437 457631 629995 532786 462734 425236 219660 163170 304268
2190 304268 440899 454991 536379 484247 514563 476747 439499 328195 272295 369262 353712
2179 353712 244872 249844 422639 415779 283545 322715 339611 365413 407863 440256 410055
$$ packed form
2248I96166N1185N1070l5882j96j9479l240j01022M4103j3703l5814j4537q993
2236I09658j6530L7482J03725l5941j71846o0395k9499l2648q0022n7264J02120
2225F68840J49374n015R5779m0401j87262n1423K0043m1249K2000r911m3112P841
2213E85504J8159r5971j13264O46J65324l1047M0152j1791r466R5978l9975J1838
2201F16087p1909q6702P8961p8806J72364r7209p0052l7498k05576n6490J41098
2190C04268J36631J4092Q1388n2132L0316l7816l7248j11304n5900R6967j5550
2179C53712j08840M972J72795o860j32234L9170J6896K5802M2450L2393l0201
$$ [...]
##END NTUPLES=NMR SPECTRUM
##END=
