##TITLE=1H_DE-80H_X3
 200.13MHz, d2o
 8 sc
 
 19ns.26.2.2025
##JCAMPDX= 6.0         $$ Bruker NMR JCAMP-DX V2.0
##DATA TYPE= NMR SPECTRUM
##DATA CLASS= NTUPLES
##ORIGIN= UXNMR, Bruker Analytische Messtechnik GmbH
##OWNER= pz
$$ XWIN-NMR		Version 3.5
$$ Fri Sep 19 14:59:51 2025 Russian Standard Time (UT+4h)  Yarkov@DPX200
##.OBSERVE FREQUENCY= 200.1313
##.OBSERVE NUCLEUS= ^1H
##.ACQUISITION MODE= SIMULTANEOUS
##.ACQUISITION SCHEME= undefined
##.AVERAGES= 8
##.DIGITISER RES= 18
##SPECTROMETER/DATA SYSTEM= spect
##.PULSE SEQUENCE= zg30
##.SOLVENT NAME= CDCl3
##.SHIFT REFERENCE= (INTERNAL, CDCl3, 0, 15.4836)
##AUDIT TRAIL= $$ (NUMBER, WHEN, WHO, WHERE, WHAT)
$$ ##TITLE= Audit trail, XWIN-NMR		Version 3.5
$$ ##JCAMPDX= 5.01
$$ ##ORIGIN= Bruker BioSpin GmbH
$$ ##OWNER= Yarkov
$$ C:/Bruker/XWIN-NMR/data/yarkov2/nmr/H-C/1/pdata/1/auditp.txt
$$ ##AUDIT TRAIL=  $$ (NUMBER, WHEN, WHO, WHERE, WHAT)
(   1,<2025-09-19 14:59:10.10 +0400>,<Yarkov>,<DPX200>,
      <created by zg, POWCHK disabled, PULCHK disabled
       configuration hash MD5:
       00 E9 B6 7A A2 85 ED C7 34 08 36 98 17 FE 4E 26
       data hash MD5: 16K
       F6 55 DA 68 10 A3 1A 9F 9F 46 F2 D7 DB 10 33 F9>)
(   2,<2025-09-19 14:59:13.57 +0400>,<Yarkov>,<DPX200>,
      <Start of raw data processing
       efp BC_mod = 2 LB = 0.25 FT_mod = 6 PKNL = 1 PHC0 = -1348.02 PHC1 = -1.209074 SI = 16K 
       data hash MD5: 16K
       41 28 95 63 8C 01 ED EB BD 3B FD 39 1D FB 84 AA>)
$$ ##END=
$$ 
$$ hash MD5
$$ 2D EE CF C5 E6 B3 74 BE 6B F0 85 1C 79 7F 9E E1
##$RELAX= 
##$RELAX= 
##$RELAX= 
##$RELAX= 
##$RELAX= 
##$RELAX= 
$$ Bruker specific parameters
$$ --------------------------
##$DU= <C:/Bruker/XWIN-NMR>
##$EXPNO= 1
##$NAME= <H-C>
##$PROCNO= 1
##$TYPE= <nmr>
##$USER= <yarkov2>
##$AMP= (0..31)
100 100 100 100 100 100 100 100 100 100 100 100 100 100 100 100 100 100 
100 100 100 100 100 100 100 100 100 100 100 100 100 100 
##$AQSEQ= 0
##$AQ_mod= 1
##$AUNM= <au_zg>
##$AUTOPOS= <>
##$BF1= 200.13
##$BF2= 200.13
##$BF3= 200.13
##$BF4= 200.13
##$BF5= 200.13
##$BF6= 200.13
##$BF7= 200.13
##$BF8= 200.13
##$BYTORDA= 1
##$CFDGTYP= 0
##$CFRGTYP= 5
##$CHEMSTR= <none>
##$CNST= (0..31)
1 1 145 1 1 1 1 1 1 1 1 1 1 1 1 1 1 1 1 1 1 1 1 1 1 1 1 1 1 1 1 1 
##$CPDPRG= <>
##$CPDPRG1= <>
##$CPDPRG2= <>
##$CPDPRG3= <>
##$CPDPRG4= <mlev>
##$CPDPRG5= <mlev>
##$CPDPRG6= <mlev>
##$CPDPRG7= <mlev>
##$CPDPRG8= <mlev>
##$CPDPRGB= <>
##$CPDPRGT= <>
##$D= (0..31)
0 0.7 0 0 0 0 0 0 0 0 0 0.03 0 0 0 0 0 0 0 0 0 0 0 0 0 0 0 0 0 0 0 0 
##$DATE= 1758279549
##$DBL= (0..7)
120 120 120 120 120 120 120 120 
##$DBP= (0..7)
150 150 150 150 150 150 150 150 
##$DBP07= 0
##$DBPNAM0= <>
##$DBPNAM1= <>
##$DBPNAM2= <>
##$DBPNAM3= <>
##$DBPNAM4= <>
##$DBPNAM5= <>
##$DBPNAM6= <>
##$DBPNAM7= <>
##$DBPOAL= (0..7)
0.5 0.5 0.5 0.5 0.5 0.5 0.5 0.5 
##$DBPOFFS= (0..7)
0 0 0 0 0 0 0 0 
##$DE= 6
##$DECBNUC= <off>
##$DECIM= 32
##$DECNUC= <off>
##$DECSTAT= 4
##$DIGMOD= 1
##$DIGTYP= 9
##$DL= (0..7)
0 120 120 120 120 120 120 120 
##$DP= (0..7)
$$ [...]
##$SUBNAM2= <"">
##$SUBNAM3= <"">
##$SUBNAM4= <"">
##$SUBNAM5= <"">
##$SUBNAM6= <"">
##$SUBNAM7= <"">
##$SUBNAM8= <"">
##$SUBNAM9= <"">
##$SW= 18.0517328524113
##$SWIBOX= (0..15)
0 0 2 0 0 0 0 0 0 0 0 0 0 0 0 0 
##$SW_h= 3612.71676300578
##$TD= 16384
##$TD0= 1
##$TE= 0
##$TE2= 300
##$TE3= 300
##$TEG= 300
##$TL= (0..7)
0 120 120 120 120 120 120 120 
##$TP= (0..7)
150 150 150 150 150 150 150 150 
##$TP07= 0
##$TPNAME0= <>
##$TPNAME1= <>
##$TPNAME2= <>
##$TPNAME3= <>
##$TPNAME4= <>
##$TPNAME5= <>
##$TPNAME6= <>
##$TPNAME7= <>
##$TPOAL= (0..7)
0.5 0.5 0.5 0.5 0.5 0.5 0.5 0.5 
##$TPOFFS= (0..7)
0 0 0 0 0 0 0 0 
##$TUNHIN= 0
##$TUNHOUT= 0
##$TUNXOUT= 0
##$USERA1= <user>
##$USERA2= <user>
##$USERA3= <user>
##$USERA4= <user>
##$USERA5= <user>
##$V9= 5
##$VALIST= <valist>
##$VCLIST= <CCCCCCCCCCCCCCC>
##$VD= 0
##$VDLIST= <DDDDDDDDDDDDDDD>
##$VPLIST= <PPPPPPPPPPPPPPP>
##$VTLIST= <TTTTTTTTTTTTTTT>
##$WBST= 1024
##$WBSW= 4
##$XGAIN= (0..3)
0 0 0 0 
##$XL= 0
##$YL= 0
##$YMAX_a= 67429
##$YMIN_a= -54045
##$ZGOPTNS= <>
##$ZL1= 120
##$ZL2= 120
##$ZL3= 120
##$ZL4= 120
##$ABSF1= 0
##$ABSF2= 0
##$ABSG= 0
##$ABSL= 0
##$ALPHA= 0
##$AQORDER= 0
##$ASSFAC= 0
##$ASSFACI= 0
##$ASSFACX= 0
##$ASSWID= 0
##$AUNMP= <proc_1d>
##$AZFE= 0.1
##$AZFW= 0.1
##$BCFW= 0
##$BC_mod= 2
##$BYTORDP= 0
##$COROFFS= 0
##$CY= -3
##$DATMOD= 1
##$DC= 0
##$DFILT= <>
##$DTYPP= 0
##$F1P= 0
##$F2P= 0
##$FCOR= 1
##$FTSIZE= 16384
##$FT_mod= 6
##$GAMMA= 0
##$GB= 0
##$INTBC= 1
##$INTSCL= 3.241238e-09
##$ISEN= 128
##$LB= 0.25
##$LEV0= 0
##$LPBIN= 0
##$MAXI= 10000
##$MC2= 0
##$MEAN= 0
##$ME_mod= 0
##$MI= 1.114404
##$NCOEF= 0
##$NC_proc= -9
##$NLEV= 6
##$NOISF1= 3.799351
##$NOISF2= 2.8
##$NSP= 0
##$NTH_PI= 0
##$NZP= 0
##$OFFSET= 15.48356
##$PC= 1
##$PHC0= -1348.02
##$PHC1= -1.209074
##$PH_mod= 1
##$PKNL= yes
##$PPARMOD= 0
##$PSCAL= 0
##$PSIGN= 0
##$REVERSE= no
##$SF= 200.130007634119
##$SI= 16384
##$SIGF1= 3
##$SIGF2= 2
##$SINO= 0.751879
##$SIOLD= 32768
##$SREGLST= <19F.Aceton>
##$SSB= 0
##$STSI= 16384
##$STSR= 0
##$SW_p= 3612.71676300578
##$SYMM= 0
##$S_DEV= 0
##$TDeff= 16384
##$TDoff= 0
##$TI= <>
##$TILT= no
##$TM1= 0
##$TM2= 0
##$TOPLEV= 0
##$USERP1= <user>
##$USERP2= <user>
##$USERP3= <user>
##$USERP4= <user>
##$USERP5= <user>
##$WDW= 1
##$XDIM= 16384
##$YMAX_p= 432116291
##$YMIN_p= -1418121
$$ End of Bruker specific parameters
$$ ---------------------------------
##NTUPLES= NMR SPECTRUM
##VAR_NAME=  FREQUENCY,     SPECTRUM/REAL,   SPECTRUM/IMAG
##SYMBOL=    X,             R,               I
##VAR_TYPE=  INDEPENDENT,   DEPENDENT,       DEPENDENT
##VAR_FORM=  AFFN,          ASDF,            ASDF
##VAR_DIM=   16384,         16384,           16384
##UNITS=     HZ,            ARBITRARY UNITS, ARBITRARY UNITS
##FACTOR=    0.220516191357247, 1,           1
##FIRST=     3098.72490264433, 0,            0
##LAST=      -513.991860361449, 0,           0
##MIN=       -513.991860361449, -1418121,    0
##MAX=       3098.72490264433, 432116291,    0
$$ Real data points
##PAGE= N=1
##DATA TABLE= (X++(R..R)), XYDATA
$$ [...]
$$ plain form
7517 413282 489625 509405 595391 800585 593535 605900 705850 521391 735717 851185 585276
7506 585276 422985 564688 473980 583121 536432 552744 789898 438431 434391 515276 366489
7495 366489 543113 626774 458816 496999 684345 651014 514614 533544 465741 228135 519259
7484 519259 807352 695403 361760 324259 161715 60219 236198 361953 349123 373784
7474 373784 324551 152251 404346 384809 -24940 33111 573390 607852 477580 273820
7464 273820 334251 384359 412855 223579 342894 519266 609111 614172 581703 555057 645235
7453 645235 516316 518869 605066 276234 112882 182543 403066 567312 403502 153632
7443 153632 178052 192168 183059 199091 486143 656739 538179 737573 662310 261215 148155
$$ packed form
7517D13282P6343J9780Q5986K05194k07050J2365R9950j84459K14326J15468k65909
7506E85276j62291J41703r0708J09141m6689J6312K37154l51467m040Q0885j48787
7495C66489J76624Q3661j67958L8183J87346l3331j36400J8930o7803k37606K91124
7484E19259K88093j11949l33643l7501j62544j01496J75979J25755j2830K4661
7474C73784m9233j72300K52095j9537m09749N8051N40279L4462j30272k03760
7464B73820O0431N0108K8496j89276J19315J76372Q9845N061l2469k6646R0178
7453F45235j28919K553Q6197l28832j63352O9661K20523J64246j63810k49870
7443A53632K4420J4116r109J6032K87052J70596j18560J99394p5263m01095j13060
$$ plain form
7432 148155 314946 464460 425578 529052 652992 303331 401193 487162 451707 599159
7422 599159 880060 735435 493512 379078 324008 300341 311657 440848 402397 325027 420079
7411 420079 547405 506888 909108 622557 753240 1022095 819773 841396 1129199 1135293
7401 1135293 1067305 1199986 970519 1168861 1119807 1058171 1348990 1282088 1085481 838998
7391 838998 648097 459399 512511 415709 550714 973754 939945 1026747 842541 573102
7381 573102 754978 764391 553837 429603 459642 406446 496202 655767 536519 599569 654504
7370 654504 649338 642069 842991 1044420 1057203 1121591 912967 533497 417775 500163 629326
7359 629326 465783 298735 491255 335540 344850 516613 756363 613276 541497 379847
$$ packed form
7432A48155J66791J49514l8882J03474J23940l49661R7862Q5969l5455J47452
7422E99159K80901j44625k41923j14434n5070k3667J1316J29191l8451p7370R5052
7411D20079J27326m0517M02220k86551J30683K68855k02322K1623K87803O094
7401A135293o7988J32681k29467J98342m9054o1636K90819o6902j96607k46483
7391H38998j90901j88698N3112r6802J35005M23040l3809Q6802j84206k69439
7381E73102J81876R413k10554j24234L0039n3196Q9756J59565j19248O3050N4935
7370F54504n166p269K00922K01429J2783O4388k08624l79470j15722Q2388J29163
7359F29326j63543j67048J92520j55715R310J71763K39750j43087p1779j61650
$$ plain form
7349 379847 622599 545684 378961 608553 856013 1085169 1223379 1070635 1145277 1277755
7339 1277755 988422 870956 917036 1049409 839532 991594 837481 887621 653787 633706
7329 633706 740428 651307 835692 545128 668208 596564 573389 443541 768817 905256
7319 905256 707472 818353 629239 817342 918500 728378 752122 838760 791717 554297
7309 554297 676638 777418 853896 943897 752254 769239 504897 489769 670934 750658 951072
7298 951072 1021246 917212 817104 688624 637475 605800 720316 974034 744733 607754
7288 607754 504361 682427 645937 825649 1287848 1279713 850987 754147 897322 1015645
7278 1015645 1246916 973498 647637 560581 878350 800890 882117 809873 746202 703847 671903
$$ packed form
7349C79847K42752p6915j66723K29592K47460K29156J38210j52744P4642J32478
7339A277755k89333j17466M6080J32373k09877J52062j54113N0140k33834k0081
7329F33706J06722q9121J84385k90564J23080p1644k3175j29848L25276J36439
7319I05256j97784J10881j89114J88103J01158j90122K3744Q6638m7043k37420
7309E54297J22341J00780P6478R0001j91643J6985k64342j5128J81165P9724K00414
7298I51072P0174j04034j00108j28480n1149l1675J14516K53718k29301j36979
7288F07754j03393J78066l6490J79712M62199q135m28726r6840J43175J18323
7278A015645K31271k73418l25861q7056L17769p7460Q1227p2244o3671m2355l1944
$$ plain form
7267 671903 905629 1092373 1173323 1155548 1241952 956340 871169 705287 519669 1027306
7257 1027306 928380 869751 784963 644461 890359 1048148 903272 650797 536268 1139861
7247 1139861 1191247 1168618 1134981 1070835 1198242 1005889 1088077 1165071 991452 959275 1129090
7236 1129090 1065192 1045285 1183512 1093296 868251 671592 911614 847851 1074724 1217906
7226 1217906 1157362 1222236 1244609 1429993 1622811 1764568 1359360 1018237 972407 1030075
7216 1030075 1182512 1205898 1179276 1193540 1056181 1085150 1208231 1218871 1004667 1256071
7206 1256071 1542463 1465316 1209477 1312296 1545785 1656153 1385474 1428516 1359674 1379898
7196 1379898 1304096 1385191 1672227 1656868 1640871 1717729 1857305 1879134 1813394 2081414 1884095
$$ packed form
7267F71903K33726J86744Q0950j7775Q6404k85612q5171j65882j85618N07637
7257A027306r8926n8629q4788j40502K45898J57789j44876k52475j14529O03593
7247A139861N1386k2629l3637o4146J27407j92353Q2188P6994j73619l2177J69815
7236A129090o3898j9907J38227r0216k25045j96659K40022o3763K26873J43182
7226A217906o0544O4874K2373J85384J92818J41757m05208l41123m5830N7668
7216A030075J52437K3386k6622J4264j37359K8969J23081J0640k14204K51404
7206A256071K86392p7147k55839J02819K33489J10368k70679M3042o8842K0224
7196A379898p5802Q1095K87036j5359j5997P6858J39576K1829o5740K68020j97319
$$ plain form
7185 1884095 1902921 2081753 1984374 2155514 2004772 1894547 2005381 2215807 2215722 2244694 2375561
7174 2375561 2654178 2770485 2837386 2422729 2468257 2827288 3069459 3061487 3137978 3450776
7164 3450776 3568066 3872531 3853343 3910481 4059399 4402747 4558100 4784399 4892360 4912428
7154 4912428 5193054 5476563 5880490 6018347 6334410 6687132 7191498 7449937 7594078 8306756
7144 8306756 8568110 9123739 9487290 9917833 10688696 10858858 11411253 11954755 12660952 12960787
7134 12960787 13202191 13589796 13801398 14009045 14002016 13850655 13963240 13855195 13477930 13200484
7124 13200484 13125871 12914634 12362722 11957694 11426154 11015228 10749809 10718827 10328154 9947407
7114 9947407 9478015 9201519 8933671 8735819 8546985 8082492 7911976 7746757 7408873 7442166
$$ packed form
7185A884095J8826J78832r7379J71140j50742j10225J10834K10426q5K8972J30867
7174B375561K78617J16307O6901m14657M5528L59031K42171p972P6491L12798
7164C450776J17290L04465j9188N7138J48918L43348J55353K26299J07961K0068
7154D912428K80626K83509M03927J37857L16063L52722N04366K58439J44141P12678
7144H306756K61354N55629L63551M30543P70863J70162N52395N43502P06197K99835
7134A2960787K41404L87605K11602K07647p029j51361J12585j08045l77265k77446
7124A3200484p4613k11237n51912m05028n31540m10926k65419l0982l90673l80747
7114I947407m69392k76496k67848j97852j88834m64493j70516j65219l37884L3293
$$ plain form
7104 7442166 7429155 7294938 7153542 6683755 6585957 6431230 6121460 6033485 5530572 5306102
7094 5306102 5117905 4684979 4395708 4300695 4415974 4450126 4467820 4172366 4126386 3988644
7084 3988644 3534193 3166487 3154234 3073509 2844710 2843165 3215159 3066140 2864797 2838151
7074 2838151 2770210 2945717 2533331 2601108 2653617 2252327 2360160 2360589 2275280 2321634 2364535
7063 2364535 2387769 2503281 2562189 2476669 2488767 2355122 2496417 2650677 2532905 2604235
7053 2604235 2541442 2392421 2404157 2229891 2125902 2114160 1992738 1925064 2164926 1873406
7043 1873406 1920936 1727350 1667815 1575620 1758350 1959941 1924804 2033177 1921053 1850950
7033 1850950 1608423 1444812 1295174 1560355 1559750 1659528 1606067 1608930 1532277 1429776 1765801
$$ packed form
7104G442166j3011j34217j41396m69787r7798j54727l09770q7975n02913k24470
7094E306102j88197m32926k89271r5013J15279L4152J7694k95454m5980j37742
7084C988644m54451l67706j2253q0725k28799j545L71994j49019k01343k6646
7074B838151o7941J75507m12386O7777N2509m01290J07833M29q5309M6354M2901
7063B364535K3234J15512N8908q5520J2098j33645J41295J54260j17772P1330
7053B604235o2793j49021J1736j74266j03989j1742j21422o7674K39862k91520
7043A873406M7530j93586n9535r2195J82730K01591l5137J08373j12124p0103
7033A850950k42527j63611j49638K65181o05R9778n3461K863p6653j02501L36025
$$ plain form
7022 1765801 1746756 1444021 1536623 1774223 1792110 1469647 1507327 1361311 1604462 1629146
7012 1629146 1432289 1463630 1510536 1310190 1322293 1184556 1050337 1369468 1673584 1893955
7002 1893955 1932331 1714279 1847706 1757794 1994684 2249740 2492815 2706708 3055792 3403930
6992 3403930 3392594 3939032 4337256 4557454 4570400 4856788 4910735 4898321 4480965 4404017
6982 4404017 4389861 4295184 4758829 5174679 5227086 5381057 5583545 5357537 5020692 4373403
6972 4373403 3870333 3773548 3542588 3097696 2918902 2715281 2681640 2611129 2555381 2484298
6962 2484298 2248643 2414977 2265118 2275299 2308440 2284456 2137343 2078963 2257676 2358268
6952 2358268 2250101 2242556 2130032 2109893 1972308 1885671 2236551 2250624 2020990 2055120 2072660
$$ packed form
7022A765801j9045l02735R2602K37600J7887l22463L7680j46016K43151K4684
7012A629146j96857L1341M6906k00346J2103j37737j34219L19131L04116K20371
7002A893955L8376k18052J33427q9912K36890K55056K43075K13893L49084L48138
6992C403930j1336N46438L98224K20198J2946K86388N3947j2414m17356p6948
6982D404017j4156r4677M63645M15850N2407J53971K02488k26008l36845o47289
6972D373403n03070r6785k30960m44892j78794k03621l3641p0511n5748p1083
6962B484298k35655J66334j49859J0181L3141k3984j47113n8380J78713J00592
6952B358268j08167p545j12524k0139j37585q6637L50880J4073k29634L4130J7540
$$ plain form
6941 2072660 1857412 2147076 2089501 1964638 2157582 2323732 2462020 2773879 2901133 2933690
6931 2933690 3223016 3783179 4116764 4518796 4521031 4504647 4300302 4282509 4208069 3974335
6921 3974335 4090368 4241938 4246288 4245364 4510041 4848796 5048184 5053666 5114470 4393869 4099135
6910 4099135 3621269 3416346 3298613 3515085 3280993 2878415 2549415 2577277 2707075 2430306
6900 2430306 2231446 2233661 2160356 2142387 1845645 1865927 2085835 2065372 2038670 1947104 1839855
6889 1839855 1885999 1845668 1817202 1855592 1778717 1854548 1890191 1586588 1582800 1571238 1549502
6878 1549502 1812288 1739787 1816569 1577295 1307271 1388560 1360934 1406440 1568905 1432802
6868 1432802 1394027 1528577 1046260 1119739 1564084 1349393 1314460 1217969 1287138 1194045 1267264
$$ packed form
6941B072660k15248K89664n7575j24863J92944J66150J38288L11859J27254L2557
6931B933690K89326N60163L33585M02032K235j6384k04345j7793p4440k33734
6921C974335J16033J51570M350r24K64677L38755J99388N482O0804p20601k94734
6910D099135m77866k04923j17733K16472k34092m02578l29000K7862J29798k76769
6900B430306j98860K215p3305j7969k96742K0282K19908k0463k6702r1566j07249
6889A839855M6144m0331k8466L8390p6875P5831L5643l03603l788j1562k1736
6878A549502K62786p2501P6782k39274k70024Q1289k7626M5506J62465j36103
6868A432802l8775J34550m82317P3479M44345k14691l4933r6491O9169r3093P3219
$$ plain form
6857 1267264 1308942 1158731 884339 1011774 1189655 1310617 1490584 1607386 1323843 1331656
6847 1331656 1048279 1018980 1275531 1413500 1436224 1169171 1109090 1453875 1588271 1360252
6837 1360252 1243526 1575090 1505880 1439968 1242508 1241427 1524621 1403624 1297446 1231019
6827 1231019 1200962 1336668 1250158 1162087 1519812 1502368 1295367 940364 1126280 1132306 1064451
6816 1064451 1247143 1247668 1348168 1278155 1330218 1148789 1334402 1519252 1365150 1321529 1263991
6805 1263991 1351492 1111440 1726781 1743575 1499611 1436442 1503822 1367375 1298308 1541003
6795 1541003 1605750 1285074 1412642 1674808 1414536 979122 1149278 1244066 1165654 1513016
6785 1513016 1293777 1436136 1329668 1317046 1397047 1547872 1628988 1739131 1580800 1494532
$$ packed form
6857A267264M1678j50211k74392J27435J77881J20962J79967J16802k83543P813
6847A331656k83377k9299K56551J37969K2724k67053o0081L44785J34396k28019
6837A360252j16726L31564o9210o5912j97460j081K83194j20997j06178o6427
6827A231019l0057J35706q6510q8071L57725j7444k07001l55003J85916O026o7855
6816A064451J82692N25J00500p0013N2063j81429J85613J84850j54102m3621n7538
6805A263991Q7501k40052O15341J6794k43964o3169O7380j36447o9067K42695
6795A541003O4747l20676J27568K62166k60272m35414J70156R4788p8412L47362
6785A513016k19239J42359j06468j2622Q0001J50825Q1116J10143j58331q6268
$$ plain form
6775 1494532 1626910 1565145 1612564 1574948 1385813 1373602 1521938 1466083 1360617 1227480
6765 1227480 1496643 1819414 1411834 1274943 1018873 1239733 1353749 1163951 1549454 1634636
6755 1634636 1572668 1706287 2013138 2035480 1802364 2097435 2412942 2267632 2401792 2719615
6745 2719615 2948444 3000716 3024701 3161920 3335703 3779638 4309734 4782837 5008025 5163074
6735 5163074 5500287 5567275 5022087 4597066 4680281 4605834 4917467 5271701 5647566 5734745
6725 5734745 5800933 5980934 5819611 5528141 5366974 5141620 5021989 4976501 4910565 5084060
6715 5084060 5334831 5491217 5838846 6199992 6451593 6578414 6566763 6707506 6380741 6256791
6705 6256791 5991214 5820860 5731441 5662912 5841042 5987682 6155109 6243033 6300974 6152203
$$ packed form
6775A494532J32378o1765M7419l7616j89135j2211J48336n5855j05466j33137
6765A227480K69163L22771m07580j36891k56070K20860J14016j89798L85503Q5182
6755A634636o1968J33619L06851K2342k33116K95071L15507j45310J34160L17823
6745B719615K28829N2272K3985J37219J73783M43935N30096M73103K25188J55049
6735E163074L37213O6988n45188m25021Q3215p4447L11633L54234L75865Q7179
6725E734745O6188J80001j61323k91470j61167k25354j19631m5488o5936J73495
6715E084060K50771J56386L47629L61146K51601J26821j1651J40743l26765j23950
6705F256791k65577j70354q9419o8529J78130J46640J67427Q7924N7941j48771
$$ plain form
6695 6152203 5594311 5080512 4724241 4143110 4059925 3981337 3727387 3374662 3324370 3274909
6685 3274909 2963757 2982925 3009851 2980450 3092697 2745452 2464658 2755656 2893596 2964831
6675 2964831 2841829 2677712 2544290 2663886 2443618 2590093 2581302 2477395 2709689 2506783
6665 2506783 2275365 2111490 2232265 2308639 2342406 2219229 2296021 2192974 2144329 2072854
6655 2072854 2229386 2439631 2395052 2487947 2258083 2259263 2640131 2548191 2613022 2284885 2059389
6644 2059389 1879841 2058376 1985354 1896459 2044227 2154929 2224723 2177908 2196171 2107651 1964232
6633 1964232 2022836 2059405 1928913 1870521 2070043 2057463 1863197 1820308 1977781 2140679
6623 2140679 2338440 2319951 1970379 2070073 2271113 2246063 2069886 2075576 2068284 2115007 2277094
$$ packed form
6695F152203n57892n13799l56271n81131q3185p8588k53950l52725n0292m9461
6685C274909l11152J9168K6926k9401J12247l47245k80794K90998J37940P1235
6675B964831j23002j64117j33422J19596k20268J46475q791j03907K32294k02906
6665B506783k31418j63875J20775P6374L3767j23177P6792j03047m8645p1475
6655B072854J56532K10245m4579R2895k29864J180L80868r1940O4831l28137k25496
6644B059389j79548J78535p3022q8895J47768J10702O9794m6815J8263q8520j43419
6633A964232N8604L6569j30492n8392J99522j2580j94266m2889J57473J62898
6623B140679J97761j8489l49572R9694K01040k5050j76177N690p292M6723J62087
$$ plain form
6612 2277094 2298376 2319919 2254334 2182386 2147223 2074537 2365976 2469567 2604015 2460020 2442889
6601 2442889 2215947 2308004 2272105 2426613 2463409 2592627 2672085 2389435 2640825 2620055
6591 2620055 2529704 2570445 2534789 2676010 2938613 2852924 2944878 3239260 2980086 3363499
6581 3363499 3336754 3529531 3557436 3454992 3703379 3607718 3811688 3932530 3738111 3478205
6571 3478205 3658745 4054375 4446999 4529782 4426812 4522646 4718030 5040275 5366617 5751557
6561 5751557 6005420 6758972 7028411 7484095 8443370 9153919 9909517 10318728 10308074 10344181
6551 10344181 9780212 9516495 9060343 8569424 8502708 7956301 7722029 7449881 7225687 6645440
6541 6645440 6487647 6433258 6364168 6089705 6046456 5943226 5538786 5180613 5186218 5015718
$$ packed form
6612B277094K1282K1543o5585p1948l5163p2686K91439J03591J34448j43995j7131
6601B442889k26942R2057l5899J54508L6796J29218P9458k82650K51390k0770
6591B620055r0351M0741l5656J41221K62603q5689R1954K94382k59174L83413
6581C363499k6745J92777K7905j02444K48387r5661K03970J20842j94419k59906
6571C478205J80540L95630L92624Q2783j02970R5834J95384L22245L26342L84940
6561E751557K53863P53552K69439M55684R59275P10549P55598M09211j0654L6107
6551A0344181n63969k63717m56152m90919o6716n46407k34272k72148k24194n80247
6541F645440j57793n4389o9090k74463m3249j03230m04440l58173N605j70500
$$ plain form
6531 5015718 4854013 4790558 4448655 4304727 4371178 4080710 3874528 3737838 3815477 3827691
6521 3827691 3987605 3942150 3872164 3906134 3867691 3675816 3434829 3205224 3159943 3338678
6511 3338678 3052269 3074651 3391354 3409866 3448365 3583054 3207259 2993433 3049081 3050941 2989163
6500 2989163 3023937 2859300 2755309 3031615 3235680 3116018 3180297 3131206 2960927 2696277
6490 2696277 2636946 2861511 3171537 3467230 3644390 3647797 3457968 3415038 3469041 3391615 3658027
6479 3658027 3718476 3715908 3744719 3641032 3515106 3384572 3571252 3590719 3702082 3721683 4045298
6468 4045298 4030609 4074344 3919559 4006856 3988254 3948101 3982335 3977078 4135485 4426671 4773836
6457 4773836 4845187 5041045 4941722 4951139 5289669 5329835 5105731 5093150 5224347 5187925 5010241
$$ packed form
6531E015718j61705o3455l41903j43928O6451k90468k06182j36690P7639J2214
6521C827691J59914m5455o9986L3970l8443j91875k40987k29605m5281J78735
6511C338678k86409K2382L16703J8512L8499J34689l75795k13826N5648J860o1778
6500B989163L4774j64637j03991K76306K04065j19662O4279m9091j70279k64650
6490B696277n9331K24565L10026K95693J77160L407j89829m2930N4003p7426K66412
6479C658027O0449k568K8811j03687j25926j30534J86680J9467J11363J9601L23615
6468D045298j4689M3735j54785Q7297j8602m0153L4234n257J58407K91186L47165
6457D773836P1351J95858r9323R417L38530M0166k24104j2581J31197l6422j77684
$$ plain form
6446 5010241 5471343 5709640 5649898 5937196 5811702 5812858 6073479 6006865 6123655 6420423
6436 6420423 6348970 6225537 6388411 6469963 6511829 6482836 6428943 6689435 6779461 6956200 6964986
6425 6964986 6777425 6733262 7283306 7585342 7645760 7817944 7889840 8059999 8439514 8367571
6415 8367571 8504988 8737039 8738502 8889367 8947470 9205095 9573436 9587584 9669651 9866652
6405 9866652 9808067 9919977 10143663 10533241 10890632 11325312 11601784 12349058 12898539 13560834
6395 13560834 14104858 14841243 15992060 16914494 17996544 19323861 20419570 21987224 23819194
6386 23819194 26076395 28414212 32135789 36679025 41932336 47371031 53624110 60779921
6378 60779921 66708347 70724742 72984202 71986092 67130634 62522550 58923547 56673882
$$ packed form
6446E010241M61102K38297n9742K87298j25494J156K60621o6614J16790K96768
6436F420423p1453j23433J62874Q1552M1866k8993n3893K60492R0026J76739Q786
6425F964986j87561m4163N50044L02036O0418J72184P1896J70159L79515p1943
6415H367571J37417K32051J463J50865N8103K57625L68341J4148Q2067J97001
6405I866652n8585J11910K23686L89578L57391M34680K76472P47274N49481O62295
6395A3560834N44024P36385J150817R22434J082050J327317J095709J567654J831970
6386B3819194K257201K337817L721577M543236N253311N438695O253079P155811
6378F0779921N928426M016395K259460r98110m855458m608084l599003k249665
$$ plain form
6370 56673882 54787842 53565762 52669219 52160635 51667153 50538573 49846678 49560737 49732674
6361 49732674 50502586 51486668 52475201 53705302 54616084 55492417 56123205 56665997 57094487
6352 57094487 57964323 58911957 60042516 61091476 62070359 63185171 64211757 65550594 67199288
6343 67199288 70008073 73985474 79004393 84986740 91974861 99280891 106580571 112982265
6335 112982265 117637632 120182647 119391239 116108246 111091185 105602500 101082633 97814042
6327 97814042 95403529 94100096 94415127 95705623 98505315 102575467 107482332 113744121
6319 113744121 120823981 127409779 133409569 137875321 140028737 139760897 137639333 133553566
6311 133553566 127752692 120426149 112750632 106138758 100245296 95344384 91731947 88828982
$$ packed form
6370E6673882j886040j222080q96543n08584m93482j128580o91895k85941J71937
6361D9732674P69912R84082R88533J230101R10782Q76333O30788N42792M28490
6352E7094487Q69836R47634J130559J048960R78883J114812J026586J338837J648694
6343F7199288K808785L977401N018919N982347O988121P306030P299680O401694
6335A12982265M655367K545015p91408l282993n017061n488685m519867l268591
6327I7814042k410513j303433L15031J290496K799692M070152M906865O261789
6319A13744121P079860O585798N999790M465752K153416k67840k121564m085767
6311A33553566n800874p326543p675517o611874n893462m900912l612437k902965
$$ plain form
6303 88828982 86355833 84768348 83868793 83981939 85027604 86893193 90186795 94598109
6295 94598109 99777235 106007643 113414707 120645504 127333917 132851395 136888270 138740664
6287 138740664 137809397 135098927 131004165 125864187 119894870 113739037 108434374 104113233
6279 104113233 100681174 98425671 97471220 97947182 99724658 102528206 106153443 110682032
6271 110682032 115080606 118829201 121215776 121457562 119148883 114228386 108036835 101392154
6263 101392154 94992044 89353430 84594501 80608526 77298955 74541298 72304378 70455877
6255 70455877 68949861 67549514 66052039 64337196 62586757 60925557 59565553 58230237
6247 58230237 57137687 55958602 54333870 52625032 50792720 48787216 47185690 45751657
$$ packed form
6303H8828982k473149j587485q99555J13146J045665J865589L293602M411314
6295I4598109N179126O230408P407064P230797O688413N517478M036875J852394
6287A38740664r31267k710470m094762n139978n969317o155833n304663m321141
6279A04113233l432059k255503r54451M75962J777476K803548L625237M528589
6271A10682032M398574L748595K386575K41786k308679m920497o191551o644681
6263A01392154o400110n638614m758929l985975l309571k757657k236920j848501
6255G0455877j506016j400347j497475j714843j750439j661200j360004j335316
6247E8230237j092550j179085j624732j708838j832312k005504j601526j434033
$$ plain form
6239 45751657 44214989 42935828 42039187 41445030 40019953 38454339 36524182 34771060
6231 34771060 32682684 30570870 28792720 27298735 26094761 24924117 23773554 22584421
6223 22584421 21776411 20931706 20198677 19510131 18711218 18063611 17704432 17362377 16842608
6214 16842608 16074159 15861837 15508206 14974528 14777005 14536743 14147381 13954997 13745633
6205 13745633 13217432 13087946 12765765 12487005 12484314 12500893 12264100 12058787 12237793 12009566
6195 12009566 11892391 11805661 11465021 11165793 11241456 11577170 11547443 11122106 11149561 11250987
6185 11250987 11029610 10748406 10677214 10628856 10393460 10159260 10212667 10127348 10138728 9977004
6175 9977004 9709417 9532322 9714788 9667770 9552193 9422556 9292429 9361365 9021526 9007074
$$ packed form
6239D5751657j536668j279161q96641n94157j425077j565614j930157j753122
6231C4771060k088376k111814j778150j493985j203974j170644j150563j189133
6223B2584421q08010q44705p33029o88546p98913o47607l59179l42055n19769
6214A6842608p68449k12322l53631n33678j97523k40262l89362j92384k09364
6205A3745633n28201j29486l22181k78760k691J6579k36793k05313J79006k28227
6195A2009566j17175q6730l40640k99228P5663L35714k9727m25337K7455J01426
6185A1250987k21377k81204p1192m8358k35396k34200N3407q5319J1380j61724
6175I977004k67587j77095J82466m7018j15577j29637j30127O8936l39839j4452
$$ plain form
6165 9007074 9062732 8844401 8725325 8838152 8723085 8520399 8508329 8763171 8606237 8402595
6155 8402595 8580234 8669571 8259709 8347194 8147776 7817620 7848310 7651092 7312482 7000382
6145 7000382 6957266 6921993 6588933 6356389 6291210 6013116 6079812 6208503 5768955 5723402
6135 5723402 5859237 5784041 5642671 5450553 5291608 5192963 5152860 4982193 4844908 4592692
6125 4592692 4496995 4433082 4688492 4795764 4754941 4658538 4121238 4240102 4383540 4450697
6115 4450697 4552883 4606512 4432153 4239437 4387694 4198950 4132901 4196602 4166505 4171570 4077214
6104 4077214 4287836 4000211 3843748 3992262 4301567 4582020 4333993 4177745 4069232 3956564
6094 3956564 3944725 3987007 3780609 3919394 3980879 4167405 4077892 4137974 4151449 3963241 3971978
$$ packed form
6165I007074N5658k18331j19076J12827j15067k02686j2070K54842j56934k03642
6155H402595J77639Q9337m09862Q7485j99418l30156L0690j97218l38610l12100
6145G000382m3116l5273l33060k32544o5179k78094O6696J28691m39548m5553
6135E723402J35835p5196j41370j92118j58945r8645m0103j70667j37285k52216
6125D592692r5697o3913K55410J07272m0823r6403n37300J18864J43438O7157
6115D450697J02186N3629j74359j92716J48257j88744o6049O3701l0097N065r4356
6104D077214K10622k87625j56463J48514L09305K80453k48027j56248j08513j12668
6094C956564j1839M2282k06398J38785O1485J86526q9513O0082J3475j88208Q737
$$ plain form
6083 3971978 4119723 4103960 3898405 4062128 3893487 3868243 3888423 3937232 3787724 4011227
6073 4011227 4059124 3949668 4169689 4304638 4249608 4310016 4362587 4380620 4232944 4112855
6063 4112855 4208411 4059727 4285236 4436064 4239381 4253166 4490980 4563220 4733699 4552364
6053 4552364 4496357 4494940 4428921 4343290 4218313 4064720 4124125 4071198 4107367 4138974 4169743
6042 4169743 4086199 4177598 4508727 4349408 4383012 4103966 4255251 4421067 4458485 4295854
6032 4295854 4215573 4268092 4441603 4519198 4419903 4466451 4461172 4483119 4708686 4751984 4824584
6021 4824584 5060311 4979803 5278023 5470780 5374065 5428515 5317741 5148933 4828830 4846019
6011 4846019 5045922 4869432 4966395 4600885 4380046 4470829 4566917 4560209 4433413 4409146 4459909
$$ packed form
6083C971978J47745j5763k05555J63723j68641k5244K0180M8809j49508K23503
6073D011227M7897j09456K20021J34949n5030O0408N2571J8033j47676j20089
6063D112855R5556j48684K25509J50828j96683J3785K37814P2240J70479j81335
6053D552364n6007j417o6019q5631j24977j53593N9405n2927L6169L1607L0769
6042D169743q3544R1399L31129j59319L3604k79046J51285J65816L7418j62631
6032D295854q0281N2519J73511P7595r9295M6548n279K1947K25567M3298P2600
6021D824584K35727q0508K98220J92757r6715N4450j10774j68808l20103J7189
6011D846019J99903j76490R6963l65510k20839R0783R6088o708j26796k4267N0763
$$ plain form
6000 4459909 4472506 4826196 4598502 4551321 4687259 4429506 4743559 5034833 4978326 5339517
5990 5339517 5556230 5436128 5375576 5345644 5668392 5695229 5771086 6185945 6483964 6544232
5980 6544232 6610072 6844964 7211208 7550239 7544879 8072164 8665911 8783853 9231099 10031564
5970 10031564 10633321 10807801 10949072 11226571 11053176 10800918 10472878 9904155 9132791
5961 9132791 8986929 8681228 8343420 8109248 8084647 7910524 7549111 7219296 6978639 6776292
5951 6776292 6443856 6580598 6491635 6394854 6302120 6180092 6067553 5966719 5860626 6054016
5941 6054016 5994530 5667315 5730378 5760798 5453064 5374887 5471503 5247069 5304942 5068346 4972779
5930 4972779 5237778 5486733 5516320 5331338 5682497 5415246 5177103 5191308 5085692 4982159
$$ packed form
6000D459909J2597L53690k27694m7181J35938k57753L14053K91274n6507L61191
5990E339517K16713j20102o0552k9932L22748K6837P5857M14859K98019O0268
5980F544232O5840K34892L66244L39031n360N27285N93747J17942M47246Q00465
5970A0031564O01757J74480J41271K77499j73395k52258l28040n68723p71364
5961I132791j45862l05701l37808k34172k4601j74123l61413l29815k40657k02347
5951F776292l32436J36742q8963r6781r2734j22028j12539j00834j06093J93390
5941F054016n9486l27215O3063L0420l07734p8177R6616k24434N7873k36596r5567
5930D972779K64999K48955K9587j84982L51159k67251k38143J4205j05616j03533
$$ plain form
5920 4982159 5002169 5224084 5489173 5508962 5494600 5532291 5674418 5789253 5804164 5938156
5910 5938156 6054210 5673387 5959979 5731558 5727318 5969367 6148861 6073379 5936810 6110909
5900 6110909 6218729 6132290 6388730 6191221 6183658 6330927 6249748 6483656 6512303 6596677 6468868
5889 6468868 6394339 6411083 6346738 6278979 6117271 6008125 5929821 5801504 5752792 5677975 5462492
5878 5462492 5425808 5469348 5400156 5361516 5507025 5380679 5360761 5430576 5441034 5188639 4941996
5867 4941996 5083509 4958297 4947504 4678078 4678460 4809792 4890099 4943524 5007447 4962415 5171552
5856 5171552 5173800 5126883 5000700 4993899 4789098 4516679 4608725 4634755 4601407 4463791 4670635
5845 4670635 4648244 4554838 4591081 4702415 4687988 4716211 4778780 4744873 4777201 5002297 5409275
$$ packed form
5920D982159K0010K21915K65089J9789j4362L7691J42127J14835J4911J33992
5910E938156J16054l80823K86592k28421m240K42049J79494p5482j36569J74099
5900F110909J07820q6439K56440j97509p563J47269q1179K33908K8647Q4374j27809
5889F468868p4529J6744o4345o7759j61708j09146p8304j28317m8712p4817k15483
5878E462492l6684M3540o9192l8640J45509j26346j9918O9815J0458k52395k46643
5867D941996J41513j25212j0793k69426L82J31332Q0307N3425O3923m5032K09137
5856E171552K248m6917j26183o801k04801k72419R2046K6030l3348j37616K06844
5845D670635k2391r3406L6243J11334j4427K8223O2569l3907L2328K25096M06978
$$ plain form
5834 5409275 5558451 5666779 5335272 5378911 5661042 6031150 6036422 6143222 6327020 6361544
5824 6361544 6250927 6358050 6292582 6193150 6265492 6151078 6187537 6145770 5892754 5574786
5814 5574786 5642554 5818978 5848929 5944526 5646049 5534378 5601061 5571272 5369542 5246980
5804 5246980 5133721 5041385 4997850 4839925 4808223 4872411 4822421 4709368 4837018 5024615
5794 5024615 4815060 4621299 4879633 5062793 4971072 4912752 4877662 5015991 5348256 5289512
5784 5289512 5301380 5279115 5064706 5086781 5135248 4747502 4514455 4975102 5002957 4925739 4975904
5773 4975904 5014328 4767285 4966203 4828323 5016472 5364656 5230538 5065975 5174025 5481654
5763 5481654 5414451 5611641 5567906 5469256 5426980 5418226 5218955 5237051 5182038 5269207 5267599
$$ packed form
5834E409275J49176J08328l31507M3639K82131L70108N272J06800J83798L4524
5824F361544j10617J07123o5468r9432P2342j14414L6459m1767k53016l17968
5814E574786O7768J76424K9951R5597k98477j11671O6683k9789k01730j22562
5804E246980j13259r2336m3535j57925l1702O4188m9990j13053J27650J87597
5794E024615k09555j93761K58334J83160r1721n8320l5090J38329L32265n8744
5784E289512J1868k2265k14409K2075M8467l87746k33047M60647K7855p7218N0165
5773D975904L8424k47043J98918j37880J88149L48184j34118j64563J08050L07629
5763E481654o7203J97190m3735r8650m2276q754j99271J8096n5013Q7169j608
$$ plain form
5752 5267599 5135678 4986336 4962738 4970240 5023560 5160614 5071329 4856893 4986640 4924481 4887129
5741 4887129 5021538 5279400 5766493 5825108 5849002 5714285 5829295 6149802 6115784 6372998
5731 6372998 6633313 6859880 6898897 6764403 6582418 6512359 6547823 6733201 6854074 7117877
5721 7117877 7011748 7283659 7239100 7352080 7667250 7867207 8039457 8151160 8316643 8458013
5711 8458013 8226845 8233544 7976907 7657101 7564962 7568465 7757930 7967530 8108539 7955474
5701 7955474 8207421 8340854 8027505 7935030 8149918 8388690 8577973 8918668 9019278 8942195
5691 8942195 9214292 9305184 9799125 10372205 10779457 11066540 11434199 12056040 12350835 12523697
5681 12523697 12977221 12606649 12325711 12014672 11999002 11962059 11633007 11593492 11427882 11032143
$$ packed form
5752E267599j31921j49342k3598P502N3320J37054q9285k14436J29747o2159l7352
5741D887129J34409K57862M87093N8615K3894j34717J15010L20507l4018K57214
5731F372998K60315K26567L9017j34494j81985p0059L5464J85378J20873K63803
5721G117877j06129K71911m4559J12980L15170J99957J72250J11703J65483J41370
5711H458013k31168O699k56637l19806r2139L503J89465K09600J41009j53065
5701G955474K51947J33433l13349r2475K14888K38772J89283L40695J00610p7083
5691H942195K72097R0892M93941N73080M07252K87083L67659O21841K94795J72862
5681A2523697M53524l70572k80938l11039j5670l6943l29052l9515j65610l95739
$$ plain form
5671 11032143 11107885 10926532 10700936 10962980 10771464 10805073 10968577 11280481 11651277 11273245
5661 11273245 11172661 11558266 11769102 11961943 12563442 13220429 13501781 14387920 15012037
5652 15012037 15408062 15683534 15738192 16334168 16187322 15613525 15491765 15298615 15368439 15320249
5642 15320249 15287816 15731481 15701191 15829616 16244693 16719410 17097767 17534172 17955055 18257804
5632 18257804 18442108 19162836 19926845 20586281 21427057 22148521 23103271 24121835 25202669
5623 25202669 26056185 27226548 28811880 30295138 31663592 32666600 34576460 36433022
5615 36433022 38346386 40696448 42973883 45949239 49223324 52695706 56553437 61132486
5607 61132486 66546631 72415635 78891267 86517377 94990222 104387760 114929748 126408468
$$ packed form
5671A1032143P5742j81353k25596K62044j91516L3609J63504L11904L70796l78032
5661A1273245j00584L85605K10836J92841O01499O56987K81352Q86139O24117
5652A5012037L96025K75472N4658N95976j46846n73797j21760j93150O9824m8190
5642A5320249l2433M43665l0290J28425M15077M74717L78357M36405M20883L02749
5632A8257804J84304P20728P64009O59436Q40776P21464R54750J018564J080834
5623B5202669Q53516J170363J585332J483258J368454J003008J909860J856562
5615C6433022J913364K350062K277435K975356L274085L472382L857731M579049
5607F1132486N414145N869004O475632P626110Q472845R397538J0541988J1478720
$$ plain form
5599 126408468 138641754 150773125 162883039 174408426 184613574 193226283 199372686
5592 199372686 203493554 204875603 203259738 198842021 192620539 184866133 176513780 167503997
5584 167503997 157735374 147856974 137735264 127284218 117684625 108880646 100432510 92596189
5576 92596189 85373608 79664847 74352232 69361470 64764151 60574705 57102297 53862755
5568 53862755 50607690 47762785 45228595 42706775 40777046 38982319 37336313 35775923
5560 35775923 34297274 33057973 31930293 30978509 29802625 28619195 27660341 26902198 26024187
5551 26024187 25028872 24182276 23133971 22645198 22100338 21606632 21210850 20607214 19572463
5542 19572463 18918489 18559974 18099156 17611162 17115221 16437685 15705073 15193862 14725995
$$ packed form
5599A26408468J2233286J2131371J2109914J1525387J0205148Q612709O146403
5592A99372686M120868J382049j615865m417717o221482p754406q352353r009783
5584A67503997r768623r878400j0121710j0451046r599593q803979q448136p836321
5576I2596189p222581n708761n312615m990762m597319m189446l472408l239542
5568E3862755l255065k844905k534190k521820j929729j794727j646006j560390
5560C5775923j478649j239301j127680r51784j175884j183430r58854p58143q78011
5551B6024187r95315q46596j048305m88773n44860m93706l95782o03636j034751
5542A9572463o53974l58515m60818m87994m95941o77536p32612n11211m67867
$$ plain form
5533 14725995 14579780 14107146 14106206 13637194 13248529 12829966 12687419 12164796 11935460 11885367
5523 11885367 11318497 10771132 10486139 10531292 10204910 10036778 10008118 9694233 9496020 9414516
5513 9414516 9623838 9625077 9664812 9340526 8909561 9031513 8865142 8850944 8746346 8537800
5503 8537800 8938902 8815403 8440981 8404909 8449659 8570353 8453950 8535042 8484876 7973030
5493 7973030 7905628 7938566 7525587 7588479 7526341 7533877 7338163 6981209 7130294 7159094 6991918
5482 6991918 6842855 6784892 6730102 6334997 6502461 6357314 6244127 5919031 5927716 6010709
5472 6010709 6116712 5970329 5664356 5608531 5626106 5748042 5763555 5699141 5426131 5428100 5335624
5461 5335624 5458174 5492739 5119699 5331244 5491039 5631939 5647535 5742728 5692869 5583063
$$ packed form
5533A4725995j46215m72634r40m69012l88665m18563j42547n22623k29336n0093
5523A1885367n66870n47365k84993M5153l26382j68132k8660l13885j98213q1504
5513I414516K09322J239L9735l24286m30965J21952j66371j4198j04598k08546
5503H537800M01102j23499l74422l6072M4750J20694j16403Q1092n0166n11846
5493G973030o7402L2938m12979O2892o2138P536j95714l56954J49085K8800j67176
5482F991918j49063n7963n4790l95105J67464j45147j13187l25096Q685Q2993
5472F010709J06003j46383l05973n5825J7575J21936J5513o4414k73010J969r2476
5461E335624J22550L4565l73040K11545J59795J40900J5596R5193m9859j09806
$$ plain form
5451 5583063 5575894 5768074 5928336 6015819 6107587 6131562 6221369 6238284 6603088 6781018 6963268
5440 6963268 7273617 7767895 7780570 7695528 7362290 7251564 7196979 6820553 6736901 6764303
5430 6764303 6869916 6939178 6962194 6655672 6447121 6417482 6227504 6316813 6589879 6793059
5420 6793059 6958975 6983793 7043318 7222931 6938946 6717782 6540696 6429312 6327316 6153354
5410 6153354 6068579 6060741 5652444 5415988 5712781 5799751 5720495 5869970 5518159 5452976 5602147
5399 5602147 5512609 5268108 5087748 4968327 4799283 4975918 4944402 5208866 5057641 4889210
5389 4889210 4880823 4969704 5033046 4836262 4751842 4914183 4805110 4748844 4773628 4959730 4750259
5378 4750259 4713467 5126955 5117771 5045102 5020223 5068648 5069362 4977868 4895168 4926451 4708237 4433175
$$ packed form
5451E583063p169J92180J60262Q7483R1768K3975Q9807J6915L64804J77930J82250
5440F963268L10349M94278J2675q5042l33238j10726n4585l76426q3652K7402
5430F764303J05613O9262K3016l06522k08551k9639j89978Q9309K73066K03180
5420F793059J65916K4818N9525J79613k83985k21164j77086j11384j01996j73962
5410F153354q4775p838m08297k36456K96793Q6970p9256J49475l51811o5183J49171
5399E602147q9538k44501j80360j19421j69044J76635l1516K64464j51225j68431
5389D889210q387Q8881O3342j96784q4420J62341j09073n6266K4784J86102k09471
5378D750259l6792M13488r184p2669k4879M8425P14r1494q2700L1283k18214k75062
$$ plain form
5366 4433175 4567730 4697270 4484064 4593538 4413939 4390450 4548736 4393232 4141421 4276888
5356 4276888 4321951 4241054 4310521 4258356 4158006 4173133 3905942 3852456 3895655 3896762 3793536
5345 3793536 3639614 3661788 3634523 3623003 3486422 3297559 3556424 3793421 3742466 3694837
5335 3694837 3450988 3620985 3825526 3995931 4107712 3667789 3678075 3724811 3487820 3527334
5325 3527334 3634766 3751937 4057799 3978440 3999990 3889839 3878187 3833299 3737629 3852947
5315 3852947 3768320 3732098 3895451 3875505 4206698 4070665 3495405 3646803 3683986 3571443
5305 3571443 3618534 3743503 3920522 4122919 3888945 3783623 3669673 3907698 3951366 4093115
5295 4093115 4034287 4211419 4181057 4076686 4340017 4436089 4600528 4409572 4389737 4702208
$$ packed form
5366D433175J34555J29540k13206J09474j79599k3489J58286j55504k51811J35467
5356D276888M5063q0897O9467n2165j00350J5127k67191n3486M3199J107j03226
5345C793536j53922K2174k7265j1520j36581j88863K58865K36997n0955m7629
5335C694837k43849J69997K04541J70405J11781m39923J0286M6736k36991L9514
5325C527334J07432J17171L05862p9359K1550j10151j1652m4888r5670J15318
5315C852947q4627l6222J63353j9946L31193j36033n75260J51398L7183j12543
5305C571443M7091J24969J77019K02397k33974j05322j13950K38025M3668J41749
5295D093115n8828J77132l0362j04371K63331R6072J64439j90956j9835L12471
$$ plain form
5285 4702208 4799024 4867549 4767393 4964877 5053130 4770799 4769749 4751348 4320571 4578074 4617404
5274 4617404 4776738 4911116 4808581 4788162 5041362 4959034 4596368 4807751 4886844 5069233
5264 5069233 5045269 4919097 5034616 5259357 5372119 5542128 5821514 5596699 5728170 6120337
5254 6120337 6093272 6161795 5894207 6068248 6457997 6630981 6804894 6709298 6648452 6613271
5244 6613271 6541195 6359592 6087733 6446322 6364209 6338458 6047722 6019824 6124483 6124094 6279133
5233 6279133 6187177 6473731 6496516 6188575 6323129 6509539 6564559 6982875 7231309 7225923
5223 7225923 7313223 7628995 7930884 8035241 8627766 9157556 9518813 9638961 10101249 10814529
5213 10814529 10778785 11216738 11320062 11346207 11669249 11669851 11854633 11748913 11828567 11981157
$$ packed form
5285D702208R6816O8525j00156J97484Q8253k82331j050j8401m30777K57503L9330
5274D617404J59334J34378j02535k0419K53200q2328l62666K11383P9093J82389
5264E069233k3964j26172J15519K24741J12762J70009K79386k24815J31471L92167
5254F120337k7065O8523k67588J74041L89749J72984J73913r5596o0846l5181
5244F613271p2076j81603k71859L58589q2113k5751k90736k7898J04659l89J55039
5233F279133r1956K86554K2785l07941J34554J86410N5020M18316K48434n386
5223G225923Q7300L15772L01889J04357N92525N29790L61257J20148M62288P13280
5213A0814529l5744M37953J03324K6145L23042O02J84782j05720P9654J52590
$$ plain form
5203 11981157 12118519 12287023 12571151 12867647 12870592 13220099 13297988 13284700 13061244 12749467
5193 12749467 12424788 12230210 12281903 11953276 11784631 11879765 11903929 11696718 11895176 12004957
5183 12004957 11898381 12009842 11967080 12499699 12835414 12885545 13119134 13707702 14275468 14850970
5173 14850970 15388702 15784536 16140895 16447640 16878973 17530900 18135877 18568872 19233841
5164 19233841 20001347 20968887 21873401 22596868 23288877 23791618 23992711 23925582 24001928 23993141
5154 23993141 23573974 23244445 23092480 23068487 23247263 23338880 23938861 24660242 25345798 26521198
5144 26521198 27629288 29036624 30808129 32778362 35212094 37845658 40959657 44106385
5136 44106385 47531637 52089767 57124683 63574973 71017871 78342207 85695109 94502547
$$ packed form
5203A1981157J37362J68504K84128K96496K945L49507P7889j3288k23456l11777
5193A2749467l24679j94578N1693l28627j68645R5134K4164k07211J98458J09781
5183A2004957j06576J11461m2762N32619L35715N0131K33589N88568N67766N75502
5173A4850970N37732L95834L56359L06745M31333O51927O04977M32995O64969
5164A9233841P67506R67540R04514P23467O92009N02741K01093o7129P6346q787
5154B3993141m19167l29529j51965k3993J78776R1617N99981P21381O85556J175400
5144B6521198J108090J407336J771505J970233K433732K633564L113999L146728
5136D4106385L425252M558130N034916O450290P442898P324336P352902Q807438
$$ plain form
5128 94502547 103295319 109424787 112652942 113086192 107390673 99235696 93671546 89833031
5120 89833031 87246840 86053329 85430688 83799347 81511622 77218519 70282445 63155079
5112 63155079 57295573 52567443 48363155 44781994 41982424 39419549 37120936 35277866
5104 35277866 33542682 31581497 29902767 28691305 27615228 26628435 25904087 25158304 24501661
5095 24501661 23434028 22514432 22106527 21809533 21240419 20577391 19754787 19149912 18759602
5086 18759602 18437231 17907564 17438375 17217624 16850466 16666943 16487676 16136170 16081773 16175453
5076 16175453 16100681 16059125 15699144 15567058 15153940 15154933 15000915 14764603 14555617 14752650
5066 14752650 14645011 14354446 14371758 14069464 13971242 13909526 14265736 14233754 14274390 14157710
$$ packed form
5128I4502547Q792772O129468L228155M33250n695519q154977n564150l838515
5120H9833031k586191j193511o22641j631341k287725m293103o936074p127366
5112F3155079n859506m728130m204288l581161k799570k562875k298613j843070
5104C5277866j735184j961185j678730j211462j076077r86793p24348p45783o56643
5095B4501661j067633r19596m07905k96994n69114o63028q22604o04875l90310
5086A8759602l22371n29667m69189k20751l67158j83523j79267l51506n4397R3680
5076A6175453p4772m1556l59981j32086m13118R93j54018k36312k08986J97033
5066A4752650j07639k90565J7312l02294r8222o1716L56210l1982M0636j16680
$$ plain form
5056 14157710 13808643 13904110 13785020 13834478 13865385 13365571 13281466 12972618 12915451 12877704
5046 12877704 12808921 12648660 12687355 12678691 12825137 12997702 12906203 13058710 13146596 13227207 13219189
5035 13219189 13531232 13837609 14108346 14291792 14370050 14485495 14638981 14966888 15367726 15658279
5025 15658279 15822074 15818365 15605442 15397459 15496747 15524126 15330578 15685808 15927572 16140712
5015 16140712 16466998 16776237 17085341 17376200 18137191 18954796 19297133 19716136 19989262
5006 19989262 20089585 20177344 20213100 20324375 20582524 20611548 20851974 21292476 21274460 21323563
4996 21323563 21679824 22185947 22595078 22742504 23027862 23088331 22901366 22982131 23108100 23371656
4986 23371656 23908930 24255879 24492334 24456376 24945767 25460972 25763602 26556056 27235733 27731125
$$ packed form
5056A4157710l49067R5467j19090M9458L0907m99814q4105l08848n7167l7747
5046A2877704o8783j60261L8695q664J46446J72565r1499J52507Q7886Q0611q018
5035A3219189L12043L06377K70737J83446P8258J15445J53486L27907M00838K90553
5025A5658279J63795l709k12923k07983R9288K7379j93548L55230K41764K13140
5015A6140712L26286L09239L09104K90859P60991Q17605L42337M19003K73126
5006A9989262J00323Q7759L5756J11275K58149K9024K40426M40502j8016M9103
4996B1323563L56261N06123M09131J47426K85358O0469j86965Q0765J25969K63556
4986B3371656N37274L46949K36455l5958M89391N15205L02630P92454O79677M95392
$$ plain form
4976 27731125 28170646 29077164 29769431 30692487 31307685 31914972 32711969 33584404 34319553
4967 34319553 35042747 36034476 36831407 37448399 38182288 39275811 40017471 40966944 42266404
4958 42266404 43332877 44682154 45951589 47269596 49025622 50935132 52610709 54465937
4950 54465937 56857780 59473009 62015355 64684527 67890307 71343408 74940347 79087986
4942 79087986 83638167 88630281 93996678 99835593 105913487 112453679 119654375 126883824
4934 126883824 134942326 144110659 154127871 165385029 177189588 189553609 203096687
4927 203096687 217675527 233240792 248951344 265365548 281924191 298041189 312758982
4920 312758982 324890692 334242428 339569509 340468847 337180827 330870740 321973802 311137309
$$ packed form
4976B7731125M39521R06518O92267R23056O15198O07287P96997Q72435P35149
4967C4319553P23194R91729P96931O16992P33889J093523P41660R49473J299460
4958D2266404J066473J349277J269435J318007J756026J909510J675577J855228
4950E4465937K391843K615229K542346K669172L205780L453101L596939M147639
4942G9087986M550181M992114N366397N838915O077894O540192P200696P229449
4934A26883824Q058502R168333J0017212J1257158J1804559J2364021J3543078
4927B03096687J4578840J5565265J5710552J6414204J6558643J6116998J4717793
4920C12758982J2131710R351736N327081Q99338l288020o310087q896938j0836493
$$ plain form
4912 311137309 299605150 288034711 276313690 264547706 252349003 239728015 226033415
4905 226033415 211946673 197805464 184206447 171825176 160886598 151038792 142159500
4898 142159500 134213334 127062018 120670234 114980990 110005276 105424535 101193090 97005734
4890 97005734 93113659 89510469 86203338 83006633 80080012 76801271 73641194 70881123
4882 70881123 68264423 65704777 63350942 61104036 59167678 57209599 55742932 54530505
4874 54530505 53010781 51672144 50434014 49315906 48497453 47904737 46933434 46248272 45487436
4865 45487436 44679028 44142909 43603504 43142255 43264700 43363098 43399364 43647196 44001789 44597694
4855 44597694 44773604 45288285 45887402 45955841 45821015 45230511 44397339 43604989 42669216 41602303
$$ packed form
4912C11137309j1532159j1570439j1721021j1765984j2198703j2620988j3694600
4905B26033415j4086742j4141209j3599017j2381271j0938578r847806q879292
4898A42159500p946166p151316o391784n689244m975714m580741m231445m187356
4890I7005734l892075l603190l307131l196705k926621l278741l160077k760071
4882G0881123k616700k559646k353835k246906j936358j958079j466667j212427
4874E4530505j519724j338637j238130j118108q18453n92716r71303o85162p60836
4865D5487436q08408n36119n39405m61249J22445R8398L6266K47832L54593N95905
4855D4597694J75910N14681N99117O8439j34826n90504q33172p92350r35773j066913
$$ plain form
4845 41602303 40411627 39218409 37793882 36462105 35055969 33857908 32801270 32020146
4837 32020146 31331789 30366586 29385771 28558778 27865431 27142026 26529054 26077482 25429636
4828 25429636 24805367 24129175 23349276 23032600 22977688 22346500 22042953 21819352 21423453 21241124
4818 21241124 20965832 20512402 20516086 20741702 20771076 20942592 21159976 20935134 20921405 21242243
4808 21242243 21335295 21560470 21501578 21390585 21428160 21073486 20576155 20439100 20681204 20686683
4798 20686683 20452826 20642255 20690441 20933498 20887730 21274201 21446637 21258336 21844344 22179261
4788 22179261 22190269 22308516 22450376 22711025 22846052 22675727 22618893 22420253 22511788 22392055
4778 22392055 22565480 22573217 22373583 22480464 22524474 22632414 22778049 23114858 23208635 23211476
$$ packed form
4845D1602303j190676j193218j424527j331777j406136j198061j056638p81124
4837C2020146o88357r65203r80815q26993o93347p23405o12972m51572o47846
4828B5429636o24269o76192p79899l16676n4912o31188l03547k23601l95899j82329
4818B1241124k75292m53430L684K25616K9374J71516K17384k24842j3729L20838
4808B1242243R3052K25175n8892j10993L7575l54674m97331j37055K42104N479
4798B0686683k33857J89429M8186K43057m5768L86471J72436j88301N86008L34917
4788B2179261J1008J18247J41860K60649J35027j70325n6834j98640R1535j19733
4778B2392055J73425P737j99634J06881M4010J07940J45635L36809R3777K841
$$ plain form
4768 23211476 23476769 23703752 24067074 24286097 24442930 24844908 25275766 25578740 25900657
4759 25900657 26403904 26842544 27035862 27277199 27801310 28414860 28855823 29375456 30128652
4750 30128652 30690058 31308556 31810249 32298832 33010052 34058851 34719490 35465765 36628872
4741 36628872 37448230 38963669 40144923 41506457 43258532 45246666 47515546 49807058
4733 49807058 52549357 55535965 59243419 62956149 67609616 72938056 79090807 85972469
4725 85972469 93848708 102941506 113443538 125380731 140705446 159920678 185480284
4718 185480284 218250767 255681464 293331367 335432318 379613719 412978726 429996330
4711 429996330 432116291 407074332 360435366 316689304 280992455 251706590 226826354
$$ packed form
4768B3211476K65293K26983L63322K19023J56833M01978M30858L02974L21917
4759B5900657N03247M38640J93318K41337N24111O13550M40963N19633P53196
4750C0128652N61406O18498N01693M88583P11220J048799O60639P46275J163107
4741C6628872Q19358J515439J181254J361534J752075J988134K268880K291512
4733D9807058K742299K986608L707454L712730M653467N328440O152751O881662
4725H5972469P876239R092798J0502032J1937193J5324715J9215232K5559606
4718A85480284L2770483L7430697L7649903M2100951M4181401L3365007J7017604
4711D29996330K119961k5041959m6638966m3746062l5696849k9285865k4880236
$$ plain form
4704 226826354 206202656 188960792 174305677 161125361 149079665 137690980 127733845
4697 127733845 119064377 112088822 106310550 100813348 95864816 91590701 87873712 84725063
4689 84725063 81948868 80543286 79492717 78876603 78388088 78469878 78719663 79074863 79289366
4680 79289366 79333466 79063446 78546899 77433492 76843114 76759565 76759817 77038617 77931602 79180290
4670 79180290 81204011 83857515 87211671 90888515 94792062 99239885 104154006 108941076
4662 108941076 113576737 118238526 122953407 128576545 135132249 142404408 151758238 163098737
4654 163098737 176670263 194121261 215837075 241898892 271790895 303530986 335892594
4647 335892594 368506228 396011517 413124282 416990607 405673497 380322380 348311411
$$ packed form
4704B26826354k0623698j7241864j4655115j3180316j2045696j1388685r957135
4697A27733845q669468o975555n778272n497202m948532m274115l716989l148649
4689H4725063k776195j405582j050569o16114m88515Q1790K49785L55200K14503
4680G9289366M4100k70020n16547j113407n90378q3549K52K78800Q92985J248688
4670G9180290K023721K653504L354156L676844L903547M447823M914121M787070
4662A08941076M635661M661789M714881N623138O555704P272159R353830J1340499
4654A63098737J3571526J7450998K1715814K6061817K9892003L1740091L2361608
4647C35892594L2613634K7505289J7112765L866325j1317110k5351117l2010969
$$ plain form
4640 348311411 317010369 289455171 265026129 244142066 226305183 210885190 197276522
4633 197276522 184828453 173544435 163524503 154411851 146088724 138768900 131791032 125587878
4625 125587878 119561829 114449978 110242717 106447331 103055374 99621639 95873742 92044438
4617 92044438 88260779 84411373 81336881 78509894 76038893 73730233 71554458 68976957
4609 68976957 66644855 64125862 62023025 59939554 57712097 55529028 53634569 51890272
4601 51890272 49934656 48179801 47042438 45757315 44590313 43742436 42828209 42050850 41262765
4592 41262765 40977454 40587747 40261645 40133320 40284000 40396898 40085475 39620769 39256865
4583 39256865 38714126 38364328 37658360 36790972 36484181 35907749 35565306 35654715 35939067 36124649
$$ packed form
4640C48311411l1301042k7555198k4429042k0884063j7836883j5419993j3608668
4633A97276522j2448069j1284018j0019932r112652q323127p319824o977868o203154
4625A25587878o026049n111851m207261l795386l391957l433735l747897l829304
4617I2044438l783659l849406l074492k826987k471001k308660k175775k577501
4609F8976957k332102k518993k102837k083471k227457k183069j894459j744297
4601E1890272j955616j754855j137363j285123j167002q47877r14227p77359p88085
4592D1262765k85311l89707l26102j28325J50680J12898l11423m64706l63904
4583C9256865n42739l49798p05968q67388l06791n76432l42443Q9409K84352J85582
$$ plain form
4573 36124649 36371977 36799019 37147218 37597992 38059683 38873088 39944917 40749539 41260337
4564 41260337 41213224 41245009 41036906 39917873 38514664 36788923 35335069 33974378 33143742
4555 33143742 32514591 31965230 31681872 31243203 30824201 30466156 30480321 30567653 30733881 30797225
4545 30797225 31298016 32007582 32675648 33701446 34683091 35770313 36423391 37759250 39266307
4536 39266307 40427360 41345929 42476696 44005749 45441324 46784079 48421506 49879516
4528 49879516 51382507 52797700 54406018 56517751 57746599 58773839 59335550 59712941
4520 59712941 60377206 60992933 62017124 63160679 64780954 67536726 70956594 75126666
4512 75126666 80740393 87859222 96599946 106006603 115096257 124585697 133232784 139069632
$$ packed form
4573C6124649K47328M27042L48199M50774M61691Q13405J071829Q04622N10798
4564D1260337m7113L1785k08103j119033j403209j725741j453854j360691q30636
4555C3143742o29151n49361k83358m38669m19002l58045J4165Q7332J66228O3344
4545C0797225N00791P09566O68066J025798R81645J087222O53078J335859J507057
4536C9266307J161053R18569J130767J529053J435575J342755J637427J458010
4528D9879516J502991J415193J608318K111733J228848J027240N61711L77391
4520E9712941O64265O15727J024191J143555J620275K755772L419868M170072
4512G5126666N613727P118829Q740724R406657R089654R489440Q647087N836848
$$ plain form
4504 139069632 140946156 138714756 131459427 120802842 109682441 99706851 90950357 83504300
4496 83504300 77216497 71573721 66910700 62484602 58518675 54919258 51678828 48903519
4488 48903519 46500674 44113245 41909708 39840439 38064156 36646158 35211959 34103974
4480 34103974 33046516 32152607 31524106 30812128 30483211 30095260 29651892 29217382 29337073
4471 29337073 29548430 30049032 30067768 30089706 30844971 31109936 31281652 31158696 30607790 29871339
4461 29871339 29239109 28430650 27407231 26697993 26215858 25696871 25486810 25491715 25549632 25602020
4451 25602020 25506540 24974165 24276718 24031539 23529837 22724696 22105217 21097665 20407488
4442 20407488 19921478 19259913 19081109 18850756 18285042 17946081 17770266 17694653 17491550 17326829
$$ packed form
4504A39069632J876524k231400p255329j0656585j1120401r975590q756494p446057
4496H3504300o287803n642776m663021m426098l965927l599417l240430k775309
4488D8903519k402845k387429k203537k069269j776283j417998j434199j107985
4480C4103974j057458q93909o28501p11978l28917l87951m43368m34510J19691
4471B9337073K11357N00602J8736K1938P55265K64965J71716j22956n50906p36451
4461B9871339o32230q08459j023419p09238m82135n18987k10061M905N7917N2388
4451B5602020r5480n32375o97447k45179n01702q05141o19479j007552o90177
4442B0407488m86010o61565j78804k30353n65714l38961j75815p5613k03103j64721
$$ plain form
4432 17326829 17757676 17779529 17589777 17681842 17912911 17850321 17726088 18031379 17952135 17615696
4422 17615696 17318336 17003064 16638838 16459998 16190536 15875869 15659445 15497100 15152515
4413 15152515 15085668 15171569 15149801 15282984 15005628 14379119 14263376 13879301 13451221 13013665
4403 13013665 12609135 12667263 12473401 12131741 12102676 11952503 11912916 11964336 12080816 11819001
4393 11819001 11492687 10981465 10796350 10542820 10364827 10410444 10078064 10015368 9992857 9779823
4383 9779823 9562179 9453737 9224306 8934634 8886933 8825400 8546320 8148767 8122032 8236949
4373 8236949 8243207 8174328 7748719 7831375 7820263 7774614 7716633 7851203 8060542 8071427 7933408
4362 7933408 7705227 7384057 7374559 7154320 6607281 6366642 6208056 6342203 6422969 6349400
$$ packed form
4432A7326829M30847K1853j89752R2065K31069o2590j24233L05291p9244l36439
4422A7615696k97360l15272l64226j78840k69462l14667k16424j62345l44585
4413A5152515o6847Q5901k1768J33183k77356o26509j15743l84075m28080m37556
4403A3013665m04530N8128j93862l41660k9065j50173l9587N1420J16480k61815
4393A1819001l26314n11222j85115k53530j77993M5617l32380o2696k2511k13034
4383I779823k17644j08442k29431k89672m7701o1533k79080l97553k6735J14917
4373H236949O258o8879m25609Q2656j1112m5649n7981J34570K09339J0885j38019
4362G933408k28181l21170r498k20239n47039k40639j58586J34147Q0766p3569
$$ plain form
4352 6349400 6497497 6469382 6602167 6613836 6641067 6799687 6740878 6619280 6842397 6743157
4342 6743157 6829663 6995379 6650859 6578978 6485116 6251294 6124657 6104781 5697297 5443789
4332 5443789 5210615 5129082 5108062 5167102 4916334 4732276 4518696 4261738 4286516 4225076
4322 4225076 4205793 3937504 4058906 3987583 4079159 3956558 3553812 3730956 3907179 3853338
4312 3853338 3730144 3946878 3907843 4017097 3957878 3554020 3558359 3657105 3575052 3564549 3626621
4301 3626621 3626130 3470664 3415395 3407709 3307993 3536500 3334540 3342398 3488036 3222212 2924400
4290 2924400 3312251 3339647 3079620 2888536 3092716 2801462 3034100 3119415 2846800 3132479
4280 3132479 2899285 2898363 2981247 2698960 2441470 2378338 2548754 2666372 2603256 2515499 2877736
$$ packed form
4352F349400J48097k8115J32785J1669K7231J58620n8809j21598K23117r9240
4342F743157Q6506J65716l44520p1881r3862k33822j26637j9876m07484k53508
4332E443789k33174q1533k1020N9040k50768j84058k13580k56958K4778o1440
4322D225076j9283k68289J21402p1323R1576j22601m02746J77144J76223n3841
4312C853338j23194K16734l9035J09254n9219m03858M339R8746q2053j0503O2072
4301C626621m91j55466n5269p686r9716K28507k01960P858J45638k65824k97812
4290B924400L87851K7396k60027j91084K04180k91254K32638Q5315k72615K85679
4280C132479k33194r22Q2884k82287k57490o3132J70416J17618o3116q7757L62237
$$ plain form
4269 2877736 2748441 2571155 2799080 2761068 2586584 2546573 2735924 2475103 2415671 2421734
4259 2421734 2333945 2436817 2473367 2726452 2853410 2716579 2893738 2948335 2972588 2820555
4249 2820555 2694870 2497598 2472160 2519510 2327337 2402923 2569015 2391579 2696521 2814572
4239 2814572 2644010 2770054 2942563 2891403 2999723 3065754 3088824 3419411 3796324 3820012
4229 3820012 4066418 4243347 4445209 4512452 4733704 4679880 4821879 4943495 5033713 4933838
4219 4933838 4515504 4660995 4535029 4538845 4403193 4170066 3993657 3872662 3848696 3860987
4209 3860987 3996334 3809842 3567695 3533354 3726254 3909348 4145656 4234619 3943711 3915407
4199 3915407 4126498 4189390 4459761 4478764 4539679 4473624 4648559 4820676 4924352 5337939
$$ packed form
4269B877736j29295j77286K27925l8012j74484m0011J89351k60821n9432O063
4259B421734q7789J02872L6550K53085J26958j36831J77159N4597K4253j52033
4249B820555j25685j97272k5438M7350j92173P5586J66092j77436L04942J18051
4239B814572j70562J26044J72509n1160J08320O6031K3070L30587L76913K3688
4229C820012K46406J76929K01862O7243K21252n3824J41999J21616R0218r9875
4219D933838m18334J45491j25966L816j35652k33127j76409j20995k3966J2291
4209C860987J35347j86492k42147l4341J92900J83094K36308Q8963k90908k8304
4199C915407K11091O2892K70371J9003O0915o6055J74935J72117J03676M13587
$$ plain form
4189 5337939 5633816 5699353 5782219 6007591 6358123 6401633 6442924 6544661 6591606 6652236 6330295
4178 6330295 6180194 6103803 6013807 5829126 5973291 6350453 6663025 6994081 7330323 7625009
4168 7625009 8079245 8550220 9106717 9610975 10114233 10452705 10543387 10783092 10644995 10536692
4158 10536692 10691048 10416569 9710742 9079052 8594411 8178381 7914713 7474232 7412637 7134049
4148 7134049 7105729 6986259 6758002 6854587 6998631 7337529 7525640 7477779 7532070 7778160
4138 7778160 7880769 7790459 7870342 7708766 7844257 7792367 7794962 8086148 8119775 8208823 8459042
4127 8459042 8479187 8417186 8248746 8466695 8521777 8305112 7972029 7740490 7362982 7270500
4117 7270500 7349251 6984865 6642154 6431805 6346559 6192200 5990240 5744845 5886027 5988477
$$ packed form
4189E337939K95877O5537Q2866K25372L50532M3510M1291J01737M6945O0630l21941
4178F330295j50101p6391q9996j84681J44165L77162L12572L31056L36242K94686
4168G625009M54236M70975N56497N04258N03258L38472R0682K39705j38097j08303
4158A0536692J54356k74479p05827o31690m84641m16030k63668m40481o1595k78588
4148G134049k8320j19470k28257R6585J44044L38898J88111m7861N4291K46090
4138G778160J02609r0310P9883j61576J35491n1890K595K91186L3627Q9048K50219
4127H459042K0145o2001j68440K17949N5082k16665l33083k31539l77508r2482
4117G270500P8751l64386l42711k10349q5246j54359k01960k45395J41182J02450
$$ plain form
4107 5988477 6105271 6209855 6160406 6279417 6277648 6293287 6387179 6174909 6081901 5899730 5819814
4096 5819814 5381820 4800138 4644683 4541548 4480629 4313150 4355716 4160151 4090606 4204425
4086 4204425 3937584 3725268 3758182 3906122 3996544 3971901 3520148 3757124 4012505 4194232
4076 4194232 4273960 4227860 4454104 4251528 4570295 4801274 4781058 4720832 4767641 4661379
4066 4661379 4501456 4476590 4078817 3934201 3752437 3846312 3458239 3068216 3141997 3169005
4056 3169005 3004771 2941904 2812828 2566026 2797586 2536252 2107716 2217300 2229279 2320489
4046 2320489 2372401 2601775 2754339 2496299 2544988 2440295 2295483 2322913 2568606 2677658
4036 2677658 2398383 2427246 2401738 2443150 2265596 2365694 2319468 2212506 2323306 2320626 2649735
$$ packed form
4107E988477J16794J04584m9449J19011j769J5639R3892k12270r3008j82171p9916
4096E819814m37994n81682j55455j03135o0919j67479M2566j95565o9545J13819
4086D204425k66841k12316L2914J47940R0422k4643m51753K36976K55381J81727
4076D194232P9728m6100K26244k02576L18767K30979k0216o0226M6809j06262
4066D661379j59923k4866l97773j44616j81764R3875l88073l90023P3781K7008
4056C169005j64234o2867j29076k46802K31560k61334m28536J09584J1979R1210
4046B320489N1912K29374J52564k58040M8689j04693j44812K7430K45693J09052
4036B677658k79275K8863k5508M1412j77554J00098m6226j06962J10800k680L29109
$$ plain form
4025 2649735 2598452 2403811 2330256 2427872 2466059 2765243 2795063 2604121 2706377 2655071 2760203
4014 2760203 2526223 2891750 2874863 2894294 3157969 3154629 3115484 2890213 2829213 2742663 2487651
4003 2487651 2349115 2467788 2343976 2294442 2291601 2388458 2409304 2221093 2205366 2317390 2138650
3992 2138650 2441073 2347324 2263148 2333687 1917095 1889700 1997926 1849297 1765141 1840834 2017309
3981 2017309 2147811 1922411 1882505 1859676 1793618 2000904 1954071 1635551 1420792 1571392
3971 1571392 1464892 1115572 1020866 1219811 1266332 1232199 1341209 1272305 1250752 1471634
3961 1471634 1727585 1595951 1456084 1332488 1265803 1086029 1239315 1280085 1058440 974033
3951 974033 1065057 1257590 930602 730791 1011463 1365194 1368872 1175815 1179089 1185487 978081
$$ packed form
4025B649735n1283j94641p3555R7616L8187K99184K9820j90942J02256n1306J05132
4014B760203k33980L65527j6887J9431K63675l340l9145k25271o1000q6550k55012
4003B487651j38536J18673j23812m9534k841R6857K0846j88211j5727J12024j78740
3992B138650L02423r3749q4176P0539m16592k7395J08226j48629q4156P5693J76475
3981B017309J30502k25400l9906k2829o6058K07286m6833l18520k14759J50600
3971A571392j06500l49320r4706J98945M6521l4133J09010o8904k1553K20882
3961A471634K55951j31634j39867j23596o6685j79774J53286M0770k21645q4407
3951I74033R1024J92533l26988j99811K80672L53731L678j93057L274O398k07406
$$ plain form
3940 978081 1012623 1122413 1133724 795411 830741 1098786 1220521 1359231 1204832 1245271
3930 1245271 1395267 1146285 1025419 1369211 1533807 1308480 1373614 1521103 1452181 1409734
3920 1409734 1289918 1421824 1439523 1409271 1329438 1699921 1734436 1707747 1935252 2053944
3910 2053944 1993552 2006128 2048536 1931710 2095094 2095187 2390698 2202082 2105409 2060369 1833343
3899 1833343 1821456 2029685 2081507 2232880 2156809 2068566 2044811 1989502 1884124 1951392 2194877
3888 2194877 2288346 2168105 2014912 2354072 2430336 2281858 2069440 2192048 2317297 2439889
3878 2439889 2842600 2625256 2423225 2447628 2417945 2364874 2126267 2358915 2667917 2395269
3868 2395269 2112186 1997964 2267676 2294193 2214627 2143149 1975233 1838831 1887519 1809838
$$ packed form
3940I78081L4542J09790J1311l38313L5330K68045J21735J38710j54399M0439
3930A245271J49996k48982j20866L43792J64596k25327O5134J47489o8922m2447
3920A409734j19816J31906J7699l0252p9833L70483L4515k6689K27505J18692
3910B053944o0392J2576M2408j16826J63384R3K95511j88616r6673m5040k27026
3899A833343j1887K08229N1822J51373p6071q8243k3755n5309j05378O7268K43485
3888B194877R3469j20241j53193L39160P6264j48478k12418J22608J25249J22592
3878B439889M02711k17344k02031K4403k9683n3071k38607K32648L09002k72648
3868B395269k83083j14222K69712K6517p9566p1478j67916j36402M8688p7681
$$ plain form
3858 1809838 1574778 1854293 1924570 1882363 1983502 1904788 2034654 2042673 2040450 2193460 1920126
3847 1920126 2054845 2014539 1950164 1953744 2148415 2194179 2022645 1867030 1595546 1487052
3837 1487052 1855982 1797098 1504547 1424753 1285780 1491352 1673642 1733670 1454856 1307869
3827 1307869 1267161 1424610 1453077 1519900 1531530 1595174 1964210 2023046 2016228 1895897 1864112
3816 1864112 2002276 1967177 1840954 2004582 1706661 1415640 1393990 1466018 1783967 1914346
3806 1914346 1830138 1589161 1744910 1688889 1473343 1496836 1617130 1720223 1951151 1886503
3796 1886503 1569486 1695226 1477673 1318152 1638486 1672902 1717178 1502091 1523711 1832894
3786 1832894 1671895 1759282 1854972 1940705 1966703 2080613 1971345 1657776 1886272 1896854
$$ packed form
3858A809838k35060K79515P0277m2207J01139p8714J29866Q019k223J53010k73334
3847A920126J34719m0306o4375L580J94671M5764j71534j55615k71484j08494
3837A487052L68930n8884k92551p9794j38973K05572J82290O0028k78814j46987
3827A307869m0708J57449K8467O6823J1630O3644L69036N8836o818j20331l1785
3816A864112J38164l5099j26223J63628k97921k91021k1650P2028L17949J30379
3806A914346q4208k40977J55749n6021k15546K3493J20294J03093K30928o4648
3796A886503l17017J25740k17553j59521L20334L4416M4276k15087K1620L09183
3786A832894j60999Q7387R5690Q5733K5998J13910j09268l13569K28496J0582
$$ plain form
3776 1896854 1642788 1664464 1680582 1834496 2090606 2213373 1950274 1811195 1920500 2036506
3766 2036506 1998659 1857288 1882833 1627645 1719352 1826889 1658111 1628370 1674634 1924429
3756 1924429 1997133 2151575 1969798 1925426 1687309 1533678 1883338 2010634 1794331 2075122
3746 2075122 1959493 1920761 2022091 2037752 2104831 1951580 2090644 2147362 2168356 2122354 1991127
3735 1991127 1912485 1792598 2013013 1960200 1836642 1867977 1858758 1988565 1915709 1495605 1371412
3724 1371412 1708162 1716849 1958655 1708165 1718952 1972730 1905015 1804459 1841481 2021460
3714 2021460 1864112 1823119 2154877 2073031 1955768 1715217 1507095 1733439 1941106 1672964
3704 1672964 1740426 1429462 1357564 1339313 1285699 1221108 1427617 1323946 1281861 1069860 1199633
$$ packed form
3776A896854k54066K1676J6118J53914K56110J22767k63099j39079J09305J16006
3766B036506l7847j41371K5545k55188R1707J07537j68778k9741M6264K49795
3756A924429P2704J54442j81777m4372k38117j53631L49660J27296k16303K80791
3746B075122j15629l8732J01330J5661O7079j53251J39064N6718K0994m6002j31227
3735A991127p8642j19887K20415n2813j23558L1335r219J29807p2856m20104j24193
3724A371412L36750Q687K41806k50490J0787K53778o7715j00556L7022J79979
3714B021460j57348m0993L31758q1846j17263k40551k08122K26344K07667k68142
3704A672964O7462l10964p1898j8251n3614o4591K06509j03671m2085k12001J29773
$$ plain form
3693 1199633 1566262 1440066 1558523 1597266 1701976 1681990 1615762 1530482 1432136 1529797 1681865
3682 1681865 1595580 1815683 1569333 1465430 1356126 1591213 1728366 1569687 1556887 1498249
3672 1498249 1431669 1387148 1319977 1282282 1468567 1365449 1335970 1301161 1397264 1709629 1749714
3661 1749714 1805243 1433303 1388443 1506234 1654642 1715669 1555051 1328857 1473499 1550190
3651 1550190 1590274 1626848 1744768 1886627 1653645 1302096 1358850 1524075 1516803 1609268 1235209
3640 1235209 1169362 1339710 1424131 1486414 1669807 2000147 1915300 1672522 1524209 1474277
3630 1474277 1627476 1476419 1824516 2078246 2058661 1845487 1766259 1857024 1764509 1763955 1926633
3619 1926633 2154761 1953354 1945377 2244556 2012843 2013968 2083441 1964772 1844600 1828609 1825709
$$ packed form
3693A199633L66629j26196J18457L8743J04710j9986o6228q5280r8346R7661J52068
3682A681865q6285K20103k46350j03903j09304K35087J37153j58679j2800n8638
3672A498249o6580m4521o7171l7695J86285j03118k9479l4809R6103L12365M0085
3661A749714N5529l71940m4860J17791J48408O1027j60618k26194J44642P6691
3651A550190M0084L6574J17920J41859k32982l51549N6754J65225p272R2465l74059
3640A235209o5847J70348Q4421O2283J83393L30340q4847k42778j48313m9932
3630A474277J53199j51057L48097K53730j9585k13174p9228R0765r2515n54J62678
3619A926633K28128k01407p977K99179k31713J125O9473j18669j20172j5991k900
$$ plain form
3608 1825709 1599468 1561898 1889830 2043024 1998565 1958786 2088470 1984981 2070578 2148884
3598 2148884 1869789 1753872 1786623 1972528 2033902 2063211 2109970 2053022 2149854 2230081 1923232
3587 1923232 2112439 2212730 2073186 2040527 1910095 2064262 2315025 2181077 2353478 2566731
3577 2566731 2463868 2475304 2416666 2605842 2419418 2492318 2476914 2701683 2857568 2626345
3567 2626345 2675341 2753062 2763640 2796667 3029921 3014902 3186756 3165747 3084213 2819416 2746292
3556 2746292 2662728 2788635 2995247 2917758 2894084 3185386 3056075 3473733 3508379 3215352
3546 3215352 3327817 3342364 3395024 3540027 3679755 3878177 3964586 3764920 3543171 3840297
3536 3840297 3996862 4157525 4266131 4210736 4389602 4459378 4644441 4953306 5056696 5069442
$$ packed form
3608A825709k26241l7570L27932J53194m4459l9779J29684j03489Q5597P8306
3598B148884k79095j15917L2751J85905O1374K9309M6759n6948R6832Q0227l06849
3587A923232J89207J00291j39544l2659j30432J54167K50763j33948J72401K13253
3577B566731j02863J1436n8638J89176j86424P2900j5404K24769J55885k31223
3567B626345M8996P7721J0578L3027K33254j5019J71854k1009q1534k64797p3124
3556B746292q3564J25907K06612p7489k3674K91302j29311M17658L4646k93027
3546C215352J12465J4547N2660J45003J39728J98422Q6409j99666k21749K97126
3536C840297J56565J60663J08606n5395J78866O9776J85063L08865J03390J2746
$$ plain form
3526 5069442 5405653 5092052 4969655 5140885 5149863 4994469 5150220 5456072 5674585 5632787
3516 5632787 5644377 5909074 5815263 5962989 5906994 6052200 6039602 6432863 6658400 6817396
3506 6817396 7225103 7333739 7441069 7525847 7367144 7373766 7853270 8033843 8145085 8427211
3496 8427211 8580760 8914900 8763054 9041225 9472371 9570603 9873262 10210483 10531199 10720210
3486 10720210 11110194 11449058 11991938 12333151 13259268 13895241 14577832 15471574 16061859
3477 16061859 16817871 17711454 18353349 19517236 20298439 21036513 22056247 22836450 23422590
3468 23422590 23909443 24464326 24827156 25011986 25108803 25069039 24832301 24519097 23830624 22860737
3458 22860737 21813079 20912411 20060785 19184685 18442469 17938124 17624328 16853236 16326016
$$ packed form
3526E069442L36211l13601j22397J71230Q978j55394J55751L05852K18513m1798
3516E632787J1590K64697r3811J47726n5995J45206j2598L93261K25537J58996
3506F817396M07707J08636J07330Q4778j58703O622M79504J80573J11242K82126
3496H427211J53549L34140j51846K78171M31146R8232L02659L37221L20716J89011
3486A0720210L89984L38864N42880L41213R26117O35973O82591Q93742N90285
3477A6061859P56012Q93583O41895J163887P81203P38074J019734P80203N86140
3468B3422590M86853N54883L62830J84830R6817l9764k36738l13204o88473r69887
3458B2860737j047658r00668q51626q76100p42216n04345l13796p71092n27220
$$ plain form
3449 16326016 15587719 15269863 15093987 14968380 14700595 14381870 14204118 14008505 13919716 14159977
3439 14159977 14247094 14040589 14360785 14699142 15199765 15849508 16329368 17085130 17820447 18186505
3429 18186505 18116268 17877672 17390205 16099230 14994334 14366417 13432946 12576418 11976084
3420 11976084 11636794 11344725 10961411 10823294 10517192 9923150 9600394 9359027 9503090
3411 9503090 9142898 8581649 8544516 8402954 8432429 8440673 8627833 8821953 9048853 8971396
3401 8971396 9057818 9448237 9936961 10222476 9903328 9668049 9457699 8599724 8138866 7970169
3391 7970169 7974031 7592183 7231266 6988132 6688630 6450988 5917462 5896046 5777327 5699029
3381 5699029 5853709 5618789 5294487 5316097 5307208 5198293 5219534 4966007 4825038 4538971
$$ packed form
3449A6326016p38297l17856j75876j25607k67785l18725j77752j95613q8789K40261
3439A4159977Q7117k06505L20196L38357N00623O49743M79860P55762P35317L66058
3429A8186505p0237k38596m87467j290975j104896o27917r33471q56528o00334
3420A1976084l39290k92069l83314j38117l06102n94042l22756k41367J44063
3411I503090l60192n61249l7133j41562K9475Q244J87160J94120K26900p7457
3401H971396Q6422L90419M88724K85515l19148k35279k10350q57975m60858j68697
3391G970169L862l81848l60917k43134k99502k37642n33526k1416j18719p8298
3381E699029J54680k34920l24302K1610q889j08915K1241k53527j40969k86067
$$ plain form
3371 4538971 4545580 4682610 4494381 4302119 4452146 4539640 4458563 4473003 4193323 4139874 4066633
3360 4066633 4151010 4076964 3950162 3891298 3765167 3599259 3353714 3523714 3677449 3451517
3350 3451517 3479327 3483067 3237357 3432449 3094710 3184181 3334764 3206419 2975519 2914428
3340 2914428 3048446 3185978 2727204 2725728 2737884 2862705 2792090 2694550 2772611 2856580 2889036
3329 2889036 3127432 3392466 3259180 2945613 3022145 2878029 2696499 2564165 2409036 2211653
3319 2211653 2302789 2572540 2454132 2583606 2728710 2640869 2270352 2374015 2579433 3013594
3309 3013594 2649336 2308742 2099847 2130679 2536566 2624655 2504461 2450887 2177135 2164817
3299 2164817 2196853 2253914 2331949 2423654 2542856 2418537 2203953 2090145 2128023 2309060
$$ packed form
3371D538971O609J37030j88229j92262J50027Q7494q1077J4440k79680n3449p3241
3360D066633Q4377p4046j26802n8864j26131j65908k45545J70000J53735k25932
3350C451517K7810L740k45710J95092l37739Q9471J50583j28345k30900o1091
3340B914428J34018J37532m58774j476J2156J24821p0615r7540P8061Q3969L2456
3329B889036K38396K65034j33286l13567P6532j44116j81530j32334j55129j97383
3319B211653R1136K69751j18408J29474J45104q7841l70517J03663K05418M34161
3309C013594l64258l40594k08895L0832M05887Q8089j20194n3574k73752j2318
3299B164817L2036N7061P8035R1705J19202j24319k14584j13808L7878J81037
$$ plain form
3289 2309060 2193392 2114148 2329417 2466234 2428910 2298941 2444156 2356592 2233319 2375185
3279 2375185 2462707 2179794 1965853 2073376 1853593 1880977 2068872 1981766 1889552 1979154
3269 1979154 2221661 2244980 1879658 1725705 1654916 1742949 1601662 1819403 1982871 1950034
3259 1950034 1732228 1759095 1760112 1616814 1560028 1641756 1745573 1920403 1959976 1605733 1567462
3248 1567462 1644997 1338027 1348703 1561049 1788820 1704377 1658359 1590950 1650226 1886223 1684884
3237 1684884 1504783 1508209 1800034 1757907 1480804 1365130 1450682 1460409 1305377 1392925 1605931
3226 1605931 1661263 1600090 1037288 1336250 1590471 1384841 1488519 1579204 1531707 1288778
3216 1288778 1459823 1542729 1447436 1563550 1398075 1416840 1462134 1594611 1831661 1766668
$$ packed form
3289B309060j15668p9244K15269J36817l7324j29969J45215q7564j23273J41866
3279B375185Q7522k82913k13941J07523k19783K7384J87895q7106r2214Q9602
3269A979154K42507K3319l65322j53953p0789Q8033j41287K17741J63468l2837
3259A950034k17806K6867J017j43298n6786Q1728J03817J74830L9573l54243l8271
3248A567462P7535l06970J0676K12346K27771q4443m6018o7409N9276K35997k01339
3237A684884j80101L426K91825m2127k77103j15674Q5552R727j55032Q7548K13006
3226A605931N5332o1173n62802K98962K54221k05630J03678R0685m7497k42929
3216A288778J71045Q2906r5293J16114j65475J8765M5294J32477K37050o4993
$$ plain form
3206 1766668 1744423 1597347 1652889 1677885 1845195 1939500 1824265 1618006 1726438 1818832
3196 1818832 1915923 1995423 1972015 2119194 2159219 1975750 2206054 2119614 1943457 1756362
3186 1756362 1924998 2184634 1995423 2129087 2149641 2313383 2359731 2314198 2137350 2426557
3176 2426557 2287057 2093145 2380695 2491737 2424089 2413501 2566636 2610118 2512332 2831727
3166 2831727 3056153 2923869 3073681 3373750 3351249 3497101 3729155 3742826 4023634 4213662
3156 4213662 4149816 4575660 4449451 4715455 4932051 4908149 4736528 5017707 5097657 4960608
3146 4960608 5085766 5207550 5310813 5339464 5453997 5439629 5684287 5839546 6142561 6298708
3136 6298708 6462924 6556864 6838582 6972973 7389748 7791700 7999245 8441195 8592206 8917431
$$ packed form
3206A766668k2245j47076N5542K4996J67310R4305j15235k06259J08432R2394
3196A818832R7091P9500k3408J47179M0025j83469K30304q6440j76157j87095
3186A756362J68636K59636j89211J33664K0554J63742M6348m5533j76848K89207
3176B426557j39500j93912K87550J11042o7648j0588J53135M3482r7786L19395
3166B831727K24426j32284J49812L00069k2501J45852K32054J3671K80808J90028
3156D213662o3846M25844j26209K66004K16596k3902j71621K81179P9950j37049
3146D960608J25158J21784J03263K8651J14533j4368K44658J55259L03015J56147
3136F298708J64216R3940K81718J34391M16775M01952K07545M41950J51011L25225
$$ plain form
3126 8917431 8991471 8794404 8627033 8739538 8496396 8450034 8486493 8363510 8250138 8145929
3116 8145929 8053050 8073066 8110395 8216162 8277876 8510913 8503691 8293883 8642565 9025272 9047172
3105 9047172 8907447 9249761 9389530 9563952 9827802 9933423 9906370 9897833 9794362 9741029
3095 9741029 9539455 9218446 8833392 8572463 8384867 8122380 8062732 7643513 7612400 7291417
3085 7291417 7231110 7257162 7219448 7472191 7370291 7200660 6847555 6992513 7054881 6688519
3075 6688519 6852972 6891354 6540810 6617688 6454410 6026816 5378481 5078057 5159977 5385219
3065 5385219 5429623 4988809 4621432 4510062 4280782 4329388 4233743 3827007 3534185 3396559
3055 3396559 3406589 3641236 3375978 3305655 3131881 3156879 2983840 2857300 2634464 2443589
$$ packed form
3126H917431P4040j97067j67371J12505k43142m6362L6459j22983j13372j04209
3116H145929r2879K0016L7329J05767O1714K33037p222k09808L48682L82707K1900
3105I047172j39725L42314J39769J74422K63850J05621k7053q537j03471n3333
3095I741029k01574l21009l85054k60929j87596k62487n9648m19219l1113l20983
3085G291417o0307K6052l7714K52743j01900j69631l53105J44958O2368l66362
3075F688519J64453L8382l50544P6878j63278m27594o48335l00424Q1920K25242
3065E385219M4404m40814l67377j11370k29280M8606r5645m06736k92822j37626
3055C396559J0030K34647k65258p0323j73774K4998j73039j26540k22836j90875
$$ plain form
3045 2443589 2310979 2328416 2229661 2063941 1899854 1862837 2263840 2105321 1795696 1768447
3035 1768447 2013901 1814229 1583520 1454957 1272501 1535316 1672393 1773046 1721435 1680573
3025 1680573 1445140 1306593 995842 783177 1022907 1127221 1330575 1240779 1324822 1390771
3015 1390771 1108010 988608 1165711 1242498 1255791 868216 652199 933126 812257 544069
3005 544069 517856 770462 643096 681888 892287 735464 714252 664617 693642 624023 715825
2994 715825 624472 488550 387784 481182 339947 332504 405726 334037 253056 112475 -23417
2983 -23417 -172626 157028 346248 575093 653580 642247 341733 157124 331776 186813
2973 186813 508866 509429 546485 423025 364281 312968 9783 -62010 -55610 155156 482564
$$ packed form
3045B443589j32610J7437r8755j65720j64087l7017M01003j58519l09625k7249
3035A768447K45454j99672k30709j28563j82456K62815J37077J00653n1611m0862
3025A680573k35433j38547l10751k12665K39730J04314K03354q9796Q4043O5949
3015A390771k82761j19402J77103P6787J3293l87575k16017K80927j20869k68188
3005E44069k6213K52606j27366L8792K10399j56823k1212m9635K9025o9619R1802
2994G15825r1353j35922j00766R3398j41235p443P3222p1689q0981j40581j35892
2983b3417j49209L29654J89220K28845P8487j1333l00514j84609J74652j44963
2973A86813L22053N63L7056j23460n8744n1313l03185p1793O400K10766L27408
$$ plain form
2962 482564 464854 434779 520249 447294 355171 470282 172002 -16293 189654 137737 1099
2951 1099 -154402 -65213 157613 -1081 -152468 -52232 153116 164489 15912 109211 237252
2940 237252 -81100 -7553 -48474 -206979 -139772 -75326 -134694 -255738 80264 -141399 -168323
2929 -168323 -237929 -295092 -139273 -58673 -46914 152285 241507 85607 -1230 -120121 -93709
2918 -93709 213533 125892 -84843 13294 -118358 -59541 -16319 -205749 -339873 -101254 -10022
2907 -10022 -64216 -162562 -280475 -483041 -337952 -318127 -225376 56825 253767 48448 -53889
2896 -53889 42379 65318 -39235 -145969 -30916 -11378 -212960 -192297 -182488 -249784 -251467
2885 -251467 -29744 -98949 -404596 -340832 -312377 4580 -156742 -351619 -142036 -158022
$$ packed form
2962D82564j7710l0075Q5470p2955r2123J15111k98280j88295K05947n1917j36638
2951A099j55501Q9189K22826j58694j51387J00236K05348J1373j48577R3299J28041
2940B37252l18352P3547m0921j58505O7207O4446n9368j21044L36002k21663k6924
2929a68323o9606n7163J55819Q0600J1759J99199Q9222j55900q6837j18891K6412
2918i3709L07242q7641k10735R8137j31652N8817M3222j89430j34124K38619R1232
2907a0022n4194r8346j17913k02566J45089J9825R2751K82201J96942k05319j02337
2896e3889R6268K2939j04553j06734J15053J9538k01582K0663R809o7296j683
2885b51467K21723o9205l05647O3764K8455L16957j61322j94877K09583j5986
$$ plain form
2875 -158022 -85818 -72141 -310195 -289909 -445220 -375501 -379757 -578561 -204852 -472544 -617271
2864 -617271 -370863 -352605 -134690 -236228 -113907 -279227 -278363 -142771 -423993 -274331
2854 -274331 -236889 -407417 -345506 -114134 -165451 -262928 -170086 -156329 -142585 -231288 -232083 -355643
2842 -355643 -22847 -92642 -224847 -414944 -323837 -197284 -92665 -97252 -223054 -164063 -467372
2831 -467372 -387029 -269636 -247472 -224681 -408903 -216820 -234065 -244158 -299471 -177711 -21095
2820 -21095 -127080 -182122 -441849 -204490 -344167 -257301 -206339 -214692 108926 258560 124691
2809 124691 -194004 -151001 -272431 -167342 -148121 -335426 -190769 -155895 -408160 -203483
2799 -203483 -367611 -201687 -74731 -106804 -76446 -386385 -343416 -296598 -202361 9036 95129
$$ packed form
2875a58022P2204J3677k38054K0286j55311O9719m256j98804L73709k67692j44727
2864f17271K46408J8258K17915j01538J22321j65320Q64J35592k81222J49662
2854b74331L7442j70528O1911K31372n1317r7477R2842J3757J3744q8703p95j23560
2842c55643L32796o9795j32205j90097R1107J26553J04619m587j25802N8991l03309
2831d67372Q0343J17393K2164K2791j84222J92083j7245j0093n5313J21760J56616
2820b1095j05985n5042k59727K37359j39677Q6866N0962q353L23618J49634j33869
2809A24691l18695M3003j21430J05089J9221j87305J44657L4874k52265K04677
2799b03483j64128J65924J26956l2073L0358l09939M2969M6818R4237K11397Q6093
$$ plain form
2788 95129 -84806 -110942 -68804 -194088 -221123 -34154 29626 -69651 -94827 -250590 -242477
2777 -242477 -199657 -201603 -153376 -236314 -155199 -121300 80291 -76287 -172735 -159874 -349820
2766 -349820 -257300 -127442 -41858 133965 -40454 -508141 -600611 -188056 -267960 -474507
2756 -474507 -307260 -345336 -300564 -367444 -299043 -452522 -321486 -15692 -113452 -299141 -411520
2745 -411520 -265948 95326 -12476 -208059 -419131 -628036 -482306 -402408 -293812 -116698
2735 -116698 -173670 -104171 -259234 -452229 -264268 -407636 -389465 -496834 -500131 -537958 -692011
2724 -692011 -507453 -317316 -559923 -101057 -200355 -195492 -72827 -109042 -135383 -135356 -392043
2713 -392043 -461780 -378377 -473806 -563468 -434637 -378301 -384072 -237435 -306825 -449408 -404238
$$ packed form
2788I5129j79935k6136M2138j25284k7035J86969O3780r9277k5176j55763Q113
2777b42477M2820j946M8227q2938Q1115L3899K01591j56578r6448J2861j89946
2766c49820R2520J29858Q5584J75823j74419m67687r2470M12555p9904k06547
2756d74507J67247l8076M4772o6880O8401j53479J31036L05794r7760j85689j12379
2745d11520J45572L61274j07802j95583k11072k08905J45730P9898J08596J77114
2735a16698n6972O9499j55063j92995J87961j43368J8171j07369l297l7827j54053
2724f92011J84558J90137k42607M58866r9298M863J22665l6215k6341K7k56687
2713c92043o9737Q3403r5429q9662J28831N6336n771J46637o9390j42583M5170
$$ plain form
2702 -404238 -472600 -292133 -195749 -463073 -453321 -277528 -431602 -247290 -217775 -204930 -534392
2691 -534392 -407050 -191495 -295051 -369089 -647722 -422423 -420156 -343463 -286966 -378104 -448832
2680 -448832 -308006 -329773 -226034 -320841 -420958 -534161 -486621 -372247 -471729 -333641
2670 -333641 -211103 -425772 -96653 57471 -171479 -423810 -270844 -85407 -308025 -420681
2660 -420681 -398269 -364716 -290725 -474118 -286079 -152227 -392064 -419590 -16444 -315475
2650 -315475 -570411 -302062 -157789 -53029 -151414 -221665 -125794 42916 -83638 -37674
2640 -37674 -264225 -100868 -28461 -350832 -40659 -278406 -357081 -86873 85700 -131688
2630 -131688 -567386 -611290 -418473 -159754 -87451 -117980 -262602 -329540 -306220 -676887 -642953
$$ packed form
2702d04238o8362J80467R6384k67324R752J75793j54074J84312K9515J2845l29462
2691e34392J27342K15555j03556p4038k78633K25299K267P6693N6497r1138p0728
2680d48832J40826k1767J03739r4807j00117j13203M7540J14374r9482J38088
2670c33641J22538k14669L29119J54124k28950k52331J52966J85437k22618j12656
2660d20681K2412L3553P3991j83393J88039J33852k39837k7526M03146k99031
2650c15475k54936K68349J44273J04760r8385p0251R5871J68710j26554M5964
2640c7674k26551J63357P2407l22371L10173k37747p8675K70208J72573k17388
2630a31688m35698m3904J92817K58719P2303l0529j44622o6938K3320l70667L3934
$$ plain form
2619 -642953 -165982 -247399 -392534 -505339 -552323 -189142 -175497 -307102 -418675 -176634
2609 -176634 -215017 -177267 17219 -117328 -113455 -54735 -247172 -143961 -56059 67541 -4580
2598 -4580 74814 287571 348912 386980 375429 477345 335364 224776 291288 148705 -96335
2587 -96335 -249155 -68016 -50772 42851 -90209 -206897 -427001 -189878 -192284 -573013 -307848
2576 -307848 -337439 -34212 -193972 -143922 -141845 -283120 -264956 -432032 -353399 -235095 -107167
2565 -107167 -122170 -302144 -408417 -625712 -409594 -207865 -221624 -233443 157237 196539
2555 196539 -99969 -107006 -117341 -499838 -284614 -81652 -297537 -239096 -177833 -305597 -252368
2544 -252368 -308335 -209641 -292132 -282180 -194308 -197123 -453667 -500710 -91718 -243753 -238964 21463
$$ packed form
2619f42953M76971q1417j45135j12805m6984L63181J3645j31605j11573K42041
2609a76634l8383L7750J94486j34547L873N8720j92437J03211Q7902J23600p2121
2598d580P9394K12757O1341L8068j1551J01916j41981j10588O6512j42583k45040
2587i6335j52820J81139J7244R3623j33060j16688k20104K37123k406l80729K65165
2576c07848k9591L03227j59760N0050K077j41275J8164j67076P8633J18304J27928
2565a07167j5003j79974j06273k17295K16118K01729j3759j1819L90680L9302
2555A96539k96508p037j0335l82497K15224K02962k15885N8441O1263j27764N3229
2544b52368n5967R8694q2491R952Q7872k815k56544m7043M08992j52035M789K60427
$$ plain form
2532 21463 126505 -94395 -282734 -277398 -70407 -319260 -358211 -131645 -104085 69862 123677
2521 123677 271157 12365 113913 37393 18425 156518 189801 -143511 -118441 -78548 -92353
2510 -92353 12400 -74606 121371 128800 -99123 -154906 -26691 30228 -2382 -76378 35462
2499 35462 139579 -95330 -147345 -93687 103464 306568 214566 138478 199869 269991 65233
2488 65233 224817 273799 182067 100781 -44968 -9039 262006 295392 327176 270325 199903
2477 199903 -38331 226955 109615 -90013 11646 75809 -7447 33512 172297 88528
2467 88528 78263 163574 19062 -184734 -79178 63470 113880 122225 167282 223347 284017
2456 284017 -38434 53359 -9440 257582 99657 126926 66104 145529 150687 106143 199002
$$ packed form
2532B1463J05042k20900j88339N336K06991k48853l8951K26566K7560J73947N3815
2521A23677J47480k58792J01548p6520j8968J38093L3283l33312K5070L9893j3805
2510i2353J04753q7006J95977P429k27923n5783J28215N6919l2610p3996J11840
2499C5462J04117k34909n2015N3658J97151K03104r2002p6088O1391P0122k04758
2488F5233J59584M8982r1732q1286j45749L5929K71045L3386L1784n6851p0422
2477A99903k38234K65286j17340j99628J01659O4163q3256M0959J38785q3769
2467H8528j0265Q5311j44512k03796J05556J42648N0410Q345M5057N6065O0670
2456B84017l22451R1793o2799K67022j57925K7269o0822P9425N158m4544R2859
$$ plain form
2445 199002 23852 74259 239183 443036 450960 427115 269371 164903 -197 170257
2435 170257 380822 494480 161331 111649 259496 501376 209381 310948 360570 620783
2425 620783 705256 630147 419870 318049 459921 598235 580271 578782 721336 701845 474073
2414 474073 630720 1020990 756489 561773 616092 755029 910021 1037910 892515 856820
2404 856820 719152 724846 897284 866199 805018 834878 913805 1232136 1369483 1368034 1661311
2393 1661311 1518510 1385316 1389181 1460195 1539651 1635110 1530797 1865286 1620858 1634413 1793581
2382 1793581 1798155 1930198 1778659 2125346 2193702 2315392 2476814 2335849 2567724 2772678
2372 2772678 2755435 3045003 3111194 3455258 3424935 3774091 3878928 4258110 4545247 4814600
$$ packed form
2445A99002j75150N0407J64924K03853P924k3845j57744j04468j65100J70454
2435A70257K10565J13658l33149m9682J47847K41880k91995J01567M9622K60213
2425F20783Q4473p5109k10277j01821J41872J38314j7964j489J42554j9491k27772
2414D74073J56647L90270k64501j94716N4319J38937J54992J27889j45395l5695
2404H56820j37668N694J72438l1085o1181K9860P8927L18331J37347j449K93277
2393A661311j42801j33194L865P1014P9456R5459j04313L34489k44428J3555J59168
2382A793581M574J32043j51539L46687O8356J21690J61422j40965K31875K04954
2372B772678j7243K89568O6191L44064l0323L49156J04837L79182K87137K69353
$$ plain form
2362 4814600 4939315 5171334 5535468 5599497 5863531 5997583 6397940 7087458 7642075 8284361
2352 8284361 8896842 9371960 10199641 11252347 12253599 13301492 14379833 15977232 17676890
2343 17676890 19394379 21171646 23176825 24979486 27480822 30234513 33765417 38306578
2335 38306578 44112304 52201924 62264840 72087257 82573950 95287005 106623882 112572197
2327 112572197 114994752 111684125 98252330 84272982 73145392 64417684 57441131 51629061
2319 51629061 46597818 42320001 38645847 35442749 32005963 29298096 27195210 25047141
2311 25047141 23056481 21226056 19179411 17399729 15871991 14680093 13508074 12384438
2303 12384438 11723447 10956904 10456297 9678415 8936210 8388390 8022966 7383372 7125222
$$ packed form
2362D814600J24715K32019L64134O4029K64034J34052M00357O89518N54617O42286
2352H284361O12481M75118Q27681J052706J001252J047893J078341J597399J699658
2343A7676890J717489J777267K005179J802661K501336K753691L530904M541161
2335C8306578N805726Q089620J0062916R822417J0486693J2713055J1336877N948315
2327A12572197K422555l310627j3431795j3979348j1127590q727708o976553n812070
2319E1629061n031243m277817l674154l203098l436786k707867k102886k148069
2311B5047141j990660j830425k046645j779682j527738j191898j172019j123636
2303A2384438o60991p66543n00607p77882p42205n47820l65424o39594k58150
$$ plain form
2294 7125222 6680885 6322313 5870661 5489294 5187180 4839906 4462694 4303119 3975876 3981727
2284 3981727 3966777 3765524 3426928 3411335 3032607 2881958 3008727 2774308 2892625 2937215
2274 2937215 2693265 2597383 2670892 2639260 2394135 2320717 2308967 2002917 1834429 1981031
2264 1981031 1806141 1618821 1291447 1176034 1143748 891765 1089994 1154592 1098801 977927
2254 977927 1013070 795454 851088 989197 767055 808563 780672 807247 888347 699191 600566
2243 600566 674834 691764 741553 795638 623489 746147 508213 597283 742875 530442 381183
2232 381183 287759 200738 194773 211897 392489 267819 244922 57066 108168 114208 27118
2221 27118 194676 225326 203443 180951 266946 181995 213465 355758 62986 120600 189464
$$ packed form
2294G125222m44337l58572m51652l81367l02114l47274l77212j59575l27243N851
2284C981727j4950k01253l38596j5593l78728j50649J26769k34419J18317M4590
2274B937215k43950r5882P3509l1632k45125p3418j1750l06050j68488J46602
2264A981031j74890j87320l27374j15413l2286k51983J98229O4598n5791j20874
2254I77927L5143k17616N5634J38109k22142M1508k7891K6575Q1100j89156r8625
2243F00566P4268J6930M9789N4085j72149J22658k37934Q9070J45592k12433j49259
2232C81183r3424q7021n965J7124J80592j24670k2897j87856N1102O040q7090
2221B7118J67558L0650k1883k2492Q5995q4951L1470J42293k92772N7614O8864
$$ plain form
2210 189464 26109 -26329 -121396 -90026 -211964 141839 469329 228608 28080 8435
2200 8435 -61534 -19332 194622 262000 192296 52919 -234851 -256048 -55379 67764 119848
2189 119848 -234736 -318502 -270577 -55201 -18148 -149221 2016 22225 209594 10501
2179 10501 -212597 -58961 -256324 -216170 -21246 -219654 -79137 -125420 -331488 -489768
2169 -489768 -331167 -51744 -64698 -455926 -478335 -552922 -675721 -344584 -491557 -380145
2159 -380145 -130257 -247751 -480973 -552188 -466300 -538786 -498625 -160714 61602 130394 -27275
2148 -27275 -399893 -287366 -163175 39021 -62 -150077 -142310 -32991 -211332 -366685
2138 -366685 -523459 -285270 -531686 -294055 -295646 -519892 -70006 -169902 -461066 -768229
$$ packed form
2210A89464j63355n2438r5067L1370j21938L53803L27490k40721k00528j9645
2200H435o9969M2202K13954O7378o9704j39377k87770k1197K00669J23143N2084
2189A19848l54584q3766M7925K15376L7053j31073J51237K0209J87369j99093
2179A0501k23098J53636j97363M0154J94924j98408J40517m6283k06068j58280
2169d89768J58601K79423j2954l91228k2409p4587j22799L31137j46973J11412
2159c80145K49888j17494k33222p1215Q5888p2486M0161L37911K22316O8792j57669
2148b7275l72618J12527J24191K02196l9083j50015P767J09319j78341j55353
2138c66685j56774K38189k46416K37631j591k24246M49886r9896k91164l07163
$$ plain form
2128 -768229 -520049 -727785 -657143 -423387 -466310 -583265 -365364 -260768 -406236 -335243
2118 -335243 -223700 -326026 -188806 -428424 -561199 -348688 -329193 -317114 -605094 -741433
2108 -741433 -741500 -805192 -757687 -455987 -351759 -489846 -420109 -230293 -377065 -381765 -297565
2097 -297565 -360305 -545127 -866148 -460512 -360257 -113001 -183849 -226706 -204815 -159919 -165471
2086 -165471 -89332 -207469 -303508 -226894 -203361 -267875 -381391 -27032 -345912 -294401 -374932
2075 -374932 -241062 -367662 -414908 -649897 -344289 -181463 -525226 -328219 -212056 -134621
2065 -134621 -335650 -363373 -212021 111998 91924 -36625 165901 -36711 -93431 -62312
2055 -62312 -22366 -279028 -335409 -143494 -214144 -203420 -153959 -373130 -294733 -249797 -189783
$$ packed form
2128g68229K48180k07736P0642K33756m2923j16955K17901J04596j45468P0993
2118c35243J11543j02326J37220k39618j32775K12511J9495J2079k87980j36339
2108g41433o7o3692M7505L01700J04228j38087O9737J89816j46772m700Q4200
2097b97565o2740j84822l21021M05636J00255K47256p0848m2857K1891M4896n552
2086a65471P6139j18137r6039P6614K3533o4514j13516L54359l18880N1511q0531
2075c74932J33870j26600m7246k34989L05608J62826l43763J97007J16163P7435
2065a34621k01029k7723J51352L24019k0074j28549K02526k02612n6720L1119
2055f2312L9946k56662n6381J91915p0650J0724M9461k19171P8397M4936O0014
$$ plain form
2044 -189783 -144121 -537153 -428696 -434962 -621315 -150020 -120770 -253889 -190319 -268702 -267367
2033 -267367 -381206 -470309 -334852 -448365 -362841 -324190 -505535 -299305 -239188 -267730 -594972
2022 -594972 -575383 -116007 -175026 -400851 -300135 -273001 -382533 -445793 -311488 -199287
2012 -199287 -127516 -13102 -134614 -405745 -373768 -668039 -635531 -727754 -460963 -286953
2002 -286953 -616287 -676377 -490047 -562792 -771368 -469502 -331942 -442161 -374227 -677748
1992 -677748 -584420 -476309 -468136 -489446 -510481 -382057 -548273 -572837 -467695 -515989 -602036
1981 -602036 -397028 -471568 -568359 -555995 -743415 -629179 -741234 -792813 -660269 -587041 -538604
1970 -538604 -657223 -641266 -722513 -340308 -539068 -763123 -569236 -236825 -290733 -490967
$$ packed form
2044a89783M5662l93032J08457o266j86353M71295K9250j33119O3570p8383J335
2033b67367j13839q9103J35457j13513Q5524L8651j81345K06230O0117k8542l27242
2022e94972J9589M59376n9019k25825J00716K7134j09532o3260J34305J12201
2012a99287P1771J14414j21512k71131L1977k94271L2508r2223K66791J74010
2002b86953l29334o0090J86330p2745k08576L01866J37560j10219O7934l03521
1992f77748R3328J08111Q173k1310k1035J28424j66216k4564J05142m8294q6047
1981f02036K05008p4540r6791J2364j87420J14236j12055n1579J32544P3228M8437
1970e38604j18619J5957q1247L82205j98760k24055J93887L32411n3908k00234
$$ plain form
1960 -490967 -311540 -620258 -540780 -509203 -632569 -598685 -702096 -956481 -1043604 -684728
1950 -684728 -612641 -1019584 -967979 -792491 -529926 -604257 -776934 -531883 -535714 -692420 -488597
1939 -488597 -672623 -800962 -508895 -677015 -412778 -193249 -349012 -411494 -441859 -856841
1929 -856841 -886337 -737882 -696599 -637193 -664605 -584385 -555149 -636440 -626850 -390825 -440922
1918 -440922 -279545 -36844 -258924 -291057 -509633 -334744 -247281 -160171 -198853 -549865
1908 -549865 -488455 -719704 -638731 -573818 -613679 -459875 -413595 -404938 -344465 -500156 -619598
1897 -619598 -423119 -432907 -548443 -605514 -671221 -674141 -798023 -700177 -845838 -841225 -638591
1886 -638591 -729630 -583482 -760080 -866638 -870656 -780612 -805803 -949876 -941157 -894770 -1029138
$$ packed form
1960d90967J79427l08718P9478L1577j23366L3884j03411k54385q7123L58876
1950f84728P2087m06943N1605J75488K62565p4331j72677K45051l831j56706K03823
1939d88597j84026j28339K92067j68120K64237K19529j55763o2482l0365m14982
1929h56841k9496J48455M1283N9406k7412Q0220K9236q1291R590K36025n0097
1918d40922J61377K42701k22080l2133k18576J74889Q7463Q7110l8682l51012
1908e49865O1410k31249Q0973O4913l9861J53804M6280Q657O0473j55691j19442
1897f19598J96479r788j15536n7071o5707k920j23882R7846j45661M613K02634
1886f38591r1039J46148j76598j06558m018R0044k5191j44073Q719M6387j34368
$$ plain form
1875 -1029138 -780200 -405086 -534812 -637164 -670204 -413637 -456656 -481270 -345658 -430197
1865 -430197 -464898 -671523 -599793 -494326 -476179 -522865 -579816 -651615 -946663 -932827 -788543
1854 -788543 -920456 -709364 -618551 -770581 -701683 -714281 -1133319 -1048313 -761740 -651393
1844 -651393 -729253 -616500 -573031 -699123 -551251 -376667 -385156 -224693 -214995 -477742 -766466
1833 -766466 -909641 -789560 -344545 -537677 -751569 -914618 -745356 -748544 -792634 -723473
1823 -723473 -996181 -731579 -743050 -681946 -676575 -579142 -369311 -81284 -190366 -340130 -528539
1812 -528539 -291635 -313710 -505097 -805348 -853624 -743060 -635485 -321190 -179798 -433203
$$ packed form
1875a029138K48938L75114j29726j02352l3040K56567m3019k4614J35612q4539
1865d30197l4701k06625P1730J05467J8147m6686n6951p1799k95048J3836J44284
1854g88543j31913K11092R0813j52030O8898j2598m19038Q5006K86573J10347
1844f51393p7860J12753M3469j26092J47872J74584q489J60463R698k62747k88724
1833g66466j43175J20081M45015j93132k13892j63049J69262l188m4090O9161
1823g23473k72708K64602j1471O1104N371R7433K09831K88027j09082j49764j88409
1812e28539K36904k2075j91387l00251m8276J10564J07575L14295J41392k53405
$$ [...]
##END NTUPLES=NMR SPECTRUM
##END=
