##TITLE=1H_DE-80H_X3
 200.13MHz, d2o
 8 sc
 
 19ns.26.2.2025
##JCAMPDX= 6.0         $$ Bruker NMR JCAMP-DX V2.0
##DATA TYPE= NMR SPECTRUM
##DATA CLASS= NTUPLES
##ORIGIN= UXNMR, Bruker Analytische Messtechnik GmbH
##OWNER= pz
$$ XWIN-NMR		Version 3.5
$$ Thu Sep 18 14:43:40 2025 Russian Standard Time (UT+4h)  Yarkov@DPX200
##.OBSERVE FREQUENCY= 200.1313
##.OBSERVE NUCLEUS= ^1H
##.ACQUISITION MODE= SIMULTANEOUS
##.ACQUISITION SCHEME= undefined
##.AVERAGES= 8
##.DIGITISER RES= 18
##SPECTROMETER/DATA SYSTEM= spect
##.PULSE SEQUENCE= zg30
##.SOLVENT NAME= CDCl3
##.SHIFT REFERENCE= (INTERNAL, CDCl3, 0, 15.4791)
##AUDIT TRAIL= $$ (NUMBER, WHEN, WHO, WHERE, WHAT)
$$ ##TITLE= Audit trail, XWIN-NMR		Version 3.5
$$ ##JCAMPDX= 5.01
$$ ##ORIGIN= Bruker BioSpin GmbH
$$ ##OWNER= Yarkov
$$ C:/Bruker/XWIN-NMR/data/yarkov2/nmr/H-C/1/pdata/1/auditp.txt
$$ ##AUDIT TRAIL=  $$ (NUMBER, WHEN, WHO, WHERE, WHAT)
(   1,<2025-09-18 14:42:37.46 +0400>,<Yarkov>,<DPX200>,
      <created by zg, POWCHK disabled, PULCHK disabled
       configuration hash MD5:
       00 E9 B6 7A A2 85 ED C7 34 08 36 98 17 FE 4E 26
       data hash MD5: 16K
       7E C1 B4 10 31 13 9A 94 26 A5 15 BA 5D F4 E4 8E>)
(   2,<2025-09-18 14:42:43.09 +0400>,<Yarkov>,<DPX200>,
      <Start of raw data processing
       efp BC_mod = 2 LB = 0.25 FT_mod = 6 PKNL = 1 PHC0 = -1348.02 PHC1 = -1.209074 SI = 16K 
       data hash MD5: 16K
       4B 83 7F 6B 76 F5 F2 C5 2E 1A EB 1A 52 4F 5E 80>)
(   3,<2025-09-18 14:42:51.73 +0400>,<Yarkov>,<DPX200>,
      <abs ABSG = 5 
       data hash MD5: 16K
       05 BD 9F F3 44 D3 DA 65 8C A1 AD B1 47 95 58 05>)
$$ ##END=
$$ 
$$ hash MD5
$$ 6E D4 85 C8 27 AF CC F1 FC 77 49 FF 56 30 71 79
##$RELAX= 
##$RELAX= 
##$RELAX= 
##$RELAX= 
##$RELAX= 
##$RELAX= 
$$ Bruker specific parameters
$$ --------------------------
##$DU= <C:/Bruker/XWIN-NMR>
##$EXPNO= 1
##$NAME= <H-C>
##$PROCNO= 1
##$TYPE= <nmr>
##$USER= <yarkov2>
##$AMP= (0..31)
100 100 100 100 100 100 100 100 100 100 100 100 100 100 100 100 100 100 
100 100 100 100 100 100 100 100 100 100 100 100 100 100 
##$AQSEQ= 0
##$AQ_mod= 1
##$AUNM= <au_zg>
##$AUTOPOS= <>
##$BF1= 200.13
##$BF2= 200.13
##$BF3= 200.13
##$BF4= 200.13
##$BF5= 200.13
##$BF6= 200.13
##$BF7= 200.13
##$BF8= 200.13
##$BYTORDA= 1
##$CFDGTYP= 0
##$CFRGTYP= 5
##$CHEMSTR= <none>
##$CNST= (0..31)
1 1 145 1 1 1 1 1 1 1 1 1 1 1 1 1 1 1 1 1 1 1 1 1 1 1 1 1 1 1 1 1 
##$CPDPRG= <>
##$CPDPRG1= <>
##$CPDPRG2= <>
##$CPDPRG3= <>
##$CPDPRG4= <mlev>
##$CPDPRG5= <mlev>
##$CPDPRG6= <mlev>
##$CPDPRG7= <mlev>
##$CPDPRG8= <mlev>
##$CPDPRGB= <>
##$CPDPRGT= <>
##$D= (0..31)
0 0.7 0 0 0 0 0 0 0 0 0 0.03 0 0 0 0 0 0 0 0 0 0 0 0 0 0 0 0 0 0 0 0 
##$DATE= 1758192157
##$DBL= (0..7)
120 120 120 120 120 120 120 120 
##$DBP= (0..7)
150 150 150 150 150 150 150 150 
##$DBP07= 0
##$DBPNAM0= <>
##$DBPNAM1= <>
##$DBPNAM2= <>
##$DBPNAM3= <>
##$DBPNAM4= <>
##$DBPNAM5= <>
##$DBPNAM6= <>
##$DBPNAM7= <>
##$DBPOAL= (0..7)
0.5 0.5 0.5 0.5 0.5 0.5 0.5 0.5 
##$DBPOFFS= (0..7)
0 0 0 0 0 0 0 0 
##$DE= 6
$$ [...]
##$SUBNAM3= <"">
##$SUBNAM4= <"">
##$SUBNAM5= <"">
##$SUBNAM6= <"">
##$SUBNAM7= <"">
##$SUBNAM8= <"">
##$SUBNAM9= <"">
##$SW= 18.0517328524113
##$SWIBOX= (0..15)
0 0 2 0 0 0 0 0 0 0 0 0 0 0 0 0 
##$SW_h= 3612.71676300578
##$TD= 16384
##$TD0= 1
##$TE= 0
##$TE2= 300
##$TE3= 300
##$TEG= 300
##$TL= (0..7)
0 120 120 120 120 120 120 120 
##$TP= (0..7)
150 150 150 150 150 150 150 150 
##$TP07= 0
##$TPNAME0= <>
##$TPNAME1= <>
##$TPNAME2= <>
##$TPNAME3= <>
##$TPNAME4= <>
##$TPNAME5= <>
##$TPNAME6= <>
##$TPNAME7= <>
##$TPOAL= (0..7)
0.5 0.5 0.5 0.5 0.5 0.5 0.5 0.5 
##$TPOFFS= (0..7)
0 0 0 0 0 0 0 0 
##$TUNHIN= 0
##$TUNHOUT= 0
##$TUNXOUT= 0
##$USERA1= <user>
##$USERA2= <user>
##$USERA3= <user>
##$USERA4= <user>
##$USERA5= <user>
##$V9= 5
##$VALIST= <valist>
##$VCLIST= <CCCCCCCCCCCCCCC>
##$VD= 0
##$VDLIST= <DDDDDDDDDDDDDDD>
##$VPLIST= <PPPPPPPPPPPPPPP>
##$VTLIST= <TTTTTTTTTTTTTTT>
##$WBST= 1024
##$WBSW= 4
##$XGAIN= (0..3)
0 0 0 0 
##$XL= 0
##$YL= 0
##$YMAX_a= 160441
##$YMIN_a= -140310
##$ZGOPTNS= <>
##$ZL1= 120
##$ZL2= 120
##$ZL3= 120
##$ZL4= 120
##$ABSF1= 15.41194
##$ABSF2= -2.639908
##$ABSG= 5
##$ABSL= 3
##$ALPHA= 0
##$AQORDER= 0
##$ASSFAC= 0
##$ASSFACI= 0
##$ASSFACX= 0
##$ASSWID= 0
##$AUNMP= <proc_1d>
##$AZFE= 0.1
##$AZFW= 0.1
##$BCFW= 0
##$BC_mod= 2
##$BYTORDP= 0
##$COROFFS= 0
##$CY= -3
##$DATMOD= 1
##$DC= 0
##$DFILT= <>
##$DTYPP= 0
##$F1P= 0
##$F2P= 0
##$FCOR= 1
##$FTSIZE= 16384
##$FT_mod= 6
##$GAMMA= 0
##$GB= 0
##$INTBC= 1
##$INTSCL= 3.241238e-09
##$ISEN= 128
##$LB= 0.25
##$LEV0= 0
##$LPBIN= 0
##$MAXI= 10000
##$MC2= 0
##$MEAN= 0
##$ME_mod= 0
##$MI= 1.114404
##$NCOEF= 0
##$NC_proc= -8
##$NLEV= 6
##$NOISF1= 3.799351
##$NOISF2= 2.8
##$NSP= 0
##$NTH_PI= 0
##$NZP= 0
##$OFFSET= 15.47915
##$PC= 1
##$PHC0= -1348.02
##$PHC1= -1.209074
##$PH_mod= 1
##$PKNL= yes
##$PPARMOD= 0
##$PSCAL= 0
##$PSIGN= 0
##$REVERSE= no
##$SF= 200.130008514563
##$SI= 16384
##$SIGF1= 3
##$SIGF2= 2
##$SINO= 0.751879
##$SIOLD= 32768
##$SREGLST= <19F.Aceton>
##$SSB= 0
##$STSI= 16384
##$STSR= 0
##$SW_p= 3612.71676300578
##$SYMM= 0
##$S_DEV= 0
##$TDeff= 16384
##$TDoff= 0
##$TI= <>
##$TILT= no
##$TM1= 0
##$TM2= 0
##$TOPLEV= 0
##$USERP1= <user>
##$USERP2= <user>
##$USERP3= <user>
##$USERP4= <user>
##$USERP5= <user>
##$WDW= 1
##$XDIM= 16384
##$YMAX_p= 365101896
##$YMIN_p= -1243283
$$ End of Bruker specific parameters
$$ ---------------------------------
##NTUPLES= NMR SPECTRUM
##VAR_NAME=  FREQUENCY,     SPECTRUM/REAL,   SPECTRUM/IMAG
##SYMBOL=    X,             R,               I
##VAR_TYPE=  INDEPENDENT,   DEPENDENT,       DEPENDENT
##VAR_FORM=  AFFN,          ASDF,            ASDF
##VAR_DIM=   16384,         16384,           16384
##UNITS=     HZ,            ARBITRARY UNITS, ARBITRARY UNITS
##FACTOR=    0.220516191357247, 1,           1
##FIRST=     3097.84238495867, 0,            0
##LAST=      -514.874378047107, 0,           0
##MIN=       -514.874378047107, -1243283,    0
##MAX=       3097.84238495867, 365101896,    0
$$ Real data points
##PAGE= N=1
##DATA TABLE= (X++(R..R)), XYDATA
$$ [...]
$$ plain form
7471 618805 420201 269444 -87112 -230841 -261769 -192033 -549539 -405544 -610304 -499340
7461 -499340 -265171 -28029 250244 218505 3469 -282237 -188228 -99927 210155 51547
7451 51547 91223 -123654 -152776 -164672 -297176 -87282 43229 328143 484951 628234
7441 628234 471704 281834 -71626 124072 106633 -28209 -29000 -53539 83281 -40101 -80731
7430 -80731 37329 165053 78222 173527 151247 275968 189509 -96327 -172344 -334554 -440715
7419 -440715 -361329 -274980 -65770 127126 80719 168535 299631 369424 274611 342988 400387
7408 400387 115375 59312 -224187 -125381 -193636 19865 189537 95414 301527 340763 370339
7397 370339 525199 715942 649820 606447 224524 259022 44710 -7391 -34250 386012 494235
$$ packed form
7471F18805j98604j50757l56556j43729l0928O9736l57506J43995k04760J10964
7461d99340K34169K37142K78273l1739k15036k85706R4009Q8301L10082j58608
7451E1547L9676k14877k9122j1896j32504K09894J30511K84914J56808J43283
7441F28234j56530j89870l53460J95698j7439j34842p91k4539J36820j23382m0630
7430h0731J18060J27724q6831R5305k2280J24721q6459k85836p6017j62210j06161
7419d40715P9386Q6349K09210J92896m6407Q7816J31096O9793r4813O8377N7399
7408D00387k85012n6063k83499R8806o8255K13501J69672r4123K06113L9236K9576
7397C70339J54860J90743o6122m3373l81923L4498k14312n2101k6859M20262J08223
$$ plain form
7386 494235 184649 37600 -273243 47857 192190 314961 449398 534026 459178 506320
7376 506320 358417 589205 817849 668247 725166 609834 529465 582407 594187 441875
7366 441875 1035546 1218819 1670433 1990170 2314634 2952642 2899490 2985660 2969227 2951628
7356 2951628 2607780 2374599 2126586 2123532 1739718 1530049 1477673 1557110 1574316 1579843 1484417
7345 1484417 1488227 1699956 1430668 1438557 1360254 1496682 1583038 1580163 1578148 1481794 1419104 1307973
7333 1307973 1157782 1038721 1324642 1122887 1234328 1067888 1284400 1586776 1259602 1301210
7323 1301210 1216357 1312855 1384500 1542234 1631168 2023652 1985113 1885777 1988956 1954911 2080597
7312 2080597 2144094 1988343 1958639 2054033 1718600 1554318 1281320 1364819 1589839 1664750
$$ packed form
7386D94235l09586j47049l10843L21100J44333J22771J34437Q4628p4848M7142
7376E06320j47903K30788K28644j49602N6919j15332q0369N2942J1780j52312
7366D41875N93671J83273M51614L19737L24464O38008n3152Q6170j6433j7599
7356B951628l43848k33181k48013l054l83814k09669n2376P9437J7206N527r5426
7345A484417L810K11729k69288P889p8303J36428Q6356k875k015r6354o2690j11131
7333A307973j50191j19061K85921k01755J11441j66440K16512L02376l27174M1608
7323A301210q4853R6498P1645J57734Q8934L92484l8539r9336J03179l4045J25686
7312B080597O3497j55751k9704R5394l35433j64282k72998Q3499K25020P4911
$$ plain form
7302 1664750 1914736 2147285 2261901 2007011 2003604 1942447 2257899 2454800 2623686 2444203
7292 2444203 2321592 2167479 2027975 2116016 2160808 2420648 2472045 2428153 2220663 2272988
7282 2272988 2185242 2463642 2596765 2877057 3089122 3059069 2892790 2836298 2964313 3032514
7272 3032514 3095266 2770136 3105669 2992816 2951112 3075436 3177347 3323790 3569750 3573205
7262 3573205 3471425 3622770 3314681 3281037 2943898 2770136 2780378 2732664 2569935 2494899
7252 2494899 2359840 2210331 2145666 2030849 2044426 2066318 1915649 1517918 1441521 1275285
7242 1275285 1275416 1257432 1326531 1461927 1577826 1619454 1304761 1146326 910623 844459 743215
7231 743215 630308 812047 679251 414843 269307 413071 610779 873325 925836 875465
$$ packed form
7302A664750K49986K32549J14616k54890l407o1157L15452J96901J68886j79483
7292B444203j22611j54113j39504Q8041M4792K59840N1397m3892k07490N2325
7282B272988q7746K78400J33123K80292K12065l0053j66279n6492J28015O8201
7272C032514O2752l25130L35533j12853m1704J24324J01911J46443K45960L455
7262C573205j01780J51345l08089l3644l37139j73762J0242m7714j62729p5036
7252B494899j35059j49509o4665j14817J3577K1892j50669l97731p6397j66236
7242A275285J31j7984O9099J35396J15899M1628l14693j58435k35703o6164j01244
7231G43215j12907J81739j32796k64408j45536J43764J97708K62546N2511n0371
$$ plain form
7221 875465 809999 665559 570682 424369 273917 241281 298658 347886 519597 652355 594731
7210 594731 526682 542035 417128 352859 332623 596514 677914 609515 619073 522852 440568
7199 440568 296611 274997 243401 514320 660813 659413 743798 933898 931563 726566 529325
7188 529325 661379 779561 702525 894988 908374 1166035 990455 779598 712257 944782
7178 944782 1224870 1420027 1537509 1450618 1261580 841476 877885 736794 975907 1038958
7168 1038958 1076539 1143294 1003576 928429 1039935 920260 917663 1279948 1150476 1153688 1031015
7157 1031015 1075046 1100198 1135303 1033424 1062935 929972 803821 714120 610983 755285
7147 755285 686224 317191 174873 318873 380639 594806 540792 659488 935603 770336
$$ packed form
7221H75465o5466j44440r4877j46313j50452l2636N7377M9228J71711J32758n7624
7210E94731o8049J5353j24907o4269k0236K63891Q1400o8399R558r6221q2284
7199D40568j43957k1614l1596K70919J46493j400Q4385J90100k335k04997j97241
7188E29325J32054J18182p7036J92463J3386K57661j75580k10857o7341K32525
7178I44782K80088J95157J17482q6891j89038m20104L6409j41091K39113O3051
7168A038958L7581O6755j39718p5147J11506j19675k597L62285j29472L212j22673
7157A031015M4031K5152L5105j01879K9511j32963j26151q9701j03137J44302
7147G55285o9061l69033j42318J44000O1766K14167n4014J18696K76115j65267
$$ plain form
7137 770336 629440 456581 343059 344612 242231 389275 463768 706357 836642 717476
7127 717476 775603 764553 610901 707549 805636 765222 768021 407929 203032 253118 178268
7116 178268 344298 589297 746690 1031076 918340 746874 621386 535695 644879 824364
7106 824364 742291 714096 721263 522545 522495 497801 494244 709650 505409 639084 789752 890413
7094 890413 1030165 999705 927807 1153053 1510205 1671833 1857813 1919341 2072943 2014683
7084 2014683 2089056 2124931 2288386 2394882 2360974 2365289 2522134 2655328 3000447 3034278 3309142
7073 3309142 3401613 3333694 3265015 3065018 2959041 2965446 3124120 3096489 2898841 2617521 2578330
7062 2578330 2404030 2297018 2595728 2746927 2596598 2507869 2073715 1955890 2103668 1883692
$$ packed form
7137G70336j40896j72859j13522J553j02381J47044P4493K42589J30285j19166
7127G17476N8127j1050j53652R6648R8087m0414K799l60092k04897N0086p4850
7116A78268J66030K44999J57393K84386j12736j71466j25488q5691J09184J79485
7106H24364q2073k8195P167j98718n0k4694l557K15406k04241J33675J50668J00661
7094H90413J39752l0460p1898K25246L57152J61628J85980O1528J53602n8260
7084B014683P4373L5875J63455J06496l3908M315J56845J33194L45119L3831K74864
7073C309142R2471o7919o8679j99997j05977O405J58674k7631j97648k81320l9191
7062B578330j74300j07012K98710J51199j50329q8729m34154j17825J47778k19976
$$ plain form
7052 1883692 1746900 1700012 1620848 1485631 1492314 1533795 1696050 1709161 1429428 1323432 1227239
7041 1227239 1249193 1179533 1046262 1163701 1263174 1335101 1082163 860647 1081865 1306270
7031 1306270 1361130 1575484 1621128 1485872 1288210 980236 962805 1328767 1594564 1879594
7021 1879594 1889300 1638987 1193801 710122 532204 552959 847220 926536 1099004 918401
7011 918401 756864 508414 445887 669712 971819 1259408 1193923 1084602 776472 557626
7001 557626 492168 388275 500476 491997 433159 504750 351624 338533 497351 431974 574004
6990 574004 698132 596893 702483 836731 826650 684651 705673 787130 440567 238176
6980 238176 163632 19320 297564 464196 484457 470392 394573 242983 424224 483759 574482
$$ packed form
7052A883692j36792m6888p9164j35217O683M1481J62255J3111k79733j05996r6193
7041A227239K1954o9660j33271J17439R9473P1927k52938k21516K21218K24405
7031A306270N4860K14354M5644j35256j97662l07974j7431L65962K65797K85030
7021A879594R706k50313m45186m83679j77918K0755K94261P9316J72468j80603
7011I18401j61537k48450o2527K23825L02107K87589o5485j09321l08130k18846
7001E57626o5458j03893J12201q479n8838P1591j53126j3091J58818o5377J42030
6990E74004J24128j01239J05590J34248j0081j41999K1022Q1457l46563k02391
6980B38176p4544j44312K78244J66632K0261j4065p5819j51590J81241N9535R0723
$$ plain form
6969 574482 700045 376637 298134 333311 514123 884154 740732 608420 799157 537612
6959 537612 556624 647389 573260 497800 248884 121935 58483 -140882 -189013 -72352 171922
6948 171922 515955 664179 264865 79530 82198 228327 393212 499406 684353 561795
6938 561795 373117 49953 51067 452934 348984 229058 416575 452517 440029 342479 65882
6927 65882 87253 411695 499425 576900 466934 316355 472513 150801 -54018 -339101
6917 -339101 -651888 -495755 -461533 -200827 231957 255712 42033 226273 22260 211978
6907 211978 367081 281398 317083 269487 67191 204935 -17123 -191655 119362 152325
6897 152325 377738 679143 568438 624189 658167 295969 126599 -40229 298821 476165
$$ packed form
6969E74482J25563l23408p8503L5177J80812L70031j43422j32312J90737k61545
6959E37612J9012R0765p4129p5460k48916j26949o3452j99365m8131J16661K44274
6948A71922L44033J48224l99314j85335K668J46129J64885J06194J84947j22558
6938E61795j88678l23164J114M01867j03950j19926J87517L5942j2488r7550k76597
6927F5882K1371L24442Q7730P7475j09966j50579J56158l21712k04819k85083
6917c39101l12787J56133L4222K60706M32784K3755k13679J84240k04013J89718
6907B11978J55103q5683L5685m7596k02296J37744k22058j74532L11017L2963
6897A52325K25413L01405j10705N5751L3978l62198j69370j66828L39050J77344
$$ plain form
6887 476165 709606 949540 827189 634448 273381 143007 414791 959325 983445 609152
6877 609152 239183 63353 -110013 -111999 59459 106793 332596 293464 235357 367601 295667
6866 295667 6654 44927 138014 347154 550650 206385 170411 342620 401279 196516
6856 196516 -161800 -376890 -231727 -71550 44605 290582 213451 196699 158895 101335
6846 101335 286419 272389 117331 257707 312951 471785 392224 10577 -95806 -185949
6836 -185949 -222951 373502 846692 814883 808163 457352 300972 138736 -96815 -228410
6826 -228410 -9954 307947 591915 602722 304328 203833 -14250 220545 518114 907510
6816 907510 960439 614377 325895 253939 272910 257711 358442 290021 420658 515074 308958
$$ packed form
6887D76165K33441K39934j22351j92741l61067j30374K71784N44534K4120l74293
6877F09152l69969j75830j73366j986J71458M7334K25803l9132n8107J32244p1934
6866B95667k89013L8273R3087K09140K03496l44265l5974J72209N8659k04763
6856A96516l58316k15090J45163J60177J16155K45977p7131j6752l7804n7560
6846A01335J85084j4030j55058J40376N5244J58834p9561l81647j06383r0143
6836a85949l7002N96453M73190l1809o720l50811j56380j62236k35551j31595
6826b28410K18456L17901K83968J0807k98394j00495k18083K34795K97569L89396
6816I07510N2929l46062k88482p1956J8971j5199J00731o8421J30637R4416k06116
$$ plain form
6805 308958 256874 219755 122617 92456 -121611 -164617 36953 103807 161968 176333 493552
6794 493552 337930 172689 88790 174437 268779 580902 664633 519166 413078 -21421
6784 -21421 -62041 -166480 -98611 -91624 -54241 -189197 -212307 -109516 -305468 -229303 50134
6773 50134 586137 775778 735857 792604 767700 619596 395639 -56365 -5472 155537 19932
6762 19932 503174 749258 786048 876249 982916 894233 1129274 1187021 1231688 1108896 1157444
6751 1157444 1294065 1153487 947875 757174 695260 917649 1076921 1120588 1334130 1035204
6741 1035204 728051 476456 155134 13507 194060 339039 510328 798204 852833 1035017
6731 1035017 624634 372696 367694 580320 802108 571082 515464 365704 177143 128454
$$ packed form
6805C08958n2084l7119r7138l0161k14067m3006K01570O6854N8161J4365L17219
6794D93552j55622j65241q3899Q5647R4342L12123Q3731j45467j06088m34499
6784b1421m0620j04439O7869O987L7383j34956k3110J02791j95952P6165K79437
6773E0134N36003J89641l9921N6747k4904j48104k23957m52004N0893J61009j35605
6762A9932M83242K46084L6790R0201J06667q8683K35041N7747M4667j22792M8548
6751A157444J36621j40578k05612j90701o1914K22389J59272M3667K13542k98926
6741A035204l07153k51595l21322j41627J80553J44979J71289K87876N4629J82184
6731A035017m10383k51938n002K12626K21788k31026n5618j49760j88561m8689
$$ plain form
6721 128454 189740 102933 281033 54332 152737 717933 809058 628709 236609 111933
6711 111933 508345 839641 588938 570791 747800 998420 907041 357500 334153 323134
6701 323134 236848 622356 887512 1089223 1191922 660794 489174 875962 1097598 1208932
6691 1208932 1097068 1079275 1234412 1240289 980068 975144 1017984 1044371 917966 888727 958216
6680 958216 1006667 1023942 1028115 1432301 1722900 1781317 1549276 1592784 1723538 2050938 2169620
6669 2169620 2065200 1783584 1549389 1246760 1044163 1191185 1380122 1450960 1367956 1613075
6659 1613075 1563607 1460084 1059981 871715 1141349 1253687 1319678 1474672 1346421 1195211
6649 1195211 1389828 1294796 1511064 1700012 1733530 1625668 1437090 1261534 1325731 1353149
$$ packed form
6721A28454O1286q6807J78100k26701R8405N65196R1125j80349l92100j24676
6711A11933L96412L31296k50703j8147J77009K50620r1379n49541k3347j1019
6701C23134q6286L85508K65156K01711J02699n31128j71620L86788K21636J11334
6691A208932j11864j7793J55137N877k60221m924M2840K6387j26405k9239O9489
6680I58216M8451J7275M173M04186K90599N8417k32041M3508J30754L27400J18682
6669B169620j04420k81616k34195l02629k02597J47022J88937P0838q3004K45119
6659A613075m9468j03523m00103j88266K69634J12338O5991J54994j28251j51210
6649A195211J94617r5032K16268J88948L3518j07862j88578j75556O4197K7418
$$ plain form
6639 1353149 1387472 1610394 1635907 1888030 1991024 2112387 2192867 2230121 2163774 2201341 2036365
6628 2036365 1623342 1669963 1481891 1953499 2161788 2138670 2014518 1685902 1417064 1231200
6618 1231200 1371710 1551442 1629409 1692641 1893966 1809466 1865215 1856403 1922910 2351862 2448080
6607 2448080 2487797 2292264 1827459 1813785 1780836 1621191 1832171 2113216 2364093 2256661
6597 2256661 2313603 2523962 2426264 2193627 1992901 1836717 1821381 1800666 1580487 1806071
6587 1806071 1680752 1373230 1392936 1452665 1736387 1956823 1928551 1887055 1674102 1360524
6577 1360524 1249795 1172564 1433097 1761764 1993896 1999390 1890360 1906870 2034685 2056360
6567 2056360 1773174 2017561 1997268 2072238 1922141 1825697 2064684 2183892 2159707 2224758
$$ packed form
6639A353149L4323K22922K5513K52123J02994J21363Q0480L7254o6347L7567j64976
6628B036365m13023M6621j88072M71608K08289k3118j24152l28616k68838j85864
6618A231200J40510J79732P7967O3232K01325q4500N5749q812O6507M28952R6218
6607B448080L9717j95533m64805j3674l2949j59645K10980K81045K50877j07432
6597B256661N6942K10359r7698k32637k00726j56184j5336k0715k20179K25584
6587A806071j25319l07522J9706N9729K83722K20436k8272m1496k12953l13578
6577A360524j10729p7231K60533L28667K32132N494j09030J6510J27815K1675
6567B056360k83186K44387k0293P4970j50097r6444K38987J19208k4185O5051
$$ plain form
6557 2224758 2330895 2445835 2538921 2611976 2639445 2641167 2862963 2703009 2541564 2667167
6547 2667167 2668654 2706180 2745569 2845272 2833274 3233217 3447464 3420816 3828411 4001818 4188198
6536 4188198 4543035 4396719 4678900 4663695 4272484 4058783 3912454 3968332 4185855 4253699
6526 4253699 4155498 4119669 3990170 3995497 3981357 3955519 4273018 4238018 4337868 4554037 4638561
6515 4638561 4857072 4663345 4489655 4740998 4932933 4685571 4716486 4547215 4375243 4236891
6505 4236891 4034604 3908870 3895025 3800997 3731566 3784228 3702989 3434730 3217939 3147784 3044443
6494 3044443 3171101 3244798 3171766 3269452 3215267 3189539 3302572 3398403 3288782 3277148 3125034
6483 3125034 3184594 2945590 2735207 2598265 2440209 2472337 2788005 3346193 3615764 3569317
$$ packed form
6557B224758J06137J14940R3086P3055K7469J722K21796j59954j61445J25603
6547B667167J487L7526L9389R9703j1998L99943K14247k6648M07595J73407J86380
6536D188198L54837j46316K82181j5205l91211k13701j46329N5878K17523O7844
6526D253699r8201l5829j29499N327j4140k5838L17499l5000R9850K16169Q4524
6515D638561K18511j93727j73690K51343J91935k47362L0915j69271j71972j38352
6505D236891k02287j25734j3845r4028o9431N2662q1239k68259k16791p0155j03341
6494C044443J26658P3697p3032R7686n4185k5728J13033R5831j09621j1634j52114
6483C125034N9560k39004k10383j36942j58056L2128L15668N58188K69571m6447
$$ plain form
6473 3569317 3165405 2969627 2822281 2797137 3107779 3169221 2921578 2906330 2825661 2398907
6463 2398907 2210399 2259532 2835286 3120962 3044878 2769187 2639232 2359981 2165264 2397118
6453 2397118 2681680 2890134 2780456 2525199 2383473 2283606 2301890 2256332 2140577 2389600
6443 2389600 2668702 2915483 3009178 3146623 3110035 3009670 2768165 2744146 3018230 3127969
6433 3127969 3070255 3125778 3203970 3160656 3133271 2797190 2828497 3396219 3654645 3422327 3180435
6422 3180435 3075843 2928367 2702685 2612613 2742357 3153214 3235271 3246983 3507999 3758536
6412 3758536 3608801 3234281 3122964 3276365 3652377 3753206 3814476 3784043 3728888 3637479
6402 3637479 3728469 3801156 4156092 4271940 4279537 4280463 4180286 4124519 3951925 3905915 4297119
$$ packed form
6473C569317m03912j95778j47346k5144L10642O1442k47643j5248q0669m26754
6463B398907j88508M9133N75754K85676p6084k75691j29955k79251j94717K31854
6453B397118K84562K08454j09678k55257j41726r9867J8284m5558j15755K49023
6443B389600K79102K46781R3695J37445l6588j00365k41505k4019K74084J09739
6433C127969n7714N5523P8192m3314k7385l36081L1307N67722K58426k32318k41892
6422C180435j04592j47476k25682r0072J29744M10857Q2057J1712K61016K50537
6412C758536j49735l74520j11317J53401L76012J00829O1270l0433n5155r1409
6402C637479R0990P2687L54936J15848P597R26j00177n5767j72594m6010L91204
$$ plain form
6391 4297119 4576010 4480797 4196422 4117872 4252448 4368182 4179130 3949201 4033877 3929856
6381 3929856 4004545 4298754 4643393 5024542 4930065 4638157 4625883 4565296 4717725 5051752
6371 5051752 5112018 5149594 5067725 4937079 4941268 5109252 5613330 6157041 6357188 6104930
6361 6104930 5861849 5737674 5827567 6013749 6174932 6528941 6590819 6741627 6837996 7095970
6351 7095970 7381290 7527882 7675226 7765177 7772590 8031733 7986872 8326157 8754326 8885979
6341 8885979 9059481 9351373 9688036 10153240 10734558 11406498 12396029 12824299 13549311 14353892
6331 14353892 15483586 16880785 18131438 19170868 20048929 20646932 21033996 21638738 22499701
6322 22499701 23509691 24800179 26133124 27529162 28909048 29966619 30674683 31020027
$$ packed form
6391D297119K78891r5213k84375p8550J34576J15734j89052k29929Q4676j04021
6381C929856P4689K94209L44639L81149r4477k91908j2274o0587J52429L34027
6371E051752O0266L7576q1869j30646M189J67984N04078N43711K00147k52258
6361F104930k43081j24175Q9893J86182J61183L54009O1878J50808R6369K57974
6351G095970K85320J46592J47344Q9951P413K59143m4861L39285M28169J31653
6341H885979J73502K91892L36663M65204N81318O71940R89531M28270P25012Q04581
6331A4353892J129694J397199J250653J039430Q78061N98003L87064O04742Q60963
6322B2499701J009990J290488J332945J396038J379886J057571P08064L45344
$$ plain form
6314 31020027 31600414 32641886 33513983 34668501 35853581 37366826 38797486 40106733
6306 40106733 41019415 42029577 43409363 45053810 47403319 50324016 53690605 57259413
6298 57259413 61226112 65026897 68640107 71734113 73384609 73532187 72525720 70520148
6290 70520148 68523879 66941868 66062939 66018244 66499445 67554272 69032465 70873841 72715809
6281 72715809 74569378 76760231 79442731 82487412 85262043 87427009 88196057 88152752 87232050
6272 87232050 85361748 82934089 80200426 77515809 75231956 73196723 71545985 69972575
6264 69972575 68060563 66742975 65293413 64326494 63171255 61864861 60666921 59710547
6256 59710547 59049688 58864782 58581092 58816748 60105310 61342916 63785033 66596444 69680928
$$ packed form
6314C1020027N80387J041472Q72097J154518J185080J513245J430660J309247
6306D0106733R12682J010162J379786J644447K349509K920697L366589L568808
6298E7259413L966699L800785L613210L094006J650496J47578j006467k005572
6290G0520148j996269j582011q78929m4695M81201J054827J478193J841376J841968
6281G2715809J853569K190853K682500L044681K774631K164966P69048m3305r20702
6272H7232050j870302k427659k733663k684617k283853k035233j650738j573410
6264F9972575j912012j317588j449562r66919j155239j306394j197940r56374
6256E9710547o60859j84906k83690K35656J288562J237606K442117K811411L084484
$$ plain form
6247 69680928 73002985 76002029 77831511 79284308 79761224 79657440 79205580 77701924 76036616
6238 76036616 73975697 72270492 70883952 70588482 70768671 71676907 72805799 74038886 75800543
6229 75800543 77618214 79592802 81355895 83412883 84861640 85408993 84387475 82281947
6221 82281947 79156522 75833047 72651120 69869074 67755600 65970889 64833537 63947019
6213 63947019 63569250 63253666 62825786 61972000 60946814 59417204 57973046 56308022 54563318
6204 54563318 53048907 51567554 50493809 49151206 47750729 46178602 44899414 43534182
6196 43534182 42413968 41302957 40119078 38943025 37456913 36349427 35386700 34384801
6188 34384801 32967513 31472747 29971946 28954488 28034670 26980316 25911436 24969192
$$ packed form
6247F9680928L322057K999044J829482J452797M76916j03784m51860j503656j665308
6238G6036616k060919j705205j386540k95470J80189R08236J128892J233087J761657
6229G5800543J817671J974588J763093K056988J448757N47353j021518k105528
6221H2281947l125425l323475l181927k782046k113474j784711j137352q86518
6213F3947019l77769l15584m27880q53786j025186j529610j444158j665024j744704
6204E4563318j514411j481353j073745j342603j400477j572127j279188j365232
6196D3534182j120214j111011j183879j176053j486112j107486r62727j001899
6188C4384801j417288j494766j500801j017458r19818j054354j068880r42244
$$ plain form
6180 24969192 24231683 23390530 22433214 21443323 20594596 19480885 18846616 18102322 17676900
6171 17676900 17165282 16474526 15960986 15395885 15092265 14434905 14006701 13368648 13006525
6162 13006525 12591844 12467449 12245661 12063079 11916807 11746365 11530831 11552412 11638015 11149135
6152 11149135 10714160 10205300 10152702 10065158 10193163 10115089 10277999 10181347 9950078 9620494
6142 9620494 8992203 8767481 8733793 8608833 8500207 8426964 8144486 8092823 7924093 7840204
6132 7840204 7939426 7712380 7479694 7091271 6928912 7139433 7177299 7116370 7232604 7023228
6122 7023228 7181487 7122546 6889094 7095840 7127989 6952872 6704746 6437678 6137175 6143821
6112 6143821 5891876 6102456 6465812 6313530 6059035 5616730 5416979 5371827 5527693 5422429
$$ packed form
6180B4969192p37509q41153r57316r89891q48727j113711o34269p44294m25422
6171A7676900n11618o90756n13540n65101l03620o57360m28204o38053l62123
6162A3006525m14681j24395k21788j82582j46272j70442k15534K1581Q5603m88880
6152A1149135m34975n08860n2598q7544J28005p8074J62910r6652k31269l29584
6142I620494o28291k24722l3688j24960j08626p3243k82478n1663j68730q3889
6132G840204R9222k27046k32686l88423j62359K10521L7866o0929J16234k09376
6122G023228J58259n8941k33452K06746L2149j75117k48126k67068l00503O646
6112F143821k51945K10580L63356j52282k54495m42305j99751m5152J55866j05264
$$ plain form
6102 5422429 5406214 5195895 5079001 4836640 4516086 4569601 4678261 4852683 4607693 4560738
6092 4560738 4396980 4555097 4626603 4794215 4772286 4946106 4785790 4641674 4877287 4917769
6082 4917769 5042533 4655199 4333976 4213970 4130252 4008941 4259229 4417726 4826975 4914426
6072 4914426 4750015 4729605 4506413 4355602 4169958 4022774 4029049 4157733 3763159 3844601
6062 3844601 3952459 3976131 4008988 3869756 3960888 4121351 4373727 4429744 4422607 4026305 3745529
6051 3745529 3563141 3659215 4148704 4392962 4397053 4310249 4323666 4339912 4419037 4207702 4088985
6040 4088985 4084859 4218654 4334115 4371374 4511135 4267561 4063944 3969399 3943073 4161015
6030 4161015 4528773 4723050 4827227 4861081 4749998 4703677 4568203 4913311 5270972 5472604
$$ packed form
6102E422429j6215k10319j16894k42361l20554N3515J08660J74422k44990m6955
6092D560738j63758J58117P1506J67612k1929J73820j60316j44116K35613M0482
6082D917769J24764l87334l21223j20006q3718j21311K50288J58497M09249Q7451
6072D914426j64411k0410k23192j50811j85644j47184O275J28684l94574Q1442
6062C844601J07858K3672L2857j39232R1132J60463K52376N6017p137l96302k80776
6051C745529j82388R6074M89489K44258M091q6804J3417J6246P9125k11335j18717
6040D088985m126J33795J15461L7259J39761k43574k03617r4545k6326K17942
6030D161015L67758J94277J04177L3854j11083m6321j35474L45108L57661K01632
$$ plain form
6020 5472604 5427476 5024300 4623016 4506733 4427871 4892813 5285495 5395390 5554289 5385438
6010 5385438 5229349 5373566 5683582 5795316 6032948 5853033 5764632 5651397 5468563 5696002
6000 5696002 5804151 6006343 5994852 5853253 5756199 5850846 5973229 6168695 6246555 6491757
5990 6491757 6464178 6435189 6627797 6705998 6974710 6819255 6546695 6163149 5988107 5814292
5980 5814292 6080719 6407464 6782397 6879568 6567628 6351651 6223695 6512034 6927656 7129201
5970 7129201 7114073 6964454 6509183 6343637 6557582 6781358 7193433 7426938 7466734 7460031
5960 7460031 7244282 6904383 6926407 6828155 6993729 7388022 7634946 7856557 7745742 7432584
5950 7432584 7675561 7926130 8118491 8555286 8482366 8492682 8480534 8076503 7740122 7411234
$$ packed form
6020E472604m5128m03176m01284j16283p8862M64942L92682J09895J58899j68851
6010E385438j56089J44217L10016J11734K37632j79915q8401j13235j82834K27439
6000E696002J08149K02192j1491j41599r7054R4647J22383J95466P7860K45202
5990F491757k7579k8989J92608P8201K68712j55455k72560l83546j75042j73815
5980E814292K66427L26745L74933R7171l11940k15977j27956K88339M15622K01545
5970G129201j5128j49619m55271j65546K13945K23776M12075K33505L9796o703
5960G460031k15749l39899K2024r8252J65574L94293K46924K21611j10815l13158
5950G432584K42977K50569J92361M36795p2920J0316j2148m04031l36381l28888
$$ plain form
5940 7411234 7261878 7224348 7295136 7537437 7701431 7418623 6922708 6624918 6674357 6923555
5930 6923555 6972200 6844523 6842035 7091837 7171837 7057728 7129297 6898362 6867606 6876236 6699068
5919 6699068 6903359 7045168 6732278 6679815 6466745 6526345 6539886 6361880 6670803 7055736
5909 7055736 7092398 7264455 6990398 6579024 6834199 6642220 6940573 7279242 7384756 7348909
5899 7348909 7156032 6942613 7153878 7217064 6990214 6825267 7011448 7424526 7615511 7637908
5889 7637908 7770367 7772613 7673359 7970026 8200914 8499781 8598658 8648258 9141987 9134066 8919330
5878 8919330 8555192 8513268 8627835 9007542 9141595 9259257 9215467 9034650 8799952 8471927
5868 8471927 8688801 8625628 8494041 8505780 8401305 8243404 7968285 7556571 7665515 7964999
$$ packed form
5940G411234j49356l7530P0788K42301J63994k82808m95915k97790M9439K49198
5930F923555M8645j27677k488K49802Q0000j14109P1569k30935l0756Q630j77168
5919F699068K04291J41809l12890n2463k13070N9600J3541j78006L08923L84933
5909G055736L6662J72057k74057m11374K55175j91979K98353L38669J05514l5847
5899G348909j92877k13419K11265O3186k26850j64947J86181M13078J90985K2397
5889G637908J32459K246r9254K96667K30888K98867R8877M9600M93729p921k14736
5878H919330l64138m1924J14567L79707J34053J17662m3790j80817k34698l28025
5868H471927K16874o3173j31587J1739j04475j57901k75119m11714J08944K99484
$$ plain form
5858 7964999 8237013 8578890 8588462 8549433 8635998 8642966 8669532 8754645 8696750 8687618 8632009 8916771
5846 8916771 8996119 8914241 8938674 8922206 9083953 9470828 9934377 9921510 10058644 10102802 9928030
5835 9928030 9834255 9832305 9802276 9841309 9929286 10193867 10382432 10454897 10584117 10808555 11372255
5824 11372255 11792953 11816141 11817728 11671107 11844834 12069244 12363390 12780468 13055443 13074725
5814 13074725 13308699 13562513 13875861 14082634 14032300 14213571 14407196 14557009 14319225 14029075
5804 14029075 13765012 13611838 13316633 13240887 13195080 12852565 12608707 12427039 12202628 12207159
5794 12207159 11849095 11318441 11162742 11231235 11360227 11142093 10834687 10678773 10495244 10183837
5784 10183837 10209668 10136861 10022863 10147839 10182136 10312036 10514328 10308478 10057001 10059194
$$ packed form
5858G964999K72014L41877R572l9029Q6565O968K6566Q5113n7895r132n5609K84762
5846H916771P9348q1878K4433j6468J61747L86875M63549j2867J37134M4158j74772
5835I928030r3775j950l0029L9033Q7977K64581J88565P2465J29220K24438N63700
5824A1372255M20698K3188J587j46621J73727K24410K94146M17078K74975J9282
5814A3074725K33974K53814L13348K06773n0334J81271J93625J49813k37784k90150
5804A4029075k64063j53174k95205p5746m5807l42515k43858j81668k24411M531
5794A2207159l58064n30654j55699O8493J28992k18134l07406j55914j83529l11407
5784A0183837K5831p2807j13998J24976L4297J29900K02292k05850k51477K193
$$ plain form
5774 10059194 9958798 10132374 10227562 10173764 10332047 10430436 10443225 10642068 10912641 11241526
5764 11241526 11826804 11980174 12429808 12812638 12801666 12898169 13192213 13577848 14103169 14217490
5754 14217490 14387528 14787304 14936558 15229358 15528716 15733589 15912491 15871017 15606402 15563455
5744 15563455 15548967 15506498 15411659 15377139 15505958 15597047 15648369 15902507 16158910 16348410
5734 16348410 16600554 16847372 16785578 16639758 16624137 16691568 16658876 16532922 16338770 16336047
5724 16336047 16306139 16123115 16174621 16400893 16535018 16487371 16628210 16653262 16748653 16954588
5714 16954588 17244448 17384017 17464592 17673619 17417343 17367350 17489405 17698326 17895544 17865112
5704 17865112 17554572 17534622 17168834 16909925 17092858 17268577 17641928 17718051 17573091 17796706
$$ packed form
5774A0059194j00396J73576R5188n3798J58283R8389J2789J98843K70573L28885
5764A1241526N85278J53370M49634L82830j0972R6503K94044L85635N25321J14321
5754A4217490J70038L99776J49254K92800K99358K04873J78902m1474k64615m2947
5744A5563455j4488m2469r4839l4520J28819R1089N1322K54138K56403J89500
5734A6348410K52144K46818o1794j45820j5621O7431l2692j25954j94152k723
5724A6336047k9908j83024N1506K26272J34125m7647J40839K5052R5391K05935
5714A6954588K89860J39569Q0575K09027k56276m9993J22055K08921J97218l0432
5704A7865112l10540j9950l65788k58909J82933J75719L73351P6123j44960K23615
$$ plain form
5694 17796706 18103579 17812994 17822912 17969479 18471175 18879655 18819017 18818751 18810502 18746231 18461540
5683 18461540 18251423 18274182 18566578 18340535 18053952 18132094 18363917 18527175 18591813 18835412
5673 18835412 19168053 19706024 19847032 19867845 19933207 20127029 20229139 20040239 20070835 20262974
5663 20262974 20327394 20152837 20217947 20868681 21449680 22015147 22561323 23216235 24008060 24402145
5653 24402145 24742291 25307985 25992752 26586852 27016919 27451201 27812731 28076490 28123654 28667110
5643 28667110 29389110 30173719 31108221 31854279 32983847 33909950 34740002 35657123 36485788
5634 36485788 37125914 37610698 37978968 38481641 39251286 40090144 41058198 42117646 43360306
5625 43360306 44739915 45862255 47086413 48633326 49974467 51228559 52393090 53860395
$$ packed form
5694A7796706L06873k90585R918J46567N01696M08480o0638k66q249o4271k84691
5683A8461540k10117K2759K92396k26043k86583P8142K31823J63258O4638K43599
5673A8835412L32641N37971J41008K0813O5362J93822J02110j88900L0596J92139
5663B0262974O4420j74557O5110O50734N80999N65467N46176O54912P91825L94085
5653B4402145L40146N65694O84767N94100M30067M34282L61530K63759M7164N43456
5643B8667110P22000P84609R34502P46058J129568R26103Q30052R17121Q28665
5634C6485788O40126M84784L68270N02673P69645Q38858R68054J059448J242660
5625D3360306J379609J122340J224158J546913J341141J254092J164531J467305
$$ plain form
5617 53860395 55662124 57445949 59503067 62018214 64762400 67785471 71203428 75225184
5609 75225184 80424976 86016798 92432644 99612153 107338313 115801463 124800481 134318208
5601 134318208 144538949 155755545 167646641 179845077 192107289 204289984 214980590
5594 214980590 223926802 230986570 236218566 239801251 241989855 242873023 242532719 240844092
5586 240844092 237284183 232165719 225551598 217978695 209907128 201330844 192791410 183776070
5578 183776070 174417431 164908305 155608313 146767406 138562062 130630878 122862323 115809697
5570 115809697 108861420 102371398 96314781 90790534 85660902 80964712 76652472 72637059
5562 72637059 68925328 65463234 62024830 59094103 56550044 54102205 51574626 49246598
$$ packed form
5617E3860395J801729J783825K057118K515147K744186L023071L417957M021756
5609G5225184N199792N591822O415846P179509P726160Q463150Q999018R517727
5601A34318208J0220741J1216596J1891096J2198436J2262212J2182695J0690606
5594B14980590Q946212P059768N231996L582685K188604Q83168l40304j688627
5586B40844092l559909n118464o614121p572903q071567q576284q539434r015340
5578A83776070r358639r509126r299992q840907q205344p931184p768555p052626
5570A15809697o948277o490022o056617n524247n129632m696190m312240m015413
5562G2637059l711731l462094l438404k930727k544059k447839k527579k328028
$$ plain form
5554 49246598 46950106 44956806 43061527 41431041 40140775 38607306 37260618 35808113
5546 35808113 34373413 33207944 31909029 30966751 30380738 29585001 28801435 28232178 27520854
5537 27520854 27054949 26646897 26334319 26186197 25926286 25619154 25257695 24817489 24617041
5528 24617041 24184214 23506578 23089415 22738855 22826706 22810478 22885772 22920052 22881348 22512387
5518 22512387 22171906 22109135 22256427 22570138 22470912 22451860 22391712 22208959 21828161 21554192
5508 21554192 21764885 21936853 21804743 21344807 21099222 20840118 20748045 20474172 20150845 20023422
5498 20023422 19623096 18961702 18686904 18415332 18274575 17890729 17300575 16821233 16647044
5489 16647044 16112696 15666573 15673735 15808748 15928402 15721597 15321013 15011412 14675717 14188685
$$ packed form
5554D9246598k296492j993300j895279j630486j290266j533469j346688j452505
5546C5808113j434700j165469j298915r42278n86013p95737p83566n69257p11324
5537B7520854m65905m08052l12578j48122k59911l07132l61459m40206k00448
5528B4617041m32827o77636m17163l50560Q7851j6228P5294L4280l8704l68961
5518B2512387l40481o2771J47292L13711r9226j9052o0148j82753l80798k73969
5508B1554192K10693J71968j32110m59936k45585k59104r2073k73873l23327j27423
5498B0023422m00326o61394k74798k71572j40757l83846n90154m79342j74189
5489A6647044n34348m46123P162J35013J19654k06805m00584l09601l35695m87032
$$ plain form
5479 14188685 13877575 13718664 13792146 13499949 13165499 12817310 12795936 12762509 12621839 12623352
5469 12623352 12741677 13000557 12807133 12282868 11965979 11680843 11321538 11257253 11184032 11429409
5459 11429409 11603288 11474046 11366983 11612833 11621958 11390321 11221857 11092063 11239515 11234319
5449 11234319 11386617 11234686 11006554 10936425 10813730 10807477 11117369 11164242 11092631 11198011
5439 11198011 11199952 11159745 10988355 10651978 10600216 10591655 10441791 10601985 10339810 10108219
5429 10108219 10036296 9800528 9668814 9669227 9783633 9739489 9805423 9798224 9941068 9730841 9501692
5418 9501692 9537643 9328492 9085289 9134283 9175302 9080065 8842730 8616021 8450321 8156132
5408 8156132 7891414 7846784 7998181 8163254 8279462 8134552 7885541 7775258 7622247 7725578
$$ packed form
5479A4188685l11110j58911P3482k92197l34450l48189k1374l3427j40670J513
5469A2623352J18325K58880j93424n24265l16889k85136l59305o4285p3221K45377
5459A1429409J73879j29242j07063K45850R125k31637j68464j29794J47452n196
5449A1234319J52298j51931k28132p0129j22695o253L09892M6873p1611J05380
5439A1198011J941m0207j71390l36377n1762q561j49864J60194k62175k31591
5429A0108219p1923k35768j31714M13J14406m4144O5934p199J42844k10227k29149
5418I501692L5951k09151k43203M8994M1019r5237k37335k26709j65700k94189
5408H156132k64718m4630J51397J65073J16208j44910k49011j10283j53011J03331
$$ plain form
5398 7725578 7926968 7884696 8021617 8080353 7787588 7730537 7580743 7652635 7938777 8121967
5388 8121967 8542701 8746883 8856616 8828945 8925244 8967848 8911611 8970499 9013193 9241659 9370976
5377 9370976 9679972 9761949 9815001 9752299 9719035 9522706 9402704 9266230 8996319 8778262
5367 8778262 8638244 8503295 8410084 8387466 8471039 8612930 8636193 8798127 8861918 8754215
5357 8754215 8469603 8374349 8352616 8266766 7954989 7826148 7735692 7650933 7661820 7519782 7166272
5346 7166272 7235653 7299925 7151230 7254424 7270417 7058704 6919486 6706897 6939287 7265150
5336 7265150 7335362 7217068 6914765 6600896 6481734 6319970 6352123 6634313 6850893 6814172
5326 6814172 6812867 6804183 6807647 6995481 7196108 7533894 7833834 7677098 7300038 6812413 6531835
$$ packed form
5398G725578K01390m2272J36921N8736k92765n7051j49794P1892K86142J83190
5388H121967M20734K04182J09733k7671R6299M2604n6237N8888M2694K28466J29317
5377I370976L08996Q1977N3052o2702l3264j96329j20002j36474k69911k18057
5367H778262j40018j34949r3211k2618Q3573J41891K3263J61934O3791j07703
5357H754215k84612r5254k1733q5850l11777j28841r0456q4759J0887j42038l53510
5346G166272O9381O4272j48695J03194J5993k11713j39218k12589K32390L25863
5336G265150P0212j18294l02303l13869j19162j61764L2153K82190K16580l6721
5326F814172j305q684L464J87834K00627L37786K99940j56736l77060m87625k80578
$$ plain form
5315 6531835 6623120 6638157 6909076 7124436 7205079 7225962 7259803 7090300 7032459 7003096 7114908
5304 7114908 7114068 7186907 7088901 6884215 7036873 7074393 7186224 7147650 7333117 7580256 7758918
5293 7758918 7812486 7806035 7669486 7442342 7120498 7050811 7215991 7228606 7406435 7508173
5283 7508173 7630548 7744463 7759660 7599511 7667157 7955878 8113886 8120822 7960682 7783106
5273 7783106 7403593 7081221 6919948 7125566 7252384 7135392 7362181 7622024 7696749 7523329
5263 7523329 7285670 6938342 7117053 7182812 7115955 7160907 6899830 6662893 6474892 6428040
5253 6428040 6674555 7022655 6959373 6916947 6954814 7211337 7081457 6729347 6431580 6545155
5243 6545155 6558093 6513299 6502011 6500686 6820878 6610316 6764071 6985602 7152183 7191715 6903409
$$ packed form
5315F531835R1285J5037K70919K15360Q0643K0883L3841j69503n7841k9363J11812
5304G114908q40P2839r8006k04686J52658L7520J11831l8574J85467K47139J78662
5293G758918N3568o451j36549k27144l21844o9687J65180J2615J77829J01738
5283G508173J22375J13915J5197j60149O7646K88721J58008O936j60140j77576
5273G783106l79513l22372j61273K05618J26818j16992K26789K59843P4725j73420
5263G523329k37659l47328J78711O5759o6857M4952k61077k36937j88001m6852
5253F428040K46515L48100o3282m2426L7867K56523j29880l52110k97767J13575
5243F545155J2938m4794j1288j325L20192k10562J53755K21531J66581L9532k88306
$$ plain form
5232 6903409 7039222 7347919 7754185 7530634 7397593 7372162 7345562 7422942 7270407 7182547
5222 7182547 7455907 7582550 7500999 7736965 7866904 7819223 7709165 7768233 7732444 8029187
5212 8029187 8000927 8155939 8042136 8056304 8374359 8215234 8301394 8327685 8434000 8653356
5202 8653356 8755279 8691342 8626091 8470576 8328703 8517275 8727497 8714418 8967176 9390116
5192 9390116 9489124 9826757 10173539 10508282 10606348 10852306 11015958 11263586 11430265 11516187
5182 11516187 11720593 11371506 11280366 11114145 11194623 11364274 11541668 11684107 11635735 11421207
5172 11421207 11350408 11629713 11845966 12322176 12507932 12541885 12516385 12419644 12370367 12457766
5162 12457766 12422821 12485202 12576793 12772722 13047573 13184637 13105747 13251358 13588753 13576175
$$ packed form
5232F903409J35813L08697M06266k23551j33041k5431k6600P7380j52535q7860
5222G182547K73360J26643q1551K35966J29939m7681j10058N9068l5789K96743
5212H029187k8260J55012j13803J4168L18055j59125Q6160K6291J06315K19356
5202H653356J01923o3937o5251j55515j41873J88572K10222j3079K52758M22940
5192I390116R9008L37633L46782L34743R8066K45958J63652K47628J66679Q5922
5182A1516187K04406l49087r1140j66221Q0478J69651J77394J42439m8372k14528
5172A1421207p0799K79305K16253M76210J85756L3953k5500r6741m9277Q7399
5162A2457766l4945O2381R1591J95929K74851J37064p8890J45611L37395j2578
$$ plain form
5152 13576175 13677343 13739106 14233993 14442669 14514635 14764686 14859278 14892246 14954357 15116142
5142 15116142 15267917 15977035 15965731 15806296 15761456 15459973 15643704 15717826 16022397 16440147
5132 16440147 16547143 16272182 16425525 16252851 16194145 16194695 15850386 16072632 16092630 15948561
5122 15948561 15709961 15499627 15393596 15610435 15567547 15745178 15955742 15965596 15963913 16110026
5112 16110026 16061735 16257321 16487045 16395302 16797792 16698166 16777588 16665400 16514883 16543967
5102 16543967 16666982 16488487 16412657 16379401 16205406 16291242 16286386 16362666 16176579 15810800
5092 15810800 15559715 15534025 15339712 15437166 15423416 15480517 15424467 15457369 15496217 15332819 15521302
5081 15521302 15539637 15739512 15700821 15510046 15240339 14975036 14765600 14780452 14808766 14895422
$$ packed form
5152A3576175J01168O1763M94887K08676P1966K50051R4592L2968O2111J61785
5142A5116142J51775P09118j1304j59435m4840l01483J83731P4122L04571M17750
5132A6440147J06996k74961J53343j72674n8706N50l44309K22246J9998j44069
5122A5948561k38600k10334j06031K16839m2888J77631K10564R854j683J46113
5112A6110026m8291J95586K29724r1743M02490r9626P9422j12188j50517K9084
5102A6543967J23015j78495p5830l3256j73995Q5836m856P6280j86087l65779
5092A5810800k51085k5690j94313R7454j3750N7101n6050L2902L8848j63398J88483
5081A5521302J8335J99875l8691j90775k69707k65303k09436J4852K8314Q6656
$$ plain form
5071 14895422 15053052 15035711 15105119 14992365 14656061 14615532 14672324 14545889 14550674 14573576 14267868
5060 14267868 14293422 14013648 14167366 14378516 14331861 14279841 14377271 14510964 14911319 14880998
5050 14880998 14723956 14953369 15000897 15383765 15680900 16034849 16174595 16171000 15990473 15995773
5040 15995773 16071548 16135395 16206956 16140727 16418053 16611256 16821214 17021650 17203769 17332160
5030 17332160 17431138 17429943 17426486 17428950 17240928 17180980 17054795 17445444 17565250 17659202 17630198
5019 17630198 17901000 18076739 18483384 18813129 19026746 19391085 19413258 19443949 19630215 20059881
5009 20059881 20315133 20692079 21011171 21400076 21713239 22091757 22269811 22269872 22583166 22731131
4999 22731131 22895294 22951609 22932009 22728802 22565952 22545957 22597606 22872926 23057130 23346047
$$ packed form
5071A4895422J57630j7341O9408j12754l36304m0529N6792j26435M785K2902l05708
5060A4267868K5554k79774J53718K11150m6655n2020R7430J33693M00355l0321
5050A4880998j57042K29413M7528L82868K97135L53949J39746l595j80527N300
5040A5995773P5775O3847P1561o6229K77326J93203K09958K00436J82119J28391
5030A7332160R8978j195l457K464j88022n9948j26185L90649J19806R3952k9004
5019A7630198K70802J75739M06645L29745K13617L64339K2173L0691J86266M29666
5009B0059881K55252L76946L19092L88905L13163L78518J78054O1L13294J47965
4999B2731131J64163N6315j9600k03207j62850j9995N1649K75320J84204K88917
$$ plain form
4989 23346047 23894787 24300069 24653101 24711730 24927058 25246555 25498891 25772683 26222434 26725889
4979 26725889 27072541 27307120 27458917 27536869 27795715 28126046 28393779 28766365 29029355 29593348
4969 29593348 30009075 30494165 31031423 31538791 32320168 33350101 34196577 35175950 36251387
4960 36251387 37049360 37718064 38232199 38414136 38862923 39478396 40012695 40964380 41450250
4951 41450250 42056776 42857388 43254610 43787675 44818163 45619117 46676073 47730376 48466702
4942 48466702 49412520 50015957 50751640 52088182 53456823 54818754 56553267 57975904 60055398
4933 60055398 62296027 64124728 66644139 69180080 72008540 75596788 79077396 83061902
4925 83061902 87993008 93016220 98863128 105598691 112916324 121532768 131193374 141916579
$$ packed form
4989B3346047N48740M05282L53032N8629K15328L19497K52336K73792M49751N03455
4979B6725889L46652K34579J51797P7952K58846L30331K67733L72586K62990N63993
4969B9593348M15727M85090N37258N07368P81377J029933Q46476R79373J075437
4960C6251387P97973O68704N14135J81937M48787O15473N34299R51685M85870
4951D1450250O06526Q00612L97222N33065J030488Q00954J056956J054303P36326
4942D8466702R45818O03437P35683J336542J368641J361931J734513J422637K079494
4933F0055398K240629J828701K519411K535941K828460L588248L480608L984506
4925H3061902M931106N023212N846908O735563P317633Q616444R660606J0723205
$$ plain form
4917 141916579 154661178 168904188 184491623 202040249 220513166 239746024 258346207
4910 258346207 274721259 288233472 297705507 302181658 301324120 296039098 287936868 278185563
4902 278185563 267133277 255101698 243165206 231094243 219081053 207204793 195517399
4895 195517399 184415590 173907903 163786614 154644343 145960241 137556661 130090199 122850310
4887 122850310 116257021 110279169 104570070 99438021 95064763 90863722 87126509 83686755
4879 83686755 80208492 77164482 74658555 72109516 70095767 68302800 66421212 65025619
4871 65025619 63687479 62937926 62386601 61711586 61293682 60641072 60033732 60096245 60477543
4862 60477543 60927768 61717921 61898324 61898381 62260432 62218348 62349764 62769223 62993743 63593467
$$ packed form
4917A41916579J2744599J4243010J5587435J7548626J8472917J9232858J8600183
4910B58346207J6375052J3512213R472035M476151q57538n285022q102230r751305
4902B78185563j1052286j2031579j1936492j2070963j2013190j1876260j1687394
4895A95517399j1101809j0507687j0121289r142271q684102q403580p466462p239889
4887A22850310o593289n977852n709099n132049m373258m201041l737213l439754
4879H3686755l478263l044010k505927k549039k013749j792967j881588j395593
4871F5025619j338140p49553n51325o75015m17904o52610o07340O2513L81298
4862F0477543M50225P90153J80403N7L62051m2084J31416M19459K24520N99724
$$ plain form
4852 63593467 63813213 64095085 64817070 65531881 66343179 67265278 68273113 69256877 70337967
4843 70337967 70965610 72224162 73515413 74573044 75635744 76390703 76946169 77870942 78598220
4834 78598220 79457121 80514489 81652383 82937699 84091114 85550435 87950526 90620621
4826 90620621 93017053 95304588 96691462 97099155 96701363 95368582 93794297 92681520
4818 92681520 91295493 90569280 90149991 89547340 89358279 88972418 88645975 89077854 89460528
4809 89460528 90032331 91220408 92578534 94002095 95249880 95874277 96000916 95869555 94908601
4800 94908601 94165159 92889278 91090921 89394439 87041906 84802893 82824940 80958535
4792 80958535 79469437 78506669 77246298 76272219 75100998 73408416 72076564 70853583
$$ packed form
4852F3593467K19746K81872P21985P14811Q11298R22099J007835R83764J081090
4843G0337967O27643J258552J291251J057631J062700P54959N55466R24773P27278
4834G8598220Q58901J057368J137894J285316J153415J459321K400091K670095
4826I0620621K396432K287535J386874M07693l97792j332781j574285j112777
4818I2681520j386027p26213m19289o02651j89061l85861l26443M31879L82674
4809H9460528N71803J188077J358126J423561J247785O24397J26639j31361r60954
4800I4908601p43442j275881j798357j696482k352533k239013j977953j866405
4792H0958535j489098r62768j260371r74079j171221j692582j331852j222981
$$ plain form
4784 70853583 69481440 68638392 68156762 68356960 68608199 68697539 68985007 69230966 69827071
4775 69827071 70698676 72097407 73586042 75279330 76506818 77605530 78646777 79437569
4767 79437569 80308964 80990564 81968495 82966023 83491804 83310982 82938259 82479199 82246494
4758 82246494 82185209 82303182 82854969 83660767 84455267 85433065 86331782 87526726 88781791
4749 88781791 90164307 91674649 93065978 94643589 95534182 96171894 96321425 96199002 96067017
4740 96067017 95727410 95775677 95828768 95648355 95039596 93847644 92513676 91260689 90424188
4731 90424188 89736555 89249881 88959891 88619635 87954779 87225558 86964169 86913616 86931769 87258974
4721 87258974 87244405 87060396 86882743 86454524 86290129 86030718 85969668 85981545 85859092 85733108
$$ packed form
4784G0853583j372143q43048m81630K00198K51239Q9340K87468K45959N96105
4775F9827071Q71605J398731J488635J693288J227488J098712J041247P90792
4767G9437569Q71395O81600R77931R97528N25781j80822l72723m59060k32705
4758H2246494o1285J17973N51787Q05798P94500R77798Q98717J194944J255065
4749H8781791J382516J510342J391329J577611Q90593O37712J49531j22423j31985
4740I6067017l39607M8267N3091j80413o08759j191952j333968j252987q36501
4731I0424188o87633m86674k89990l40256o64856p29221k61389n0553J8153L27205
4721H7258974j4569j84009j77653m28219j64395k59411o1050J1877j22453j25984
$$ plain form
4711 85733108 85862474 86082204 86446148 86952591 87659053 88853193 90058540 91457474 93707326
4702 93707326 96670617 99597318 103312178 107408786 112185293 118423445 125869768 135289250
4694 135289250 147228900 163227057 184645708 212351749 242066233 268085768 291587722
4687 291587722 311362841 321945200 314558154 295948532 279942010 267517236 257627465
4680 257627465 250319508 245560007 242007699 236617998 226457199 214087534 202721698 192845330
4672 192845330 184745334 178133747 172014151 166232602 160931204 155895140 151760970 148479873
4664 148479873 146506612 146015051 146125794 147173933 148739129 151563918 155798835 160989593
4656 160989593 166831726 173761119 181519419 190309279 199526075 209956942 223358875 240057442
$$ packed form
4711H5733108J29366K19730L63944N06443P06462J194140J205347J398934K249852
4702I3707326K963291K926701L714860M096608M776507O238152P446323R419482
4694A35289250J1939650J5998157K1418651K7706041K9714484K6019535K3501954
4687B91587722J9775119J0582359p387046j8609622j6006522j2424774r889771
4680B57627465p307957m759501l552308n389701j0160799j2369665j1365836r876368
4672A92845330q099996o611587o119596n781549n301398n036064m134170l281097
4664A48479873j973261m91561J10743J048139J565196K824789M234917N190758
4656A60989593N842133O929393P758300Q789860R216796J0430867J3401933J6698567
$$ plain form
4648 240057442 260005543 281913225 304537225 325843390 343639777 355410781 359673061
4641 359673061 356309788 348763230 340810937 334290438 330649607 330183517 333211963 339668764
4633 339668764 347816195 356155204 362507081 365101896 362099981 351809049 336271146 318929844
4625 318929844 302173225 287073091 272952256 259432447 246581050 234209382 222453326
4618 222453326 211702527 201258963 191324440 181813138 172438364 163620910 155397337 147741916
4610 147741916 140729204 134429871 128958196 124218984 120284282 117056154 114325435 112058523
4602 112058523 110333618 108903807 108084674 107455200 106807268 105890923 104077676 101789749 99011854
4593 99011854 95893645 92673130 89530934 86287801 83538466 80575147 77881493 75459682
$$ packed form
4648B40057442J9948101K1907682K2624000K1306165J7796387J1771004M262280
4641C59673061l363273p546558p952293o520499l640831m66090L028446O456801
4633C39668764Q147431Q339009O351877K594815l001915j0290932j5537903j7341302
4625C18929844j6756619j5100134j4120835j3519809j2851397j2371668j1756056
4618B22453326j0750799j0443564r934523r511302r374774q817454q223573p655421
4610A47741916p012712o299333n471675m739212l934702l228128k730719k266912
4602A12058523j724905j429811q19133o29474o47932r16345j813247k287927k777895
4593I9011854l118209l220515l142196l243133k749335k963319k693654k421811
$$ plain form
4585 75459682 72993769 70844910 69112872 67321657 65771638 64125436 62239747 61255058
4577 61255058 59932763 59008205 58262258 57158974 56724334 56566077 56480589 56845252 56865124
4568 56865124 56934141 57400505 57785113 58229417 58547883 58589269 58643134 58525229 57870348 57318597
4558 57318597 56168231 54990015 53658016 52477731 51841997 51021881 50172682 49312789 48264251
4549 48264251 47408413 47161392 46667340 46559152 46853520 47107444 47856186 48847304 50082660
4540 50082660 52060647 54240964 56528034 58776089 60626684 62210019 62332958 61468030
4532 61468030 60658866 60005598 59424213 58956746 57813382 56253257 54339335 52424913 50719501
4523 50719501 49041368 47632612 46152546 44885124 43697767 42372425 40980241 39666582
$$ packed form
4585G5459682k465913k148859j732038j791215j550019j646202j885689r84689
4577F1255058j322295r24558p45947j103284m34640j58257q5488L64663J9872
4568E6865124O9017M66364L84608M44304L18466M1386N3865j17905o54881n51751
4558E7318597j150366j178216j331999j180285o35734q20116q49199q59893j048538
4549D8264251q55838k47021m94052j08188K94368K53924P48742R91118J235356
4540E0082660J977987K180317K287070K248055J850595J583335J22939q64928
4532F1468030q09164o53268n81385m67467j143364j560125j913922j914422j705412
4523E0719501j678133j408756j480066j267422j187357j325342j392184j313659
$$ plain form
4515 39666582 38859149 38089429 37343972 36645906 35717874 34808505 34035894 33723014 33438060
4506 33438060 33630500 34078188 34240901 34837044 35468263 36133084 37182672 38218094 39923148
4497 39923148 42145020 44577822 47519695 50195853 52550807 54380002 55376357 55222391
4489 55222391 53913144 51910738 49747866 47663132 45478266 43814246 41711969 39591147
4481 39591147 37589298 35927873 34256971 32583931 30874363 29511465 28273852 26818897
4473 26818897 25551719 24414186 23487521 22590843 21847147 21096584 20476735 19845841 19154142
4464 19154142 18486511 18245386 17992087 17919799 17703476 17314381 17072314 16794696 16584823 16381415
4454 16381415 16630916 16644883 16511348 16291478 16036808 15944095 15588719 15573376 15418589 15269335
$$ packed form
4515C9666582q07433p69720p45457o98066r28032r09369p72611l12880k84954
4506C3438060J92440M47688J62713N96143O31219O64821J049588J035422J705054
4497C9923148K221872K432802K941873K676158K354954J829195R96355j53966
4489E5222391j309247k002406k162872k084734k184866j664020k102277k120822
4481C9591147k001849j661425j670902j673040j709568j362898j237613j454955
4473B6818897j267178j137533r26665q96678p43696p50563o19849o30894o91699
4464A9154142o67631k41125k53299p2288k16323l89095k42067k77618k09873k03408
4454A6381415K49501J3967j33535k19870k54670r2713l55376j5343j54787j49254
$$ plain form
4444 15269335 15239674 14870834 14563770 14235721 14167289 14172168 13896525 13736450 13818994 13631918
4434 13631918 13379256 13280390 13014827 12800206 12674574 12368370 12218179 12092881 11868040 11955259
4424 11955259 11739838 11850970 11862740 11758733 11694148 11636471 11947737 12374623 12565091 12690314
4414 12690314 12953286 12829953 13211603 13514106 13925629 14301780 14138176 13886241 13788640 13525031
4404 13525031 13226254 13508728 13305559 13267589 13250718 13127600 13034837 12629964 12513983 12626562
4394 12626562 12407148 12429643 12027426 11510205 11095451 10502775 10396292 10108807 9996058 9674169
4384 9674169 9559406 9616087 9916944 10013020 9706358 9628974 9312999 9335690 9019647 8839798
4374 8839798 8924378 9021512 9089560 9146541 8930110 8913040 8648348 8318564 8511290 8663465
$$ packed form
4444A5269335k9661l68840l07064l28049o8432M879k75643j60075Q2544j87076
4434A3631918k52662r8866k65563k14621j25632l06204j50191j25298k24841Q7219
4424A1955259k15421J11132J1770j04007o4585n7677L11266M26886J90468J25223
4414A2690314K62972j23333L81650L02503M11523L76151j63604k51935r7601k63609
4404A3525031k98777K82474k03169l7970j6871j23118r2763m04873j15981J12579
4394A2626562k19414K2495m02217n17221m14754n92676j06483k87485j12749l21889
4384I674169j14763N6681L00857R6076l06662p7384l15975K2691l16043j79849
4374H839798Q4580R7134O8048N6981k16431j7070k64692l29784J92726J52175
$$ plain form
4364 8663465 8899497 8984379 8659996 8434722 8550952 8358155 8279477 8393500 8448243 8538598
4354 8538598 8473302 8278963 7973150 7517218 7086536 7146005 7206498 7479303 7236328 6661180
4344 6661180 6636274 6426818 6615966 6461102 6666605 6743946 7088476 7239590 6933804 6729359
4334 6729359 6546379 6696977 6984161 7083226 7214791 7472082 7372616 7260277 7466940 7587105
4324 7587105 7304851 7235512 6780847 6517291 6609762 6253403 6103651 5754728 5533588 5385231
4314 5385231 5167251 4828124 4875713 4815123 4806659 4808070 4667209 4568719 4264937 3755664 3687851
4303 3687851 3847979 3731416 3824006 3332744 3164228 3114239 2946501 2841352 2977812 3205013
4293 3205013 3652821 3841530 3463640 3285838 3161865 2924428 2883826 3267014 3555480 3734350
$$ packed form
4364H663465K36032Q4882l24383k25274J16230j92797p8678J14023N4743R0355
4354H538598o5296j94339l05813m55932m30682N9469O0493K72805k42975n75148
4344F661180k4906k09456J89148j54864K05503P7341L44530J51114l05786k04445
4334F729359j82980J50598K87184R9065J31565K57291r9466j12339K06663J20165
4324G587105k82254o9339m54665k63556R2471l56359j49752l48923k21140j48357
4314E385231k17980l39127M7589o0590q464J411j40861r8490l03782n09273o7813
4303C687851J60128j16563R2590m91262j68516m9989j67738j05149J36460K27201
4293C205013M47808J88709l77890j77802j23973k37437m0602L83188K88466J78870
$$ plain form
4283 3734350 3495160 3150957 3063308 2922936 2936815 2685515 2727341 2821308 2798565 2445464
4273 2445464 2091380 2228149 2248345 2396032 2727331 2802168 3021659 3035349 2815971 2935363
4263 2935363 3070698 3251919 2998810 2760864 2953580 3224477 3235416 3044817 3034345 2894882
4253 2894882 2999232 2932812 2637287 2657144 2710432 2661124 2516020 2522245 2401875 2272936 2302069
4242 2302069 2303463 2620808 2698028 2406391 2391091 2540914 2423290 2405859 2435956 2370268 2375445
4231 2375445 2234584 2119190 2146367 2125124 2146275 2231415 2182547 2187682 2204151 2089615 2334158
4220 2334158 2315865 2291126 2537399 2400386 2307815 2524308 2578044 2781206 2868718 2811236 2734530
4209 2734530 2596192 2565683 2477603 2287231 2200115 2203722 1997342 2004693 2100360 1859229 2083775
$$ packed form
4283C734350k39190l44203q7649j40372J3879k51300M1826R3967k2743l53101
4273B445464l54084J36769K0196J47687L31299P4837K19491J3690k19378J19392
4263B935363J35335J81221k53109k37946J92716K70897J0939j90599j0472j39463
4253B894882J04350o6420k95525J9857N3288m9308j45104O225j20370j28939K9133
4242B302069J394L17345P7220k91637j5300J49823j17624j7431L0097o5688N177
4231B375445j40861j15394K7177k1243K1151Q5140m8868N135J6469j14536K44543
4220B334158j8293k4739K46273j37013r2571K16493N3736K03162Q7512n7482p6706
4209B734530j38338l0509q8080j90372q7116L607k06380P351R5667k41131K24546
$$ plain form
4198 2083775 2000740 2016581 2201925 2139028 2156223 2273292 2341109 2217481 2349014 2137905
4188 2137905 2098848 2216074 2327607 2276540 2329686 2385710 2387648 2045821 2011302 2089497 2210792
4177 2210792 2339526 2426752 2449567 2642148 3032817 3057523 3216053 3079009 3180493 3222950
4167 3222950 3233231 3009434 2879317 2968657 2735330 2776907 2798420 2901731 2898038 2850052 2893152
4156 2893152 3147762 3139906 3029641 3031919 3343240 3450198 3755757 3847021 4140327 4269191
4146 4269191 4234947 4596292 4685613 4920136 4569118 4130603 3948098 3701396 3570860 3677293
4136 3677293 3571460 3365051 3364251 3303862 3498746 3799689 3619464 3740333 3831012 3461809
4126 3461809 3336244 3034800 2854499 3036738 3016941 3220411 3397179 3369379 3506767 3585892
$$ packed form
4198B083775q3035J5841J85344o2897J7195J17069O7817j23628J31533k11109
4188B137905l9057J17226J11533n1067N3146N6024J938l41827l4519P8195J21295
4177B210792J28734Q7226K2815J92581L90669K4706J58530j37044J01484M2457
4167C222950J0281k23797j30117Q9340k33327M1577K1513J03311l693m7986M3100
4156B893152K54610p856j10265K278L11321J06958L05559R1264K93306J28864
4146D269191l4244L61345Q9321K34523l51018m38515j82505k46702j30536J06433
4136C677293j05833k06409q00o0389J94884L00943j80225J20869R0679l69203
4126C461809j25565l01444j80301J82239j9797K03470J76768k7800J37388P9125
$$ plain form
4116 3585892 3508612 3753437 3866227 3816487 3847616 3572428 3258423 3208254 3133993 3185360 3355736
4105 3355736 3316054 3608300 3635089 3504092 3734890 3440195 3342307 3495277 3631747 3458092
4095 3458092 3195976 2786185 2774231 3147365 3147818 3460521 3596701 3514990 3543080 3630107 3597491
4084 3597491 3975482 3852730 3504347 3167037 3147728 3204190 3017014 2913081 2792744 2870933
4074 2870933 2602434 2452967 2089226 2096925 2093483 2374680 2708061 2769354 2594849 2077168
4064 2077168 1746096 1686593 2088295 2268006 2353374 2154397 2231043 2269925 2218005 2298479 2314340
4053 2314340 2462359 2603260 2439320 2379792 2622557 2252303 2049757 1828626 1763456 1842846
4043 1842846 1865011 1753699 2007217 2128682 2089531 2127536 1776211 1680993 1499392 1519257
$$ packed form
4116C585892p7280K44825J12790m9740L1129k75188l14005n0169p4261N1367J70376
4105C355736l9682K92246K6789j30997K30798k94695r7888J52970J36470j73655
4095C458092k62116m09791j1954L73134M53L12703J36180q1711K8090Q7027l2616
4084C597491L77991j22752l48383l37310j9309N6462j87176j03933j20337P8189
4074B870933k68499j49467l63741P699l442K81197L33381O1293j74505n17681
4064B077168l31072n9503M01702J79711Q5368j98977P6646L8882n1920Q0474J5861
4053B314340J48019J40901j63940n9528K42765l70254k02546k21131o5170P9390
4043A842846K2165j11312K53518J21465l9151L8005l51325r5218j81601J9865
$$ plain form
4033 1519257 1553737 1272273 972899 700680 381279 239767 393431 683100 1056765 1409891
4023 1409891 1376928 1462217 1530669 1340279 1513158 1453294 1487405 1410842 1288005 1312780 1394045
4012 1394045 1538501 1431035 1466842 1629724 1739020 1597969 1519059 1379447 1142924 1310852
4002 1310852 967939 600040 554216 571591 699098 783871 1033387 1343073 1512329 1319107
3992 1319107 1160616 1094122 1118072 1052880 925251 973398 739566 418217 350236 163480
3982 163480 335215 441949 652744 755344 897565 1012818 755379 808966 643112 835262
3972 835262 834093 711103 785593 919730 946195 819363 664623 620897 510964 611044 555704
3961 555704 994834 1296094 975365 725071 123029 121897 156236 362362 471921 639125
$$ packed form
4033A519257L4480k81464k99374k72219l19401j41512J53664K89669L73665L53126
4023A409891l2963Q5289O8452j90390J72879n9864L4111p6563j22837K4775Q1265
4012A394045J44456j07466L5807J62882J09296j41051p8910j39612k36523J67928
4002A310852l42913l67899m5824J7375J27507Q4773K49516L09686J69256j93222
3992A319107j58491o6494K3950o5192j27629M8147k33832l21349o7981j86756
3982A63480J71735J06734K10795J02600J42221J15253k57439N3587j65854J92150
3972H35262j169j22990P4490J34137K6465j26832j54740m3726j09933J00080n5340
3961E55704M39130L01260l20729k50294o02042j132L4339K06126J09559J67204
$$ plain form
3951 639125 750259 515751 325105 325892 575127 893568 1300221 1468426 1231190 838972
3941 838972 588376 607727 812077 1032862 974424 917150 684693 470188 536298 908425
3931 908425 793352 709455 594576 294962 337760 596389 290600 462858 318902 47754
3921 47754 272789 63820 317095 493476 374520 643413 843978 469883 411390 343044
3911 343044 366249 638364 537474 168761 141450 -247722 -183774 61795 253366 774398
3901 774398 475874 278700 515622 887765 1038378 1160118 1077888 1120398 957344 704854
3891 704854 471078 306602 223824 210592 199067 205702 334988 420093 304193 235968 629075
3880 629075 806123 972954 1028747 1079727 1225613 1245901 858858 695876 797006 1005279
$$ packed form
3951F39125J11134k34508j90646P87K49235L18441M06653J68205k37236l92218
3941H38972k50596J9351K04350K20785n8438n7274k32457k14505O6110L72127
3931I08425j15073q3897j14879k99614M2798K58629l05789J72258j43956k71148
3921D7754K25035k08969K53275J76381j18956K68893K00565l74095n8493o8346
3911C43044K3205K72115j00890l68713k7311l89172O3948K45569J91571N21032
3901G74398k98524j97174K36922L72143J50613J21740q2230M2510j63054k52490
3891G04854k33776j64476q2778j3232j1525O635J29286Q5105j15900o8225L93107
3880F29075J77048J66831N5793N0980J45886K0288l87043j62982J01130K08273
$$ plain form
3870 1005279 1412049 1706413 1524693 1609418 1293577 1285859 1408385 1586618 1616380 1444697
3860 1444697 1370264 1331895 1241865 1182654 1266009 1179574 1393899 1668539 1689299 1736980 1526814
3849 1526814 1350123 1413890 1250251 1342952 1215020 1188803 1267469 1425685 1705265 1565416
3839 1565416 1495324 1400440 1493249 1609689 1949115 1804500 1578315 1649320 1267083 1594341
3829 1594341 1636919 1633760 1709942 1742738 1736010 1789711 1346717 1272561 1297082 1106514 1171647
3818 1171647 1188863 1444131 1570721 1519041 1611171 1850661 1519705 1381034 1073114 1142909
3808 1142909 1344666 1299624 1118514 1176556 1145934 1034481 1326450 1398341 1899949 2008349
3798 2008349 1882997 1588636 1474493 1427760 1315643 1513627 1509880 1556808 1392726 1301042
$$ packed form
3870A005279M06770K94364j81720Q4725l15841p718J22526J78233K9762j71683
3860A444697p4433l8369r0030n9211Q3355q6435K14325K74640K0760M7681k10166
3849A526814j76691O3767j63639R2701j27932k6217P8666J58216K79580j39849
3839A565416p0092r4884R2809J16440L39426j44615k26185P1005l82237L27258
3829A594341M2578l159P6182L2796o728N3701m42994p4156K4521j90568O5133
3818A171647J7216K55268J26590n1680R2130K39490l30956j38671l07920O9795
3808A142909K01757m5042j81110N8042l0622j11453K91969P1891N01608J08400
3798B008349j25352k94361j14143m6733j12117J97984l747M6928j64082r1684
$$ plain form
3788 1301042 1061047 1225754 1319031 1447378 1434994 1145046 985549 977852 978310 1169414 1455155
3777 1455155 1403015 1422126 1244792 1464334 1623576 1841857 1760463 1444108 1355946 1375777
3767 1375777 1297676 1358307 1514162 1565966 1608220 1492507 1436699 1384847 1607599 1577922 1629589
3756 1629589 1650189 1581963 1523975 1374107 1558392 1923546 2115583 1870951 1695974 1772383
3746 1772383 1901207 1978173 2094232 1895857 1786714 1890903 1663764 1721215 1575879 1489214
3736 1489214 1440118 1755987 2117987 2078534 2066782 1750652 2156611 2556387 2646327 2705953
3726 2705953 2524240 2072732 1932147 1787293 1982600 2312289 2525384 2760900 2808629 2868056
3716 2868056 3099482 3299786 3096499 3316574 3449171 3801820 3937701 3517120 3085950 2996500
$$ packed form
3788A301042k39995J64707R3277J28347j2384k89948j59497p697M58J91104K85741
3777A455155n2140J9111j77334K19542J59242K18281q1394l16355q8162J9831
3767A375777p8101O0631J55855N1804M2254j15713n5808n1852K22752k9677N1667
3756A629589K0600o8226n7988j49868J84285L65154J92037k44632j74977P6409
3746A772383J28824P6966J16059j98375j09143J04189k27139N7451j45336q6665
3736A489214m9096L15869L62000l9453j1752l16130M05959L99776Q9940N9626
3726B705953j81713m51508j40585j44854J95307L29689K13095K35516M7729N9427
3716B868056K31426K00304k03287K20075J32597L52649J35881m20581m31170q9450
$$ plain form
3706 2996500 3013447 3297527 3629002 3432387 3627422 3209056 2906642 2959321 3010796 2821573
3696 2821573 2997915 2692909 2753959 3037076 2900624 2910704 2968505 2912708 2950680 3169213
3686 3169213 2749705 3171002 3169165 3405915 3565005 3685275 3848264 3801504 4030437 3975569
3676 3975569 4064852 3723019 3497228 2981857 2791533 2929829 2786346 2768261 2680879 2757900
3666 2757900 2806344 2604979 2354503 2520307 2524670 2425472 1996054 1708960 1545550 1581075
3656 1581075 1610440 1391644 1534865 1568913 1524982 1376040 1440351 1453600 1680708 1542458
3646 1542458 1109575 985571 862797 730542 589240 806588 1064066 1210166 1012401 1004526
3636 1004526 780559 659616 815284 668475 771217 944945 910788 826416 703216 699419
$$ packed form
3706B996500J6947K84080L31475j96615J95035m18366l02414N2679N1475j89223
3696B821573J76342l05006O1050K83117j36452J0080N7801n5797L7972K18533
3686C169213m19508M21297j837K36750J59090J20270J62989m6760K28933n4868
3676C975569Q9283l41833k25791n15371j90324J38296j43483j8085q7382P7021
3666B757900M8444k01365k50476J65804M363r9198m29418k87094j63410L5525
3656A581075K9365k18796J43221L4048m3931j48942O4311J3249K27108j38250
3646A542458m32883j24004j22774j32255j41302K17348K57478J46100j97765p875
3636A004526k23967j20943J55668j46809J02742J73728l4157q4372j23200l797
$$ plain form
3626 699419 955673 602475 399212 583013 717568 909151 913385 694395 605920 643575
3616 643575 621072 1192906 1100682 1123713 930820 543632 677989 581956 538176 645603 722738
3605 722738 668075 1068265 1056205 1079864 1106645 1063802 1293881 1557683 1146212 1066556 1199904
3594 1199904 1242291 1300886 1111905 1162202 1094382 945294 765024 1116828 1248599 1361697
3584 1361697 970994 588245 670669 724155 988904 1126531 1077568 885399 653917 618243
3574 618243 564463 814970 833958 816797 908119 809407 760849 836126 827453 1060361 1428733
3563 1428733 1232285 959357 881716 593333 924544 970735 990248 1536325 1482513 1617083
3553 1617083 1546988 1507353 1760682 1730516 1477222 1442864 1420658 1344505 1268055 873446 900789
$$ packed form
3626F99419K56254l53198k03263J83801J34555J91583M234k18990q8475L7655
3616F43575k2503N71834r2224K3031j92893l87188J34357r6033m3780J07427P7135
3605G22738n4663M00190j2060K3659K6781m2843K30079K63802m11471p9656J33348
3594A199904M2387N8595j88981N0297o7820j49088j80270L51804J31771J13098
3584A361697l90703l82749Q2424N3486K64749J37627m8963j92169k31482l5674
3574F18243n3780K50507J8988j7161R1322r8712m8558P5277q673K32908L68372
3563A428733j96448k72928p7641k88383L31211M6191J9513N46077n3812J34570
3553A617083p0095l9635K53329l0166k53294l4358k2206p6153p6450l94609K7343
$$ plain form
3542 900789 1187349 1360060 1595858 1705611 1882176 2036352 1889500 1521638 1453094 1657754
3532 1657754 1840646 1963006 1956341 1734600 1898546 1945654 1956720 2125458 2420164 2487959
3522 2487959 2504993 2428660 2271433 2652449 2406684 2361804 2443078 2515382 2666236 2569041 2360494
3511 2360494 2673210 3141667 3188656 3495611 3309524 3326486 3473121 3372029 3515657 3631327
3501 3631327 3539495 3362638 2953625 3151697 3637660 3894246 4176220 4442215 4712926 5417592
3491 5417592 5650364 5368718 5646024 5950608 6183869 6725137 7019070 7498711 7657151 7791436
3481 7791436 8115518 8583379 9280260 9745255 9905987 10239305 10532735 10324588 9880416 9365830
3471 9365830 9167750 9181461 8981776 8854306 8595275 8019769 7600633 6908027 6534831 6709925
$$ packed form
3542I00789K86560J72711K35798J09753J76565J54176j46852l67862o8544K04660
3532A657754J82892J22360o665k21741J63946M7108J1066J68738K94706O7795
3522B487959J7034p6333j57227L81016k45765m4880Q1274P2304J50854r7195k08547
3511B360494L12716M68457M6989L06955j86087J6962J46635j01092J43628J15670
3501C631327r1832j76857m09013J98072M85963K56586K81974K65995K70711P04666
3491E417592K32772k81646K77306L04584K33261N41268K93933M79641J58440J34285
3481G791436L24082M67861O96881M64995J60732L33318K93430k08147m44172n14586
3471I365830j98080J3711j99685j27470k59031n75506m19136o92606l73196J75094
$$ plain form
3461 6709925 6920216 7061716 6838875 6678851 6419812 6068035 5783561 5801125 5806000 5752668
3451 5752668 5658653 5237040 5281111 5059097 5201658 5256128 5098284 5508400 5914924 5917038
3441 5917038 5776449 5532971 5273392 5372424 5113485 5115575 5352376 5575597 6002875 6370059
3431 6370059 7172579 8100012 8253023 8272939 8523282 8915898 9024519 8169870 7453468 6993934
3421 6993934 6943532 6710008 6615181 6777918 7226110 7494059 7374815 7419714 7285597 7154384
3411 7154384 6655188 6374932 6641079 6919528 6941730 6646928 6315104 6551283 7171774 7571203
3401 7571203 8227569 9002524 10539029 11769340 12526028 13540495 14288881 13867757 12713061
3392 12713061 11321829 10659805 10670742 10065240 9813230 9780509 9895559 10007316 9615692 8831581
$$ packed form
3461F709925K10291J41500k22841j60024k59039l51777k84474J7564M875n3332
3451E752668r4015m21613M4071k22014J42561N4470j57844M10116M06524K114
3441E917038j40589k43478k59579R9032k58939K090K36801K23221M27278L67184
3431F370059Q02520R27433J53011J9916K50343L92616J08621q54649p16402m59534
3421F993934n0402k33524r4827J62737M48192K67949j19244M4899j34117j31213
3411G154384m99196k80256K66147K78449K2202k94802l31824K36179O20491L99429
3401G571203O56366P74955J536505J230311P56688J014467P48386m21124j154696
3392A2713061j391232o62024J0937o05502k52010l2721J15050J11757l91624p84111
$$ plain form
3382 8831581 8422013 8102867 7830529 7912269 7478257 7495485 7132309 6645085 6635349 6649535
3372 6649535 6524462 6337137 6372754 6798280 7272456 7424840 7413862 7336163 7742105 8224698
3362 8224698 8226966 7831162 7575786 7044962 6634831 6094519 5998730 5971888 5745569 5908821
3352 5908821 5862242 5835445 5670348 5223993 4665045 4520995 4496449 4592770 4620169 4108542
3342 4108542 4128602 3756298 3350736 3137525 2954768 3117721 3446319 3154861 3068540 2976855
3332 2976855 2975681 2996824 2420027 2518107 2825363 2688975 2540732 2575522 2559039 2920955 2655392
3321 2655392 2416237 2545757 2590369 2675711 2433759 2097223 2403531 2597741 2265764 2235345
3311 2235345 2225029 2140289 2125256 2024264 2116855 2542541 2358957 1918131 1380985 1204166
$$ packed form
3382H831581m09568l19146k72338Q1740m34012J7228l63176m87224r736J4186
3372F649535j25073j87325L5617M25526M74176J52384j0978p7699M05942M82593
3362H224698K268l95804k55376n30824m10131n40312r5789k6842k26319J63252
3352E908821m6579k6797j65097m46355n58948j44050k4546R6321K7399n11627
3342D108542K0060l72304m05562k13211j82757J62953L28598k91458q6321r1685
3332B976855j174K1143n76797R8080L07256j36388j48243L4790j6483L61916k65563
3321B655392k39155J29520M4612Q5342k41952l36536L06308J94210l31977l0419
3311B235345j0316q4740j5033j00992R2591M25686j83584m40826n37146j76819
$$ plain form
3301 1204166 1484524 1455555 1443876 1543445 1657146 1733561 1669914 1428459 1801341 2041634
3291 2041634 1992951 2312449 2324522 2304340 2008224 1559161 1487796 1618700 1577386 1528433 1298783
3280 1298783 1223329 1684404 1962356 1803170 1664027 1476529 1427448 1475150 1510364 1915816
3270 1915816 1922346 1586341 1452255 1608544 1805159 1995081 2074118 2264548 2666327 2599248
3260 2599248 2393985 2183855 1843511 1697164 1655609 1550679 1446843 1335374 1229263 1320346
3250 1320346 1486947 1502682 1382646 1142092 1194766 1212726 1458573 2050508 2007194 1627590
3240 1627590 1194981 1015961 1392553 1781362 2040166 2110897 2116275 1777856 1484248 1183614
3230 1183614 979683 966490 1120111 1515910 1498523 1459803 1318790 985757 1104694 1168725
$$ packed form
3301A204166K80358k8969j1679R9569J13701P6415o3647k41455L72882K40293
3291B041634m8683L19498J2073k0182k96116m49063p1365J30904m1314m8953k29650
3280A298783p5454M61075K77952j59186j39143j87498m9081M7702L5214M05452
3270A915816O530l36005j34086J56289J96615J89922P9037J90430M01779o7079
3260B599248k05263k10130l40344j46347m1555j04930j03836j11469j06111R1083
3250A320346J66601J5735j20036k40554N2674J7960K45847N91935m3314l79604
3240A627590m32609j79020L76592L88809K58804P0731N378l38419k93608l00634
3230A183614k03931j3193J53621L95799j7387l8720j41013l33033J18937O4031
$$ plain form
3220 1168725 1063104 1142673 945331 1007271 1134527 1114652 1032215 823422 509694 567628
3210 567628 796376 945711 1151577 923264 759980 426508 97952 148873 425869 619159
3200 619159 913823 1025765 859300 764261 374139 463973 647990 532230 594143 648248
3190 648248 546043 769816 679390 471737 309223 338079 494031 510224 651934 891197
3180 891197 1285265 1382053 1206841 859363 1039472 1137434 1248916 1478242 1341907 1380767
3170 1380767 947369 471754 527703 1014078 1324475 1467644 1422159 1455278 1469797 1268861
3160 1268861 1265922 1458926 1469703 1617626 1565104 1359557 1649712 1819993 1806326 1642229
3150 1642229 1705394 1939676 2072803 1947185 2133525 2455664 2395788 2741110 2680055 2816142
$$ packed form
3220A168725j05621P9569j97342O1940J27256j9875q2437k08793l13728N7934
3210E67628K28748J49335K05866k28313j63284l33472l28556N0921K76996J93290
3200F19159K94664J11942j66465r5039l90122Q9834J84017j15760O1913N4105
3190F48248j02205K23773r0426k07653j62514K8856J55952J6193J41710K39263
3180H91197L94068R6788j75212l47478J80109R7962J11482K29326j36335L8860
3170A380767m33398m75615N5949M86375L10397J43169m5485L3119J4519k00936
3160A268861k939J93004J0777J47923n2522k05547K90155J70281j3667j64097
3150A642229O3165K34282J33127j25618J86340L22139n9876L45322o1055J36087
$$ plain form
3140 2816142 3059560 3074029 3065794 3219012 3542368 3443787 3268337 2898692 2961148 3081647
3130 3081647 2948248 3142377 3358918 3447688 3425427 3025221 2748979 2799652 2715702 2712465 2709570
3119 2709570 2903426 3271517 3327124 2868692 3027092 3353575 3458765 3817263 3761749 3838583
3109 3838583 3578073 3313079 3040450 3324883 3311945 3468874 3493552 3373961 3817255 3912502
3099 3912502 3519738 3239966 3176837 2960514 2818697 2595824 2772298 2599415 2670562 2578356
3089 2578356 2567355 2547954 2536816 2447321 2620245 2973826 2954843 2862384 2257178 1972343 1693360
3078 1693360 1875284 1875470 1788736 1945088 1732426 1462674 1230725 1133055 1134001 1442495 1392708
3067 1392708 1553699 1737487 1509107 1406657 1222443 1010298 1213398 1222560 982474 885600
$$ packed form
3140B816142K43418J4469q235J53218L23356r8581j75450l69645O2456J20499
3130C081647j33399J94129K16541Q8770k2261m00206k76242N0673q3950l237k895
3119B709570J93856L68091N5607m58432J58400L26483J05190L58498n5514P6834
3109C838583k60510k64994k72629K84433j2938J56929K4678j19591M43294R5247
3099C912502l92764k79772o3129k16323j41817k22873J76474j72883P1147r2206
3089B578356j1001j9401j1138q9495J72924L53581j8983r2459o05206k84835k78983
3078A693360J81924J86q6734J56352k12662k69752k31949r7670R46L08494m9787
3067A392708J60991J83788k28380j02450j84214k12145K03100R162k40086r6874
$$ plain form
3057 885600 529870 630687 565796 414751 589125 458823 242726 372601 303120 264773
3047 264773 388949 39125 265257 462827 311864 443969 337846 356668 602441 640065
3037 640065 273194 102402 -151820 -230249 -376822 -486865 -445490 -350297 -380603 -511481
3027 -511481 -289004 175856 373292 379364 238602 430754 761739 578425 640646 620950
3017 620950 466134 376500 167969 -76569 -174006 -219176 -337183 -486443 -543297 -514324 -633324
3006 -633324 -745453 -368271 -127839 171721 404293 -76691 -210976 -137737 -270191 -128837
2996 -128837 -207447 -228906 45960 -101046 -267484 -299847 -568938 -594712 -485989 -472920 -335034
2985 -335034 -341292 -355192 -401965 -516559 -406237 -151930 -8727 260799 267453 269511 175763
$$ packed form
3057H85600l55730J00817o4891j51045J74374j30302k16097J29875o9481l8347
3047B64773J24176l49824K26132J97570j50963J32105j06123J8822K45773L7624
3037F40065l66871j70792k54222p8429j46573j10043M1375R5193l0306j30878
3027e11481K22477M64860J97436O072j40762J92152L30985j83314O2221j9696
3017F20950j54816q9634k08531k44538r7437m5170j18007j49260n6854K8973j19000
3006f33324j12129L77182K40432K99560K32572m80984j34285P3239j32454J41354
2996a28837p8610k1459K74866j47006j66438l2363k69091k5774J08723J3069J37886
2985c35034o258j3900m6773j14594J10322K54307J43203K69526O654K058r3748
$$ plain form
2974 175763 -263092 -376551 -315063 -319634 -253991 -284548 -405405 -477404 -906902 -989809 -833918
2963 -833918 -569374 -415162 -662756 -511804 -240217 -376427 -179448 -376527 -291783 30390
2953 30390 -180947 -492002 -359684 -553353 -622424 -503194 -674580 -337521 -428394 -403238
2943 -403238 -246906 -275221 -72686 65442 -347925 -304231 -221756 -340663 -72784 -387319
2933 -387319 -284816 -229721 -628616 -620527 -561977 -631591 -529023 -572639 -655597 -434789 -580094
2922 -580094 -545936 -416458 -477588 -245671 -302653 -360259 -432099 -585179 -528170 -519368 -527708
2911 -527708 -276655 -438505 -414324 -343000 -310726 -315064 -332496 -587697 -526706 -226337 -343124
2900 -343124 -361073 -546696 -350665 -230201 -390707 -559137 -591364 -513713 -614340 -678773
$$ packed form
2974A75763m38855j13459O1488m571O5643l0557j20857p1999m29498q2907J55891
2963h33918K64544J54212k47594J50952K71587j36210J96979j97079Q4744L22173
2953C0390k11337l11055J32318j93669o9071J19230j71386L37059r0873K5156
2943d03238J56332k8315K02535J38128m13367M3694Q2475j18907K67879l14535
2933c87319J02503N5095l98895Q089N8550o9614J02568m3616q2958K20808j45305
2922e80094L4158J29478o1130K31917n6982n7606p1840j53080N7009Q802q340
2911e27708K51053j61850K4181P1324L2274m338j7432k55201O0991L00369j16787
2900c43124j7949j85623J96031J20464j60506j68430l2227P7651j00627o4433
$$ plain form
2890 -678773 -625265 -384173 -410511 -462077 -616863 -380946 -224893 -253822 -555095 -658795
2880 -658795 -588300 -335832 -220723 -355366 -277724 -449286 -175102 -506401 -427678 -282302
2870 -282302 -336392 -466674 -378919 -410180 -340912 -513434 -867511 -500218 -284271 3228
2860 3228 -71346 -496159 -636056 -585895 -548763 -358360 -76595 -196327 -241591 -455974 -384507
2849 -384507 -605285 -488370 -394966 -222825 -419563 -524582 -808446 -1058445 -959729 -977237
2839 -977237 -481525 -383835 -148167 -346839 -603592 -696791 -550166 -392467 -442131 -425700
2829 -425700 -540747 -473775 -808778 -542518 -579995 -346712 12901 43983 -52304 -25516 -337363
2818 -337363 -479766 -526382 -784257 -391180 -318091 -238003 -284664 -266916 -408525 -400676 -904813
$$ packed form
2890f78773N3508K41092k6338n1566j54786K35917J56053k8929l01273j03700
2880f58795P0495K52468J15109j34643P7642j71562K74184l31299P8723J45376
2870b82302n4090j30282Q7755l1261O9268j72522l54077L67293K15947K87499
2860C228p4574m24813j39897N0161L7132J90403K81765j19732m5264k14383P1467
2849c84507k20778J16915R3404J72141j96738j05019k83864k49999R8716j7508
2839i77237M95712R7690K35668j98672k56753r3199J46625J57699m9664J6431
2829d25700j15047O6972l35003K66260l7477K33283L59613L1082r6287K6788l11847
2818c37363j42403m6616k57875L93077P3089Q0088m6661J7748j41609P849n04137
$$ plain form
2807 -904813 -735278 -612515 -618218 -158477 -432455 -567597 -840753 -914616 -668953 -237767
2797 -237767 -118718 -183994 -190163 -428550 -398599 -476468 -250629 -141776 -51181 -178997 -126623
2786 -126623 -401350 -236945 -485859 -643644 -576085 -652082 -611419 -726503 -557917 -582679
2776 -582679 -206656 -362807 -337302 -358568 -259199 -71350 -173461 -144684 -260471 -240827 -540442
2765 -540442 -649220 -919757 -588351 -483611 -464387 -768938 -716605 -605252 -514186 -347527
2755 -347527 -315914 -169022 -429043 -494011 -609142 -285758 -311191 -276385 -279662 -228209 -280118
2744 -280118 -310125 -320659 -444719 -135163 -299369 -372024 -413159 -414521 -563426 -761004 -922389
2733 -922389 -843259 -524835 -551785 -216082 16711 161949 22315 -250247 -610723 -397199
$$ packed form
2807i04813J69535J22763n703M59741k73978j35142k73156p3863K45663M31186
2797b37767J19049o5276o169k38387K9951p7869K25839J08853R0595j27816N2374
2786a26623k74727J64405k48914j57785O7559p5997M0663j15084J68586k4762
2776e82679L76023j56151K5505k1266R9369J87849j02111K8777j15787J9644k99615
2765e40442j08778k70537L31406J04740J9224l04551N2333J11353R1066J66659
2755c47527L1613J46892k60021o4968j15131L23384k5433L4806l277N1453n1909
2744b80118l0007j0534j24060L09556j64206p2655m1135j362j48905j97578j61385
2733i22389P9130L18424k6950L35703K32793J45238j39634k72562l60476K13524
$$ plain form
2723 -397199 -372509 -268851 -135592 -400227 -647214 -1016043 -1004953 -762064 -254423 129808
2713 129808 455863 130285 -132811 -262056 -444858 -447682 -483728 -454109 -606326 -408556
2703 -408556 -337005 -379225 -397514 -382804 -723565 -818362 -675019 -436341 -189132 -238046 -255850
2692 -255850 -197336 -223981 -416042 -326301 -352795 -162551 -9674 -1798 -291062 -599416 -797105
2681 -797105 -965463 -867589 -562468 -148092 -110847 -128961 -418422 -500421 -424895 -572049 -634842
2670 -634842 -417498 -224019 -12491 39947 -237986 -444455 -727555 -841207 -700872 -420938
2660 -420938 -222216 -215568 -484113 -691499 -629819 -747123 -697144 -547282 -91110 234751
2650 234751 417820 190110 -99077 -305055 -414608 -365022 -339492 -277621 -263773 -476695
$$ packed form
2723c97199K4690J03658J33259k64635k46987l68829J1090K42889N07641L84231
2713A29808L26055l25578k63096j29245j82802k824l6046K9619j52217J97770
2703d08556P1551m2220j8289J4710l40761r4797J43343K38678K47209m8914j7804
2692b55850N8514k6645j92061Q9741k6494J90244J52877P876k89264l08354j97689
2681g97105j68358R7874L05121M14376L7245j8114k89461q1999P5526j47154o2793
2670f34842K17344J93479K11528N2438k77933k06469k83100j13652J40335K79934
2660d20938J98722O648k68545k07386O1680j17304M9979J49862M56172L25861
2650B34751J83069k27710k89187k05978j09553M9586K5530O1871J3848k12922
$$ plain form
2640 -476695 -554240 -395974 -326641 -413364 -623044 -780133 -308302 73924 229896 246654
2630 246654 -205952 -503872 -646597 -647277 -419431 -203707 -58358 -119131 -336102 -604312
2620 -604312 -630142 -700031 -484737 -237552 -152928 -18766 -314473 -312100 -396962 -347942 -233513
2609 -233513 -234177 -264669 -100136 -293209 -226658 28307 84603 1708 -229811 -431085 -280382
2598 -280382 -166232 55368 196808 2987 -42075 -58897 -363755 -168482 -107063 10004
2588 10004 285713 -85132 -415073 -362739 -581180 -524952 -277307 -239648 145988 -24219
2578 -24219 -244044 -112871 -106740 22781 51653 -227942 -58189 192855 -23616 130749
2568 130749 2021 -55487 52528 -273248 -210081 -154524 -287460 -118971 -344530 -344449 -26089
$$ packed form
2640d76695p7545J58266O9333q6723k09680j57089M71831L82226J55972J6758
2630B46654m52606k97920j42725o80K27846K15724J45349o0773k16971k68210
2620f04312k5830o9889K15294K47185Q4624J34162k95707K373q4862M9020J14429
2609b33513o64l0492J64533j93073O6551K54965N6296q2895k31519k01274J50703
2598b80382J14150K21600J41440j93821m5062j6822l04858J95273O1419J17067
2588A0004K75709l70845l29941N2334k18441N6228K47645L7659L85636j70207
2578b4219k19825J31173O131J29521K8872k79595J69753K51044k16471J54365
2568A30749j28728n7508J08015l25776O3167N5557j32936J68489k25559Q1L18360
$$ plain form
2557 -26089 -275065 -257749 -117476 -133609 -298139 -463856 -486558 -210633 -221472 -413635 -520472
2546 -520472 -564358 -548855 -492392 -375952 9925 -28168 -11342 41345 -313307 -268824 -360650
2535 -360650 -472112 -364530 -398103 -377781 -341394 -468076 -421601 -267774 -91319 94539
2525 94539 61569 -64798 -362132 -626004 -499644 -452326 -484032 -108296 -174448 -272315 -49590
2514 -49590 -103603 185861 412919 103852 225862 216400 44436 39702 -194429 -225231 -104035
2503 -104035 -38139 16965 -46678 -226933 -62777 -114534 101889 329671 226087 157236 185733
2492 185733 143230 130099 5783 -397307 -450023 -553241 -399084 -280028 -96199 4507
2482 4507 -5964 -138903 -181191 -9602 -32506 -110563 -161992 -86163 -129400 -206952 -531187
$$ packed form
2557b6089k48976J7316J40273j6133j64530j65717k2702K75925j0839j92163j06837
2546e20472m3886J5503N6463J16440L85877l8093J6826N2687l54652M4483r1826
2535c60650j11462J07582l3573K0322L6387j26682M6475J53827J76455J85858
2525I4539l2970j26367k97334k63872J26360M7318l1706L75736o6152r7867K22725
2514d9590n4013K89464K27058l09067J22010r462j71964m734k34131l0802J21196
2503a04035O5896N5104o3643j80255J64156n1757K16423K27782j03584o8851K8497
2492A85733m2503j3131j24316m03090n2716j03218J54157J19056J83829J00706
2482D507j0471j32939m2288J71589k2904p8057n1429P5829m3237p7552l24235
$$ plain form
2471 -531187 -715626 -703412 -380139 -139602 57345 234438 83961 32348 -224735 -339017
2461 -339017 -390216 -287362 -155465 -21852 143874 166866 41912 -49976 -26372 208705
2451 208705 398725 357323 552096 312729 57232 -170601 -329038 -215108 -33602 80965
2441 80965 253935 396957 308146 501588 204426 72807 225090 60684 207980 359022
2431 359022 176502 274321 124335 61668 264867 68886 6969 224965 151160 177926 308500
2420 308500 227386 606299 613489 312869 476956 276229 317523 528828 484768 528254 284415
2409 284415 -206240 29885 209460 149923 474271 326288 374629 390689 110328 11187
2399 11187 106558 20432 106246 156669 205330 542773 764925 645121 798018 881979 1016870
$$ packed form
2471e31187j84439J2214L23273K40537J96947J77093j50477n1613k57083j14282
2461c39017n1199J02854J31897J33613J65726K2992j24954r1888K3604K35077
2451B08705J90020m1402J94773k39367k55497k27833j58437J13930J81506J14567
2441H0965J72970J43022q8811J93442k97162j31619J52283j64406J47296J51042
2431C59022j82520R7819j49986o2667K03199j95981o1917K17996p3805K6766J30574
2420C08500q1114L78913P190l00620J64087k00727M1294K11305m4060M3486k43839
2409B84415m90655K36125J79575n9537L24348j47983M8341J6060k80361r9141
2399A1187R5371q6126Q5814N0423M8661L37443K22152j19804J52897Q3961J34891
$$ plain form
2388 1016870 993531 913223 949306 970842 1169921 1086642 915844 851691 903297 1150154 1377900
2377 1377900 1624034 1836471 1801814 1584629 1649402 1625924 1890394 2118236 2390156 2668196
2367 2668196 2785180 2746372 2858267 2807355 2912233 3518586 3900786 4422769 4584335 4468529
2357 4468529 4571005 4599429 4778752 5740459 6293861 7153760 8100708 8719533 9613335 10322413
2347 10322413 10981130 12238074 13671504 15294595 17779031 20357620 23732336 28737511
2339 28737511 33577306 38279856 43245206 47017736 49328985 47737252 40366065 33861490
2331 33861490 29877346 26828088 23955205 21283604 19179434 17269644 15735475 14644284
2323 14644284 13370358 12015940 11291003 10462253 9441981 8659379 7912169 7213928 6695138
$$ packed form
2388A016870k3339q0308L6083K1536J99079q3279j70798o4153N1606K46857K27746
2377A377900K46134K12437l4657k17185O4773k3478K64470K27842K71920K78040
2367B668196J16984l8808J11895n0912J04878O06353L82200N21983J61566j15806
2357D468529J02476K8424J79323R61707N53402Q59899R46948O18825Q93802P09078
2347A0322413O58717J256944J433430J623091K484436K578589L374716N005175
2339B8737511M839795M702550M965350L772530K311249j591733p371187o504575
2331C3861490l984144l049258k872883k671601k104170j909790j534169j091191
2323A4644284j273926j354418p24937q28750j020272p82602p47210o98241n18790
$$ plain form
2314 6695138 6173656 5643136 5021721 4329265 3986578 4013249 3867708 3840498 3318035 3096228
2304 3096228 2995524 2560448 2609547 2742564 2519255 2448321 2058441 1856211 2011936 1921849
2294 1921849 1730525 1739860 1316127 1284206 1293485 1337245 1518786 1432506 1202059 1318092 1177142
2283 1177142 910317 799259 465267 638600 615335 435998 168777 205164 64651 286011
2273 286011 397142 425714 889783 796491 673658 660058 673222 658354 779821 506701 287808
2262 287808 234151 83054 351532 337951 455700 349797 164889 -64022 137097 293841
2252 293841 241190 190045 199326 -13035 -57655 198 -67707 299367 350282 433940 443110 381201
2240 381201 61170 136155 -101511 81641 372968 227196 43150 -190237 -384128 -368218
$$ packed form
2314F695138n21482n30520o21415o92456l42687K6671j45541k7210n22463k21807
2304C096228j00704m35076M9099J33017k23309p0934l89880k02230J55725r0087
2294A921849j91324R335m23733l1921R279M3760J81541q6280k30447J16033j40950
2283A177142k66825j11058l33992J73333k3265j79337k67221L6387j40513K21360
2273B86011J11131K8572M64069r3292j22833j3600J3164j4868J21467k73120k18893
2262B87808n3657j51097K68478j3581J17749j05903j84908k28911K01119J56744
2252B93841n2651n1145R281k12361m4620N7853o7905L67074N0915Q3658R170o1909
2240C81201l20031P4985k37666J83152K91327j45772j84046k33387j93891J5910
$$ plain form
2230 -368218 -422376 -541480 460 -8018 375142 801420 691994 783004 633476 306403
2220 306403 561314 705119 648606 704155 330638 7580 -87684 -140636 -113448 16540 -282941
2209 -282941 -244621 -89814 -285292 -268820 -505505 -599199 -552952 -324863 -118925 165747
2199 165747 22984 -21068 40899 -209469 -102035 -150173 -57290 -24374 116188 -27658 -101442
2188 -101442 -138634 -158719 -269362 -165373 17006 86286 -43855 -495480 -356734 -262938
2178 -262938 -113612 95316 32525 -62445 185942 34439 -26698 227001 -89643 -115081
2168 -115081 -405247 -449668 -75181 -106444 -346022 -318265 -273913 -185555 65504 -286927 -211590
2157 -211590 -253064 -382714 -234342 -24742 -15464 219676 82839 -91813 177452 -74256
$$ packed form
2230c68218n4158j19104N41940q478L83160M26278j09426R1010j49528l27073
2220C06403K54911J43805n6513N5549l73517l23058r5264n2952K7188J29988k99481
2209b82941L8320J54807j95478J6472k36685r3694M6247K28089K05938K84672
2199A65747j42763m4052O1967k50368J07434m8138R2883L2916J40562j43846p3784
2188a01442l7192k0085j10643J03989J82379O9280j30141m51625J38746R3796
2178b62938J49326K08928o2791r4970K48387j51503o1137K53699l16644k5438
2168a15081k90166m4421L74487l1263k39578K7757M4352Q8358K51059l52431P5337
2157b11590m1474j29650J48372K09600R278K35140j36837j74652K69265k51708
$$ plain form
2147 -74256 -130241 -217450 -209485 -58690 331309 199027 -10254 -462656 -542521 -286951 -272438
2136 -272438 -42597 -121644 -298097 -572821 -429432 -523790 -410662 -476019 -340323 -82175
2126 -82175 279819 312191 190697 5693 -225852 -294358 -515396 -168347 96622 3110
2116 3110 -161080 -66937 -162064 -135119 -373249 -331561 -106728 -86795 -156770 -308725 -499466
2105 -499466 -785405 -694688 -610737 -268711 53113 235620 315107 -29923 -114350 -144325 -304989
2094 -304989 -509592 -526137 -374520 -36445 142879 180478 188269 -98687 -139148 -178117 -290467
2083 -290467 -185079 -42263 -312631 -274286 -338032 -288872 -37234 -174298 158989 451456
2073 451456 446464 361855 135331 -213683 -220280 -393121 -348528 -170481 -192264 -60996 -130255
$$ packed form
2147g4256n5985q7209P965J50795L89999j32282k09281m52402p9865K55570J4513
2136b72438K29841p9047j76453k74724J43389r4358J13128o5357J35696K58148
2126h2175L61994L2372j21494j85004k31545o8506k21038L47049K64969r3512
2116C110j64190R4143r5127K6945k38130M1688K24833J9933o9975j51955j90741
2105d99466k85939R0717Q3951L42026L21824J82507P9487l45030q4427k9975j60664
2094c04989k04603j6545J51617L38075J79324L7599P791k86956m0461l8969j12350
2083b90467J05388J42816k70368L8345o3746M9160K51638j37064L33287K92467
2073D51456m992q4609k26524l49014o597j72841M4593J78047k1783J31268o9259
$$ plain form
2062 -130255 -255345 -286770 39725 -237536 -196091 -18657 20839 267521 399119 282760
2052 282760 254573 204902 -3450 16109 -3753 92558 -76644 -195746 -255699 -66259 39251
2041 39251 89129 -70270 -298286 -299830 -521514 -515512 -458238 -429046 -519626 -587896 -562709 -698999
2029 -698999 -507348 -424661 -103604 271545 216204 363048 180437 -164049 -113225 -158457
2019 -158457 -207602 -60636 -128180 -315671 -182748 -122268 48836 -38017 -437937 -578822
2009 -578822 -473026 -342760 -118325 -87667 -128040 -74433 -279150 -259883 -275427 -263247 -74764
1998 -74764 -164357 -241962 -81642 -262661 -435471 -402761 -173197 233563 545942 230487
1988 230487 -168725 -244404 -451001 -498254 -469170 -311810 -110555 -278762 -149266 -79741
$$ packed form
2062a30255j25090l1425L26495k77261M1445J77434L9496K46682J31598j16359
2052B82760k8187m9671k08352J9559j9862R6311j69202j19102n9953J89440J05510
2041C9251M9878j59399k28016j544k21684O002N7274K9192r0580o8270K5187j36290
2029f98999J91651Q2687L21057L75149n5341J46844j82611l44486N0824m5232
2019a58457m9145J46966o7544j87491J32923O0480J71104q6853l99920j40885
2009e78822J05796J30266K24435L0658m0373N3607k04717J9267j5544J2180J88483
1998g4764q9593p7605J60320j81019j72810L2710K29564M06760L12379l15455
1988B30487l99212p5679k06597m7253K9084J57360K01255j68207J29496O9525
$$ plain form
1978 -79741 77393 210673 58947 -94441 -128515 -236905 -275040 -202110 -479800 -361250
1968 -361250 -147116 -56077 58986 -40565 -225664 -274294 -469804 -270339 -132451 -247755
1958 -247755 -245101 -312043 -350874 -340668 -139314 -87402 96287 216584 430302 145201 -456842
1947 -456842 -588320 -666791 -490392 -351910 -130261 -159944 -96422 -385384 -459738 -202501
1937 -202501 -133219 9608 91452 -98737 45140 44086 -267998 -158869 -228501 -46534 95938
1926 95938 310074 324170 247007 -11617 -109221 -185456 -171544 -229569 -417521 -163859 60977
1915 60977 259185 -89772 -358502 -623526 -500708 -234413 86221 340585 502683 177212
1905 177212 -171939 35251 -32251 -13195 -295672 -279913 -137135 57899 -91492 -93063 -252052
$$ packed form
1978g9741J57134J33280j51726j53388l4074j08390l8135P2930k77690J18550
1968c61250K14134R1039J15063r9551j85099m8630j95510J99465J37888j15304
1958b47755K654o6942l8831J0206K01354N1912J83689J20297K13718k85101o02043
1947d56842j31478p8471J76399J38482K21649k9683O3522k88962p4354K57237
1937b02501O9282J42827Q1844j90189J43877j054l12084J09129o9632J81967J42472
1926I5938K14136J4096p7163k58624r7604p6235J3912n8025j87952K53662K24836
1915F0977J98208l48957k68730k65024J22818K66295L20634K54364J62098l25471
1905A77212l49151K07190o7502J9056k82477J5759J42778J95034j49391j571j58989
$$ plain form
1894 -252052 -263202 -121353 -241008 102312 328309 360459 279485 97018 -284023 -363973
1884 -363973 -546684 -521260 -47325 109224 201766 -154681 -545971 -513439 -342620 -139415
1874 -139415 213581 239253 215321 29546 -302807 -447763 -248420 -306180 -238865 -107880
1864 -107880 -334523 77039 15592 45014 66050 130962 107723 -163597 -196593 -373799 -76433
1853 -76433 75537 76951 -86549 -195545 -6738 224301 276572 319397 462647 237973 35600
1842 35600 -292056 -428753 -293397 -265737 -422195 -262509 -269591 -55224 -58774 -370480 -119164
1831 -119164 -38395 -160118 -147471 -99435 -31633 32559 -323272 -438917 -342481 -401510 -44848
1820 -44848 133606 260590 180849 147703 -175789 -104659 -45620 199656 294719 80134 273956
$$ packed form
1894b52052j1150J41849j19655L43320K25997L2150q0974j82467l81041p9950
1884c63973j82711K5424M73935J56549R2542l56447l91290L2532J70819K03205
1874a39415L52996K5672k3932j85775l32353j44956J99343n7760O7315J30985
1864a07880k26643M11562o1447K9422K1036O4912k3239k71320l2996j77206K97366
1853g6433J51970J414j63500j08996J88807K31039N2271M2825J43250k24674k02373
1842C5600l27656j36697J35356K7660j56458J59686p082K14367l550l11706K51316
1831a19164Q0769j21723J2647M8036O7802O4192l55831j15645R6436n9029L56662
1820d4848J78454J26984p9741l3146l23492P1130N9039K45276R5063k14585J93822
$$ plain form
1809 273956 60211 -62182 -173670 -133346 -193843 -61938 -173591 -66721 -406624 -311569
1799 -311569 -211525 -83889 57095 -115877 -131837 -216888 -135309 -235802 74515 -217230
1789 -217230 -188690 -157227 -194178 112088 318317 488697 393295 50334 -170828 -48937
1779 -48937 -270746 -90911 -106152 -273267 -284485 -119080 -82926 103979 121141 3637 133274
1768 133274 128663 207586 -22498 -136681 -54470 62362 17101 -37956 -189735 -72625 114788
1757 114788 96286 235935 127584 -121051 -381194 -442089 -328450 -210395 -126959 -108529
1747 -108529 -58906 -63474 -105062 -306676 -203530 -145232 -32257 68465 233171 256623 143998
1736 143998 -252231 -416988 -190455 -170527 -91329 -310960 -282693 -209557 -284622 -338459 -200709
$$ packed form
1809B73956k13745j22393j11488M0324o0497J31905j11653J06870l39903R5055
1799c11569J00044J27636J40984j72972j5960q5051Q1579j00493L10317k91745
1789b17230K8540L1463l6951L06266K06229J70380r5402l42961k21162J21891
1779d8937k21809J79835j5241j67115j1218J65405L6154J86905J7162j17504J29637
1768A33274m611P8923k30084j14183Q2211J16832m5261n5057j51779J17110J87413
1757A14788j8502J39649j08351k48635k60143o0895J13639J18055Q3436J8430
1747a08529M9623m568m1588k01614J03146N8298J12975J00722J64706K3452j12625
1736A43998l96229j64757K26533J9928P9198k19631K8267P3136p5065n3837J37750
$$ plain form
1725 -200709 -74461 117937 281627 241930 319582 238833 7152 -196574 -45697 149147
1715 149147 289966 183101 111880 108868 -175838 -384601 -442776 -531463 -625624 -645712 -732133
1704 -732133 -430415 -137192 168918 215219 151363 224920 216290 361431 209344 238021 274949
$$ packed form
1725b00709J26248J92398J63690l9697P7652q0749k31681k03726J50877J94844
1715A49147J40819j06865p1221l012k84706k08763n8175q8687r4161k0088q6421
1704g32133L01718K93223L06110M6301o3856P3557q630J45141j52087K8677L6928
$$ [...]
##END NTUPLES=NMR SPECTRUM
##END=
