##TITLE=1H_DE-80H_X3
 200.13MHz, d2o
 8 sc
 
 19ns.26.2.2025
##JCAMPDX= 6.0         $$ Bruker NMR JCAMP-DX V2.0
##DATA TYPE= NMR SPECTRUM
##DATA CLASS= NTUPLES
##ORIGIN= UXNMR, Bruker Analytische Messtechnik GmbH
##OWNER= pz
$$ XWIN-NMR		Version 3.5
$$ Thu Sep 18 15:04:20 2025 Russian Standard Time (UT+4h)  Yarkov@DPX200
##.OBSERVE FREQUENCY= 200.1313
##.OBSERVE NUCLEUS= ^1H
##.ACQUISITION MODE= SIMULTANEOUS
##.ACQUISITION SCHEME= undefined
##.AVERAGES= 8
##.DIGITISER RES= 18
##SPECTROMETER/DATA SYSTEM= spect
##.PULSE SEQUENCE= zg30
##.SOLVENT NAME= CDCl3
##.SHIFT REFERENCE= (INTERNAL, CDCl3, 0, 15.4957)
##AUDIT TRAIL= $$ (NUMBER, WHEN, WHO, WHERE, WHAT)
$$ ##TITLE= Audit trail, XWIN-NMR		Version 3.5
$$ ##JCAMPDX= 5.01
$$ ##ORIGIN= Bruker BioSpin GmbH
$$ ##OWNER= Yarkov
$$ C:/Bruker/XWIN-NMR/data/yarkov2/nmr/H-C/1/pdata/1/auditp.txt
$$ ##AUDIT TRAIL=  $$ (NUMBER, WHEN, WHO, WHERE, WHAT)
(   1,<2025-09-18 15:03:28.82 +0400>,<Yarkov>,<DPX200>,
      <created by zg, POWCHK disabled, PULCHK disabled
       configuration hash MD5:
       00 E9 B6 7A A2 85 ED C7 34 08 36 98 17 FE 4E 26
       data hash MD5: 16K
       09 D4 7F 23 2B 79 8B E7 60 A1 D0 1C 4F 1E 99 C7>)
(   2,<2025-09-18 15:03:35.67 +0400>,<Yarkov>,<DPX200>,
      <Start of raw data processing
       efp BC_mod = 2 LB = 0.25 FT_mod = 6 PKNL = 1 PHC0 = -1348.02 PHC1 = -1.209074 SI = 16K 
       data hash MD5: 16K
       6A AE 97 B8 58 1C 1F 39 E1 23 F1 4F 2F 1A 6B 65>)
(   3,<2025-09-18 15:03:40.26 +0400>,<Yarkov>,<DPX200>,
      <abs ABSG = 5 
       data hash MD5: 16K
       FE B0 24 88 99 C9 52 F0 25 68 21 9D 3F 7C 2C CB>)
$$ ##END=
$$ 
$$ hash MD5
$$ 6F 32 70 37 4B C9 87 DB A1 EB DA E0 90 15 4A C4
##$RELAX= 
##$RELAX= 
##$RELAX= 
##$RELAX= 
##$RELAX= 
##$RELAX= 
$$ Bruker specific parameters
$$ --------------------------
##$DU= <C:/Bruker/XWIN-NMR>
##$EXPNO= 1
##$NAME= <H-C>
##$PROCNO= 1
##$TYPE= <nmr>
##$USER= <yarkov2>
##$AMP= (0..31)
100 100 100 100 100 100 100 100 100 100 100 100 100 100 100 100 100 100 
100 100 100 100 100 100 100 100 100 100 100 100 100 100 
##$AQSEQ= 0
##$AQ_mod= 1
##$AUNM= <au_zg>
##$AUTOPOS= <>
##$BF1= 200.13
##$BF2= 200.13
##$BF3= 200.13
##$BF4= 200.13
##$BF5= 200.13
##$BF6= 200.13
##$BF7= 200.13
##$BF8= 200.13
##$BYTORDA= 1
##$CFDGTYP= 0
##$CFRGTYP= 5
##$CHEMSTR= <none>
##$CNST= (0..31)
1 1 145 1 1 1 1 1 1 1 1 1 1 1 1 1 1 1 1 1 1 1 1 1 1 1 1 1 1 1 1 1 
##$CPDPRG= <>
##$CPDPRG1= <>
##$CPDPRG2= <>
##$CPDPRG3= <>
##$CPDPRG4= <mlev>
##$CPDPRG5= <mlev>
##$CPDPRG6= <mlev>
##$CPDPRG7= <mlev>
##$CPDPRG8= <mlev>
##$CPDPRGB= <>
##$CPDPRGT= <>
##$D= (0..31)
0 0.7 0 0 0 0 0 0 0 0 0 0.03 0 0 0 0 0 0 0 0 0 0 0 0 0 0 0 0 0 0 0 0 
##$DATE= 1758193408
##$DBL= (0..7)
120 120 120 120 120 120 120 120 
##$DBP= (0..7)
150 150 150 150 150 150 150 150 
##$DBP07= 0
##$DBPNAM0= <>
##$DBPNAM1= <>
##$DBPNAM2= <>
##$DBPNAM3= <>
##$DBPNAM4= <>
##$DBPNAM5= <>
##$DBPNAM6= <>
##$DBPNAM7= <>
##$DBPOAL= (0..7)
0.5 0.5 0.5 0.5 0.5 0.5 0.5 0.5 
##$DBPOFFS= (0..7)
0 0 0 0 0 0 0 0 
##$DE= 6
$$ [...]
##$SUBNAM3= <"">
##$SUBNAM4= <"">
##$SUBNAM5= <"">
##$SUBNAM6= <"">
##$SUBNAM7= <"">
##$SUBNAM8= <"">
##$SUBNAM9= <"">
##$SW= 18.0517328524113
##$SWIBOX= (0..15)
0 0 2 0 0 0 0 0 0 0 0 0 0 0 0 0 
##$SW_h= 3612.71676300578
##$TD= 16384
##$TD0= 1
##$TE= 0
##$TE2= 300
##$TE3= 300
##$TEG= 300
##$TL= (0..7)
0 120 120 120 120 120 120 120 
##$TP= (0..7)
150 150 150 150 150 150 150 150 
##$TP07= 0
##$TPNAME0= <>
##$TPNAME1= <>
##$TPNAME2= <>
##$TPNAME3= <>
##$TPNAME4= <>
##$TPNAME5= <>
##$TPNAME6= <>
##$TPNAME7= <>
##$TPOAL= (0..7)
0.5 0.5 0.5 0.5 0.5 0.5 0.5 0.5 
##$TPOFFS= (0..7)
0 0 0 0 0 0 0 0 
##$TUNHIN= 0
##$TUNHOUT= 0
##$TUNXOUT= 0
##$USERA1= <user>
##$USERA2= <user>
##$USERA3= <user>
##$USERA4= <user>
##$USERA5= <user>
##$V9= 5
##$VALIST= <valist>
##$VCLIST= <CCCCCCCCCCCCCCC>
##$VD= 0
##$VDLIST= <DDDDDDDDDDDDDDD>
##$VPLIST= <PPPPPPPPPPPPPPP>
##$VTLIST= <TTTTTTTTTTTTTTT>
##$WBST= 1024
##$WBSW= 4
##$XGAIN= (0..3)
0 0 0 0 
##$XL= 0
##$YL= 0
##$YMAX_a= 123908
##$YMIN_a= -105883
##$ZGOPTNS= <>
##$ZL1= 120
##$ZL2= 120
##$ZL3= 120
##$ZL4= 120
##$ABSF1= 15.47916
##$ABSF2= -2.572689
##$ABSG= 5
##$ABSL= 3
##$ALPHA= 0
##$AQORDER= 0
##$ASSFAC= 0
##$ASSFACI= 0
##$ASSFACX= 0
##$ASSWID= 0
##$AUNMP= <proc_1d>
##$AZFE= 0.1
##$AZFW= 0.1
##$BCFW= 0
##$BC_mod= 2
##$BYTORDP= 0
##$COROFFS= 0
##$CY= -3
##$DATMOD= 1
##$DC= 0
##$DFILT= <>
##$DTYPP= 0
##$F1P= 0
##$F2P= 0
##$FCOR= 1
##$FTSIZE= 16384
##$FT_mod= 6
##$GAMMA= 0
##$GB= 0
##$INTBC= 1
##$INTSCL= 3.241238e-09
##$ISEN= 128
##$LB= 0.25
##$LEV0= 0
##$LPBIN= 0
##$MAXI= 10000
##$MC2= 0
##$MEAN= 0
##$ME_mod= 0
##$MI= 1.114404
##$NCOEF= 0
##$NC_proc= -8
##$NLEV= 6
##$NOISF1= 3.799351
##$NOISF2= 2.8
##$NSP= 0
##$NTH_PI= 0
##$NZP= 0
##$OFFSET= 15.49568
##$PC= 1
##$PHC0= -1348.02
##$PHC1= -1.209074
##$PH_mod= 1
##$PKNL= yes
##$PPARMOD= 0
##$PSCAL= 0
##$PSIGN= 0
##$REVERSE= no
##$SF= 200.130005208623
##$SI= 16384
##$SIGF1= 3
##$SIGF2= 2
##$SINO= 0.751879
##$SIOLD= 32768
##$SREGLST= <19F.Aceton>
##$SSB= 0
##$STSI= 16384
##$STSR= 0
##$SW_p= 3612.71676300578
##$SYMM= 0
##$S_DEV= 0
##$TDeff= 16384
##$TDoff= 0
##$TI= <>
##$TILT= no
##$TM1= 0
##$TM2= 0
##$TOPLEV= 0
##$USERP1= <user>
##$USERP2= <user>
##$USERP3= <user>
##$USERP4= <user>
##$USERP5= <user>
##$WDW= 1
##$XDIM= 16384
##$YMAX_p= 365573564
##$YMIN_p= -506909
$$ End of Bruker specific parameters
$$ ---------------------------------
##NTUPLES= NMR SPECTRUM
##VAR_NAME=  FREQUENCY,     SPECTRUM/REAL,   SPECTRUM/IMAG
##SYMBOL=    X,             R,               I
##VAR_TYPE=  INDEPENDENT,   DEPENDENT,       DEPENDENT
##VAR_FORM=  AFFN,          ASDF,            ASDF
##VAR_DIM=   16384,         16384,           16384
##UNITS=     HZ,            ARBITRARY UNITS, ARBITRARY UNITS
##FACTOR=    0.220516191357247, 1,           1
##FIRST=     3101.15049016169, 0,            0
##LAST=      -511.566272844095, 0,           0
##MIN=       -511.566272844095, -506909,     0
##MAX=       3101.15049016169, 365573564,    0
$$ Real data points
##PAGE= N=1
##DATA TABLE= (X++(R..R)), XYDATA
$$ [...]
7593G24371K3519K8445m8525J16824N6879l7504j35263j8222J39618m9038J8397
7582H19501k2580O7323O1900L6653m8139R2837J6410o377J42544n0985J04937
7571A214024m8978o7385K27026O8970j2309M7598J30797p8550j15275J62185p9
7560A528024l2216j99852L6799M9446q4777R2549N2642p5582j44854K5090j04814
7549A142455p921m199J1268o1406p661p5739n1113L5740q8840j6606k1617N0169
7537I04530K9668j2626q5683r5200m7150K12478J23286r0953m2007j14383j21622
7526F60338M4237M2881j7567q7667N3878K2086K4215j9809j56715L4404P5803
7515F76084m3118m7967j05253j6796K03518O7068K1531l9382j81080j3758R7424
$$ plain form
7593 724371 747890 776335 727810 844634 901513 864009 728746 710524 850142 801104 819501
7582 819501 796921 864244 926144 962797 914658 1007495 1023905 1017528 1160072 1109087 1214024
7571 1214024 1165046 1097661 1324687 1393657 1381348 1428946 1559743 1481193 1365918 1528103 1528024
7560 1528024 1495808 1295956 1332755 1382201 1297424 1389973 1442615 1367033 1222179 1247269 1142455
7549 1142455 1134534 1130335 1141603 1080197 1072536 996797 945684 981424 892584 875978 854361 904530
7537 904530 934198 921572 835889 740689 693539 906017 1029303 938350 896343 781960 660338
7526 660338 704575 747456 729889 642222 696100 718186 742401 722592 565877 600281 676084
7515 676084 632966 584999 479746 462950 666468 733536 755067 715685 534605 520847 618271
7504F18271K8979P314K4418j78899j2762N3662K4312J18403k8925R114j22874
7493E41013J6707k0097Q4501L249M4953q4495j01085k4704K2693M5015Q266j04348
7481D31668L7412K19251n1786J8711J3519n1928j55305L4843j05408P7546n4670
7470D13853O551J47372L5653j13313o5402q8493J39522J32907j02150j50250k5134
7459C31116Q3551J14738r4258N2543P4694j7092k928l9343O6583q7798J6012R6034
7447E93852m6852j1185R006J636O7165m1192l2734P0696r5767p3260k6227J3711
7435D28849J78066q6050k2201K23751n5965k00292J74200p4652J9129P8260N4504
7424G17599m4234j01970n1182n5585M0241J17151J97107M3685L6217q4697q8415
$$ plain form
7504 618271 647250 654564 678982 500083 487321 540983 565295 683698 654773 663887 541013
7493 541013 557720 537623 622124 625373 670326 585831 484746 460042 482735 527750 536016 431668
7481 431668 469080 688331 636545 655256 668775 616847 461542 496385 390977 468523 413853
7470 413853 420404 567776 603429 490116 424714 336221 475743 608650 506500 356250 331116
7459 331116 414667 529405 435147 487690 562384 545292 542364 503021 569604 481806 497818 593852
7447 593852 547000 535815 544821 546457 613622 572430 539696 610392 514625 441365 415138 428849
7435 428849 606915 520865 498664 722415 666450 466158 640358 565706 584835 663095 717599
7424 717599 673365 571395 520213 464628 504869 622020 819127 862812 899029 814332 725917
7413G25917m5273L0003L3821J0867q0241R4523O1347L7580k094p4892J4724j28187
7401F78095P7605K5370P5247O495j20036K4505n503J62315N0842r0303J30331
7390A014963K7968K8425P0806l8173j30828M1701R1446L7546J24283J68004n9372
7379A376769q3376J10247J70627K1139r383q320R2765j21419j21859J69008J5950
7368A612148Q0428L3644q0580p3539J63479K0912j5101p20J72919N7088k0710
7357A949968j34109J57358J67334n4329K0834n1107J0549J44720J27558O9259
7347B408035P7478M8791K56510M68o2821K069J42266J12417j3046J6379K32793
7336C221339L3016J08099R0441K66638n0730J95359K66407K97164K00733M3467
$$ plain form
7413 725917 680644 710647 744468 755335 675094 769617 830964 868544 866450 791558 806282 678095
7401 678095 755700 781070 856317 862812 742776 767281 761778 924093 974935 884632 1014963
7390 1014963 1042931 1071356 1142162 1103989 973161 1014862 1106308 1143854 1268137 1436141 1376769
7379 1376769 1293393 1403640 1574267 1595406 1586023 1577703 1670468 1549049 1427190 1596198 1612148
7368 1612148 1692576 1726220 1645640 1572101 1735580 1756492 1741391 1740671 1913590 1970678 1949968
7357 1949968 1815859 1973217 2140551 2086222 2107056 2055949 2066498 2211218 2338776 2408035
7347 2408035 2485513 2534304 2790814 2791282 2728461 2730530 2872796 2985213 2972167 2988546 3221339
7336 3221339 3254355 3362454 3452895 3719533 3668803 3864162 4130569 4427733 4628466 4671933
7326D671933K02714K90340K81845J69707K12791L31336L88853K98524L07646K74367
7316G430056L52142N57632M67174M43951N97886M93550O02868P42465O61116O51888
7306A3000728P73368O64914P40629P32253R37722Q13445P79116Q47733R54441
7297B0244349Q92067Q16127P39271Q31082P79036O16097N36330K71375K85618
7288B6011352J20760j05449k59279k69755n66937o44871n66311q57250p55438
7279B2106822q59735q65057q34349r18822r73293r70503q51232o56606n99140
7270A4578085n68176q11266n59236m72581n49341o36204n87788l43763m81440
7261I568290l25996l63872m33067l24880l72102l85153k03704l25056l03208j70376
$$ plain form
7326 4671933 4874647 5164987 5446832 5616539 5829330 6160666 6549519 6848043 7155689 7430056
7316 7430056 7782198 8339830 8807004 9250955 9848841 10342391 10945259 11687724 12348840 13000728
7306 13000728 13774096 14439010 15179639 15911892 16849614 17663059 18442175 19289908 20244349
7297 20244349 21136416 21952543 22691814 23522896 24301932 24918029 25454359 25725734 26011352
7288 26011352 26132112 26026663 25767384 25497629 24930692 24285821 23719510 22862260 22106822
7279 22106822 21247087 20382030 19547681 18628859 17655566 16685063 15833831 15177225 14578085
7270 14578085 14009909 13198643 12639407 12166826 11617485 10981281 10393493 10049730 9568290
7261 9568290 9242294 8878422 8445355 8120475 7748373 7363220 7159516 6834460 6531252 6360876
7251F360876l82363k97895k2455j81186j96087j42410k04047o1366r4318k12672
7241D566077k51091j30479j54907m1574p1576m3930j62868j14522o0295j18286
7231C416549j06507n5666j80392q5972j33134n4668L6897m8828n0112j25083J394
7220B614478J83041r9017q7565q4314j51628l8765L8321N2338l9045k59698k9628
7209B098518q9041k43591K1525L2120R5268o0147j29728j04765J25398n5697K9175
7198A719035j15238J1520M4335l7167p1606l8957Q9748O0537q6075l8145k60M0878
7186A578605P033r6794n2086j14156j60719P9283O5656P5826q644j45627j0621
7175A217756J58769P5300o1870j3211K8737K7948r6807q9428N1572N7981j16663
$$ plain form
7251 6360876 5978513 5680618 5658163 5476977 5280890 5138480 4934433 4873067 4778749 4566077
7241 4566077 4314986 4184507 4029600 3988026 3916450 3872520 3709652 3595130 3534835 3416549
7231 3416549 3310042 3254376 3073984 2988012 2854878 2800210 2837107 2788279 2738167 2613084 2614478
7220 2614478 2797519 2698502 2610937 2526623 2374995 2336230 2374551 2426889 2387844 2128146 2098518
7209 2098518 2009477 1765886 1787411 1819531 1914799 1854652 1724924 1620159 1745557 1689860 1719035
7198 1719035 1603797 1615317 1659652 1622485 1550879 1511922 1601670 1662207 1576132 1537987 1537727 1578605
7186 1578605 1585638 1488844 1436758 1322602 1161883 1241166 1306822 1382648 1374004 1228377 1217756
7175 1217756 1376525 1451825 1389955 1376744 1405481 1433429 1336622 1247194 1298766 1356747 1240084
7164A240084Q2596L2706j99360n6685o4098J67322Q537j27172K2101r7704Q7317
7153A095644P2174j11865n334J4477N5222O4203q0398J6489P9455k8031N1397
7142A223433j15049K720J32554r5011k5749j5811J4821J73382n637j41953j07635
7131A040065Q7160J86911j8012J6842p9744k28619M0611N4915j6756j09560o8918
7120I04895J1633K6941j3274Q007J10541j1639m2904J2608K9662l5009O894N6336
7108A064691k8583j95724P9739J6167N2651m6811J154J27297L7227p4123J28910
7097A162595J72563q49r6005K51016J39755p9203N6730m93J77579K31185K65874
7086B280747R5477J44857J08857J71067J29108N5756n6334j28775j68799q7865
$$ plain form
7164 1240084 1322680 1355386 1156026 1099341 1035243 1202565 1211102 1083930 1106031 1008327 1095644
7153 1095644 1167818 1055953 1050619 1065096 1120318 1184521 1104123 1120612 1200067 1172036 1223433
7142 1223433 1108384 1111104 1243658 1148647 1122898 1107087 1121908 1295290 1289653 1147700 1040065
7131 1040065 1127225 1314136 1296124 1312966 1233222 1004603 1045214 1100129 1083373 973813 904895
7120 904895 916528 943469 930195 938202 1048743 1037104 994200 1006808 1036470 1001461 1008355 1064691
7108 1064691 1036108 840384 920123 936290 988941 942130 943284 1070581 1107808 1033685 1162595
7097 1162595 1335158 1334309 1238304 1489320 1629075 1549872 1606602 1606109 1783688 2014873 2280747
7086 2280747 2376224 2521081 2629938 2801005 2930113 2985869 2929535 2800760 2631961 2544096
7076B544096k07542j41223q7722j28424m1607j61923j18509j5033k45301k15462
7066A181350N7612Q2302q9829j45617k640n8007n0279o828K75153N7940q1222
7055A219935J141p4634O119k278J4182n502P2743q6559n8793m1206l4311j7530
7043I93307o4747K9222J41119p160j99094Q998J7255o4133Q195O3100p1836m6802
7031H07424r9904q8290J06865Q8601r8294J22480L8649j12154o8534R4125m6659
7020G44309q8773J00114l3937r182L8095K4767J9449Q3341N1214j3052j9555j26483
7008G70307k4249R5661k4243j65375l2465J21543q5598J28731K0576m4102p354
6997G53432j24045L5788k1024R7436k6426l7820k0984j41976K7374q4889Q3334
$$ plain form
7076 2544096 2336554 2195331 2107609 1979185 1937578 1775655 1657146 1642113 1396812 1181350
7066 1181350 1238962 1321264 1231435 1085818 1083178 1025171 974892 968064 1243217 1301157 1219935
7055 1219935 1221076 1146442 1152561 1150283 1164465 1158963 1231706 1145147 1086354 1045148 1010837 993307
7043 993307 928560 957782 1098901 1091741 892647 901645 918900 854767 862962 926062 854226 807424
7031 807424 707520 619230 726095 814696 716402 838882 877531 765377 696843 790968 744309
7020 744309 655536 755650 721713 712531 750626 775393 794842 878183 929397 916345 896790 770307
7008 770307 746058 841719 817476 652101 619636 741179 655581 784312 804888 760786 753432
6997 753432 629387 665175 644151 741587 715161 677341 656357 514381 541755 456866 540200
6986E40200M5390j01006Q8434m2285M8009m384L4641O3699q5158n68j5752k4218
6974E47002L7713l9038J44326j0026n7148n2674r3739Q2869Q8984J369O8254m8421
6962F69471p702j9355P0018O6193m5660P5260j21340r7884J3819R6997j02285
6951E97532L9334O0600k9025j73179N6505J34128J2304j47223p1413J16806K0601
6940F16970M3038M1774L6927Q740j08455r5479J2980L1995j25358K6110J44447
6929F33689J34716r4280r3021m2670J7507k9470l5709M288P5542O5413j44610
6918D91395M2398O0257J68672j00492r5214J9414K9801M7190o9269J7053r911
6907F01294j21451M5813J1681M1622p9135n6373L1871Q6596P7925p1693j1821
$$ plain form
6986 540200 585590 484584 573018 530733 578742 574358 608999 672698 587540 586972 571220 547002
6974 547002 584715 545677 690003 679977 622829 570155 476416 559285 648269 649638 717892 669471
6962 669471 661769 642414 712432 778625 732965 808225 686885 589001 602820 699817 597532
6951 597532 636866 697466 668441 495262 551767 685895 698199 550976 479563 596369 616970
6940 616970 660008 701782 738709 747449 638994 543515 556495 588490 463132 489242 633689
6929 633689 768405 674125 581104 538434 555941 526471 490762 495050 570592 636005 491395
6918 491395 533793 594050 762722 662230 567016 586430 616231 663421 594152 611205 601294
6907 601294 479843 525656 537337 578959 499824 443451 475322 561918 639843 568150 556329
6896E56329j85473O3754J51903J4199L5282j1441J38618L2464K627j06389m4241
6885F47632P0215l3883l1525o537P8631O3336O6938Q62j31371o575m3072j01187
6873E73464J0686L2474J54713K2317m8929j52791K2787N7526m0474L3898p0632
6862E95039K0243P711q450O5571l9042p1099p0910N9299n0473R9464L507j53139
6850D57721j73674J17708J06535j27439J50480J23271N0293n8192o8493r2819
6840D85391K6587J5961J0930O4109j22375K09731k4965M0106R6414j260J43749
6829I44378k17021p6054M9102M5803j285j2788q341n5250N3324j67283J53594
6818G08179L9931j44371O919J36441M1467j8217Q3077j74239R6745j01838q3715
$$ plain form
6896 556329 370856 434610 586513 600712 635994 624553 763171 795635 798262 691873 647632
6885 647632 717847 683964 652439 645902 724533 787869 854807 855669 724298 717723 674651 573464
6873 573464 584150 616624 771337 793654 744725 591934 614721 672247 631773 665671 595039
6862 595039 615282 622993 614543 680114 641072 569973 499063 558362 507889 607353 610860 457721
6850 457721 284047 401755 508290 380851 531331 654602 704895 646703 578210 485391
6840 485391 511978 527939 538869 602978 480603 690334 665369 705475 801889 800629 944378
6829 944378 727357 651303 700405 746208 744923 732135 723794 668544 721868 554585 708179
6818 708179 748110 603739 610658 747099 788566 770349 853426 679187 775932 674094 590379
6807E90379o7758j2415k3985K3282M2918N8709j26954J30844P5401j51550o6036
6796D72835M256J54137R6802j23163k05659M6186O2331j11488J55646Q3186k03115
6785D31954k0888O4326p811J11136O5149J75542K0225o1258q0409M6976N7032
6774H01974j38805j33788L3200J36334o3453P6854m1514p5553p0333O1909L2277
6763F19102J4568n0505k0717Q0904j00582O0816L6473j10687p0702J14243j0884
6752E62029j07933J42695N2115o3433o1275j04724K47723J01932j83108l5110
6742E50911O0377J58061k9553J24850j13397p3752O8336P4264j29162l3614J36247
6731G93568k7980P2343j1585k1245k684R6572N7292J04481j1784o9105l4869M7399
$$ plain form
6807 590379 522621 510206 486221 509503 552421 611130 484176 615020 690421 538871 472835
6796 472835 477091 631228 728030 604867 399208 445394 507725 396237 551883 635069 431954
6785 431954 411066 475392 467581 578717 643866 819408 839633 778375 697966 744942 801974
6774 801974 663169 529381 562581 698915 635462 712316 670802 595249 524916 586825 619102
6763 619102 633670 583165 562448 643352 542770 603586 640059 529372 458670 572913 562029
6752 562029 454096 596791 648906 585473 524198 419474 667197 769129 586021 550911
6742 550911 611288 769349 739796 864646 751249 677497 745833 820097 690935 657321 793568
6731 793568 765588 837931 826346 805101 802417 898989 956281 1060762 1048978 979873 945004 992403
6719I92403L6320p2375J39944J07757j15038j23875P7122N0910N0617J95861K7520
6708A367166q236O4595j51475J8628j78430J452n0252m2258J2748j28395l3853
6697H71690P1826J483L7633R2236o6115P3587n7902l3434P6258n4905j5705r5736
6685I00916J66615R8302K984J0876J17742N1765r4641q9848j7135J4713j48997
6674A013292K3326K608J07817L5489j8336n1061K3597k7733Q0273J39374K35459
6663A564105P5303O4706Q0288r5853l7678K0943J27951J29562m7176j13879q1750
6652A686522K1814L546j23999r1799R356Q8296j4797J6617j01079k6777j9201
6641A448499m5582J87104k9515J4335P4961N3989o4111N3340j1793o1069n8276
$$ plain form
6719 992403 1028723 956348 1096292 1204049 1089011 965136 1042258 1093168 1143785 1339646 1367166
6708 1367166 1358930 1423525 1272050 1290678 1112248 1113700 1063448 1021190 1033938 905543 871690
6697 871690 943516 944999 982632 1074868 1008753 1082340 1024438 991004 1067262 1012357 996652 900916
6685 900916 1067531 1165833 1168817 1179693 1297435 1349200 1254559 1164711 1147576 1162289 1013292
6674 1013292 1036618 1039226 1147043 1182532 1164196 1113135 1136732 1108999 1189272 1328646 1564105
6663 1564105 1639408 1704114 1784402 1688549 1650871 1671814 1799765 1929327 1882151 1768272 1686522
6652 1686522 1708336 1711882 1587883 1496084 1505440 1593736 1578939 1595556 1494477 1467700 1448499
6641 1448499 1402917 1590021 1560506 1574841 1649802 1703791 1639680 1693020 1681227 1620158 1561882
6630A561882j5508J26075o459q3474k9849j00724L1354j3233o377j15413J25237
6619A473511J17659m3117J26482l7094N7140j26036J0996J36407K3036Q142P379
6608A754505r1063K6699p1014k8056r7994J09879J03671K4446m7400n0976K05872
6597A838569K0353j14177L3648l1326N4449Q5079J33653J34824j26580q4125l017
6586A941350O096K9848K6119J32050j1612j84755R9152Q6274R8944R5030M6058
6575B364554k914l8444J39842n9157Q7292N0630q1460M5134O3589Q8079J85627
6564B842772J21461n8587J67344n5608J7681K28689J23570k1137K7282J16097
6554C509564M6554J25777J37863J83908K29420K92939L40271L96951L18448M21237
$$ plain form
6630 1561882 1546374 1672449 1665990 1582516 1552667 1451943 1483297 1470064 1463687 1348274 1473511
6619 1473511 1591170 1548053 1674535 1637441 1694581 1568545 1579541 1715948 1738984 1747126 1754505
6608 1754505 1663442 1690141 1619127 1591071 1493077 1602956 1706627 1731073 1683673 1632697 1838569
6597 1838569 1858922 1744745 1778393 1747067 1801516 1886595 2020248 2155072 2028492 1944367 1941350
6586 1941350 1947446 1977294 2003413 2135463 2123851 1939096 2038248 2124522 2223466 2318496 2364554
6575 2364554 2361640 2323196 2463038 2403881 2491173 2541803 2460343 2505477 2569066 2657145 2842772
6564 2842772 2964233 2905646 3072990 3017382 3035063 3263752 3387322 3366185 3393467 3509564
6554 3509564 3556118 3681895 3819758 4003666 4233086 4526025 4866296 5263247 5581695 6002932
6544F002932O56563M06148P14663N98667N86202N71248L47943J46528p9703j61162
6534I790029n01631m42234m54393l79540k82366k54024k52935q2076r4718l5675
6524G010437k8911j04924j57090k61444j52171l86497k26591k23344k17213k79275
6514D972977k55854j79864k20058j04092p5934j18813P68j27092j25269j03588
6504C663181j00081j04243Q4375m898j52483k7559J828p4100j61043J43777n252
6493C263502Q5391k3766m3129j51886j21999o1883l1632j32513R8166O8008o5343
6482B882916j29121L7551R8376o3307M2744O2930M6621k7044n9141j83289R3941
6471B803177M7176l5237J90849R2205p9551r7347N7906M2197j32254K6849J8005
$$ plain form
6544 6002932 6659495 7065643 7780306 8378973 8965175 9536423 9884366 10030894 9951191 9790029
6534 9790029 9288398 8846164 8391771 8012231 7729865 7475841 7222906 7140830 7046112 7010437
6524 7010437 6981526 6876602 6719512 6458068 6305897 5919400 5692809 5469465 5252252 4972977
6514 4972977 4717123 4537259 4317201 4213109 4137175 4018362 4019130 3892038 3766769 3663181
6504 3663181 3563100 3458857 3543232 3538334 3385851 3358292 3360120 3286020 3124977 3268754 3263502
6493 3263502 3348893 3325127 3281998 3130112 3008113 2946230 2914598 2782085 2880251 2948259 2882916
6482 2882916 2753795 2791346 2889722 2826415 2869159 2932089 2978710 2951666 2892525 2709236 2803177
6471 2803177 2850353 2815116 3005965 3098170 3018619 2921272 2979178 3021375 2889121 2915970 2933975
6460B933975r9664o2991J54312n4770K8242m3776R6276P5621m4988j07069L5118
6449B910286J94323R8237Q030L6966J11208J22226K8767l2401J46123Q4995J2324
6438C721084O1980Q4359M8765l5263O4367N1483K4970J26252N8580l4620J40784
6427D312741J14673J0127J10862n76j4439K4134Q5247J8452N3827O514m8658j82651
6415D490253K2033M3655J10891L5749J92909R7878j19470O4777M2914Q0832J49257
6404E211678M8328J89773R7543N9957J64232J00949p0170j11035P141J9058j02509
6393E614945R9152o1054p7976m0959J36856O2472M4933J14335j14584J91108J55938
6382F125166J75870J04865k4065L38736J94747K10321K11267J35507J28124K21657
$$ plain form
6460 2933975 2834311 2771320 2925632 2870862 2899104 2855328 2951604 3027225 2982237 2875168 2910286
6449 2910286 3104609 3202846 3210876 3247842 3359050 3481276 3510043 3477642 3623765 3708760 3721084
6438 3721084 3783064 3867423 3916188 3880925 3945292 3996775 4021745 4147997 4206577 4171957 4312741
6427 4312741 4427414 4437541 4548403 4547827 4533388 4557522 4642769 4661221 4715048 4721562 4672904 4490253
6415 4490253 4512286 4555941 4666832 4702581 4895490 4993368 4873898 4938675 4981589 5062421 5211678
6404 5211678 5260006 5449779 5547322 5607279 5771511 5872460 5802290 5691255 5698396 5717454 5614945
6393 5614945 5714097 5653043 5575067 5534108 5670964 5733436 5778369 5892704 5778120 5969228 6125166
6382 6125166 6301036 6405901 6381836 6720572 6915319 7125640 7336907 7472414 7600538 7822195
6372G822195L27435J84190K13373K11111M18737L64784M29455M21039M73002N59758
6362A1425079M38691P17279P30230P21118Q60793J131174J269482J337041J458609
6353B0089496J556298J677273J628923J468809J259495R75503Q83865P44667J110442
6344C1394771J495549J403155J584605J460219J267265J144145J034351Q71365
6336D1655425P97234R54885J283179J494015J695522J452077J528189J383245
6328E2243771J210467J308438J901684K454912L370733M393303N336715N832235
6320G8052258O071334N525581M538263K778907P62658j536833l168043m369132
6312H8654993m329096l362646k583992j554004o02927L40095J225403K214196
$$ plain form
6372 7822195 8149630 8333820 8547193 8758304 9177041 9541825 9971280 10392319 10865321 11425079
6362 11425079 11863770 12581049 13311279 14032397 14893190 16024364 17293846 18630887 20089496
6353 20089496 21645794 23323067 24951990 26420799 27680294 28655797 29539662 30284329 31394771
6344 31394771 32890320 34293475 35878080 37338299 38605564 39749709 40784060 41655425
6336 41655425 42452659 43407544 44690723 46184738 47880260 49332337 50860526 52243771
6328 52243771 53454238 54762676 56664360 59119272 62490005 66883308 72220023 78052258
6320 78052258 84123592 89649173 94187436 96966343 97729001 96192168 93024125 88654993
6312 88654993 84325897 80963251 78379259 76825255 76222328 76562423 77787826 80002022
6304H0002022L455919M170066M742185N243729N037470M509899L198352J215342
6296A11574984p67223k139769l409795m762757o043938o309924n392317m706429
6288G8042832m102900l151529k561126j958806j465774p71374l81130J18059O08638
6279F4376890J006449J727336K533374L334382M185623M593645N295133N609443
6271I2662275N204887M808857L842326K240487L17010j319852k483831l452435
6263A01819724m122132m805814m472407l672927k927848k243015j217135l52047
6255G8006399N39113J513413K593048L468787L717120L426259K774734J734332
6247I7773205l04994k228721l718974m824205n307386m815246m162476l546274
$$ plain form
6304 80002022 83457941 87628007 92370192 97613921 102651391 107161290 110359642 111574984
6296 111574984 110807761 108667992 105258197 100495440 94451502 88141578 82749261 78042832
6288 78042832 73939932 70788403 68227277 66268471 64802697 64031323 63650193 63768252 64376890
6279 64376890 65383339 67110675 69644049 72978431 77164054 81757699 87052832 92662275
6271 92662275 97867162 102676019 106518345 108758832 109075842 107755990 105272159 101819724
6263 101819724 97697592 92891778 88419371 84746444 81818596 79575581 78358446 78006399
6255 78006399 78545512 80058925 82651973 86120760 89837880 93264139 96038873 97773205
6247 97773205 97468211 95239490 91520516 86696311 81388925 76573679 72411203 68864929
6239F8864929l011337k269150j829626j698438j639036j641255j668543j739800
6231E3367744j630009j593132j383094j082054q62510r79274r69283j232344j236715
6222D2399329j592877j477878j355536j150913q30158r11081j020025r32105j104612
6213C2024144j383798j675165j659076j605237j595657j369584j262334j038698
6205B0434595j092255q48519o52312p67496o64211o63620n47674m10865n34914
6196A4252729l91813l95357l18117k19568l66906k70290j01863k24907k08909
6187A1754999j93341j03521p2267q7791m9412q5131k16966j59721r1022j25833
6177A0569994o2396k13082l27624k41977j43282m2242q753k29373q1963J3802
$$ plain form
6239 68864929 65853592 63584442 61754816 60056378 58417342 56776087 55107544 53367744
6231 53367744 51737735 50144603 48761509 47679455 46816945 45837671 44868388 43636044 42399329
6222 42399329 40806452 39328574 37973038 36822125 35991967 35080886 34060861 33128756 32024144
6213 32024144 30640346 28965181 27306105 25700868 24105211 22735627 21473293 20434595
6205 20434595 19342340 18493821 17841509 17074013 16409802 15746182 15198508 14787643 14252729
6196 14252729 13860916 13465559 13147442 12927874 12560968 12290678 12188815 11963908 11754999
6187 11754999 11561658 11458137 11385870 11298079 11248667 11163536 10946570 10786849 10695827 10569994
6177 10569994 10507598 10294516 9966892 9724915 9581633 9539391 9530638 9301265 9219302 9233104
6167I233104j58658j62811j38209j45947m5368q9614j33075j66742N0137j3873
6157H228944j47236L1165j78271p4099j47085N1470j10713j74706L9203p055p5891
6146G435726M0570j13490j10871L985j25077J1519j5645k38842k27802j54812
6136F505261l9638j54630k19902r1513j74774j47256j23966q5991r6295k17128
6126E154168m0469j26238k0658j03717l3540q1019k35970j90351n3439k0446j9896
6115D228425j30025m3750O528J11811j20605j99076m9863j21765n8739J17114
6105C740055N6411j90425J44264K8701p4349j48246l1941L8663j53170M3584j94130
6094C259417j43630J60211P2400k1603j15232p1616j8218k1089q2878R1352J69021
$$ plain form
6167 9233104 9074446 8911635 8773426 8627479 8582111 8492497 8359422 8192680 8242817 8228944
6157 8228944 8081708 8112873 7934602 7860503 7713418 7764888 7654175 7479469 7518672 7511617 7435726
6146 7435726 7476296 7362806 7251935 7255920 7130843 7142362 7126717 6887875 6660073 6505261
6136 6505261 6465623 6310993 6091091 5999578 5824804 5677548 5553582 5467591 5371296 5154168
6126 5154168 5113699 4987461 4966803 4863086 4829546 4748527 4512557 4322206 4268767 4248321 4228425
6115 4228425 4098400 4054650 4061178 4172989 4052384 3853308 3803445 3681680 3622941 3740055
6105 3740055 3796466 3606041 3750305 3779006 3704657 3556411 3524470 3563133 3409963 3453547 3259417
6094 3259417 3115787 3275998 3348398 3326795 3211563 3139947 3121729 3100640 3017762 3109114 3278135
6083C278135k3176M8051P0175J1831Q1914j85216j71721p1065N2496O2907l4758
6072C119573m2461J5391J12063p0237j00022J5427j1234R6238j4360q2794n2559
6061B985025Q7325P8040J39887N3757P6536j0603L093j9216K9073R9613j56859
6050C365671r5994q5676O5527q5305J4666N3328q7639m8646P0527L8076m3094
6039C161441q9578P2302L266P7786O9029n4098L398p4816o574m3392J19705k627
6027C235842M5382Q9827K1262l5446O9478n1991j750j54380j31286O0019P345
6016C154302k450l1128J7221J71462o2112p4784J7173k9177P8194P4291q204K69112
6004C573900l0869M9997Q1150J1738J30742J54756j61160j35661J77361k4074
$$ plain form
6083 3278135 3254959 3303010 3373185 3385016 3466930 3281714 3109993 3038928 3091424 3154331 3119573
6072 3119573 3077112 3092503 3204566 3134329 3034307 3049734 3038500 3134738 3120378 3037584 2985025
6061 2985025 3072350 3150390 3290277 3344034 3420570 3409967 3413060 3393844 3422917 3522530 3365671
6050 3365671 3269677 3184001 3249528 3164223 3178889 3232217 3144578 3095932 3166459 3204535 3161441
6039 3161441 3071863 3144165 3147431 3225217 3294246 3240148 3243546 3168730 3162156 3118764 3238469 3235842
6027 3235842 3281224 3371051 3392313 3356867 3426345 3374354 3372604 3218224 3086938 3146957 3154302
6016 3154302 3151852 3120724 3137945 3309407 3247295 3172511 3189684 3160507 3238701 3312992 3304788 3573900
6004 3573900 3543031 3593028 3674178 3685916 3816658 3971414 3810254 3674593 3851954 3827880
5994C827880k4836M0270j43942m9091j44007j6607L2683p3301Q2407M1105J09254
5983C681815O4467K12917k771Q0527R6754P2138J11645J46092J05245K24700N292
5972D798821m5962L97580J27870P4980J61668J20355L03748K93871L10218J30665
5962F673814L54666L88402M47697L60377O29527M67308L11790Q2601O1198n6703
5952I720677k86035k67146m47682l94318l04465n72000m14029k76678l25723k32125
5942F200476j61359k26378j94129m6497k8934j36390p4806Q8723j18024M272k9660
5931E277294j01442j30058K5102j30445j21764j44133j20303O2269N3072q3425
5921D586167j0181j05575K5477m0675j79178j04694J9575L9822Q1261R9835K5871
$$ plain form
5994 3827880 3803044 3843314 3699372 3650281 3506274 3489667 3522350 3449049 3531456 3572561 3681815
5983 3681815 3746282 3959199 3956428 4036955 4133709 4205847 4317492 4463584 4568829 4793529 4798821
5972 4798821 4752859 5150439 5278309 5353289 5514957 5635312 5939060 6232931 6543149 6673814
5962 6673814 7028480 7416882 7864579 8224956 8854483 9321791 9633581 9716182 9777380 9720677
5952 9720677 9434642 9167496 8719814 8325496 8021031 7449031 7035002 6758324 6432601 6200476
5942 6200476 6039117 5812739 5618610 5572113 5543179 5406789 5331983 5420706 5302682 5306954 5277294
5931 5277294 5175852 5045794 5070896 4940451 4818687 4674554 4554251 4616520 4669592 4586167
5921 4586167 4575986 4470411 4495888 4455213 4276035 4171341 4190916 4230738 4311999 4411834 4437705
5910D437705Q8350k18368J74891R4462q7216R5657N672P5864L5070m4807O2367
5899D719647Q0409J56428J16574R3907O455J9929l0236J26771J32186J35186Q0479
5888E637735k551j15785J07564O2068Q4973m7030k8663Q6095J8292N4660k4813
5877E832545j39291n8429K2480j1218q5799l34680J38461j66093j12640O363k00347
5866D891352L925Q2770N1888N8232j04106N2953L1905J08388j4471Q5417l2939
5855E215314j35452j85775j3236n9368n8127l9180o627J52292N0936j17849M2359
5844D845287O2746n518p0036J51696N0722L4988K3639k15028k8724j11238p3942
5833D664592K031n6618P9169R2233j4500j7669J4059J75335P6795J99969P0028
$$ plain form
5910 4437705 4526055 4307687 4482578 4577040 4489824 4585481 4591153 4667017 4702087 4657280 4719647
5899 4719647 4800056 4956484 5073058 5166965 5173420 5193349 5163113 5289884 5422070 5557256 5637735
5888 5637735 5635184 5519399 5626963 5689031 5774004 5726974 5698311 5784406 5802698 5857358 5832545
5877 5832545 5693254 5634825 5657305 5646087 5560288 5225608 5364069 5197976 5085336 5091699 4891352
5866 4891352 4895277 4978047 5029935 5088167 4984061 5037014 5068919 5177307 5162836 5248253 5215314
5855 5215314 5079862 4894087 4880851 4821483 4763356 4724176 4717549 4869841 4920777 4802928 4845287
5844 4845287 4908033 4902515 4832479 4984175 5034897 5069885 5093524 4878496 4849772 4738534 4664592
5833 4664592 4666623 4610005 4689174 4781407 4766907 4749238 4763297 4938632 5015427 5215396 5285424
5822E285424P0711P2146J14898Q7204K49138O2063J23313J40105L3222J22711
5812F360935K55331J57814P5239r3241r5450o95p9049q8322q1624M6892n3718
5801F404112j16658j91493o6823L7803M0433K4259j45862j67920j70232q1250
5791E566369n5921K9305j10308p5252j50079k21998p5054q26O5074j14223J7150
5780D874237r5563m813J3594m657O2012N3601J85627p9506j70088R6029p0290
5769D860183J20219L2359N6003J7440O474K8031j29713j36759l1245m9429J4141
5758D787704l5806j0890r9289J28102J34442j18955r2700l0021R193M829j21680
5747D554929p8006P9084P070L8891n9617k6143j75223m3717j53864n4101P9121
$$ plain form
5822 5285424 5356135 5428281 5543179 5630383 5879521 5941584 6064897 6205002 6238224 6360935
5812 6360935 6616266 6774080 6849319 6756078 6660628 6659933 6580884 6492562 6410938 6457830 6404112
5801 6404112 6287454 6095961 6029138 6066941 6107374 6131633 5985771 5817851 5647619 5566369
5791 5566369 5510448 5539753 5429445 5354193 5204114 4982116 4907062 4906236 4971310 4857087 4874237
5780 4874237 4778674 4773861 4787455 4782798 4844810 4898411 5084038 5004532 4834444 4930473 4860183
5769 4860183 4980402 5012761 5068764 5086204 5092678 5120709 4990996 4854237 4822992 4773563 4787704
5758 4787704 4751898 4741008 4641719 4769821 4904263 4785308 4692608 4662587 4671780 4676609 4554929
5747 4554929 4476923 4556007 4563077 4601968 4542351 4516208 4340985 4297268 4143404 4089303 4168424
5736D168424J75409M1267p5945q4014k1509O6783J59516P0252j5971K95K0701
5725D505208M9307J89931O1446o1641k01897R2610Q8810J36491J20526K9923O6100
5714E076814J5743J32545L5989J19945J49339J88026L3334k6259K25217R8521
5704F049214J52977K95893J91623Q4636J11562J93346K30836J67559J45512K70117
5694G893275L46404K60455K43665L13850K21592J26467J29708m4234k27659j43084
5684I120439J025R2111K1218q6332p5203J38635J19794O9621M6785R7241P2411
5673I617745J50259K60720O9599p9173K68902L03874K06258L15255K80468L60092
5663A1753999P15372P06508R25717Q69922O86926N54593J91379m4405n92623n94121
$$ plain form
5736 4168424 4343833 4385100 4309155 4225141 4203632 4270415 4429931 4500183 4484212 4484507 4505208
5725 4505208 4554515 4744446 4805892 4744251 4542354 4634964 4723774 4860265 4980791 5010714 5076814
5714 5076814 5092557 5225102 5261091 5381036 5530375 5718401 5751735 5725476 5950693 6049214
5704 6049214 6202191 6498084 6689707 6774343 6885905 7079251 7310087 7477646 7623158 7893275
5694 7893275 8239679 8500134 8743799 9057649 9279241 9405708 9535416 9491182 9263523 9120439
5684 9120439 9121464 9213575 9234793 9148461 9073258 9211893 9331687 9401308 9448093 9545334 9617745
5673 9617745 9768004 10028724 10098323 10019150 10288052 10591926 10798184 11113439 11393907 11753999
5663 11753999 12469371 13175879 14101596 14971518 15658444 16213037 16404416 16360011 15767388 15173267
5653A5173267m19347m53193k98503j64850k56125j60314P8110l6879n4617P7966
5643A3485515K75991K12515K67461K14332L69890K96179J34256L62245O22618
5634A6241002M76066N89986P12374P70503P96148Q52451Q18049R18314O24581
5625B2799474M05774J06260m51911l55702k40261P2255J7742K29599K73532J97137
5615B3053899N35807O83157O52795P31847P90397Q37548J056089J098150J020823
5606C0460512J324177J481781J439454J511730J915628K212416K303542K675666
5598D5324906L116249L441251L730087M053993M540107N087547N803697O157275
5590H1255112O774217P730908Q367179R024063R570832R572090R567675Q993802
$$ plain form
5653 15173267 14753920 14300727 14002224 13837374 13581249 13420935 13499045 13462166 13407549 13485515
5643 13485515 13761506 13974021 14241482 14455814 14825704 15121883 15256139 15618384 16241002
5634 16241002 16717068 17307054 18019428 18789931 19586079 20438530 21256579 22174893 22799474
5625 22799474 23205248 23311508 22859597 22503895 22263634 22335889 22353631 22583230 22856762 23053899
5615 23053899 23589706 24272863 24925658 25657505 26447902 27285450 28341539 29439689 30460512
5606 30460512 31784689 33266470 34705924 36217654 38133282 40345698 42649240 45324906
5598 45324906 48441155 51882406 55612493 59666486 64206593 69294140 75097837 81255112
5590 81255112 88029329 95760237 104127416 113151479 122722311 132294401 141862076 150855878
5582A50855878P716843N986840L879409J458048j009162l317197n268083o604222
5574A53698354p375351p752848p998981q325169q447419q290610p904112p443684
5566I0160180o998571o385721n664837n194699m680580m101358l749887l500923
5558D9883604l221992k732373k332992k187822k143571j953497j720317j641999
5550C1949041j416881j222515j193048j116403r48653o96772p83468q73823q42709
5541B2854769q29141p91268q76885o58465o61778o03473n48083n53936m93629
5532A6838111m79046o37122o94120l97778l70020k08706m00908m37198m16182
5523A2797031m55796m95544l09693k95983l13882k87635l00326k25199j37649
$$ plain form
5582 150855878 158572721 164559561 168438970 169897018 168887856 165570659 160302576 153698354
5574 153698354 146323003 138570155 130571174 122246005 113798586 105507976 97603864 90160180
5566 90160180 83161609 76775888 71111051 65916352 61235772 57134414 53384527 49883604
5558 49883604 46661612 43929239 41596247 39408425 37264854 35311357 33591040 31949041
5550 31949041 30532160 29309645 28116597 27000194 26051541 25354769 24571301 23697478 22854769
5541 22854769 22025628 21234360 20357475 19699010 19037232 18433759 17885676 17331740 16838111
5532 16838111 16359065 15721943 15027823 14630045 14260025 14051319 13650411 13213213 12797031
5523 12797031 12341235 11845691 11535998 11240015 10926133 10638498 10338172 10112973 9975324
5514I975324k61695l44174j74215j79492k14211k3022k50595m7847j00598k62929
5504H116546j34978J3266k4838N5010j33688j82202J8899J4170P4473j28423n7345
5493G630890j32732J57691P2160r5850l1844J06507j33132j74687m9777p953j72524
5482G168749j3620R4108j21307j34697k06863o7767l4692q7308o8072j11982j67654
5471F248895j63221j20013j11968n7640l7223j91460j69855j23242K5211j11688
5461E187796k03936N2683O2893j05201j27144M5885p0222o2112r9821Q8455n8920
5450D710356o0419j63584P0777P9039j12894k2013l7902l8877r8801M7021K49204
5439D621907P1418r6023n8531P2072J02165R4579k2911k2519J69066m6318J8132
$$ plain form
5514 9975324 9713629 9369455 9195240 9015748 8801537 8778515 8527920 8480073 8379475 8116546
5504 8116546 7981568 7994834 7969996 8025006 7891318 7709116 7728015 7742185 7816658 7688235 7630890
5493 7630890 7498158 7655849 7728009 7632159 7600315 7706822 7573690 7399003 7349226 7341273 7168749
5482 7168749 7155129 7249237 7127930 6993233 6786370 6718603 6683911 6596603 6528531 6416549 6248895
5471 6248895 6085674 5965661 5853693 5796053 5758830 5567370 5397515 5274273 5299484 5187796
5461 5187796 4983860 5036543 5099436 4994235 4867091 4912976 4842754 4780642 4680821 4769276 4710356
5450 4710356 4649937 4486353 4557130 4636169 4523275 4501262 4463360 4424483 4325682 4372703 4621907
5439 4621907 4693325 4597302 4538771 4610843 4713008 4807587 4784676 4762157 4931223 4884905 4903037
5428D903037m6042q7372q6961N9669J62248M0045J4244R3041J0099j40025j0306
5417D911677O8600j28166R1664Q7809Q1513Q9347J32229K27767j9861J31508K53011
5406E927098J9345j1119m3748p7176j19574k5223r3198r9796p2780k45028k47602
5395D911199k0709j30122j34544k958n3961j35102l2487o4744j6611n6121r2583
5384D171257k7064N931p8942J35128N4660L0059k46614n9626J9321j22423O8868
5373C950555L6146m6774M912N5999m9691l8803K1495K8291q3430j4492n9490K8746
5361C833464P3401j01804j75570J14104O3008o9376J1791M7449j05644j4040P0469
5350C747252j08427j80836m3637j22815j28303N9373Q4185Q6043p0727k1983l6785
$$ plain form
5428 4903037 4856995 4769623 4682662 4742331 4904579 4944624 4958868 5051909 5062008 4921983 4911677
5417 4911677 4980277 4852111 4943775 5031584 5113097 5202444 5334673 5562440 5542579 5674087 5927098
5406 5927098 5946443 5935324 5891576 5814400 5694826 5669603 5576405 5476609 5403829 5158801 4911199
5395 4911199 4890490 4760368 4625824 4622866 4568905 4433803 4401316 4336572 4319961 4263840 4171257
5384 4171257 4144193 4150124 4071182 4206310 4260970 4291029 4044415 3984789 4004110 3881687 3950555
5373 3950555 3986701 3939927 3944839 4000838 3951147 3912344 3933839 3962130 3878700 3864208 3804718 3833464
5361 3833464 3906865 3805061 3629491 3743595 3806603 3737227 3749018 3796467 3690823 3676783 3747252
5350 3747252 3638825 3457989 3414352 3291537 3163234 3222607 3306792 3392835 3322108 3300125 3263340
5339C263340J10692l7470L3731L5462o5767J23500r6093L7724j10389m5880O6696
5328C315546M4183j39408m9439m3482J47478L735j55900j44093J03300R5120J14587
5317C291627l3613M6683J61156O2026r8864j55979N1500M3983O8401K3626K4684
5306C485230L0911K2073Q2465p738J00254P5415l2199j43407J5913o0475j07710
5295C460732J56805j38185K9991J25684L9372Q5369J43830o9648O0998R3917k6842
5284C962023l1777l9026J20758K3081J16632P0238J12904N734O6363k8833l449
5273D374648R5921P8622J46794j32611J08657l9520J29337J093o9625N0058N6853
5262D800227J62336M7680p0665J79179J96759M3724P6392K20269Q6117J15928
$$ plain form
5339 3263340 3374032 3336562 3370293 3405755 3339988 3463488 3367395 3405119 3294730 3248850 3315546
5328 3315546 3359729 3220321 3170882 3127400 3274878 3278613 3122713 2978620 3081920 3177040 3291627
5317 3291627 3258014 3304697 3465853 3527879 3429015 3273036 3324536 3368519 3436920 3460546 3485230
5306 3485230 3516141 3538214 3620679 3612941 3713195 3788610 3756411 3613004 3628917 3568442 3460732
5295 3460732 3617537 3479352 3509343 3635027 3674399 3759768 3903598 3833950 3894948 3988865 3962023
5284 3962023 3930246 3891220 4011978 4035059 4151691 4221929 4334833 4340567 4406930 4378097 4374648
5273 4374648 4470569 4549191 4695985 4563374 4672031 4632511 4761848 4762941 4693316 4743374 4800227
5262 4800227 4962563 5010243 4939578 5118757 5315516 5359240 5435632 5655901 5742018 5857946
5252E857946K71150K67908M72278K63344M63749M83939L76708K73162J88647J45339
5242I064170j29666l38948j48270k89011k60150l36467j69690o5591k14454j37953
5232F973970j28320m1493m3956q753l7486K8681j91225J24601J39227O8456l6823
5221F846879J19774P8054k24068J67446J85058J83783J49920J45089K97186K27585
5211H176706K35013K54581K55947K29125N26660N47391M08275L44980O18301N93865
5201A2190844O37727O80899O54248L95622K44085N01401K92643N6748J03638m2759
5191A5715096K8530J03020J47959J32716N17385M24786M11441N42371N52210K90901
5181A8866415L8284J30231j52095k54287l37421m63926n63708o05499l57126l88674
$$ plain form
5252 5857946 6129096 6397004 6869282 7132626 7596375 8080314 8457022 8730184 8918831 9064170
5242 9064170 8934504 8595556 8447286 8158275 7898125 7561658 7391968 7326377 7111923 6973970
5232 6973970 6845650 6804157 6760201 6751448 6713962 6742643 6551418 6676019 6815246 6883702 6846879
5221 6846879 6966653 7044707 6820639 6988085 7173143 7356926 7506846 7651935 7949121 8176706
5211 8176706 8411719 8666300 8922247 9151372 9678032 10225423 10633698 10978678 11596979 12190844
5201 12190844 12828571 13509470 14163718 14559340 14803425 15304826 15597469 15654217 15757855 15715096
5191 15715096 15743626 15846646 15994605 16127321 16644706 17069492 17480933 18023304 18575514 18866415
5181 18866415 18904699 19034930 18882835 18628548 18291127 17827201 17263493 16657994 16300868 15912194
5171A5912194j36242r5401q938p5368K03968J55864K46283N44662M73911Q40524
5161A8061457O97680Q03922R18580R29457P36876Q00975P37449P90878P64841
5152B5242115O98918Q28092O93972Q85267Q81325O54235O89688K13562J02226
5143C0889400r8440k01219p73303q16243j010071j002206j009600j051870p89225
5134B4137223p31407o99197k49816j72334k9266M8254K47313N72355R32876J241031
5124B5297032J414075J449915J339329J214135Q42320O84125J34834n88793q86034
5115C0900938q91406r04651j035074j103424j123721j125514r75999r06407j100238
5106B1734504r23476p84826o81483o74312n01577l68971n84897k60990j86829
$$ plain form
5171 15912194 15775952 15680551 15671613 15596245 15800213 15956077 16202360 16747022 17220933 18061457
5161 18061457 18759137 19563059 20481639 21411096 22147972 22948947 23686396 24477274 25242115
5152 25242115 25941033 26769125 27463097 28348364 29229689 29883924 30573612 30787174 30889400
5143 30889400 30790960 30589741 29816438 29000195 27990124 26987918 25978318 24926448 24137223
5134 24137223 23405816 22706619 22456803 22284469 22255203 22303457 22550770 23123125 24056001 25297032
5124 25297032 26711107 28161022 29500351 30714486 31556806 32240931 32375765 31786972 30900938
5115 30900938 30009532 29104881 28069807 26966383 25842662 24717148 23741149 22834742 21734504
5106 21734504 20811028 20026202 19344719 18670407 18168830 17799859 17214962 16953972 16767143
5097A6767143l71445l24599k80483k09908j80294q1006Q8862j94023r5821j7001
5087A5101425J49106K00422Q8475J11930J46217L3906j10667Q4391k7958o572
5077A5770675j3810j00859k00536j41309q0678j6744K9437k32577o5814q2306
5067A4865479m6771j17055m8721r140k38606r1873m379j96469j65429J100j51150
5056A3796986q065l1879o3486n2918j97726J99942J34650p7841N6622J70228K2537
5045A3949050k7344J30354K02163J3766O3146O3823L1150K33170j2517j8184M9497
5034A4678074K3013J70844N0439L0595J01288J49404J58635J34765J22398J18814
5024A5738269J77193K25245L2776M2571J40089K86219K37254L41767L70302K09277
$$ plain form
5097 16767143 16395698 16071099 15790616 15580708 15400414 15319408 15408270 15214247 15118426 15101425
5087 15101425 15250531 15450953 15539428 15651358 15797575 15831481 15720814 15805205 15777247 15770675
5077 15770675 15756865 15656006 15455470 15314161 15233483 15216739 15246176 15013599 14947785 14865479
5067 14865479 14818708 14701653 14652932 14643792 14405186 14313313 14308934 14112465 13947036 13948136 13796986
5056 13796986 13788921 13757042 13693556 13640638 13442912 13642854 13777504 13699663 13756285 13926513 13949050
5045 13949050 13921706 14052060 14254223 14267989 14331135 14394958 14426108 14659278 14646761 14628577 14678074
5034 14678074 14701087 14871931 14922370 14952965 15054253 15203657 15362292 15497057 15619455 15738269
5024 15738269 15915462 16140707 16173483 16216054 16356143 16642362 16879616 17221383 17591685 17800962
5014A7800962K65544L53386J84920J41498o0310j6167J17295P8279J30231K66935
5004A9262573J25022Q3928Q6503K51214L78167L14847L20721J78727K61933K51209
4994B1514844J87557J44224J96702J70642J36881J53732K02490K30578n17J98181
4984B3135314K55807J46121K26948L09462L26469L59889L23631L62226K38513
4975B5684380K92599M44414M09936M06123M35058O16260N58720M80996L99420
4966B9727906N62372P47455N10999N29885M60138N32278O12691M71193N39073
4957C4693990N28825N36781M68744O02305O32653O41149P29452Q32100Q71224
4948D0537223P38669Q92989Q62765R24202J066968J174568J357184J259078J384266
$$ plain form
5014 17800962 18066506 18419892 18604812 18746310 18686000 18669833 18787128 18865407 18995638 19262573
5004 19262573 19387595 19471523 19558026 19809240 20187407 20502254 20822975 21001702 21263635 21514844
4994 21514844 21702401 21846625 22043327 22213969 22350850 22504582 22707072 22937650 22937133 23135314
4984 23135314 23391121 23537242 23764190 24073652 24400121 24760010 25083641 25445867 25684380
4975 25684380 25976979 26421393 26831329 27237452 27672510 28288770 28847490 29328486 29727906
4966 29727906 30290278 31037733 31548732 32078617 32538755 33071033 33683724 34154917 34693990
4957 34693990 35222815 35759596 36228340 36830645 37463298 38104447 38833899 39665999 40537223
4948 40537223 41275892 42168881 43031646 43955848 45022816 46197384 47554568 48813646 50197912
4939E0197912J688050K022497J927008J924736K252890K478065K378679K775837
4931F7645674K939994L364989L624956M133578M564837M909369N328913N906431
4923A02418741O320340O745430P506797Q168072Q885069R620399J0257925J1270836
4915A71193609J2115116J2644999J3179163J3754955J4086894J3820106J3047758
4908B63842600J1757775R664240O758648L254694n25909l541966o226028p931145
4900B77052909r054329r598615r885680j0515874j0755595j1270589j1733857
4893B04238370j1887067j1536293j0565812r555111q855440q063891p293488o828001
4885A29653267o378895o054942n822972n610564n287680m943192m542248m094069
$$ plain form
4939 50197912 51885962 53908459 55835467 57760203 60013093 62491158 64869837 67645674
4931 67645674 70585668 73950657 77575613 81709191 86274028 91183397 96512310 102418741
4923 102418741 108739081 115484511 122991308 131159380 140044449 149664848 159922773 171193609
4915 171193609 183308725 195953724 209132887 222887842 236974736 250794842 263842600
4908 263842600 275600375 285264615 292023263 295277957 294752048 291210082 284984054 277052909
4900 277052909 267998580 258399965 248514285 237998411 227242816 215972227 204238370
4893 204238370 192351303 180815010 170249198 160694087 151838647 143774756 136481268 129653267
4885 129653267 123274372 117219430 111396458 105785894 100498214 95555022 91012774 86918705
4877H6918705l823412l525875l191061k961150k677960k498684k623196k505542
4869F3111825k335716k153513j803312j747074j717526j412740j219199j080803
4861D9641942q12524p03121m89936m63733k42863J9568K05946N27463O02875J016935
4851D9302552J275294J274023J535958J492749J318597J220166J050638N53192
4843E9023169L991n31606j060770j457231j799135k085275k355814k354822k164239
4834D5218268j948487j964079j743065j440204j376178j273864j203759j166258
4826C3102374j032328p02341r05498r66357q30639p05091p77240o67003o39131
4817B5876746n64038p00733n93016n85567o23742k97201l23030k93006m47422
$$ plain form
4877 86918705 83095293 79569418 76378357 73417207 70739247 68240563 65617367 63111825
4869 63111825 60776109 58622596 56819284 55072210 53354684 51941944 50722745 49641942
4861 49641942 48829418 48126297 47636361 47172628 46929765 46949333 47155279 47682742 48285617 49302552
4851 49302552 50577846 51851869 53387827 54880576 56199173 57419339 58469977 59023169
4843 59023169 59027160 58495554 57434784 55977553 54178418 52093143 49737329 47382507 45218268
4834 45218268 43269781 41305702 39562637 38122433 36746255 35472391 34268632 33102374
4826 33102374 32070046 31367705 30462207 29495850 28665211 27960120 27182880 26515877 25876746
4817 25876746 25312708 24611975 24018959 23433392 22809650 22512449 22189419 21896413 21448991
4808B1448991k21321l25371k40678l22398k17002k21788k64653j69470q1389L6482
4798A9421403k23482k7109K058L2875o5855J92942J1852j16711L9688J3240r6466
4787A9184435k2581K8168q144r622J04282o8241M7407L05214j3035R8118J79554
4776A9825555J20903K06037J40903J76047K34414K78285J05714J16790N8657Q3491
4766B1346796m425j46487l8229q581j17119q5054J49468L43133P8849O4665J8273
4755B1601289J94142K07487K04235K09590J28282K92144K66349M48657L10765
4746B3862940M04798N28291M10715K07458K44924L69237K00972K26958K73981
4737B6730274L86585K20589L26649M44620O28107O30504P75976P48959O62449
$$ plain form
4808 21448991 21227670 20902299 20661621 20339223 20122221 19900433 19635780 19466310 19384921 19421403
4798 19421403 19197921 19170812 19172870 19205745 19139890 19332832 19344684 19227973 19267661 19280901 19184435
4787 19184435 19161854 19190022 19181878 19172256 19276538 19208297 19255704 19560918 19547883 19646001 19825555
4776 19825555 19946458 20152495 20293398 20469445 20703859 20982144 21087858 21204648 21263305 21346796
4766 21346796 21342371 21195884 21157655 21149074 21031955 20946901 21096369 21439502 21518351 21583016 21601289
4755 21601289 21795431 22002918 22207153 22416743 22545025 22837169 23103518 23552175 23862940
4746 23862940 24267738 24796029 25206744 25414202 25659126 26028363 26229335 26456293 26730274
4737 26730274 27116859 27337448 27664097 28108717 28736824 29367328 30143304 30892263 31554712
4728C1554712P75627Q20188R60004J112058J062401J424443J545590J681275J924004
4719D2860302K393070K818255L287918L993857M520637N146310N608521O002639
4711G6631509O801654P295125P787500R012597J0676448J3211456J7372835K2970934
4703A71760058K9819417L6444448L7182064L3423056K7684631J9256347J0003543
4696C65573564q814994l6505306m0626380l1903633k5324568k0767825j7867118
4689A83763740j4745955j2603950j0909386r978641r064258q613286p754863o130987
4681A03962414m827682m045996l461736k967102k403086j764781j076487o18263
4673H2797281l37659k37370j24570n61537r01253r78360q86758o56127k98903
$$ plain form
4728 31554712 32330339 33150527 34110531 35222589 36284990 37709433 39255023 40936298 42860302
4719 42860302 45253372 48071627 51359545 55353402 59874039 65020349 70628870 76631509
4711 76631509 83433163 90728288 98515788 107528385 118204833 131416289 148789124 171760058
4703 171760058 201579475 238023923 275205987 308629043 336313674 355570021 365573564
4696 365573564 356758570 320253264 279626884 247723251 222398683 201630858 183763740
4689 183763740 169017785 156413835 145504449 135525808 126461550 117848264 110093401 103962414
4681 103962414 99134732 95088736 91627000 88659898 86256812 84492031 83415544 82797281
4673 82797281 82459622 82222252 82097682 81536145 80634892 79656532 78769774 78113647 77814744
4664G7814744k9508L29396Q80218J367519J659923K661950L344340M009069M366638
4655I6404289M533757M313632L743997K747790K216694J596280J715507K373059
4647A19645005L189476M222158N249676O200335P849585R526643J1857314J5166183
4639A82906375J9239522K3302488K6675370K7267246K5341677K1102922J4059509
4632C39895109M868100p111745k0139657k6713427k5924506k2593844j9610384
4625B22669646j7037688j4307513j2054484j0436207r169623q187791p306675
4618A44169665o485200n226930m316023l445276l353194l163757l035431l006192
4610A12137662l098657l738708m500536m979991m973076m334222l605374k879452
$$ plain form
4664 77814744 77785236 78114632 78994850 80362369 82022292 84684242 88028582 92037651 96404289
4655 96404289 100938046 105251678 108995675 111743465 113960159 115556439 117271946 119645005
4647 119645005 122834481 127056639 132306315 138506650 146356235 155882878 167740192 182906375
4639 182906375 202145897 225448385 252123755 279391001 304732678 325835600 339895109
4632 339895109 344763209 337651464 317511807 290798380 264873874 242280030 222669646
4625 222669646 205631958 191324445 179269961 168833754 159664131 151476340 144169665
4618 144169665 137684465 132457535 128141512 124696236 121343042 118179285 115143854 112137662
4610 112137662 109039005 105300297 100799761 95819770 90846694 86512472 82907098 80027646
4602H0027646k560390k149852k039738k157010k284348k443395k426652k897651
4594F1068610k749071k732971k496309k247872j971973j807915j588999j356864
4586D4116636j201339j157843r81252q74367o31063m19912l47250Q960K1205L880
4576C8537655K37915M40616M24260J98317J12676K41724J23216j412n5148j6094
4566D0243725K75472L07775N79066O18455P88834Q22213Q38811Q10294J024373
4557D6309018R90145R32587N85627J72685m58484q48645j223462j671771k163101
4548D2624599k104120j686023j481506j264697r90172p29233n37197l13715k44389
4539C3273547J4758K4530J82114M92315N21989M02150M59981O51032O83569J029779
$$ plain form
4602 80027646 77467256 75317404 73277666 71120656 68836308 66392913 63966261 61068610
4594 61068610 58319539 55586568 53090259 50842387 48870414 47062499 45473500 44116636
4586 44116636 42915297 41757454 40776202 39901835 39270772 38850860 38503610 38512570 38533775 38537655
4576 38537655 38775570 39216186 39640446 39838763 39951439 40193163 40316379 40314967 40259819 40243725
4566 40243725 40519197 40826972 41406038 42024493 42813327 43635540 44474351 45284645 46309018
4557 46309018 47299163 48231750 48817377 48990062 48531578 47682933 46459471 44787700 42624599
4548 42624599 40520479 38834456 37352950 36088253 35098081 34368848 33831651 33517936 33273547
4539 33273547 33288305 33312835 33494949 33987264 34509253 34911403 35371384 36022416 36705985 37735764
4529C7735764J368080J587829J796129K005582K219930K198041K181317K062977
4521E3155649J795662J549685J340118J576099J738099J563681J459982J298407
4513F5477382J175174J122342R01041R60785J138125J553336K011644K430266
4505G6770095K801489L665077M322681N182347O282232P832862J0029269J2597634
4497A29483686J5800092J8789809K0229793J9056471J6194785J1738897N681999
4490B36975532j929492j2431147k1003791k1933592j9197864j6097847j3776531
4483A30605268j1778386j0097414q918493p832055p239269o654864o074690n473843
4475F6536254m760456m302163l669968l340522l138698k817913k545534k287362
$$ plain form
4529 37735764 39103844 40691673 42487802 44493384 46713314 48911355 51092672 53155649
4521 53155649 54951311 56500996 57841114 59417213 61155312 62718993 64178975 65477382
4513 65477382 66652556 67774898 68675939 69636724 70774849 72328185 74339829 76770095
4505 76770095 79571584 83236661 87559342 92741689 99023921 106856783 116886052 129483686
4497 129483686 145283778 164073587 184303380 203359851 219554636 231293533 236975532
4490 236975532 235046040 222614893 201611102 179677510 160479646 144381799 130605268
4483 130605268 118826882 108729468 99810975 91978920 84739651 78084787 72010097 66536254
4475 66536254 61775798 57473635 53803667 50463145 47324447 44506534 41961000 39673638
4467C9673638k009567j838523j498158j277233j180455j143452r33710o52345
4459B9140195m40062m41034j75480J88224M11166M97045P13082P57100P99034
4450C1449270P22333N23762K50176k94510p27468j209118j131387r36294q05671
4441B7841093n46046m33325k58664m2426N7083L45455J58113L600l10684n44267
4431B6269932r48617j294397j632144j513376j233075q38996q39587q69902o48835
4422A6451003m87195n29510l51630j93325k95892k23866k16948M2580K19907K67785
4412A4682909M31909M99653L01902N06725L02978J99989j88145n99537n66559
4403A5571824o44803m92690k32759k68314m0479l8120K58223K40105Q4128J67962
$$ plain form
4467 39673638 37664071 35825548 34327390 33050157 31869702 30726250 29792540 29140195
4459 29140195 28700133 28259099 28083619 28271843 28683009 29180054 29893136 30650236 31449270
4450 31449270 32171603 32695365 32945541 32651031 31923563 30714445 29583058 28646764 27841093
4441 27841093 27295047 26861722 26603058 26560632 26617715 26963170 27121283 27124883 26814199 26269932
4431 26269932 25321315 24026918 22394774 20881398 19648323 18809327 17969740 17099838 16451003
4422 16451003 15963808 15434298 15082668 14889343 14593451 14369585 14152637 14195217 14415124 14682909
4412 14682909 15114818 15614471 15916373 16423098 16726076 16926065 16737920 16138383 15571824
4403 15571824 14927021 14434331 14201572 13933258 13892779 13854659 14112882 14352987 14437115 14605077
4393A4605077l4016m6522k57229n98580n58309n48405o43548m01670m67206l84224
4383A0665368k23931l20514j35747k77226l13917k63249m88826l48048k81702
4374H012208k07424k35889l26068j64102j11177k4067k23349j89188r3692j59872
4364F277380j75565J9049p9199k09401J54289K2056j67482R9404N6260j18492
4354E878299J23881K26096n7849O7748K07064k1416r6010j08198j72254k83194
4344E764167j94993l26478k41464k72218j91863k4131j58277K3692r2729K2027
4334D307733J55347q9645j01468M0288L0010j39651r1427N12j82151j45621k49598
4323C534329j96473k6051k46479o7638j78256o348o6832k19215k1515k23270M2229
$$ plain form
4393 14605077 14571061 14524539 14267310 13668730 13110421 12562016 11918468 11516798 11049592 10665368
4383 10665368 10441437 10120923 9985176 9707950 9394033 9130784 8641958 8293910 8012208
4374 8012208 7804784 7568895 7242827 7078725 6967548 6943481 6720132 6530944 6437252 6277380
4364 6277380 6101815 6120864 6041665 5832264 5986553 6008609 5841127 5940531 5996791 5878299
4354 5878299 6002180 6228276 6170427 6238175 6445239 6423823 6327813 6219615 6047361 5764167
4344 5764167 5569174 5242696 5001232 4729014 4537151 4513020 4354743 4378435 4285706 4307733
4334 4307733 4463080 4373435 4271967 4312255 4342265 4202614 4111187 4111699 3929548 3783927 3534329
4323 3534329 3337856 3311805 3065326 2997688 2819432 2813084 2746252 2527037 2505522 2282252 2324481
4312B324481p0788o6917P3525r0737n7278l8112o8713N2148J1124J08201l3059
4301B143875r9591m6874r1463p4060M1355P530n3141o9593J0884O2383M9714j02054
4289A778965r2335K4814j30317p1250J8946j088o6996J0371P8074j4305r5939
4278A438940J97584r9537J6867l6483J40936m8108k66712R2821m1129m9594m7017
4267A298568k084J08043j69661O0231k3747N6698l2738L8459j02591p9215J63444
4256A315407l6282n3249M0319J56370J78706j01238p2159O956L0681R2492J58463
4245A716466j8666J11403M9361J8222J01896m957N3933J5988J28072J09113J17478
4234B398309K5381M2841j52473k5675J12608M2335o7969K12527J15103J31709
$$ plain form
4312 2324481 2253693 2186776 2260301 2169564 2112286 2074174 2005461 2057609 2068733 2176934 2143875
4301 2143875 2044284 1997410 1905947 1831887 1873242 1880772 1827631 1758038 1768922 1831305 1881019 1778965
4289 1778965 1686630 1711444 1581127 1509877 1528823 1527735 1460739 1471110 1549184 1534879 1438940
4278 1438940 1636524 1536987 1553854 1517371 1658307 1610199 1343487 1436308 1395179 1345585 1298568
4267 1298568 1296484 1404527 1234866 1295097 1271350 1328048 1295310 1333769 1231178 1151963 1315407
4256 1315407 1279125 1225876 1266195 1422565 1601271 1500033 1427874 1434830 1465511 1558003 1716466
4245 1716466 1697800 1809203 1858564 1876786 1978682 1973725 2027658 2043646 2171718 2280831 2398309
4234 2398309 2423690 2466531 2314058 2288383 2400991 2443326 2375357 2587884 2702987 2834696
4224B834696N7111J6093K10513L24454K46047K62431K48518J68865J81735K79131
4214D829594J00376K0207o3742m510j3923k5488j68451l09054j15101j52531k42911
4203C854466j39863j09020P302p924j93939o5114J07845l041J41251J40130J38527
4192C870620J20293L17515J90800K89963L24249K95536K73672K65512M90595L25366
4182F764121M04830N14061N31414M32370O06411L28625K03616k8746L2422j99258
4172I589866l86083l06284j72113k73576l93914Q0075P979O8782M8319J82777
4162H445828M51228N73766O51509P57005Q52804J088372J180511J149356J068892
4153A6219271J018309Q27923L94799J32987j02627m47806p44000q16129j025586
$$ plain form
4224 2834696 2891807 2907900 3118413 3442867 3688914 3951345 4199863 4368728 4550463 4829594
4214 4829594 4929970 4950177 4886435 4881925 4868002 4842514 4674063 4365009 4249908 4097377 3854466
4203 3854466 3714603 3605583 3612885 3604961 3411022 3345908 3453753 3450712 3591963 3732093 3870620
4192 3870620 3990913 4308428 4499228 4789191 5113440 5408976 5682648 5948160 6438755 6764121
4182 6764121 7168951 7683012 8214426 8646796 9253207 9581832 9785448 9756702 9789124 9589866
4172 9589866 9203783 8897499 8725386 8451810 8057896 8137971 8145950 8214732 8263051 8445828
4162 8445828 8897056 9470822 10122331 10879336 11732140 12820512 14001023 15150379 16219271
4153 16219271 17237580 18065503 18460302 18593289 18490662 18042856 17298856 16482727 15457141
4144A5457141j073874q41900q39546o48263n37190l62907k61411k47276O2671
4135A0707445J37327J74554J73655K55435M12926L67517K48333O6750q0881m8681
4125A2414380m9970m609l90950m8369K18818K16863K21623J65237K92720K57983
4115A3293726R4965j39071j40021k20039k19225k16848l78514k37910j66189j74549
4105A1496325j13225l09240k89601j60311j59949j16982j97162P0212K7434o9141
4095A0178360J09502J03580J31491L7721j04955l46005l19430m87279m81302n36590
4085H285093n59079n20681m84628m95972m32976j16898l79092j58223j81795j66246
4075D789503p331O840j3121l0639o3605J15371J04006M2927J12797M3347K91023
$$ plain form
4144 15457141 14383267 13541367 12701821 12053558 11516368 11153461 10892050 10644774 10707445
4135 10707445 10844772 11019326 11192981 11448416 11861342 12228859 12477192 12543942 12463061 12414380
4125 12414380 12364410 12359801 11968851 11920482 12139300 12356163 12577786 12743023 13035743 13293726
4115 13293726 13388691 13249620 13109599 12889560 12670335 12453487 12074973 11837063 11670874 11496325
4105 11496325 11383100 11073860 10784259 10623948 10463999 10347017 10149855 10220067 10247501 10178360
4095 10178360 10287862 10391442 10522933 10560654 10455699 10109694 9790264 9302985 8821683 8285093
4085 8285093 7726014 7205333 6720705 6224733 5791757 5674859 5295767 5137544 4955749 4789503
4075 4789503 4782172 4789012 4775891 4745252 4681647 4797018 4901024 4943951 5056748 5100095 5391118
4064E391118J94404K49431L10733J87609J65080J71937j4520j00128k15304j63438
4054F176922j32129l62674l28226m84532m94003l40719l78643k78318j17000k44543
4044C016135k35016l05178l16798j06906k5487m0024j50173j98367j04801l2420
4034A500965j59315J59605N2725k23663q1148K249o9274J7751J63034j86308k64561
4023I12060j417q928K7532o2732j13431m3772o4020N0870l6868j52102j9185o208
4011D81799N7048j20714n4327J2187K49719k2759j05065q6853k16960m0902l4798
4000A18375N3564J49006Q6337P657O723j20940k3494o2489m1062O5779p3765r8205
3988F7486N5059l6362J504J6747o112R0437Q8722J34649j26137p4335q0973n9332
$$ plain form
4064 5391118 5585522 5834953 6145686 6333295 6498375 6670312 6655792 6555664 6340360 6176922
4054 6176922 6044793 5682119 5353893 4869361 4375358 4034639 3655996 3377678 3260678 3016135
4044 3016135 2781119 2475941 2159143 2052237 2026750 1986726 1836553 1638186 1533385 1500965
4034 1500965 1341650 1501255 1553980 1330317 1249169 1251418 1182144 1199895 1362929 1176621 912060
4023 912060 910643 901715 929247 866515 753084 709312 645292 696162 659294 507192 488007 481799
4011 481799 538847 418133 363806 375993 625712 602953 497888 411035 194075 153173 118375
4000 118375 171939 320945 407282 414939 421662 300722 277228 214739 173677 239456 165691 67486
3988 67486 122545 86183 87687 104434 98322 188759 277481 412130 285993 211658 130685 71353
3976G1353J29436r6384j0703K9829m9779j25912L1630J00961N9668l6846N4977
3965A58230q5825J46020o5685j5557K6527j62662Q9009N5363j16058r5956O6184
3954d10K24626j94355n4927J25799j24846J7094p6804k6542o9987K9560O075J0788
3942a33929k7499p7543L1930J14721K8245N1189m2424M6999j9643m1297k4654
3931i3905m7465L9658k6659O1247q0338j8671J2970J23957m3522M0946J04218
3920G2436n9678j17519k2646L8099j8902O6329l7908M0886j9427K37523L8393
3909B17586K7107n7855o2428j0014J4206O5435J2622Q0386j3984J7600n0839L4894
3897B74716j08417k8123J54242N8398j27047M9245M8385q377P1341P0384L5829
$$ plain form
3976 71353 200789 104405 93702 123531 73752 -52160 -20530 80431 140099 103253 158230
3965 158230 72405 218425 152740 137183 163710 1048 90057 145420 29362 -66594 -410
3954 -410 224216 29861 -25066 100733 -24113 -7019 -83823 -110365 -180352 -150792 -144717 -133929
3942 -133929 -161428 -238971 -207041 -92320 -64075 -12886 -55310 -8311 -27954 -69251 -93905
3931 -93905 -141370 -101712 -128371 -67124 -147462 -166133 -153163 -29206 -72728 -31782 72436
3920 72436 12758 -104761 -127407 -89308 -108210 -41881 -79789 -38903 -58330 179193 217586
3909 217586 244693 186838 124410 114396 128602 194037 206659 287045 273061 290661 239822 274716
3897 274716 166299 138176 292418 350816 223769 273014 321399 313022 384363 454747 490576
3886D90576o0656L7823r5487J1797j29426j3462J49540o771K8959R3619J854k0300
3874D88066K59755J08746q0180J02144p3770l1882M1163J8829J8757L5902L5763
3863I23293m3616j09933n8415m5917r8134M0766j0707n3327J04735k0687r5636
3852E32422J03420o4483M3721P2367r4902j6396O5419m0859M6978p3435R118p881
3840E75489R7182J96789j22117r9599L7740q1272P3800J09946n3902M5268j18158
3829F61166k8610m7571j5843k6785N2189M3226J26022N7282q3558j51923l2870
3818E52725n536p6153r4651l0628n647L84N2318L2584J5686P6514r8168J389J30339
3805E51156j07351p4797J4544o5168r8128M4633Q5333M2535Q9584R4713o3680
$$ plain form
3886 490576 429920 467743 372256 384053 254627 241165 390705 383934 412893 506512 508366 488066
3874 488066 747821 856567 776387 878531 804761 772879 814042 832871 851628 887530 923293
3863 923293 879677 769744 711329 665412 567278 608044 597337 544010 648745 628058 532422
3852 532422 635842 571359 615080 687447 592545 576149 641568 600709 647687 574252 583370 575489
3840 575489 672671 869460 747343 647744 685484 604212 678012 787958 734056 779324 661166
3829 661166 632556 584985 569142 542357 594546 637772 763794 821076 737518 585595 552725
3818 552725 547189 471036 376385 345757 340110 340494 392812 425396 441082 517596 419428 420817 551156
3805 551156 443805 369008 383552 318384 220256 264889 350222 392757 482341 577054 513374
3794E13374L5606m6096j23488n3391l4794p3827R1303K39019p4722j32482O5481
3783D05983L1590n1618K4918j19893P734m388k5328O6606R107l488P2751J16125
3771E30099l5010n9588o8144J30665K3032j2265j00014J33837o6898J12272K2569
3760F10555j01920J03162J26798q835J634l4969M5097o3946o5922j10088P381
3749E08947N2379L2801j59333l0666o0313M9041O6024j02796j04567N688P5898
3738C33103k4097M4601o0707J9725R4606o8541m4688J52779J4108j13125L1386
3727C79150L4219k40256J66593J10295q9017j00564J15541K1712r2920r9658J58978
3716C64073L7544l8852m5263P031L8226j15752l3367m5367J152R0419o7758k9468
$$ plain form
3794 513374 548980 502884 379396 326005 291211 217384 308687 547706 472984 340502 405983
3783 405983 437573 385955 410873 290980 298714 294326 268998 335604 344711 341223 413974 530099
3771 530099 495089 435501 367357 498022 521054 508789 408775 542612 475714 587986 610555
3760 610555 508635 611797 738595 729760 731394 696425 741522 677576 611654 501566 508947
3749 508947 561326 594127 434794 404128 343815 392856 458880 356084 251517 257205 333103
3738 333103 309006 353607 292900 312625 407231 338690 294002 446781 460889 347764 379150
3727 379150 413369 173113 339706 450001 360984 260420 375961 397673 304753 205095 364073
3716 364073 401617 362765 317502 324533 362759 247007 213640 168273 169425 259844 192086 162618
3704A62618K510O0007J3808l4620j19613N5904Q8305J0318k5230j65573Q7710
3693A36144J2671R542k3122R19J36594P137o3508p0933j23846j2064J2221m9990
3681b8235J71566k7056Q4625P1526O8141j24395j32183n5008N7089o3358L5482
3670E8194J43454o9639p4968M5077r387n2217o1237P0217K6742J4270m0138m4662
3658E706Q9115N0473j78026q8566K00561Q263J00364m215j33317l7829n2049P1419
3646C1899L6534k8904L7047J78897l3088k23815Q5667J70718p8265p9388N1832
3635A49134L5459K7141R5909J20712j31215j04965r3378J34902J555q0068M5549
3624B00735R3619j09963j16953m1501J49508K3405q1249P4808j6172j4348j367
$$ plain form
3704 162618 165128 225135 238943 204323 84710 140614 228919 239237 214007 48434 136144
3693 136144 148815 158357 135235 136154 272748 279885 216377 145444 21598 9534 21755 -28235
3681 -28235 143331 116275 200900 272426 340567 216172 83989 28981 86070 22712 58194
3670 58194 201648 132009 57041 102118 92731 40514 -20723 49494 76236 90506 50368 5706
3658 5706 94821 145294 -32732 -121298 79263 87526 187890 183675 50358 12529 -39520 31899
3646 31899 68433 39529 76576 255473 222385 -1430 84237 254955 176690 97302 149134
3635 149134 184593 211734 307643 428355 297140 192175 98797 233699 235254 155186 200735
3624 200735 294354 184391 67438 25937 175445 198850 117601 192409 176237 161889 160522
3613A60522R7415M4506j57055K0012j4277M915K1099J73270j11594o2620R6844
3602B73037L0033L5624j6610N7802N2793q3750n6916q7656n9870n1040J59991
3591B53438N8976J3451l2096j3790O4568k1983J03010q6815N891O4643j07423
3580C01870J95857m2934l5074m5732j31545J65301M9697p7613O5937Q1472m9352
3569D77884K3057l8126M2338L184K4750L6983m2629l7650Q089O3313N7349l5678
3557E82864M1048l837r0124Q9631P8659m9121N1337k1869j78895K066K73343q9938
3545F85164K0332l8008P094M5329K0558j5140j1236J27737K5992J6596R2576k2743
3533I54251m6065r1347R9324P6957j1102l2513m4905J10835J43845N9204o0414
$$ plain form
3613 160522 257937 302443 145388 165400 151123 156038 177137 350407 238813 176193 273037
3602 273037 303070 338694 322084 379886 432679 348929 292013 204357 144487 93447 253438
3591 253438 312414 325865 293769 279979 344547 322564 425574 338759 344650 409293 301870
3580 301870 497727 454793 419719 373987 242442 407743 457440 379827 445764 527236 477884
3569 477884 500941 462815 505153 508337 533087 570070 527441 489791 497880 561193 618542 582864
3557 582864 623912 620075 529951 619582 698241 649120 700457 678588 499693 501759 775102 685164
3545 685164 705496 667488 674582 719911 740469 725329 714093 841830 867822 884418 976994 954251
3533 954251 908186 816839 916163 993120 982018 949505 904600 1015435 1159280 1218484 1158070
3522A158070l273M5245J78726p9000l9686l194R1431O3919M9812j959K6908Q6124
3510A573123M0686N4766j20022J18719R8317Q7660L7346o2642J24884l4538o0596
3499A857703J41134L1040J21076L180K04208J8710R8875J21354q9478R8958J83106
3488B789866J12838M5587J60290J30206k7297K4380j7168J38390J70374J76570
3478C704036J89525J55311J49817K29384K36201M5165K25357K72409L26102L39549
3468E872856M76483K54826K95910J89184M59841L15199K09868L15547J08544K85740
3458H783998q7341o8893j00553j00500J21662R4951j3334J8937K67135M68736
3448I384798N24554O95956O23321K53605J00023J18396j61346r17503q24421p27082
$$ plain form
3522 1158070 1154797 1200042 1378768 1299768 1260082 1256888 1348319 1412238 1462050 1460091 1486999 1573123
3510 1573123 1613809 1668575 1548553 1667272 1765589 1853249 1890595 1827953 1952837 1918299 1857703
3499 1857703 1998837 2029877 2150953 2154133 2358341 2377051 2475926 2597280 2507802 2606760 2789866
3488 2789866 2902704 2948291 3108581 3238787 3211490 3235870 3218702 3357092 3527466 3704036
3478 3704036 3893561 4048872 4198689 4428073 4664274 4709439 4934796 5207205 5533307 5872856
3468 5872856 6349339 6604165 6900075 7089259 7549100 7864299 8074167 8389714 8498258 8783998
3458 8783998 8696657 8627764 8527211 8426711 8548373 8643324 8629990 8648927 8916062 9384798
3448 9384798 9909352 10605308 11228629 11482234 11582257 11700653 11539307 10621804 9797383 9070301
3438I070301m81451k97383k48601l28980l12357l40286k60937o1029l0046o5554
3428F643677N0406M3371Q7407J2474K22697K61021L61508J72601K68916P19421
3418H843499Q83009J149914J235569J357133J166213R42296L74866J50285q82593
3409A5220191j720603j324759j174889j078510p50337n68519n74143m55318m67030
3400G106083l26255l34580m16437k45396k75159j10519q8891l6260r7796L7090
3390E211880M425J31064P7701K35633L86801N32621N80185O77330L54847K94397
3380H486884J62590r3619m74924q49176o51862p29335n68854m47840l18240l73667
3370D141957k30837k74787k43505p8680k37290l07077r0229j55533q2407o5488
$$ plain form
3438 9070301 8588850 8291467 8042866 7713886 7401529 7061243 6800306 6739277 6709231 6643677
3428 6643677 6694083 6737454 6824861 6837335 7060032 7321053 7682561 7855162 8124078 8843499
3418 8843499 9726508 10876422 12111991 13469124 14635337 15577633 15952499 16102784 15220191
3409 15220191 13499588 12174829 10999940 9921430 9171093 8602574 8028431 7573113 7106083
3400 7106083 6779828 6445248 6028811 5783415 5508256 5397737 5308846 5272586 5174790 5211880
3390 5211880 5216305 5347369 5425070 5660703 6047504 6580125 7160310 7837640 8192487 8486884
3380 8486884 8649474 8555855 8080931 7231755 6579893 5850558 5281704 4833864 4515624 4141957
3370 4141957 3911120 3636333 3392828 3314148 3076858 2769781 2679552 2524019 2441612 2376124
3360B376124L9462j39058j22360j773r5560q7880o9685j02868o9364J15033j67162
3349A674909j37364k552q6018j8977q1906o8553m7052j41873m9777L4731J59895
3338A235463k2738m3401P987q4688j08469K969j7930K9650l9437o2243J5351O1456
3326I73970j65661j01609m0138N822R2550R9618j17915q8495M1173Q6002Q0531
3315H65848j77806r2591L8001L9691o4722K8315J02028j8608p108J03930j0720
3304H06258j25999j15975J1630M5779L6211K6789p012j15785L5551n8521q459
3293E30467N8357L6821M258n2956k01873J27180J4431n1855l2158J158m4453o5441
3281C23936M0855M8762k8323J64556j19570r0522m88P5897L5367n6281p3031N3472
$$ plain form
3360 2376124 2415586 2276528 2154168 2152395 2056835 1968955 1899270 1796402 1727038 1842071 1674909
3349 1674909 1537545 1534993 1448975 1429998 1348092 1279539 1232487 1090614 1040837 1075568 1235463
3338 1235463 1212725 1169324 1177311 1092623 984154 987123 969193 998843 959406 897163 912514 973970
3326 973970 808309 706700 666562 672384 764934 864552 746637 658142 699315 785317 865848
3315 865848 688042 595451 633452 673143 608421 636736 738764 720156 713048 816978 806258
3304 806258 680259 564284 575914 621693 657904 684693 677681 561896 597447 538926 530467
3293 530467 588824 625645 629903 576947 375074 502254 516685 464830 432672 433830 389377 323936
3281 323936 364791 413553 385230 549786 430216 339694 339206 415103 450470 394189 321158 374630
3269C74630Q3934o0814Q1131k3531j55650j10754P5178M8553j14595q7948K6111
3258A36245p8485L7109p6865J43874k0567j3146J59614N5212n4800j54280n4922
3247G8989J01973m1433K3867L5409o9327m2123O9628J52591o8112p9118j9097
3236A43247n2026p3868j9098K08419M8188j4058l6747M729J15707o8215k3732
3225B32546j29057p7605J8364R7541N6696q2101k8522J23810j1269O4389J58182
3214D22974k21757M4661r5198R0866o7699j23113k6714J43246Q6578q5000j47153
3203B1691J18348J02958q1479K614m3803M1710O632K2396j03939k6167Q9947l420
3191A47488R11P6554J12460r5775j3434m6373M8999p4253Q909L7669L7024j916
$$ plain form
3269 374630 458564 397750 478881 455350 299700 188946 264124 312677 198082 110134 136245
3258 136245 57760 94869 18004 161878 141311 128165 287779 342991 288191 133911 78989
3247 78989 180962 139529 163396 198805 129478 87355 156983 309574 241462 162344 143247
3236 143247 91221 17353 -1745 206674 254862 240804 204057 208786 324493 256278 232546
3225 232546 103489 25884 44248 141789 198485 116384 87862 211672 200403 264792 422974
3214 422974 201217 245878 150680 241546 173847 50734 24020 167266 253844 168844 21691
3203 21691 140039 242997 161518 164132 120329 162039 168671 191067 87128 60961 150908 147488
3191 147488 148399 224953 337413 241638 228204 181831 230830 156577 165486 203155 240179 238263
3179B38263J22474O9714q6509O7433k45257L9133K680K5679k9924J12077L545
3168C19308O1204K5010p3918J14967o788R3382K13838r2121j28050J08534O1643
3157F97009r32O6827j26028q629J38591O8657n108J10227J52542J6562j74904
3146I34814n3511O1835j0753P6182J47964J27520k0876q1574O6829n8776R0769
3135A280423M3789l6303R7014O3764q7707R0798J55788P3356J03417J55483R3528
3124B033350l5611L1446R0700P0347Q0850J09341k5097O223n922j1338p2146p2570
3112B199573J0333j05795l2928M7470q0513M4493P9551l2414r1956j7736P7415
3101B097493J37231J2365j3196J35480J40700m8757J3412J04533P1585o5446o8579
$$ plain form
3179 238263 360737 430451 343942 411375 166118 205251 207931 233610 203686 315763 319308
3168 319308 380512 405522 331604 446571 439783 533165 747003 654882 526832 635366 697009
3157 697009 696077 762904 636876 628247 766838 835495 830387 940614 1093156 1109718 934814
3146 934814 881303 943138 932385 1008567 1156531 1284051 1263175 1181601 1248430 1189654 1280423
3135 1280423 1324212 1287909 1384923 1448687 1360980 1451778 1607566 1680922 1784339 1939822 2033350
3124 2033350 1997739 2029185 2119885 2190232 2271082 2380423 2355326 2361549 2355627 2344289 2272143 2199573
3112 2199573 2209906 2104111 2071183 2118653 2038140 2082633 2162184 2129770 2037814 2020078 2097493
3101 2097493 2234724 2247089 2233893 2369373 2510073 2461316 2474728 2579261 2650846 2585400 2516821
3090B516821L2418K3306j02409q2377M762j04120k04022M1674j74782m3431o624
3079A901216q6426N5530O4008p7299k6455P4679N1178n5284j6451n1885M1508
3068A874319P2904k43724j01477J1999L2674j05841j45212r7135O567j71096l1460
3057A102518j00121r229r2251j78223n0359J8123m660K5300l7081p2686n4607
3046E46724m4905P0502K3214M4474j100j21966j4478j48869m2061Q3643j6714
3035C78464l0827K5505p1115M42n5377O614J52670M702j31426j2977m8063j15188
3023A03424O0989P653l618K3366j24606R8486J25253k20824J8517p7983R4255
3012A04912J8257l1810j20517l2210P6079J55927p8866r0385O3752J7171Q3043
$$ plain form
3090 2516821 2549239 2572545 2470136 2387759 2392521 2288401 2084379 2126053 1951271 1907840 1901216
3079 1901216 1814790 1870320 1934328 1857029 1830574 1905253 1956431 1901147 1884696 1832811 1874319
3068 1874319 1947223 1703499 1602022 1614021 1646695 1540854 1395642 1298507 1305074 1133978 1102518
3057 1102518 1002397 993168 900917 722694 672335 690458 685798 711098 674017 601331 546724
3046 546724 501819 572321 595535 640009 638909 516943 502465 353596 311535 395178 378464
3035 378464 347637 373142 302027 302469 247092 253706 406376 411078 279652 266675 218612 103424
3023 103424 164413 172066 168448 191814 67208 165694 290947 70123 88640 10657 104912
3012 104912 123169 91359 -29158 -61368 14711 170638 91772 1387 65139 82310 165353
3001A65353q1367n8937J35906j36370j22017o3102K3926K0165j24354J26548o7488
2990a81737Q0073q843l4508J5438k8364l0010P0855O2640q2999j5718k3593J12789
2978f3977j41139j40334J9891K7931O7439q1473L3706J77422J4145m5823N6689
2967g5523j51180j6040J8998l5233o1557R698J39329Q0449M7344j63674Q2829
2956a24560K4384n0598R2688j46318J149m1888o2989J10902j91542M4121P9098
2945b65553J3564M7288q5219K7702R1091j40284J44635r201r8994K7841K9262
2934b17868N217o6859l1495R5173J0802p7865Q3075L816j16511J18671l4569p0661
2922b99074J5629m6475O7381J0336K7975O7231j2791j40511J2268O4344P000j26599
$$ plain form
3001 165353 83986 25049 160955 24585 -97432 -160534 -136608 -116443 -240797 -114249 -181737
2990 -181737 -101664 -110507 -145015 -129577 -157941 -187951 -117096 -54456 -137455 -153173 -176766 -63977
2978 -63977 -205116 -345450 -325559 -297628 -230189 -311662 -277956 -100534 -86389 -132212 -75523
2967 -75523 -226703 -242743 -223745 -258978 -320535 -310837 -171508 -91059 -43715 -207389 -124560
2956 -124560 -100176 -150774 -58086 -204404 -203255 -245143 -308132 -197230 -388772 -344651 -265553
2945 -265553 -251989 -204701 -289920 -262218 -171127 -311411 -166776 -175977 -274971 -247130 -217868
2934 -217868 -212651 -279510 -311005 -215832 -205030 -282895 -199820 -196004 -312515 -193844 -228413 -299074
2922 -299074 -283445 -329920 -262539 -252203 -224228 -156997 -169788 -310299 -298031 -233687 -226687 -353286
2910c53286J30533q5615m6552m8093p245M1243O8526l8864J9456K5532j44769
2899d39134J20346N6079p1280p2326l0548K6960J13865K5832n4856k9708N5176
2888b99594L4962l7416K7949j3579O4875N1407n009L865n0925j00247l2792R8514
2876b57990p6051l9281J45837J0335L7098l3764n6095m8335J8751o3753L1289
2865c31959r818j25699j6132J31296P7396j2146N4922o9939M1589O336P513p6999
2853c23640P1490J1568k4223p4752J06563J8919j45488P6798k8170n8797p9335
2842d49067J03125k1728J14510M5438o7941j46231L8393k729l4942J36245j03141
2831c88068K9360l875J26833L1912O1157K4462o5183K3972j49890l9542j3968
$$ plain form
2910 -353286 -222753 -308368 -354920 -403013 -410258 -369015 -300489 -339353 -319897 -294365 -439134
2899 -439134 -318788 -262709 -333989 -406315 -436863 -409903 -296038 -270206 -325062 -354770 -299594
2888 -299594 -264632 -302048 -274099 -287678 -222803 -171396 -176405 -172540 -223465 -323712 -356504 -257990
2876 -257990 -334041 -373322 -227485 -217150 -180052 -213816 -269911 -318246 -299495 -363248 -331959
2865 -331959 -341777 -467476 -483608 -352312 -274916 -287062 -232140 -302079 -260490 -254154 -246641 -323640
2853 -323640 -252150 -240582 -264805 -339557 -232994 -214075 -359563 -282765 -310935 -369732 -449067
2842 -449067 -345942 -367670 -253160 -207722 -275663 -421894 -383501 -386230 -421172 -284927 -388068
2831 -388068 -358708 -362583 -235750 -203838 -142681 -118219 -183402 -159430 -309320 -348862 -362830
2820c62830L6261o0482R7178P8395j8290n3627q066p5800M6928M2072o4112o067
2808c48440N1941m0849M071m0219J05520N1177O4645j42371k6488J0925j31304
2797d41392P9452p0246J81842k3137R3072m9888j92485q4127M3506Q1910J29030
2786b52463q7827J4662J20092n6969r0685j603O8976O1562j51985P0866J39181
2775a66193j00496r5408K9801O0837O793p8086J91637L0810j43008J41694j76927
2764b98546q3629n7721P7323K3252p0567O764Q4696j1728o4210J85304P400o3319
2752b64981p2358n4203J2622l4998l6769N6959L0952N5166J78344N9759j81814
2741b51321K7564J987J4342q1666j2901n3530r578k428R3581r000l4183R9036
$$ plain form
2820 -362830 -326569 -387051 -289873 -211478 -229768 -283395 -291461 -367261 -320333 -278261 -342373 -348440
2808 -348440 -296499 -337348 -333277 -373496 -267976 -216799 -152154 -294525 -321013 -310088 -441392
2797 -441392 -361940 -432186 -250344 -273481 -180409 -230297 -422782 -506909 -463403 -381493 -252463
2786 -252463 -340290 -325628 -205536 -262505 -353190 -354793 -285817 -224255 -376240 -305374 -166193
2775 -166193 -266689 -362097 -332296 -271459 -264666 -342752 -151115 -120305 -263313 -121619 -298546
2764 -298546 -382175 -439896 -362573 -339321 -409888 -403124 -318428 -330156 -394366 -209062 -201662 -264981
2752 -264981 -337339 -391542 -378920 -413918 -450687 -393728 -362776 -307610 -129266 -69507 -251321
2741 -251321 -223757 -221770 -207428 -289094 -301995 -355525 -365103 -367531 -273950 -282950 -317133 -218097
2729b18097k0966m0720j25039r216O9241m6002J05440j5149j4960O239p9552Q4448
2717c04333M3840n6193R4140Q1329j03841J85615M7322j45280n8779j3783m876
2706b34839n6528K3980q3303O8712r5310J12277M2510J033J02334R22M7603j47096
2694b17705l9678L9725P5336n2076j2581j8552j5928j8172K7329j0205R8640p2256
2682b16123p4466j00975L9663O8840J52620o7635j05025m3547K3811K4834o0941
2671c58944N5160J13567J21151K3664j50535O1844p19j25855l7949j32483M3226
2660c87873K00097L2331n0352j08818m5136Q6002k529Q8243j19407j80925J38476
2649c49891Q0050n6578J22470J16890j55915m6737P4844Q8995l2771r8469K2339
$$ plain form
2729 -218097 -239063 -279783 -404822 -414038 -344797 -390799 -285359 -300508 -315468 -309229 -388781 -304333
2717 -304333 -260493 -316686 -222546 -141217 -245058 -59443 -12121 -157401 -216180 -229963 -234839
2706 -234839 -291367 -267387 -350690 -281978 -377288 -265011 -222501 -221468 -119134 -118212 -70609 -217705
2694 -217705 -257383 -217658 -142322 -194398 -206979 -225531 -241459 -259631 -232302 -242507 -143867 -216123
2682 -216123 -290589 -391564 -351901 -283061 -130441 -198076 -303101 -346648 -322837 -298003 -358944
2671 -358944 -303784 -190217 -69066 -45402 -195937 -134093 -134812 -260667 -298616 -431099 -387873
2660 -387873 -187776 -155445 -205797 -314615 -359751 -273749 -276278 -188035 -307442 -488367 -349891
2649 -349891 -269841 -326419 -203949 -87059 -242974 -289711 -214867 -125872 -158643 -257112 -234773
2638b34773q965O2293J9841K693M1462p2871j46376K8339j425Q8696k7826k045
2626b50957J59519K6025o0992r6988N1282j46170r8592P0477Q5973O0537j7528
2615b17414l2527L197m3484j3452M1900Q9410o8677L6036l9286P7224n2795K8248
2603a91620N9881p0565L7581K03005j07153j52824K9265P0516M2544n0832J03691
2592b6511j8292q0899O1900L5504L2834j76710M8422J26422n6041Q8164n3687
2581a8894M3237J1068J6835j36134J4216L4442j08163P6213j7443j50601M2283
2570a92941K7803j9438J3928j3923O5879J14017n6516P2265j4161p0871k5602
2559i9560p495o9525J2978J742J21123Q475q0410r0291L4828r0863M9346M6138
$$ plain form
2638 -234773 -243738 -181445 -161604 -158911 -117449 -190320 -336696 -308357 -309782 -221086 -248912 -250957
2626 -250957 -91438 -65413 -126405 -223393 -172111 -318281 -416873 -346396 -260423 -199886 -217414
2615 -217414 -249941 -246744 -290228 -303680 -261780 -172370 -241047 -205011 -244297 -167073 -219868 -191620
2603 -191620 -131739 -202304 -164723 38282 -68871 -221695 -192430 -121914 -79370 -130202 -26511
2592 -26511 -44803 -125702 -63802 -28298 4536 -172174 -123752 2670 -53371 34793 -18894
2581 -18894 24343 35411 52246 -83888 -69672 -35230 -143393 -67180 -84623 -235224 -192941
2570 -192941 -165138 -184576 -170648 -184571 -118692 -4675 -61191 11074 -3087 -73958 -99560
2559 -99560 -107055 -176580 -163602 -161860 -40737 -32262 -112672 -202963 -168135 -258998 -209652 -163514
2547a63514n2665J54559J2925j66678O0809K8738M0831j8216R3638m7356m9553
2536a06482j07297j3991K9811Q0237N0431k5998j789j2658k4091J44643q791m0066
2524c6041k108m2549R5270N0471k3201q7892k4714L3107n6520r9112M6162j1139
2512a58266k4414p6546L5430J02703k5846j1598O9202l8964K245J7053L4951m4974
2500a19024N303J22646J190K5572M8635q030O1412n0141l4586Q5157o0141j60958
2488h2965M9099M2048K7676k7552m4459K1921O52N386p5839k5385Q3938J27053
2476A01573L7217k6318o2757o0967N2785L8785n2090q7833P2852Q1607o2105p8939
2464d6190J11043O8876r9880n8238J24970q344q3626N5323L152R312N9926j46167
$$ plain form
2547 -163514 -216179 -61620 -48695 -215373 -154564 -125826 -84995 -103211 -9573 -56929 -106482
2536 -106482 -213779 -227770 -197959 -117722 -67291 -93289 -95078 -107736 -131827 12816 4025 -36041
2524 -36041 -38149 -80698 14572 65043 41842 -46050 -70764 -37657 -94177 -193289 -147127 -158266
2512 -158266 -182680 -259226 -223796 -121093 -146939 -158537 -89335 -128299 -126054 -109001 -74050 -119024
2500 -119024 -113721 8925 10115 35687 84322 76292 137704 87563 52977 138134 77993 -82965
2488 -82965 -33866 8182 35858 8306 -36153 -14232 -13580 -8194 -84033 -109418 -25480 101573
2476 101573 138790 112472 49715 -11252 41533 80318 28228 -59605 13247 94854 32749 -46190
2464 -46190 64853 133729 33849 -24389 100581 92237 8611 63934 67086 76398 136324 -9843
2452i843J02948j29720K2331J1443J7264L5750J02972k5258R222k1186k7072J8854
2440A07705q950m2732J41347J7485q586j31768O3917Q7835l5440o2971l4268N38
2428I4112M8609L2498J0194q2206o3677P9426Q8283O5646k0280r011k1672K7059
2416B48981J4728L4875j32977q0681O2614K7926j31483J10739j7076n3279M3845
2405A28212J02067J71082O3200k46128L070N9332J03058K50729l8968j84923J35666
2394E46397m5944m6840R3950K3771K1556J3645j5480o9363M8883J45482J2729
2383G28786r9160M4516J08293N5782Q5707l5235j4345N8940J9030M7898Q5714
2372A085926M1858j66724O6878Q4496N1823m2718o1089k937J87749J98166R7829
$$ plain form
2452 -9843 93105 -36615 -14284 -2841 14423 50173 153145 127887 137109 115923 88851 107705
2440 107705 98755 56023 197370 214855 206269 74501 138418 226253 190813 127842 93574 94112
2428 94112 142721 175219 185413 103207 39530 118956 207239 272885 252605 243594 221922 248981
2416 248981 263709 298584 165607 84926 147540 175466 43983 154722 137646 84367 128212
2405 128212 230279 401361 464561 218433 221503 280835 383893 634622 595654 410731 546397
2394 546397 500453 453613 547563 571334 592890 606535 591055 521692 570575 716057 728786
2383 728786 629626 674142 782435 838217 923924 888689 874344 933284 952314 1000212 1085926
2372 1085926 1127784 961060 1027938 1112434 1164257 1121539 1060450 1057513 1245262 1443428 1541257
2361A541257p0870J55872J43308l8735J15976R0594K23971J61306J14030J35821
2351B572530J26117O9544K11949J1545K47124K41627J74120K50582K89745L57151
2341D552034N88084N43969N85174O79549P49852P87565R28416P81270R37827O54672
2331A1788412J033013J215581J627973J943638K839724L687915N052810N020426
2323C4209492M687464M621556L089426J487009q8232n157184p215875m820996
2315C0812660l775391k983049k707608k152110j840806j384477j348598j102010
2307A3518611j243853r76834r38210q07305o85431p66044p33553n77746n20667
2298F268968n23583n24051l87963k58939k32741l90861p4307k54011k56749j95698
$$ plain form
2361 1541257 1470387 1626259 1769567 1730832 1846808 1937402 2161373 2322679 2436709 2572530
2351 2572530 2698647 2768191 2980140 2991685 3238809 3480436 3654556 3905138 4194883 4552034
2341 4552034 5140118 5684087 6269261 6948810 7698662 8486227 9414643 10195913 11133740 11788412
2331 11788412 12821425 14037006 15664979 17608617 20448341 24136256 29189066 34209492
2323 34209492 38896956 43518512 46607938 48094947 48006715 42849531 35633656 30812660
2315 30812660 27037269 24054220 21346612 19194502 17353696 15969219 14620621 13518611
2307 13518611 12274758 11297924 10359714 9552409 8866978 8100934 7367381 6789635 6268968
2298 6268968 5745385 5221334 4833371 4574432 4341691 3950830 3876523 3622512 3365763 3170065
2288C170065k07396k79121q9606j1920j89085r5224j23218p3935J1150j61610
2278A950100q1943k25115o0832j35633M6455j68772j24091J4777l688j46520l9905
2267A024833J6723n8448m7081j13400m514K8090r4095r8281o5895P1561n6592
2256F02901l1626j48491K7100K1785J04575k0735r0839M5841j25191l3847Q4513
2245D35986M3920n9400M3845j12069P2191l7020j02409r1903N9243J07195J49823
2234E09402j20785k36751p257J57737J48878j00007N2013j3286j14859K0804j87594
2223A08295K1629n1645M4814l1208j0258n9728K5703M3092K6993Q1342J5415r5537
2211A18907l3197P6586l4917k7698O8326K3894j02376L3370K961P2105j22776
$$ plain form
2288 3170065 2962669 2683548 2593942 2582022 2392937 2297713 2174495 2100560 2111710 1950100
2278 1950100 1868157 1643042 1582210 1446577 1493032 1324260 1200169 1214946 1211258 1064738 1024833
2267 1024833 1041556 983108 936027 822627 818113 846203 752108 653827 587932 659493 602901
2256 602901 571275 422784 449884 471669 576244 555509 464670 510511 385320 351473 435986
2245 435986 479906 420506 464351 352282 424473 387453 285044 193141 252384 359579 509402
2234 509402 388617 151866 144609 302346 451224 351217 403230 389944 275085 295889 108295
2223 108295 129924 78279 123093 91885 81627 21899 47602 90694 117687 199029 214444 118907
2211 118907 85710 162296 127379 99681 168007 191901 89525 122895 125856 197961 75185
2200G5185j44371J353p7979P5453j0704n7160O9412J28813l3652m1418m7509J33634
2188G1057N4847n891j6349o1868L308j86153L4839k4226M4464k2625r132Q1008
2176c6721p4216P0052M7261j5730l7194L8891N54L6382K1587k1778j19637o4012
2164a54561n4684K5855J10336q0355p6670Q0404P6918p1453q8401O5816K5011
2153a41784N3428l0188j22437Q0591Q7786L2344n4108J0383j49913o6426J66252
2142a34072O8304Q6521m0848n5339j0713o0544o8092Q1239j3092O8053J7973M7174
2130a3436n616k023J30595q3809j48958o817J7058Q5513k0944r1624J25391N0810
2118C6140r2736k0703m1526q600M4998p5543J4303L6049k2907k2146J22424J05982
$$ plain form
2200 75185 -69186 -67833 -145812 -70359 -81063 -138223 -68811 60002 26350 -15068 -62577 71057
2188 71057 125904 120013 103664 41796 45104 -141049 -106210 -130436 -85972 -108597 -117729 -36721
2176 -36721 -110937 -40885 6376 -9354 -46548 -7657 -7103 29279 50866 29088 -90549 -154561
2164 -154561 -209245 -183390 -73054 -153409 -230079 -149675 -72757 -144210 -232611 -166795 -141784
2153 -141784 -88356 -118544 -240981 -160390 -72604 -40260 -94368 -83985 -233898 -300324 -134072
2142 -134072 -65768 20753 -20095 -75434 -86147 -146691 -214783 -133544 -146636 -78583 -60610 -13436
2130 -13436 -19052 -21075 109520 25711 -123247 -130064 -113006 -27493 -48437 -140061 -14670 36140
2118 36140 -56596 -77299 -118825 -127425 -82427 -157970 -143667 -107618 -130525 -152671 -30247 75735
2106G5735q4272J5315J00195r5583k33122p2974J164N7677R6527K9708O5447o1840
2094a06023L1099K3132O4915J0471j76938o5491o001J79301L5281p7179o0678
2083a48111p1739l43j53261R5194n2722P703P0593j08627K6241N5583p252k4655
2071c11396J3844N5720J15337j8842q2929K07166j43983O3337K5302p7670P1777
2060h2337K0476o2579j1553J08729M2241J66939p5868o4096J05313l5142K8524
2049A40647m0723L5502O6542r2906j06483p4059J20191m3289N7669O1696j22336
2038B451j66780j0659O3097q349Q0064M144j04535L5155k778J128n3398q8170
2026b48630K8895M7763j928P9624O7461o2508J43799P2569k30160n8063J08559
$$ plain form
2106 75735 -8537 6778 106973 11390 -221732 -294706 -293542 -235865 -139338 -109630 -44183 -106023
2094 -106023 -74924 -51792 13123 23594 -153344 -218835 -224836 -45535 -10254 -87433 -148111
2083 -148111 -219850 -220193 -373454 -278260 -330982 -323279 -252686 -361313 -335072 -279489 -286741 -311396
2071 -311396 -297552 -241832 -126495 -145337 -228266 -21100 -165083 -101746 -76444 -154114 -82337
2060 -82337 -61861 -124440 -135993 -27264 14977 181916 106048 41952 147265 112123 140647
2049 140647 99924 135426 201968 109062 2579 -71480 48711 5422 63091 124787 2451
2038 2451 -164329 -174988 -111891 -120240 -40176 -36032 -140567 -105412 -108190 -107062 -160460 -248630
2026 -248630 -219735 -171972 -173900 -94276 -26815 -89323 54476 127045 -103115 -161178 -52619
2015e2619j01159O882R3701k0812n0006K6287P8890l1384j07692o1738m2885N3060
2003b09475j4739J94074K6444q8465r8299k3493K2564m7863J74659k617p2559
1992a39769l9287p9455O8293n1174L1608J69486m9519N4073j81794o1500J10410
1981a68628R5997N8397n5596n0865j5167k8107p8297q0756p981N2085O2080L4958
1969a81880Q7845j51793O93L5244j08779p552J89314O2795j06691L0539q3093
1958b33358J19040R8562j95069k9321O8946k014L2278j7245j23769J24369M0896
1947a16685M196K3653J6004j13548Q323R7484o8236j21768N1898J24380q5025
1936a79324K5870L0972L089l936K0170m1850p0650o1513K3193J20173K8494M5757
$$ plain form
2015 -52619 -153778 -146896 -53195 -74007 -124013 -97726 -18836 -50220 -157912 -219650 -262535 -209475
2003 -209475 -224214 -30140 -3696 -92161 -190460 -213953 -191389 -239252 -64593 -67210 -139769
1992 -139769 -179056 -258511 -190218 -241392 -209784 -40298 -89817 -35744 -217538 -279038 -168628
1981 -168628 -72631 -14234 -69830 -120695 -135862 -163969 -242266 -323022 -331003 -278918 -216838 -181880
1969 -181880 -94035 -245828 -245135 -209891 -318670 -326222 -136908 -74113 -180804 -150265 -233358
1958 -233358 -114318 -15756 -210825 -240146 -171200 -173214 -140936 -158181 -281950 -157581 -116685
1947 -116685 -112489 -88836 -72832 -186380 -178057 -80573 -148809 -270577 -218679 -94299 -179324
1936 -179324 -153454 -122482 -119393 -123329 -103159 -145009 -215659 -277172 -253979 -133806 -105312 -59555
1924e9555j0311J7326P0916l5931j1742j15917j8179P0921K0019j40032n2798
1913b65283O1511J52613n6615N7956r6528q8805O9308n3013k118L8975k0946J53320
1901d9625J18391j16259j85575J39079J24974l8104J2314k1639p0934j19349J15556
1890i1171l8156j4159m608o3007r4394P1241J36920j4193l246m2778L6985M161
1878a16405q5084J1993n3467N2932R2449O4791P5448O2600k20301k8954j3358
1867a57356M3494K403j44462J8041J38918N4311M9082J28081K0859q0701j55443
1856h2773L1089j39562q7750m3225K6318k857P4383L7686n017J19079n0119P9554
1844d3194l158j02508N9306O2008m1541n7590Q5471n8673n6663M1716K299n9744
$$ plain form
1924 -59555 -69866 -52540 18376 -17555 -29297 -145214 -163393 -92472 -72453 -212485 -265283
1913 -265283 -203772 -51159 -107774 -49818 -146346 -235151 -165843 -218856 -220974 -181999 -202945 -49625
1901 -49625 68766 -47493 -233068 -93989 30985 -7119 5195 -16444 -87378 -206727 -91171
1890 -91171 -129327 -143486 -148094 -211101 -305495 -234254 -97334 -111527 -114773 -157551 -120566 -116405
1878 -116405 -201489 -189496 -242963 -190031 -97582 -32791 42657 105257 -115044 -143998 -157356
1867 -157356 -113862 -111459 -255921 -237880 -98962 -44651 4431 132512 153371 72670 -82773
1856 -82773 -51684 -191246 -278996 -322221 -295903 -298760 -224377 -186691 -191708 -72629 -122748 -43194
1844 -43194 -46352 -148860 -89554 -27546 -69087 -126677 -41206 -99879 -156542 -114826 -112527 -172271
1832a72271m0478Q9491K4017p0184P9582M3063O4834k09211N3500J25158p2860
1821h5359L5777j10967O3092Q5471k0671n4826K0969m7496M3137r848R2995J18514
1809A30788j48776j88560K03233J0304p8964K349l1759M4869L0363j521K3449
1798d225n7955l8921l9934j16692L0220O2097L6615m5291P7389J63828j71581
1787a04450p0692J40830m9174l9484n688M429J5234n2720p577l6886P3449J04499
1775b8230j48607L250M782l09p7792M7876K7357j43400M2912J28140k7852L8829
1763a33044Q816j9412L3603J51366r9208o9354Q5473o9233N6779K125P1047j38892
1751a19934j1245R4927J0683p2379q4825J10489R464K684m0194j9918l0242m210
$$ plain form
1832 -172271 -212749 -123258 -99241 -169425 -89843 -46780 18054 -191157 -137657 -12499 -85359
1821 -85359 -49582 -160549 -97457 -11986 -32657 -87483 -66514 -114010 -70873 -80721 12274 130788
1809 130788 -17988 -206548 -3315 6989 -71975 -69626 -101385 -56516 -26153 -27674 -4225
1798 -4225 -62180 -101101 -141035 -257727 -227507 -165410 -128795 -174086 -96697 67131 -104450
1787 -104450 -175142 -34312 -83486 -122970 -128658 -124229 -108995 -161715 -169292 -206178 -132729 -28230
1775 -28230 -176837 -173587 -168805 -169114 -246906 -199030 -171673 -315073 -272161 -144021 -171873 -133044
1763 -133044 -124228 -143640 -110037 41329 -57879 -127233 -41760 -110993 -54214 -52089 18958 -119934
1751 -119934 -131179 -36252 -25569 -97948 -182773 -72284 -62820 -60136 -100330 -120248 -150490 -154700
1739a54700M014M0782n2191K1063P057P1257R8613n6992o3003J61871l4527m9313
1727f069n8492l5895P9119q0562n1692n693J13951l9597Q4718q9805p1914J14166
1715d7765R118n1874j77277N0734J06816j19401J41888L7155R6796j15184o2624
1704a31618m3835j3219m094J25084J19641n1961r113k1735J949n0226R526q0217
1692a49818K5975J23412m1475k04363O2539M866J33946L8234m7134j69203R0398
1681a32623O0551N9483J08139K1624j03380j06501j9539n0106J72667m8693n5497
1670i3875L5063P5374r1413N2922p2177K8856k975l0408J8504J07291J06481K355
1658A35998j77368r3151J19874q8392J8182n114K40493Q039j38874j10646R1634
$$ plain form
1739 -154700 -150686 -109904 -162095 -141032 -133975 -62718 35895 -21097 -84100 77771 43244 -6069
1727 -6069 -64561 -100456 -21337 -101899 -153591 -159284 -45333 -84930 -212 -90017 -161931 -47765
1715 -47765 -38647 -90521 -267798 -217064 -110248 -229649 -87761 -50606 46190 -68994 -131618
1704 -131618 -175453 -188672 -192766 -67682 51959 -2 -9115 -30850 -28901 -79127 -69601 -149818
1692 -149818 -123843 -431 -41906 -246269 -183730 -178864 -44918 -6684 -53818 -223021 -132623
1681 -132623 -72072 -12589 95550 117174 13794 -92707 -112246 -162352 10315 -38378 -93875
1670 -93875 -58812 16562 -74851 -21929 -94106 -65250 -68225 -98633 -80129 27162 133643 135998
1658 135998 -41370 -134521 -14647 -103039 -84857 -89971 150522 158561 19687 -90959 675
1647F75k8759L0948K1520l0036M9326j25122p7507P7864J00782j16355J16486
1636A9822J9109O3764J550j225j18148p7350J10165O3588j7896j03983m9425j3476
$$ plain form
1647 675 -28084 2864 24384 -5652 43674 -81448 -158955 -81091 19691 -96664 19822
1636 19822 38931 102695 104245 103020 -15128 -92478 17687 81275 63379 -40604 -90029 -103505
$$ [...]
##END NTUPLES=NMR SPECTRUM
##END=
