##TITLE=1H_DE-80H_X3
 200.13MHz, d2o
 8 sc
 
 19ns.26.2.2025
##JCAMPDX= 6.0         $$ Bruker NMR JCAMP-DX V2.0
##DATA TYPE= NMR SPECTRUM
##DATA CLASS= NTUPLES
##ORIGIN= UXNMR, Bruker Analytische Messtechnik GmbH
##OWNER= pz
$$ XWIN-NMR		Version 3.5
$$ Wed Sep 17 14:33:02 2025 Russian Standard Time (UT+4h)  Yarkov@DPX200
##.OBSERVE FREQUENCY= 200.1313
##.OBSERVE NUCLEUS= ^1H
##.ACQUISITION MODE= SIMULTANEOUS
##.ACQUISITION SCHEME= undefined
##.AVERAGES= 8
##.DIGITISER RES= 18
##SPECTROMETER/DATA SYSTEM= spect
##.PULSE SEQUENCE= zg30
##.SOLVENT NAME= CDCl3
##.SHIFT REFERENCE= (INTERNAL, CDCl3, 0, 15.4836)
##AUDIT TRAIL= $$ (NUMBER, WHEN, WHO, WHERE, WHAT)
$$ ##TITLE= Audit trail, XWIN-NMR		Version 3.5
$$ ##JCAMPDX= 5.01
$$ ##ORIGIN= Bruker BioSpin GmbH
$$ ##OWNER= Yarkov
$$ C:/Bruker/XWIN-NMR/data/yarkov2/nmr/H-C/1/pdata/1/auditp.txt
$$ ##AUDIT TRAIL=  $$ (NUMBER, WHEN, WHO, WHERE, WHAT)
(   1,<2025-09-17 14:32:10.81 +0400>,<Yarkov>,<DPX200>,
      <created by zg, POWCHK disabled, PULCHK disabled
       configuration hash MD5:
       00 E9 B6 7A A2 85 ED C7 34 08 36 98 17 FE 4E 26
       data hash MD5: 16K
       38 3B 2B 27 C8 C2 14 94 AD 90 1E D5 E1 4D E1 3C>)
(   2,<2025-09-17 14:32:16.35 +0400>,<Yarkov>,<DPX200>,
      <Start of raw data processing
       efp BC_mod = 2 LB = 0.25 FT_mod = 6 PKNL = 1 PHC0 = -1352.778 PHC1 = -0.009078503 SI = 16K 
       data hash MD5: 16K
       59 4D FB DD A4 05 68 E1 C8 46 7F 13 6F EA 63 85>)
(   3,<2025-09-17 14:32:20.40 +0400>,<Yarkov>,<DPX200>,
      <abs ABSG = 5 
       data hash MD5: 16K
       4A 4D 19 71 1A 65 32 7A 5A 8E D2 18 8A 45 D9 47>)
$$ ##END=
$$ 
$$ hash MD5
$$ 22 12 30 44 74 B4 24 C9 20 37 EA 75 82 E6 4C 10
##$RELAX= 
##$RELAX= 
##$RELAX= 
##$RELAX= 
##$RELAX= 
##$RELAX= 
$$ Bruker specific parameters
$$ --------------------------
##$DU= <C:/Bruker/XWIN-NMR>
##$EXPNO= 1
##$NAME= <H-C>
##$PROCNO= 1
##$TYPE= <nmr>
##$USER= <yarkov2>
##$AMP= (0..31)
100 100 100 100 100 100 100 100 100 100 100 100 100 100 100 100 100 100 
100 100 100 100 100 100 100 100 100 100 100 100 100 100 
##$AQSEQ= 0
##$AQ_mod= 1
##$AUNM= <au_zg>
##$AUTOPOS= <>
##$BF1= 200.13
##$BF2= 200.13
##$BF3= 200.13
##$BF4= 200.13
##$BF5= 200.13
##$BF6= 200.13
##$BF7= 200.13
##$BF8= 200.13
##$BYTORDA= 1
##$CFDGTYP= 0
##$CFRGTYP= 5
##$CHEMSTR= <none>
##$CNST= (0..31)
1 1 145 1 1 1 1 1 1 1 1 1 1 1 1 1 1 1 1 1 1 1 1 1 1 1 1 1 1 1 1 1 
##$CPDPRG= <>
##$CPDPRG1= <>
##$CPDPRG2= <>
##$CPDPRG3= <>
##$CPDPRG4= <mlev>
##$CPDPRG5= <mlev>
##$CPDPRG6= <mlev>
##$CPDPRG7= <mlev>
##$CPDPRG8= <mlev>
##$CPDPRGB= <>
##$CPDPRGT= <>
##$D= (0..31)
0 0.7 0 0 0 0 0 0 0 0 0 0.03 0 0 0 0 0 0 0 0 0 0 0 0 0 0 0 0 0 0 0 0 
##$DATE= 1758105130
##$DBL= (0..7)
120 120 120 120 120 120 120 120 
##$DBP= (0..7)
150 150 150 150 150 150 150 150 
##$DBP07= 0
##$DBPNAM0= <>
##$DBPNAM1= <>
##$DBPNAM2= <>
##$DBPNAM3= <>
##$DBPNAM4= <>
##$DBPNAM5= <>
##$DBPNAM6= <>
##$DBPNAM7= <>
##$DBPOAL= (0..7)
0.5 0.5 0.5 0.5 0.5 0.5 0.5 0.5 
##$DBPOFFS= (0..7)
0 0 0 0 0 0 0 0 
##$DE= 6
$$ [...]
##$SUBNAM3= <"">
##$SUBNAM4= <"">
##$SUBNAM5= <"">
##$SUBNAM6= <"">
##$SUBNAM7= <"">
##$SUBNAM8= <"">
##$SUBNAM9= <"">
##$SW= 18.0517328524113
##$SWIBOX= (0..15)
0 0 2 0 0 0 0 0 0 0 0 0 0 0 0 0 
##$SW_h= 3612.71676300578
##$TD= 16384
##$TD0= 1
##$TE= 0
##$TE2= 300
##$TE3= 300
##$TEG= 300
##$TL= (0..7)
0 120 120 120 120 120 120 120 
##$TP= (0..7)
150 150 150 150 150 150 150 150 
##$TP07= 0
##$TPNAME0= <>
##$TPNAME1= <>
##$TPNAME2= <>
##$TPNAME3= <>
##$TPNAME4= <>
##$TPNAME5= <>
##$TPNAME6= <>
##$TPNAME7= <>
##$TPOAL= (0..7)
0.5 0.5 0.5 0.5 0.5 0.5 0.5 0.5 
##$TPOFFS= (0..7)
0 0 0 0 0 0 0 0 
##$TUNHIN= 0
##$TUNHOUT= 0
##$TUNXOUT= 0
##$USERA1= <user>
##$USERA2= <user>
##$USERA3= <user>
##$USERA4= <user>
##$USERA5= <user>
##$V9= 5
##$VALIST= <valist>
##$VCLIST= <CCCCCCCCCCCCCCC>
##$VD= 0
##$VDLIST= <DDDDDDDDDDDDDDD>
##$VPLIST= <PPPPPPPPPPPPPPP>
##$VTLIST= <TTTTTTTTTTTTTTT>
##$WBST= 1024
##$WBSW= 4
##$XGAIN= (0..3)
0 0 0 0 
##$XL= 0
##$YL= 0
##$YMAX_a= 68140
##$YMIN_a= -50846
##$ZGOPTNS= <>
##$ZL1= 120
##$ZL2= 120
##$ZL3= 120
##$ZL4= 120
##$ABSF1= 15.48907
##$ABSF2= -2.562779
##$ABSG= 5
##$ABSL= 3
##$ALPHA= 0
##$AQORDER= 0
##$ASSFAC= 0
##$ASSFACI= 0
##$ASSFACX= 0
##$ASSWID= 0
##$AUNMP= <proc_1d>
##$AZFE= 0.1
##$AZFW= 0.1
##$BCFW= 0
##$BC_mod= 2
##$BYTORDP= 0
##$COROFFS= 0
##$CY= -3
##$DATMOD= 1
##$DC= 0
##$DFILT= <>
##$DTYPP= 0
##$F1P= 0
##$F2P= 0
##$FCOR= 1
##$FTSIZE= 16384
##$FT_mod= 6
##$GAMMA= 0
##$GB= 0
##$INTBC= 1
##$INTSCL= 3.241238e-09
##$ISEN= 128
##$LB= 0.25
##$LEV0= 0
##$LPBIN= 0
##$MAXI= 10000
##$MC2= 0
##$MEAN= 0
##$ME_mod= 0
##$MI= 1.114404
##$NCOEF= 0
##$NC_proc= -9
##$NLEV= 6
##$NOISF1= 3.799351
##$NOISF2= 2.8
##$NSP= 0
##$NTH_PI= 0
##$NZP= 0
##$OFFSET= 15.48356
##$PC= 1
##$PHC0= -1352.778
##$PHC1= -0.009078503
##$PH_mod= 1
##$PKNL= yes
##$PPARMOD= 0
##$PSCAL= 0
##$PSIGN= 0
##$REVERSE= no
##$SF= 200.130007634198
##$SI= 16384
##$SIGF1= 3
##$SIGF2= 2
##$SINO= 0.751879
##$SIOLD= 32768
##$SREGLST= <19F.Aceton>
##$SSB= 0
##$STSI= 16384
##$STSR= 0
##$SW_p= 3612.71676300578
##$SYMM= 0
##$S_DEV= 0
##$TDeff= 16384
##$TDoff= 0
##$TI= <>
##$TILT= no
##$TM1= 0
##$TM2= 0
##$TOPLEV= 0
##$USERP1= <user>
##$USERP2= <user>
##$USERP3= <user>
##$USERP4= <user>
##$USERP5= <user>
##$WDW= 1
##$XDIM= 16384
##$YMAX_p= 335558219
##$YMIN_p= -2044805
$$ End of Bruker specific parameters
$$ ---------------------------------
##NTUPLES= NMR SPECTRUM
##VAR_NAME=  FREQUENCY,     SPECTRUM/REAL,   SPECTRUM/IMAG
##SYMBOL=    X,             R,               I
##VAR_TYPE=  INDEPENDENT,   DEPENDENT,       DEPENDENT
##VAR_FORM=  AFFN,          ASDF,            ASDF
##VAR_DIM=   16384,         16384,           16384
##UNITS=     HZ,            ARBITRARY UNITS, ARBITRARY UNITS
##FACTOR=    0.220516191357247, 1,           1
##FIRST=     3098.72490264555, 0,            0
##LAST=      -513.991860360226, 0,           0
##MIN=       -513.991860360226, -2044805,    0
##MAX=       3098.72490264555, 335558219,    0
$$ Real data points
##PAGE= N=1
##DATA TABLE= (X++(R..R)), XYDATA
$$ [...]
9674 695833 726679 537506 503413 440266 683315 484779 538344 623078 701502 774366 649503
9663 649503 573369 564357 566922 680604 635984 667992 820142 585449 761104 892207 983045
9652 983045 1126036 998748 1055339 1315469 1310431 1011554 1126680 1293820 1194805 1022661
9642 1022661 924709 949454 1115643 977522 892586 879509 817439 811794 782334 784469 669967
9631 669967 976135 942689 774803 624270 769056 798239 563728 366148 662594 806111
9621 806111 639104 916350 834503 584863 548103 575482 681911 855444 833052 866827 1234804
9610 1234804 1092959 1085680 1232059 942364 761859 847236 1029950 978367 840835 623833
9600 623833 755224 952064 802396 942376 1024289 1033025 756480 515493 672825 752760
9590 752760 683002 601352 443467 576285 381560 470147 818248 971302 790121 393377
9580 393377 315870 475748 274000 169571 102228 533277 717908 874319 798745 579460
9570 579460 528954 384932 378896 504090 533153 333557 337900 269750 438258 450725 458634
9559 458634 294339 321906 424957 390431 330485 351586 307214 471044 447148 121188 210016
9548 210016 511505 305701 618335 472653 395277 557967 902817 1092045 930855 893011
9538 893011 608073 574803 722117 627935 856992 728045 551608 600534 690977 513299
9528 513299 510066 651717 677623 656610 763553 875201 529309 602830 935941 948026 906560
9517 906560 914811 1155047 996067 853713 668738 670197 648228 511741 770867 809411 644544
9506 644544 873809 963568 778720 977840 954235 889460 755811 692890 727219 780278 545068
9495 545068 692308 692920 702789 387111 499272 593277 687240 554561 301198 173763 519669
9484 519669 632407 826139 771888 637698 554189 485276 762627 736000 740421 654005 750675
9473 750675 659042 570888 607381 533241 574599 783816 568316 511051 439240 315844 512953
9462 512953 251585 471683 774281 499645 397219 505967 561801 437161 703168 657104
9452 657104 479602 279195 419314 561149 383279 437217 438549 364667 462538 492517 388747
9441 388747 99955 466184 704731 542852 596643 514479 208126 83808 131944 318881
9431 318881 557432 715572 556896 646926 700046 990419 1055782 724897 679800 635766 738197
9420 738197 959946 998539 1025103 1218347 1056740 994722 1031546 844475 696533 834588
9410 834588 1102889 1064517 1060351 1246879 1671611 1478878 1082901 824026 1017410 1230907
9400 1230907 1146674 1362827 1608944 1827521 1721892 1780175 1513276 1410679 1405699 1180614
9390 1180614 1157325 1309939 1601081 1444080 1148024 1039015 875627 929254 885481 998472
9380 998472 1039852 1186724 1096825 1056449 923257 765364 859051 914693 630784 722116 643035
9369 643035 457483 462832 673056 903041 934944 1050468 611339 183845 614007 605358 309467
9358 309467 491159 606284 601515 470130 672398 686672 680519 890103 883189 656370 807239
9347 807239 824390 798927 803747 460169 519347 858945 976633 614431 617201 669639 618191
9336 618191 295041 359941 355128 260380 114187 397420 228678 84362 378145 361623 777704
9325 777704 799746 987725 793391 555618 445592 762803 878944 761225 683574 622170
9315 622170 622434 783613 746568 727712 744779 680622 482958 615297 715295 845674 870704
9304 870704 484683 543410 748272 621529 551987 685769 458578 564412 674556 719677
9294 719677 711184 891157 782283 641588 529142 674543 658686 635513 794225 697558 858663
9283 858663 862876 925666 750921 719415 560241 557719 726621 650433 629627 785384 816887
9272 816887 1287468 1046579 1088823 1086496 925901 862743 963801 990587 814009 831571 852843
9261 852843 658322 516130 621794 844944 783854 897065 1001109 930325 851057 591918
9251 591918 588174 861224 930037 775329 861749 929466 1038560 970641 1096006 985168 912837
9240 912837 1087730 1113173 822894 808093 1003523 1360091 1170785 1223325 1317404 1271753 1051117
9229 1051117 1149424 1442826 1381739 1361781 1379298 1469667 1375163 1091335 758920 882256 1148570
9218 1148570 1055620 1198658 1153576 1280768 1255847 1143154 1283190 1286809 1386840 1309370 1113618
9207 1113618 1325824 1525096 1411653 1459220 1494770 1501341 1528421 1513775 1161858 1020008 839716
9196 839716 1123414 1403740 1154578 1392953 1538133 1553988 1337456 1547674 1394995 1212318
9186 1212318 1593858 1478214 1567157 1573492 1003189 1065262 1200956 1577175 1453487 1428905
9176 1428905 1394581 1488062 1594014 1288788 1460838 1658523 1502699 1426008 1510914 1639947
9166 1639947 1989777 1780002 1510127 1657720 1758113 1681728 1858710 1739995 1629485 1707034
9156 1707034 1889625 1893463 1939061 1993525 2054089 1754858 1906291 2089812 1968023 1751542
9146 1751542 1851567 2081926 2167498 1911708 1587295 1435411 1618186 1616046 1855666 1970111
9136 1970111 1821291 1889467 1946861 1784820 1823302 2055538 1925744 2135571 2028422 1999477
9126 1999477 2003440 1946813 2193506 2126191 2191263 2357387 2045698 2080214 2263081 2571176 2509091
9115 2509091 2225148 2738406 2710699 2586691 2674699 2503078 2492555 2429120 2491093 2397193 2569180
9104 2569180 2567582 2270544 2359756 2326236 2336087 2447018 2492212 2246217 2300377 2816098 2585405
9093 2585405 2633050 2536934 2541005 2663918 2926646 3014420 3035842 3074306 3213191 3019030 3016290
9082 3016290 3066914 3134281 3441235 3457677 3664852 3623256 3485100 3329007 3393379 3777284
9072 3777284 3774627 3648240 3639572 3591887 3773514 3406499 3267132 3372971 3411953 3683760 4232280
9061 4232280 4100887 4063191 3989547 3762645 3831342 4109452 3839785 3766972 3744080 4008454
9051 4008454 3760710 3915850 3647210 3432691 3703180 3804526 4186335 4085791 4308377 4064445
9041 4064445 4170197 4296101 4249458 4246659 4321677 4143990 3937710 4242064 4173923 4151821 4399907
9030 4399907 4480507 4340079 4302899 4500935 4302650 4632400 4711134 5003186 4778619 4697683
9020 4697683 4858270 5017991 4830550 4812492 4886106 5103038 4996852 4906420 5120048 5057014
9010 5057014 5117143 5197965 5262510 5332456 5368378 5272145 5232707 5335985 5539376 5561828 5873231
8999 5873231 5783523 5794319 5927341 5939194 5848783 5964710 6001712 6112379 6165303 6333497 6557481
8988 6557481 6856988 6949832 7114018 7047277 7337741 7643672 7733212 8163673 7938042 7963269
8978 7963269 8187732 8407806 8689017 8849318 8638326 8969094 9298920 9672929 9945724 9971749
8968 9971749 10332892 10560754 10661983 11089447 11740032 11803265 11922288 12435398 13415044 14013217
8958 14013217 14515106 14994936 15783198 16525397 17156876 17647499 18814831 19644227 20617595
8949 20617595 21957744 23149074 24320936 25475176 27248191 28961537 31029354 33413852
8941 33413852 36214183 39126290 42556248 46481579 50614661 55300309 60725822 67076208
8933 67076208 74725402 84647029 97812308 115461105 136969990 156847130 173116329
8926 173116329 186549597 196080061 200935578 193777946 171775211 147959529 130017955
8919 130017955 116280528 104995003 95683515 88030738 81421855 75479045 70179272 65594016
8911 65594016 61101433 56832107 53548225 50674484 48428649 46185962 43918376 41808588
8903 41808588 39941392 38813931 37842905 37283466 36639731 36472582 36294125 35808761 35770724
8894 35770724 35515275 35626770 35572460 35466692 36241880 37163950 37975257 39079606 40389282
8885 40389282 41795652 42796246 43487622 43532221 43262777 42765908 41829075 40585191 39332602
8876 39332602 38172261 37109507 36486601 36522693 37082747 37800947 38520424 39207004 39873323
8867 39873323 40866640 41237710 41006808 41158457 41509849 41743919 41801906 41515527 40598859 39475543
8857 39475543 38059235 37198521 36126016 35143611 34001996 33191595 32697493 32882050 33200828
8848 33200828 33584249 34480542 35810480 37591217 39105837 40361982 41445077 42183637 42555871
8839 42555871 41965910 40852737 39548092 38099929 36736676 35685539 35582507 35450869 35207007
8830 35207007 35535246 36297024 36890880 37594934 38334107 39219904 40284348 41101666 41481663
8821 41481663 41497217 40945964 39828671 37884295 35662710 33551470 31775346 30125649 28442108
8812 28442108 27133481 25908229 24830118 24048269 23477898 22933437 22419552 21996188 21548885
8803 21548885 21161737 20946145 20670092 20679761 20620446 20521659 20330077 20190942 20284632 20659255
8793 20659255 20716381 20640532 20802753 20928189 21330045 22086022 22821551 23650915 24676129 25439932
8783 25439932 26528862 27850614 28822988 29388136 29687212 29581662 29334712 28621571 27959555
8774 27959555 27781557 27569466 27510136 27620176 27641708 28255226 29346007 30632786 32374465
8765 32374465 34357760 36224583 38987389 41754128 44162930 46193422 47379192 48040939
8757 48040939 48163318 47511776 46636595 45746260 45566542 45861054 46809881 48037546 49147271
8748 49147271 50516275 51451083 52020767 52505782 52425466 52012789 51538511 50487606 49677286
8739 49677286 48672912 47372371 46182396 45353043 44761940 44380564 44416841 44661170 45276898
8730 45276898 46170684 46957472 47775007 48884170 50095369 51312880 52992071 54735497 56838926
8721 56838926 59018957 61158522 62958377 64103417 64360436 63793946 62396175 60629116
8713 60629116 58226122 55848262 53455356 51834835 50600858 50146763 50099529 49679283 49334946
8704 49334946 48591781 47553864 45691933 43663262 41331154 38744049 36673635 34935947
8696 34935947 33865692 32780705 31888238 31626151 31173145 31269956 31347146 31668793 32018502
8687 32018502 32440718 32865021 33126589 33375721 33366479 33052135 32595465 32207200 32193513 32186268
8677 32186268 32601492 32963661 32895259 32904955 32595452 32110599 31165873 30391978 29351572 28355792
8667 28355792 26891989 25899448 25205953 24539432 24133897 23686568 23398473 23101882 23183852
8658 23183852 23310696 23532867 23569074 24020476 24608985 25404014 26259376 27283125 27678305
8649 27678305 28166328 28496764 27975933 26998926 26257964 25588718 25677289 25523426 25573861 25802046
8639 25802046 25850172 26359405 26349560 26033694 25379985 24230364 22837197 21868488 20998875 20377084
8629 20377084 20147549 19957318 19888520 19775023 19736368 19958517 20200509 20290812 20255857 20480559
8619 20480559 20937107 21494641 22177830 23033290 24135269 25499517 27178849 28787188 30682429
8610 30682429 32596148 34401411 35503248 36021329 35928912 35343228 34200850 33113548 32442024
8601 32442024 32314963 32783535 33404200 33540104 33243907 33001878 32343602 31079561 29497696
8592 29497696 27578916 25728018 24187773 22832136 21978140 21025684 20134786 19421076 18877587
8583 18877587 18492910 18182475 17375144 16292249 15373773 18326728 19113630 18581993 18976208
8574 18976208 19370711 19745105 20350519 21502126 22396172 22968832 23482453 23941749 24400687
8565 24400687 24747333 24118575 23424293 23474413 23659434 23593357 23909413 24325743 24871596 25527084
8555 25527084 25847673 25946961 26051121 25782067 25485496 25301408 25205089 24751081 24155840 23280006
8545 23280006 22538994 21740819 21425142 21348220 21550008 21501877 21444978 21403323 21425718 20938790
8535 20938790 20237084 19348978 18672600 18211729 17700379 17329236 16620881 16323609 16101132
8526 16101132 16026041 16327058 16379389 16241161 16261983 16313558 16575644 17003017 17196217 17446714
8516 17446714 18111536 18793034 19581281 20645776 21464413 22889507 24265616 25474101 26266028
8507 26266028 26777144 26820845 26539831 26080001 25923470 26304683 26807397 27432537 28395104 29613548
8497 29613548 30725563 31231949 31250298 31041270 30262635 28829138 27240587 25861483 24167284
8488 24167284 22769558 21615324 20666030 19894401 19179778 19141627 19347106 19691194 19923130
8479 19923130 20355246 20894985 21052172 21499600 21620101 21069253 20401120 19956051 19764998
8470 19764998 19549920 19474129 19274409 19194849 19383558 19177672 19243500 18959834 18709802 18749336
8460 18749336 18646455 18988797 19572377 20308004 20611982 20670905 20835606 20213538 19246657 18237483
8450 18237483 17268186 16412404 15132817 14254504 13696120 13282548 12975371 12835534 13104051
8441 13104051 13111204 13471326 13824291 13827555 14017193 13903982 13161322 12510160 11329555 10279523
8431 10279523 9439695 8603987 8083815 7482768 7167060 6843614 6161467 5644513 5441508
8422 5441508 5160273 4834554 4549402 4475162 4451341 4253740 4034992 4021964 3895354 3549384
8412 3549384 3579801 3469967 3487101 3629733 3639422 3629280 3732301 3803114 3687914 3515317 3584477
8401 3584477 3545496 3513401 3411148 3175454 2882134 2320952 2719147 3049148 2654352 2392027
8391 2392027 2171247 2103790 2281769 2295800 2016590 2120936 1976595 1842620 2086893 2141838
8381 2141838 2324323 2672908 2906671 2681705 2593663 2731603 2701388 2827073 2673121 2414929
8371 2414929 2386434 1848937 1659173 1842959 1693567 1586492 1385636 1543973 1474537 1441703
8361 1441703 1376018 1433057 1419600 1403211 1664774 1439482 1262287 1253251 1385905 1105483 1111841
8350 1111841 1424456 1378273 1215289 1112271 1166606 1170517 919069 911556 760516 900429 1325241
8339 1325241 1292941 802289 1026034 1236728 1151256 1407173 1192239 1077499 1030164 1090020
8329 1090020 1109011 704657 777394 1081372 1120572 1260749 996229 1123233 1244808 933280
8319 933280 701115 683714 849752 754515 603847 740356 719375 643505 867113 872870 901860
8308 901860 1111161 1044522 959401 806844 991336 1118062 959170 1063939 788740 708141
8298 708141 750514 733500 891232 1006815 976998 979383 913988 953644 1080742 859970 913756
8287 913756 1026935 882879 993880 1179756 1299952 1015413 908276 1321573 1683340 1540990
8277 1540990 1405829 1220962 1474883 1422141 1330959 1686516 1666425 1629881 1180228 1291981
8267 1291981 1751005 1750345 1848961 1675302 1968040 2147546 2318214 2323071 2405668 2283523 2228112
8256 2228112 2106871 2058427 2345917 2034467 1575337 1519935 1537816 1939744 2109719 1985651
8246 1985651 1870030 1645657 1532362 1893866 1930625 1762641 2053276 2181289 2341905 2236875
8236 2236875 2515824 2652670 2682144 2433827 2452407 2493388 2511594 2103107 2233492 1976673
8226 1976673 1602064 1295963 1365830 1538462 1386721 1109198 1103780 1259621 989891 925011
8216 925011 909553 565004 652916 513243 539268 536602 586288 627262 312547 82169 395021
8205 395021 415593 396767 133165 -85025 -493552 -75715 13824 -234752 -184838 -24457
8195 -24457 -591880 -705540 -1886735 -2044805 645392 451985 558000 -251348 -83465 -247772
8185 -247772 219374 302991 -7039 654 112499 229700 43184 5969 254655 183878 207844
8174 207844 162558 -59986 -278565 -170281 -64265 -113667 -178674 -150251 -101170 -69442 200686
8163 200686 5786 80669 58634 81558 -196353 -179564 62024 126518 -64392 -61304 -349897
8152 -349897 -547226 -488749 -347609 -490741 -263116 -351573 -444651 -373697 -311217 -234660 -104379
8141 -104379 -332875 -213785 190081 26755 -222688 -5955 -214816 -189113 81504 -56531
8131 -56531 -94926 -113293 -56267 -121004 -132941 -257678 -289293 -166266 14571 -76395 -228379
8120 -228379 -183735 -472382 -345943 -695543 -548731 -383141 -437590 -424859 -422788 -466587 -490106
8109 -490106 -312581 -207221 -630949 -492016 -4462 21854 1826 -282158 -364715 -293689
8099 -293689 -256641 -251648 -328506 -504834 -184788 -559158 -641590 -464830 -492439 -515066 -333038
8088 -333038 -391344 -365359 -296084 -613171 -696178 -487871 -354833 -1485 -203145 -234750 -228153
8077 -228153 -693090 -655718 -521819 -600320 -88005 -298185 -424699 -470769 -381692 -458044 -510367
8066 -510367 -552308 -578076 -538086 -799569 -665882 -511144 -795877 -646097 -545097 -613593
8056 -613593 -537773 -593321 -262882 -192211 -327216 -251374 -216019 -117775 -153064 15421 98443
8045 98443 275028 68627 -333039 -127344 -231501 -360282 -332077 -316898 -481655 -328065
8035 -328065 -125106 -176138 -302237 -352596 -278230 -81913 -101067 -6848 -200400 -610037 -565443
8024 -565443 -544982 -530810 -285980 -434377 -513388 -369206 -226917 -270942 -254602 -397695 -192132
8013 -192132 -253246 -387650 -404867 -287390 -297987 34162 -51915 -156775 -71725 -61801 -90361
8002 -90361 -313052 -39156 2479 -151273 -2900 -57558 -94944 -181400 -46257 85875 171283
7991 171283 -87051 11229 -61621 -243561 -159909 -183288 -373781 -477259 -487788 -390144 -227263
7980 -227263 -295093 -198427 -121634 -256274 -211173 -107539 -295337 -297898 -558333 -448829 -597553
7969 -597553 -544660 -638017 -562678 -255100 -228791 -197485 -80012 -298446 -492907 -631335 -387411
7958 -387411 -173151 -121624 77799 -193018 -498411 -310582 -50768 14652 169828 115401
7948 115401 -84961 -178361 -126963 -493789 -607977 -268635 -256580 -539710 -733169 -508627
7938 -508627 -200209 -360548 -406803 -537878 -378805 -662190 -931518 -684957 -635956 -525931
7928 -525931 -465246 -470546 -550860 -593050 -391296 -284579 -425379 -503460 -406202 -236662 -385490
7917 -385490 -292189 -96060 -131374 -430505 -223830 -180249 -85642 -425350 -362883 -313075 -493427
7906 -493427 -544776 -413295 -477751 -447235 -536468 -465147 -453183 -279524 -243342 -502132 -510840
7895 -510840 -574857 -495267 -542864 -409135 -272184 -556522 -678198 -428384 -84495 -57648
7885 -57648 -197329 -232316 -257885 -205908 -200137 -66498 -50370 -73172 -294009 -432246 -182603
7874 -182603 -104990 -166590 3783 -40267 -84305 -303229 -202977 -125724 -205822 -348687 -131360
7863 -131360 78531 144623 41613 -155537 68010 -107541 -343632 -31759 -183881 -474441
7853 -474441 -452143 -60068 -255499 -311941 -432926 -579279 -398875 -645738 -340739 -296251
7843 -296251 -329671 -367124 -165151 -267048 -337021 11755 -53871 217243 392932 279659
7833 279659 241582 240754 73259 -113608 -147985 38727 -9854 -172143 -364401 -34076 82137
7822 82137 -152090 -223650 -137356 -90398 -222480 -321021 -114180 148712 -64113 -335309 182430
7811 182430 195064 35106 110435 360129 187791 634023 -427360 -853904 -528928 -361123
7801 -361123 -90797 -38146 72016 -47542 -196799 -99196 9375 -119786 -23485 -299585
7791 -299585 73427 -181649 -9628 52253 -9200 -234754 -9010 -365488 -520839 -510778
7781 -510778 -308732 61050 184523 -273848 -209552 -10401 10662 -29075 115266 214547
7771 214547 38887 -191144 -33111 139126 -62662 92624 362959 527737 452478 132418
7761 132418 103168 14902 190158 277044 208829 449536 365472 280522 181747 79004 341526
7750 341526 425304 315960 333050 375275 236095 19377 135267 233321 630140 776260
7740 776260 762077 321780 528124 591774 551190 479953 508963 574688 423830 635682 722285
7729 722285 444347 498227 478313 595707 709006 632100 376370 -41392 -33309 141971 479778
7718 479778 783876 603797 427525 314260 31439 205964 354042 447356 127352 316091
7708 316091 187640 374935 692613 593066 308062 440998 469046 237676 167851 291379
7698 291379 313734 339623 286362 61531 227450 -17196 177955 133707 151678 258350 386742
7687 386742 456205 171654 501746 369158 147562 171515 -130663 -192892 -336549 -333417 -317800
7676 -317800 -75968 -154187 -160523 -231284 172159 154514 -135909 42028 137478 206863 163729
7665 163729 -44875 253360 249203 12596 38264 -167661 -238644 154418 -160961 -141947 99562
7654 99562 -147548 -20163 202567 209468 -165623 -184946 171925 104603 40684 77010 61184
7643 61184 -115802 30446 210858 41084 162111 143661 261894 256369 261616 131271 46950
7632 46950 212525 261686 214687 257176 76958 285685 200339 -14159 93253 47919 282805
7621 282805 426102 461318 317765 -42085 58453 193871 217586 62205 77715 176983
7611 176983 367909 250152 368587 371506 316436 247253 159911 62346 201109 239103 227700
7600 227700 380480 607569 771441 609376 382158 460426 435265 555136 458291 542911
7590 542911 592142 557836 565886 589099 677398 595233 285266 455527 664478 514011 643410
7579 643410 672774 808950 714572 688226 854485 883920 711932 885947 653023 413762
7569 413762 497006 713031 707233 1082548 861941 870277 831848 934480 840512 862041 968304
7558 968304 670789 583756 682631 543725 358450 389236 516686 668296 715901 613632
7548 613632 453069 388286 384263 548081 913056 616006 551924 705574 532971 701661
7538 701661 755195 768588 778167 835080 507161 379987 536267 555307 583506 620444 346458
7527 346458 258333 543408 679838 522943 508775 335688 302152 162023 27287 252348
7517 252348 423628 526757 376482 330925 133805 2937 248271 226772 137754 -110903
7507 -110903 76867 225518 189020 136915 210702 263560 163559 -86936 32057 191718
7497 191718 149070 141552 196397 205256 60852 86384 323199 208387 31578 144809 32278
7486 32278 107963 410563 410116 290014 537614 272561 238424 186240 45371 175035 1300
7475 1300 146529 348752 238982 100342 125975 543883 485728 513931 459896 107296 245674
7464 245674 255642 218283 281842 324592 316183 390245 285613 380761 376032 337381 244910 205578
7452 205578 123121 242 124888 -49608 23637 220375 76177 -6745 157392 331118
7442 331118 311075 514654 709053 454645 366603 453555 302962 102437 268068 225403
7432 225403 -96403 221857 302799 445435 468709 304338 292579 218293 40919 196587
7422 196587 460811 506151 281450 207794 337184 437696 440232 319749 343960 679409 725206
7411 725206 816170 810121 576069 889236 849439 718279 699800 665261 718858 959206 877415
7400 877415 794808 1025524 1330691 1380766 1494660 1494851 1458714 1550628 1487879 876444 1022424
7389 1022424 1138346 1121559 1112762 1153509 1084702 719657 742520 845402 641460 515979 634965
7378 634965 613639 356519 422223 400148 462815 699389 568532 405209 437947 260840 246554
7367 246554 -30043 -43592 14009 -25523 186979 361042 395389 346907 96036 418814 553214
7356 553214 95968 190967 198455 115612 123403 97101 266248 500162 440961 276395 169300
7345 169300 564220 487681 402478 330827 350563 276724 300049 851585 856916 476092 554152
7334 554152 604622 667631 537725 611670 826739 725767 726715 721515 494306 447183 806073
7323 806073 842890 660020 640849 597468 858809 766170 682129 565694 466955 613500 769035
7312 769035 480157 481433 316792 475046 478522 717063 700060 454122 511264 495381 532220
7301 532220 401234 523038 672973 607007 789042 538834 338252 533419 619219 864461
7291 864461 816220 611238 723737 930669 620878 681318 703745 685241 937745 874884 816275
7280 816275 735576 938054 1182414 973136 912942 845241 650906 521908 531209 735862 880392
7269 880392 555474 373997 618932 497291 353598 503798 716026 827431 935355 994277
7259 994277 1013329 1274117 1090111 826445 706581 892781 1310773 1135793 989383 961835
7249 961835 725356 909684 1068548 1250941 1015966 997727 1103192 968353 1119683 1275637
7239 1275637 1119592 1300621 1293347 1348844 1385967 1363643 1524399 1760153 1722595 1681508 1594837
7228 1594837 1377003 1536669 1405517 1324805 1456262 1159778 1036919 1164456 1199498 1223664
7218 1223664 1050427 1007042 973859 1011371 1079435 1220397 1338774 1149696 1633398 1594729
7208 1594729 1577999 1506241 1586644 1547855 1474902 1418222 1329304 1472803 1537999 1537134 1477098 1711364
7196 1711364 1633198 1801769 1975281 1842972 1766676 2089416 2301109 2118031 2361033 2122173
7186 2122173 1657872 1873052 2169640 2166196 2140163 2271950 2252733 2488142 2586940 2613750 2789407
7175 2789407 2767131 2712110 2623929 2802603 2930909 2845033 3006814 3186251 3398597 3447303
7165 3447303 3595398 3727610 3922025 4073641 4255468 4330927 4210720 4223993 5002584 4977170
7155 4977170 5117512 5737379 5762286 5946579 6286515 6570183 6695247 7108824 7495013 8060495
7145 8060495 8390466 8800239 9261547 9205537 9657927 10366782 10969713 11302544 11746631 12143211
7135 12143211 12327537 12449832 12719740 12931466 13268468 13538038 13651683 13592028 13757474 13448818
7125 13448818 13530094 13561076 13407360 13000884 12476943 12049937 11715536 11347973 10855455 10665810
7115 10665810 10227175 9928594 9606436 9186546 8774247 8731472 8721518 8459254 8297950 7883626
7105 7883626 7512969 7571443 7208946 7029786 6853995 6629686 6610297 6384097 6288708 5833079
7095 5833079 5500962 5003555 4760852 4744804 4538869 4459303 3933519 3668469 3771631 3738513
7085 3738513 3433150 3426246 3131014 3070766 2994894 2943080 2788096 2765629 2802915 2915853 2678833
7074 2678833 2536194 2551838 2236742 2105301 2119905 2274849 2252209 2191579 2148104 2216920 1999563
7063 1999563 1878072 2188731 2265394 2429231 2749727 2462128 2156697 2643370 2616258 2290502
7053 2290502 2104434 2028584 1995240 2079884 2289973 2460217 2264179 1991321 1944955 2030569
7043 2030569 1957543 2153395 2113487 1941211 1982720 1700412 1702722 1873759 1840735 1570259 1742296
7032 1742296 1851456 1666435 2025826 2211246 1949000 1987735 1863937 1646998 1616666 1704595
7022 1704595 1651879 1672752 1666336 1229724 1282015 1420792 1632235 1747288 1839465 1692861 1586061
7011 1586061 1733081 1639424 1874962 1671816 1552647 1625642 1563406 1505206 1548424 1478805 1700751
7000 1700751 1805891 1905571 2032885 1583771 1873560 2286465 2465999 2470949 2282406 2629400
6990 2629400 2550616 2414884 2405062 2246915 2398724 2846650 2774373 2699174 2674858 2765321 2922522
6979 2922522 3164536 3187571 2966441 2791836 2315501 1924087 1891751 2015291 1837635 1868233
6969 1868233 1863252 1825350 1815323 1696670 1942199 1808982 1524801 1519997 1214495 1879547 2015771
6958 2015771 1950682 1847074 1669711 1789980 1905138 1762876 1982553 2214230 2045533 2006615
6948 2006615 1869647 2034734 1999781 2331838 2403828 2392024 2468771 2370819 2111169 2462212
6938 2462212 2370658 2307674 2436177 2522375 2594532 2580407 2623303 2731123 2957722 2954599 2976438
6927 2976438 2847424 2881771 2651365 2482662 2790455 2814073 2857063 3083512 2994372 3132707
6917 3132707 2902556 2675824 2610053 2327370 2371077 2325854 2130338 1974746 2040296 1792458
6907 1792458 1901757 1931831 1776786 1785773 1660250 1686789 1519203 1474005 1563814 1505994 1197975
6896 1197975 1284546 1328032 1011507 1233728 1229481 984181 1191968 1201097 1207788 1084564 1186575
6885 1186575 1282797 924266 986276 1139974 1501328 1481308 1131147 1287817 1221753 1084221
6875 1084221 900944 658686 762253 745041 984509 1167542 1097831 1105879 901316 1217298
6865 1217298 1316825 1015303 949775 857858 806716 988931 1242052 1502098 1206838 1093030
6855 1093030 1201680 1134658 1119150 1149922 1109699 1055445 1330811 1129228 1119239 1159211 1113956
6844 1113956 1170522 1248674 1175010 1216012 1496994 1475668 1348803 1088304 1178047 1456459 1414678
6833 1414678 1307999 1264603 1404587 1503777 1337893 1370182 1457949 1715469 1488043 1574865
6823 1574865 1544185 1625902 1435072 1533115 1591191 1397482 1446138 1350341 1466980 1522292 1467409
6812 1467409 1295728 1553689 1618763 1726483 1793688 1819319 1674939 1698944 1802259 1835072
6802 1835072 1814106 1627493 1784942 1901066 1816778 1569528 1114686 1249722 1430018 1391718
6792 1391718 1380781 1621308 1569419 1654882 1780789 1646420 2013902 1758003 1506511 1721112
6782 1721112 1853959 1807919 1618978 1641669 1680133 1647479 1500583 1687528 1720928 1506643
6772 1506643 1605451 1816260 1586081 1581551 1594468 1596904 1721052 1770361 1521105 1470730 1514738
6761 1514738 1789254 1815957 1889182 1960436 1799363 1698298 2003879 2047018 1832110 1923932
6751 1923932 2141898 2142850 1873610 2218451 2282927 2502415 2774626 2783940 2805127 3171416 3527858
6740 3527858 3916092 3901143 3879341 3650091 3680620 3659784 3458974 3427110 3418880 3328976 3309832
6729 3309832 3534269 3947093 4138922 4010981 4032327 3860092 3572285 3480323 3418594 3384034
6719 3384034 3354213 3458003 3506402 3400230 3725218 4153199 4403644 4504757 4699592 4705756
6709 4705756 4383813 4139924 4180724 4268496 4295453 4613352 4436785 4323570 4431617 4495359
6699 4495359 4460333 4194971 3983334 3622760 3228758 3020730 3037081 3213884 2960503 2831224
6689 2831224 2773871 2764156 2567139 2441610 2298013 2537096 2672224 2731866 2645466 2442520
6679 2442520 2933450 2842076 2641578 2579887 2769040 2638005 2590621 2636094 2660436 2476303
6669 2476303 2728270 3062629 3003723 2781766 2833329 2554794 2652017 2661486 2500376 2635046
6659 2635046 2748736 2691498 2363513 2454188 2317582 1957149 2084081 2240900 2351826 2450322
6649 2450322 2557915 2258369 2232062 2179744 2294276 2668863 2908519 3076096 2713922 2790794
6639 2790794 2525875 2380320 2679415 2513238 2655069 2824998 2461907 2693701 2494195 2357740
6629 2357740 2313238 2383033 2606886 2697174 2483020 2616541 2462644 2332973 2607702 2505347
6619 2505347 2502884 2684324 2929970 2836994 2708077 2813870 2990997 2711107 2580389 2636054
6609 2636054 2728977 2617494 2801272 2751412 2760751 2764989 2949227 3008692 2895601 2911451 2623045
6598 2623045 2702286 2969842 2943382 3055357 2890889 2920452 3019393 2969196 3072450 3500308
6588 3500308 3574862 3380681 3427521 3448069 3502682 3547203 3584630 3738755 3839324 3853680 3975069
6577 3975069 3836366 4096233 3948350 3873036 3795668 3975698 4272508 4401492 4420226 4533958
6567 4533958 4631041 4539459 4667690 5075839 5343162 5662193 6082639 6315953 6329917 6950329
6557 6950329 7356668 7350875 7259273 7270433 7194796 6864802 6820957 6220112 5845435 5604614 5577686
6546 5577686 5677474 5518551 5581426 5471983 5305834 5384303 5260671 5133988 5205329 5148780
6536 5148780 5327165 5306298 5061390 5182745 5178554 4926208 4644313 4783690 4614160 4462420
6526 4462420 4562972 4532998 4446647 4384228 4175565 4020026 3817348 3624628 3794267 3863713
6516 3863713 4006484 3953916 3966781 3550861 3120960 3378599 3620730 3539429 3502309 3525306
6506 3525306 3504219 3388739 3670311 3650959 3394065 3506051 3829010 3597438 3828922 3926571
6496 3926571 3650369 3759227 3770789 3810184 3617174 3599832 3670624 3842893 4064596 4315915
6486 4315915 4195227 3971216 4019109 3709336 3885630 4143802 4305988 4195290 4116137 4291141
6476 4291141 4355588 4211529 4123667 4283925 4244070 4322912 4507155 4790708 4707081 4519387
6466 4519387 4526449 4665411 4510280 4731376 5029399 4906739 4562499 4434404 4578504 4820279
6456 4820279 4825209 5111537 5225644 5201400 5121460 5392706 5560674 5442456 5492341 5621387
6446 5621387 5407395 5619964 5877103 5600639 5634266 5850929 5973515 6249983 6258727 6350338
6436 6350338 6328347 6296388 6160939 6444906 6503116 6258557 6081664 6201598 6400499 6481730
6426 6481730 6450153 6395025 6910873 7095803 7384063 7329227 7150214 6875540 6970671 7489986
6416 7489986 7691744 7973313 7891131 7922521 8142324 8184972 8488300 8702221 8799077 8706406
6406 8706406 8883294 8906383 8756172 8799360 9064930 9267457 9450444 9989759 10536832 10717108
6396 10717108 10809001 11100021 11403981 11631776 12223370 12959691 13687174 13991544 14438702 15486971
6386 15486971 17116055 18638160 20514177 22778079 25396249 27866959 29409377 30822949
6378 30822949 31513930 31072258 29324780 26900250 25069825 23722697 22758525 22083875 21977523
6369 21977523 21922133 22120966 22485144 23004771 23744494 23960240 24661928 25252367 25447220 25531305
6359 25531305 25810068 26101480 26361349 27381945 28440512 29219835 30193218 31319010 32209123
6350 32209123 32824554 33398683 34405568 35164305 35830994 36353537 37105987 37620860 38058192
6341 38058192 38689274 39448178 40306890 41634284 43682376 46154894 49482367 53178851 57327642
6332 57327642 61265395 64773159 67944688 69990773 70770228 70039667 67801406 65000938
6324 65000938 61705240 58869609 57348833 56488399 56531640 57090949 58263656 60329454 63265635
6315 63265635 66379760 69843778 73488303 76813405 79663509 81194437 81368092 80260378
6307 80260378 78416675 75596297 71821358 67592744 63643807 60345351 57656511 55754465
6299 55754465 54223145 52884517 52450528 52651173 53096847 53995988 55646472 57455845 60125123
6290 60125123 63488753 67228228 71001364 74360750 77256887 79037304 79580865 78697027
6282 78697027 76688680 74182861 71324415 67967786 63944869 60584497 58110984 56163978
6274 56163978 55052584 54711119 54931221 55888753 57440578 59790189 62154937 64237857 65858240
6265 65858240 66261296 65732202 64214914 61252492 57688192 53638957 49646067 46394455
6257 46394455 43679024 41692845 40029793 38573610 37540649 36794164 35604002 34691766
6249 34691766 33862005 33216265 32378283 31702181 30878364 30176523 29257199 28240044 27469328
6240 27469328 26410005 25648602 24555270 23585026 23059708 22475087 21653113 21233603 20612534
6231 20612534 19616251 18882322 18144182 17060378 15818027 15238237 14250222 13436472 12728234
6222 12728234 11831318 11208021 10726307 10669554 10263851 9656526 9692279 9338246 8777119 8776296
6212 8776296 8460936 8163166 7939925 7958705 7417341 7240447 7251828 7291141 7196520 7012781
6202 7012781 7034704 7092325 6854433 6738155 6680697 6635533 6813320 6765312 6717164 6752146 6552020
6191 6552020 6421583 6428637 6299889 6354130 6098161 5815750 6058101 6029044 5938413 6138951
6181 6138951 6029333 5996056 5933949 6063660 5890010 5939551 5813120 5700875 5594147 5816894
6171 5816894 5514487 5430952 5363686 5287383 5554815 5510024 5755728 5475005 5540953 5647253
6161 5647253 5875713 5709744 5704917 5896729 5532163 5469482 5340913 5231113 5323995 5507113
6151 5507113 5259844 4946661 4750130 4517287 4598079 4702891 4534633 4347947 4130370 4175332
6141 4175332 4121560 3926462 3825204 3953126 3967471 4064964 4090034 4036236 3901530 3718632
6131 3718632 3715607 3748724 3858838 3575999 3569892 3724030 3856124 3650057 3600210 3286836 3213889
6120 3213889 3034920 2987036 3270557 3250809 3099443 3079597 3230580 3614675 3371574 3332584
6110 3332584 3450594 3293170 3125073 3119761 3113526 3158527 3064414 2880434 3140043 3166860 3305979
6099 3305979 3394585 2972955 3000242 3227502 3113370 3153746 3067997 3023450 3132695 3131054 2951323
6088 2951323 3300609 3422708 3194250 3017711 3219821 3207007 3336274 3168485 3141040 3386334
6078 3386334 3370870 3189438 3179067 3148399 3392350 3399116 3461876 3391567 3576816 3510533 3398822
6067 3398822 3321233 3191317 3220875 3054099 3433731 3493080 3584816 3532527 3542308 3683279 3760925
6056 3760925 3768891 4075483 4028009 3912753 3999115 3964982 4010165 3858705 3950324 3766516 4099845
6045 4099845 4242214 4006293 4061941 4120794 4193251 4158208 4032020 3973354 3838088 3924412 4128083
6034 4128083 4267180 4312356 4505849 4496399 4452675 4426459 4371489 4451967 4158841 4340110 4394018
6023 4394018 4469176 4603896 4680030 4410521 4498118 4696527 4616424 4735143 4925569 4821121
6013 4821121 4937009 4571434 4294529 4535376 4687530 4681363 4628430 4397473 4442978 4482821
6003 4482821 4555963 4823800 5047077 5146979 4902469 4839136 4841789 4806588 4863255 4781585 4987449
5992 4987449 5249927 5155492 5344974 5377265 5671849 5917206 5736527 5794314 6011655 6121601
5982 6121601 6124019 6256528 6317926 6453305 6857165 7068108 7168823 7379369 7672583 7992708
5972 7992708 8388934 8312233 8081664 8158845 7940520 8001226 7773273 7420105 7479665 7219055
5962 7219055 7025521 7093119 6710365 6695982 6599497 6600095 6545712 6633023 6567641 6089021 5968068
5951 5968068 5880920 5754532 5914708 5938079 5829271 5807315 5874041 5774628 5696780 5716829 5650431
5940 5650431 5707081 5392558 5311331 5385886 5482628 5163988 5328695 5668954 5659222 5849647 5985312
5929 5985312 5754843 5743108 5923761 5970014 6183489 5898441 5810825 6075390 6254349 6398990
5919 6398990 6386038 6514725 6423818 6341360 6367870 6415552 6592841 6605336 6593235 6540830 6658808
5908 6658808 6948941 7036603 7265830 7529571 7506337 7550657 7348647 7397238 7495678 7513954 7672287
5897 7672287 7378796 7458299 7451553 7407169 7244487 7163710 7078460 7319982 7485676 7634783 7486965
5886 7486965 7563647 6997249 7048994 7254674 7015570 7038822 7163670 7138633 6953601 7053171
5876 7053171 6965370 7029229 7117596 7056248 7140167 7087153 7004281 7256924 7284475 7363433 7325756
5865 7325756 7594906 7654539 7396973 7468248 7937862 7855682 7812565 7677747 7622410 7488192
5855 7488192 7431633 7347301 7319823 7552316 7277518 7387101 7343819 7198058 7226476 7227287 7145487
5844 7145487 7109076 6839268 7068994 7244320 7106902 7071859 7040435 7285713 7380644 7303429
5834 7303429 7431917 7544809 7728695 7692893 7633522 7763801 7783171 7782155 8052983 8122430 7967862
5823 7967862 7857322 7803499 7966273 7672139 7588938 7399852 7531043 7617662 7621966 7543217 7541474
5812 7541474 7364810 7341857 7324717 7419602 7714501 7702248 7812711 7899693 8147770 7812571
5802 7812571 7728665 8098910 8343477 8310318 8206345 8311412 8385478 8234173 7864309 7923320
5792 7923320 7947037 7954211 7942471 7927795 7703282 7686783 7540501 7548210 7786836 7645043 7541991
5781 7541991 7733450 7918424 7746523 7825578 7995318 8079574 8283420 8104989 8161043 8205472
5771 8205472 8315982 8409039 8499959 8605307 8695594 9079709 9123893 8960082 9037115 8820493
5761 8820493 8908907 9158607 9174403 9067612 8996545 8881534 8884858 8865715 9007926 9049317 9077269
5750 9077269 9033487 8698716 8490637 8551488 8896346 8935281 8666999 8510043 8728856 8796347
5740 8796347 8695453 8572215 8739028 8766165 8831144 9171666 9324529 9351417 9273281 9209729
5730 9209729 8924038 8885916 9386881 9509440 9486640 9471803 9291703 9530561 9655094 9734066
5720 9734066 10009723 10144446 10264475 10359764 10419838 10196677 10177675 10016595 10045241 10206132
5710 10206132 10494615 10699528 10853508 11012309 11331435 11264154 11390483 11660254 11912571 12286791
5700 12286791 12143328 12356336 12308557 12264676 12589562 12781240 12937963 13318376 13812556 13976526
5690 13976526 14268158 14558573 14640563 14658336 15014273 15012544 14731818 14562275 14468141 14446521
5680 14446521 14384556 14113864 14105458 14143923 14117340 13994912 13907573 13744690 13782390 13715403 13717495
5669 13717495 13750585 14273474 14524506 14640049 15023904 15253269 15384776 15989647 16370473 16872649
5659 16872649 17650463 18281990 18872389 19181376 19717492 20133025 20240325 20245032 20414806 20414108
5649 20414108 20818343 21165707 21405566 21672747 22099759 22668941 23000056 23522187 24204104
5640 24204104 24509327 25313199 26308613 27120051 27810989 28739788 29627825 30629408 31796817
5631 31796817 33521738 34861294 36651163 38146247 39654714 41704498 43795354 45976442
5623 45976442 48202103 50710792 53289308 55918156 59034174 62689681 66789508 71261084
5615 71261084 76299674 82322420 89047051 96336562 104435977 113147904 122514906 132789341
5607 132789341 143479008 154599277 165390584 175254224 183918247 190767582 194870641 196541690
5599 196541690 195528779 191012685 183789712 175369243 166169838 156426986 146516033 136359557
5591 136359557 126267037 116864785 107443388 98896985 90638603 83264078 76958974 71034033
5583 71034033 65951744 61515528 57237325 53396275 50080477 47121914 44341553 41774830
5575 41774830 39826966 37947599 36275284 34668813 33230829 31794110 30350365 29180951
5567 29180951 28133449 27107954 26130099 25275674 24248862 23627814 22703832 22002125 21351445
5558 21351445 20485934 19824189 19300273 18829141 18276852 17689345 16790754 16348305 15977636
5549 15977636 15797133 15503109 15355410 14687250 14369477 13999315 13750597 13735120 13255652 13073543
5539 13073543 13054486 12775753 12582458 12441055 12038654 11981662 12436553 12093540 11897691 12015270
5529 12015270 11670472 11549302 11414455 11265330 11374245 11168572 11051813 11048849 11186175 11259516
5519 11259516 11071105 10941052 11060549 10964090 10650711 10630946 10533158 10706032 10820406 10673317
5509 10673317 10619666 10649780 10658022 10492920 10319337 10196446 9889933 9735467 9704965 9696349 9561265
5498 9561265 9256319 9138542 8975594 8771068 8454951 8317895 8330964 8170159 8128909 7857846
5488 7857846 7769132 7789189 7626318 7350690 7295837 7291336 7167335 7228714 7428995 7197136 7194386
5477 7194386 7136599 6944786 6998764 6917032 6629147 6571542 6551632 6600564 6669930 6661985 6765224
5466 6765224 6730204 6717442 6785910 7096619 7034129 7124469 7110157 7365818 7646418 7819669 8156205
5455 8156205 8202599 8523949 8753085 9032895 9362102 9996799 10498685 11224931 12555132 13513762
5445 13513762 14438010 15220516 15832677 16210586 16290347 15787634 14501897 13278631 12203435
5436 12203435 11621655 11150642 10731583 10307051 10109158 9767613 9412551 9193276 9017616
5427 9017616 8563234 8397750 8333767 7940228 8089447 8110920 7921447 8267576 8389219 8517102
5417 8517102 8389248 8147060 7851646 7274914 7079913 7200368 7179102 7197573 7288886 7430452
5407 7430452 7290500 7219474 7080192 6978897 6908426 7147802 7103539 7009373 6959792 6786316
5397 6786316 6597439 6756441 6669804 6486863 6286616 6164174 6123790 6271299 6292233 6105268
5387 6105268 6238040 6448669 6363691 6283931 6302672 6308356 6053507 5914719 5886694 5674712 5761548
5376 5761548 5632781 5837696 5742953 5780480 5716805 5559142 5432014 5699739 5719967 5667241
5366 5667241 5543048 5566159 5610879 5563905 5198065 5171550 4932446 5224321 5208045 5167053 5231610
5355 5231610 5240273 5232193 5492311 5296404 5110842 5232222 5158702 5122210 5294700 5338989 5184265
5344 5184265 5114491 5452456 5560748 5439647 5298468 5227276 5278912 5334982 5673341 5583343
5334 5583343 5582041 5691494 5403340 5400974 5533543 5494182 5349784 5223084 5212240 5249673 5260844
5323 5260844 5301612 5288911 5174886 5275619 5333746 5510915 5500503 5425771 5262970 5196421 5148664
5312 5148664 5266074 5510719 5603487 5248899 5268162 5627237 5815271 5635282 5507349 5570781
5302 5570781 5850568 5917692 6068945 6148238 6065927 6270644 6261268 6336885 6359177 6212164 6205178
5291 6205178 6194821 6360262 6520879 6363437 6367471 6358045 6498446 6626310 6757659 6834667 6568777
5280 6568777 6531681 6642836 6568215 6764732 6783467 6718565 6548254 6576801 6804012 6742270 6932807
5269 6932807 6784798 6458436 6492653 6884138 7072861 7162246 7259503 7209014 7002532 7241141
5259 7241141 7369067 7510467 7758801 7767612 7678427 7897559 8119688 8490481 8379226 8343137
5249 8343137 7973794 7834059 7674196 7342931 7396649 7505423 7397489 7345006 7486348 7585072
5239 7585072 7653078 7568484 8016741 8145968 8149357 8223270 8146789 8261995 8514352 8796129 8957298
5228 8957298 9000311 9131282 9263159 9670347 9908716 9991198 10119071 10552696 10829893 11346270
5218 11346270 11838161 12195997 12555614 12868393 13040836 12653442 12735811 12938791 13074602 13195136
5208 13195136 13114209 13233941 13600102 14096572 14547649 14497059 14826410 14887419 15213512 15235131
5198 15235131 15014889 14492750 14030780 13869643 13566364 13590230 13669202 13633154 13585191 13601331
5188 13601331 13140010 12985175 13426919 13986782 14102312 14569042 14987734 15324466 15788893
5179 15788893 16272208 16924192 17272679 17554685 18060717 18308633 18663829 19065437 19381988
5170 19381988 19802386 20283047 20683988 21285631 22163336 22676716 23100045 23416060 23371510 23627912
5160 23627912 23244801 22846150 22421127 22338591 22156095 21828485 21703731 21566781 21665264 21964120
5150 21964120 21906111 22061207 22485099 23144181 24083285 24901618 26108806 27183484 28186705
5141 28186705 29021956 30172867 31521359 32789288 34343848 36459607 38924571 41713498
5133 41713498 44912392 48591682 51326030 53201852 54700855 55458320 55073055 52944999
5125 52944999 49758603 47420186 46265667 45648363 44858505 44159287 43701789 42774418 40583912
5116 40583912 37532349 33931405 30977388 28960901 27326489 25810873 24512772 23684397
5108 23684397 22698326 21982229 21481199 20740050 19976106 19665362 19097088 18908439 18431254
5099 18431254 18198939 17987841 17580498 17351619 17467979 17333999 17033749 16481288 16250114
5090 16250114 16033328 16027716 15785250 15593229 15642073 15428679 15066727 14969071 14973487 14754891
5080 14754891 14472121 14532465 14750390 14373528 14184966 14231803 14147156 13927258 13665686 13738569
5070 13738569 14088462 14030571 13844213 13638128 13760550 13894417 14171973 14483564 14560460 14579309
5060 14579309 14660530 14764380 14732598 14767535 14875804 15074680 14995429 14981124 14997280 14752893
5050 14752893 14787786 14871145 14967147 15036308 15197337 15287928 15286224 15157765 15052617 14950429 15111014
5039 15111014 15186105 15421157 15572922 15445238 15102788 15123933 15245608 15502092 15736865 15890361
5029 15890361 15953406 16069782 16352705 16511774 16865582 16785306 16956635 17079024 17068300 17498734
5019 17498734 17471363 17541799 17531517 17602604 17877222 18137196 18441354 18809160 18966139 19534248
5009 19534248 19764267 20315892 20710493 20876343 21588663 22125549 22448462 22790009 23049262
5000 23049262 23263430 23337950 23617754 23932093 24188038 24296125 24598037 24731243 24604907 24929263
4990 24929263 24740397 25173017 25435279 25703623 25997620 26711590 27117195 27448572 28034112
4981 28034112 28438965 28955075 29151821 29540431 30238891 30596773 31047866 31578324 31759009
4972 31759009 32203615 32690792 33188871 33653854 34085795 34628366 35162280 35601874 36524129
4963 36524129 37188814 37748430 38913315 40210115 41074831 41994184 42949358 44261057 45812986
4954 45812986 47462112 48717868 50482347 52254136 54094078 56140586 58063690 60347396
4946 60347396 62650838 65293092 67990405 71039100 74334297 78360773 82885590 87361485
4938 87361485 92086597 97750620 103501650 109980289 117727988 125992171 134991548 144548444
4930 144548444 154894085 165918144 177674329 189386154 200308915 210372014 219176947
4923 219176947 225792023 229703041 230836744 229341323 224997884 218267858 210019517 200087329
4915 200087329 189206232 177603775 165951438 154359542 143324963 133641993 125108089
4908 125108089 117475724 111063543 105358649 100460647 96237126 92521015 89655106 86952559
4900 86952559 84665198 82876326 80723863 78803921 76900669 75398215 73552624 72015696
4892 72015696 70647694 69537933 68490034 67911305 67732815 67673671 67719279 68527839 69298929
4883 69298929 70398131 72226326 74071845 76456583 79174255 82570225 86603863 91174107
4875 91174107 96957723 103314916 110559052 119298214 128691115 139229324 150764685 162852990
4867 162852990 174453655 184312809 191683417 196466950 198054420 195785005 189975752 181059854
4859 181059854 170592334 159831759 149067109 138818742 128867539 119991663 111709615
4852 111709615 103999126 96807821 90062378 83933868 78113749 73032117 68327297 64417681
4844 64417681 60757350 57522967 54508363 51687120 49224894 47345922 45572205 43395128
4836 43395128 41778672 40500993 39085416 37604989 36591438 35455071 34459839 33571015
4828 33571015 32839219 32027028 31335725 30367585 29774141 29371044 28905619 28221640 27646181
4819 27646181 27324915 26869368 26553469 26153214 25959330 25869850 25502247 25524697 25444295 25145589
4809 25145589 24929477 24858697 24584625 24564320 24469261 24411731 24339250 24314704 24505073 24464388 24512921
4798 24512921 24646928 24803864 24820865 24888880 25226714 25188815 25282053 25188820 25368597 25477965
4788 25477965 25379664 25131822 25109654 25048970 25137781 25342035 25440387 25572461 25812768 26192311
4778 26192311 26546249 26495370 26496962 26632590 26348623 26516670 26281110 26254361 26170690 26096008
4768 26096008 26250261 26583950 26684771 26751975 26973132 27224452 27392203 27407959 27536490 27775804
4758 27775804 28254358 28296795 28795975 29117909 29422045 29663761 29933208 30004263 30474976 31003858
4748 31003858 31522338 32181278 32338626 32895664 33512854 34216938 34678099 35382059 36107395
4739 36107395 36989037 38246042 39558685 40841679 42109939 43290048 44776977 46397914
4731 46397914 48661247 50789089 53367110 55978079 58748875 62163701 66252197 70583231
4723 70583231 75110821 80278352 86098308 93097997 101705200 112215067 126122726 143960316
4715 143960316 166715090 191902392 214032003 231533749 244878178 253465412 253097398
4708 253097398 237710637 211276963 185353552 164481114 148017284 134547424 124187212
4701 124187212 116036259 108887162 102337552 96754983 91629533 86013915 81511505 78215741
4693 78215741 75659219 73887506 72266430 71239315 70555812 70254022 70087928 69996609 70000727
4684 70000727 70022047 70175613 70856101 71392061 72170014 73941115 75561811 77571280 80120695
4675 80120695 83400403 86764862 90987086 95469315 99724838 103618000 107401749 110840554
4667 110840554 114304934 117560823 121184000 125480510 130459587 136800266 144116800 152664798
4659 152664798 163389498 176834562 192827732 211846450 233890725 256711239 278175073
4652 278175073 297567796 314581866 328073895 335522313 335558219 329331593 319838591 309628532
4644 309628532 298748346 285329103 267251196 245589451 223972304 204311996 187466593
4637 187466593 173076493 160593018 149963058 141221504 133110306 126074102 119569238 113760298
4629 113760298 108655035 103767289 99815037 96313467 92417350 88759557 84931754 81075148
4621 81075148 77677640 74419418 71332685 68624986 66601734 65072478 63491687 61862923
4613 61862923 60972821 60253266 59511861 58495949 57152411 55935636 54240708 52366213 51027837
4604 51027837 49601602 48143084 46859039 45218466 43771904 42608832 41254000 39957253
4596 39957253 38903078 38052681 37192961 36361127 35723819 35223896 35133778 34997119 34701099
4587 34701099 34350364 34731853 35133686 35337375 35749304 36112092 36392898 36935820 37446559
4578 37446559 37514892 37288254 36947688 36907423 36929305 36997126 36957918 36971723 37113055 36816916
4568 36816916 36605435 35864746 35451890 34978945 34597762 34353725 34132154 34231578 34676703 35106646
4558 35106646 35743743 36358399 36853718 36723225 36698461 36337350 35323037 34575550 34112323
4549 34112323 33878274 33665726 34054034 34402690 35008440 35690783 36705398 37826983 38976622
4540 38976622 40178315 41346446 42491939 43900951 45228456 46236959 47488987 48448640
4532 48448640 49609547 50130224 50880025 51672992 52096909 52669677 52942461 53585900 54326558
4523 54326558 55224590 56255454 57226149 58594007 60925514 63538118 67026820 70930111
4515 70930111 76182909 82396364 89682304 98045905 107125486 115343911 121689153 125861693
4507 125861693 127484986 126336297 120842566 111335315 99984374 89341364 80631366 73347384
4499 73347384 67262093 61707647 57166014 53452292 49892291 46086357 43215066 40330944
4491 40330944 37540494 34994795 32837238 30921631 29322872 27936423 26755473 25764015
4483 25764015 24726740 24121555 23575076 23004998 22707705 22160471 21769605 22074874 22346973
4474 22346973 22506848 22573647 23127718 23201027 23276966 23193586 22853433 22440329 21596357 20791637
4464 20791637 20365517 19828346 19268153 19094985 19028288 18960148 19071867 19173032 19187526 18944109
4454 18944109 18790862 18394841 18065187 17290793 16626236 16161436 15719082 15499904 15217968
4445 15217968 15467334 15459441 15192144 14760788 14382232 14252616 14092742 13849314 13741379 13642841
4435 13642841 13361776 13446773 13670518 13796268 13911537 14061158 14191813 14077735 13964395 13902344
4425 13902344 13359709 13030689 12855659 12633052 12451349 12265787 11750464 11607538 11473613
4416 11473613 11157899 11292943 11252810 10900576 10700081 10510854 10009091 9634944 9013646 8590952
4406 8590952 8426623 8098499 7509954 7328077 7385826 7095353 6690459 6722606 6860563 6830316
4396 6830316 6766269 6655786 6906324 7203470 7140181 7051845 6948572 6759857 6611014 6474545
4386 6474545 6723355 6769597 6412379 6473841 6361593 5993551 6049313 5831750 5794875 5734830
4376 5734830 5554008 5440785 5616545 5815737 5847886 5467369 5407589 5522304 5658325 5372559
4366 5372559 5038936 5166109 5358310 5069513 5428838 5882883 6248847 5959343 5823575 6113399
4356 6113399 5879754 5668160 5298163 5122929 5010968 4902589 5045915 4903560 4674257 4608991
4346 4608991 4521319 4904901 4740041 4511224 4119431 4065755 4185175 4188325 3681235 3555619
4336 3555619 3437392 3660006 3182845 2783410 2898972 2874275 2746516 2691505 2653470 2635877
4326 2635877 2595137 2560531 2479713 2260767 2379409 2485036 2445014 2228226 2264703 2363827 2504884
4315 2504884 2469960 2732023 2571595 2364717 2338785 2345542 2380534 2417317 2391767 2607996 2771027
4304 2771027 2832149 2818229 2703668 2690276 2565095 2331286 2066187 2068419 1676234 1904783
4294 1904783 2169117 2062180 1975963 2114041 2345584 2032069 1992515 1801030 1631912 1951228
4284 1951228 1880805 1483567 1537468 1451497 1235425 1607351 1574677 1769522 1776939 1704407 1639019
4273 1639019 1765012 1751361 1597802 1555331 1561498 1454744 1356144 1499999 1497914 1509639 1476484
4262 1476484 1932312 1844844 1438097 1553032 1653456 1586321 1744910 1758978 1880001 1588976
4252 1588976 1434322 1415586 1700242 1539052 1651710 1679283 1530296 1616684 1726388 1573412
4242 1573412 1668676 2044669 1995747 2100438 2194110 2101877 2437114 2487605 2222191 2223531 2229645
4231 2229645 2509594 2752952 3039179 2994233 3214587 3332131 3580058 3665286 4038904 4223263
4221 4223263 3965763 3766341 3871192 3720131 3515119 3558504 3364119 3053843 3030387 2903728
4211 2903728 3102146 2969109 2569469 2723622 2709348 2642278 2853050 3207683 2941096 2802736
4201 2802736 3022258 3006107 3179103 3687701 3759441 3811178 3926279 4055084 4010979 4164590
4191 4164590 4694728 4760642 4803046 5201657 5510235 5722431 5829911 5847067 6022068 6144106
4181 6144106 6066791 5756682 5848759 5707259 5371674 5602659 5850145 6167511 6511188 6922070
4171 6922070 7299849 7546826 8117182 8718125 9061569 9337599 9651583 9741188 9898024 10003993
4161 10003993 9785874 9451324 8867991 8391280 8028132 7606655 7004693 6857906 6873975 6711549
4151 6711549 6557634 6519068 6483507 6432462 6741026 6630638 7030623 7284582 7293296 7403480
4141 7403480 7327299 7411693 7320903 7432313 7230332 7197881 7024434 7355308 7550231 7695635
4131 7695635 7872172 8012812 8181667 8228692 8179240 7890917 8063037 7657204 7432529 7430822
4121 7430822 7065126 6688459 6146586 6166930 6330973 6209276 5766305 5602650 5478177 5406135
4111 5406135 5580074 5560346 5691557 5797192 5793045 6323181 6561129 6288453 6347536 6027872
4101 6027872 5929674 5706349 5598050 5213166 4812370 4828055 4571326 4583569 4436615 4200360
4091 4200360 4273290 4134922 4250354 4188743 3993302 4145208 4008657 4475385 4507015 4316004
4081 4316004 4612929 4330885 4383219 4480078 4537534 4866655 4607194 4607153 5087227 5041084 4934757
4070 4934757 4795973 4607865 4851791 4534579 4207860 3826310 3546742 3367680 3331608 3126212
4060 3126212 2944311 2798750 2734316 3007274 2857798 2726129 2720249 2983652 3255396 3198853
4050 3198853 2903515 2550669 2694427 2615558 2581713 2863295 2822961 3130160 3049179 3281735
4040 3281735 3180699 2992188 3038276 3257422 3288958 3105299 3043623 2965293 3058034 2755412
4030 2755412 2698890 3029503 3069046 2935132 2979814 3116743 2980670 3092838 2955046 3091833
4020 3091833 3206762 3390643 3485538 3535583 3588457 3494474 3557261 3358554 3546808 3473529 3530001
4009 3530001 3375799 3284220 3298449 3332186 3398024 3275916 3395510 3325490 3151000 3152360 3275458
3998 3275458 3179878 3575036 3678022 3402059 3048120 2989569 3093904 3163595 2968248 2945935
3988 2945935 3239857 3241947 3232645 2807236 2925317 3283993 3073266 2876304 2823606 2815147 2646761
3977 2646761 2745475 3247366 2910357 2512753 2548267 2821027 2902606 2559858 2387857 2767706
3967 2767706 2866200 3061444 3120812 2874490 2517067 2954008 3084300 2702738 2567112 2628536
3957 2628536 2829610 2779410 2955527 2831374 2644863 2981931 3018210 2723780 2639940 2730267
3947 2730267 3009114 3027942 3090372 2988447 2856207 3293950 3217869 3262051 3346994 3452099
3937 3452099 3653996 3494337 3510787 3712302 3873663 3810333 3697411 3600381 3886885 3886237 3806674
3926 3806674 3977358 4326950 4265339 4047958 4318133 4121559 4220845 4521988 4647487 4428598
3916 4428598 4448595 4608001 4677585 4767695 4656179 5011811 5099572 5058611 5066713 5083436 4938384
3905 4938384 5009328 5548470 5675064 5119580 5015225 5203083 5045623 5072276 5176686 5301131
3895 5301131 5327502 5437656 5442050 5494905 5711942 5606356 5784318 5307619 5616277 5690922
3885 5690922 5641051 5902651 5740700 5667457 5987414 5883942 6012542 6102784 6021058 6035657
3875 6035657 6359110 6240703 5899480 5747685 5520560 5785011 5755402 5941377 5991178 5931140
3865 5931140 5986791 5943371 5857105 6008800 5909377 6077904 5655086 5605665 5752244 5799294 5975950
3854 5975950 6200614 5832732 5548511 5848654 6055598 6114203 6077725 6108986 6290420 6096858
3844 6096858 6107869 5690612 5716923 6082352 6194196 6205377 6155179 6325513 6185985 6115372
3834 6115372 6004935 5812238 5912848 6218428 5994979 5834655 5981698 5874040 5761038 5904057
3824 5904057 5904156 5891896 5884377 5846026 5788527 5866384 5757745 5674640 5458587 5391727 5598962 5779086
3812 5779086 5805498 5799482 5852493 5740015 5625228 5712255 5488413 5669126 5788855 5923981
3802 5923981 6037047 6036478 5907204 5765515 6022582 6275721 6169296 5922376 5900687 5816828
3792 5816828 5869761 5743459 5510256 5603110 5918381 5743080 5695513 5805122 5904892 5880508
3782 5880508 5876193 5822147 5871197 5897758 6094700 6327047 6046684 6232699 6366790 6479433
3772 6479433 6777567 6801977 6590199 6510729 6575562 6471797 6485033 6625247 6406242 6335456
3762 6335456 6592424 6652003 6788566 6842409 6695800 6781330 6923477 7053778 7324486 7343843
3752 7343843 7419447 7379166 7473701 7662290 7664878 7733334 8147382 8113080 8003755 8246425 8133137
3741 8133137 7953749 7996257 7875202 7879692 7946064 7983029 7874185 7843734 7624932 7447705 7754832
3730 7754832 7631933 7653732 7475473 7492846 7572773 7483075 7721553 7752642 7596954 7901718
3720 7901718 7970224 8156376 8132006 8065267 8289786 8493014 8684150 8516205 8318397 8388840
3710 8388840 8227750 8182815 8114602 8126463 8099332 8086687 8088990 8170250 7982506 7665162 7514592
3699 7514592 7579381 7660444 7595487 7693401 7907764 7846135 7454681 7553492 7735737 7537510 7371966
3688 7371966 7451661 7303980 7219583 7326809 7448423 7439370 7491224 7560996 7637736 7591437 7392573
3677 7392573 7352575 7519410 7495381 7412144 7585533 7536476 7462900 7625971 7742077 7483522
3667 7483522 7451550 7419112 7180784 7412553 7580013 7942070 7915729 7871299 8022542 7741992
3657 7741992 7726666 7781578 7559748 7627132 7764348 7676250 7756172 7907654 7872441 8061607 7997459
3646 7997459 7918842 7901742 8068038 7902370 7817393 8010110 8123105 8059655 8166083 8188497
3636 8188497 8016052 8074844 8217665 8159109 8457627 8424462 8435693 8560950 8477360 8745052
3626 8745052 8782451 8645947 8670216 8840150 9017568 9071884 9076575 9323070 9215244 9167869 9346442
3615 9346442 9295680 9253359 9617720 9678361 9801529 9910962 10088496 9747794 9908204 10403665
3605 10403665 10161388 10431686 10556950 10477647 10329593 10240952 10537695 10722778 10897814 10905029
3595 10905029 10898345 10956512 11004584 11078119 11139685 11183890 11409079 11737254 11812880 11557322 11782600
3584 11782600 11797613 11987660 12173081 12359398 12255012 12201936 12341026 12181258 12324495 12909279
3574 12909279 12996649 12876981 12876413 12962601 13191874 13347329 13678740 13626844 13966346 14171443
3564 14171443 14266725 14284940 14370656 14432240 14728191 15189173 15419854 15399399 15769776 15849552
3554 15849552 15693969 15853861 15960335 16528250 17100364 16991659 17240201 17310249 17561530 18044280
3544 18044280 18405441 18418177 18330976 18709988 18909577 19441520 19857611 20071381 20221967 20622515
3534 20622515 21172559 21606435 21922494 22318532 22607880 23102828 23516598 23859752 24008449
3525 24008449 24521003 24901911 25283109 26012144 26444495 26797381 27147171 27709073 28129408
3516 28129408 28871560 29264236 29621181 30259222 30981441 31830230 32406459 33077860 33541916
3507 33541916 34093037 34987405 35577995 36424194 37614045 38353885 38974100 40130948 41086794
3498 41086794 42134740 43118105 44332272 45526586 46913604 48380752 49809908 51626560
3490 51626560 53672375 55840483 57899096 60032227 62385834 64928404 67963531 70940953
3482 70940953 74117536 77473163 81276516 85211183 88920723 92943130 96700111 100304637
3474 100304637 103233884 105440738 106778295 107438773 106962470 106120211 104294491 101545830
3466 101545830 98329714 95181079 91863617 88817748 85643834 82192409 79149639 76353138
3458 76353138 74180767 71664340 69143089 66964941 64919240 63264862 61399577 59945748
3450 59945748 58484841 57094930 55846709 54920101 53910190 52936983 52027924 51162407 50497511
3441 50497511 49887625 49340166 48800020 48471850 48176994 47804522 47255230 46945802 46261363
3432 46261363 45264770 43885522 42271714 40784385 39533247 38407528 37514369 36576046 35644376
3423 35644376 34528524 33885150 33075296 32199238 31349098 30783445 30364902 29774722 29123489
3414 29123489 28358054 28147106 27808645 27415073 27068030 26375741 26086351 26072436 26014490 26213580
3404 26213580 26221075 25847100 25568125 25300943 25199606 24697043 23779057 23248128 22727698 22389165
3394 22389165 22057900 21797856 21254623 21040493 20863219 20222817 20102793 19686877 19390900
3385 19390900 19176255 19206576 18852429 18591824 18384556 18016298 17797620 17762598 17518793 17156587
3375 17156587 17208427 17112726 16701771 16716953 16600110 16330666 16280528 16199824 16189731 15844700
3365 15844700 15654919 15828303 15904197 15490934 15082039 14961461 15154564 14726265 14393070 14280147
3355 14280147 14302791 14039095 13882670 13751443 13878399 13801685 13993245 13935967 13530811 13130356
3345 13130356 12948089 13291843 13328094 12890926 12659436 12732485 12657864 12483641 12454278 12361219
3335 12361219 12304000 12439840 12279752 12062837 12031351 12211059 11935915 11754377 11830184 11870213
3325 11870213 11531825 11402755 11287006 11244612 11057653 11210513 11072234 11257690 11134907 11136782
3315 11136782 11340256 11039984 11157279 11231409 10880100 10747940 10755929 10580990 10486602 10592994
3305 10592994 10427346 10508915 10642281 10421616 10250605 10096516 9919116 9979886 9797372 9812022
3295 9812022 10298085 10081671 9945785 10166665 10341031 10117755 10122301 9979160 9999665 9938592
3285 9938592 9532643 9450746 9356878 9215177 9390431 9423806 9405117 9225310 9269755 9113939
3275 9113939 8993365 8743576 8659730 8922728 8743457 8987826 8983901 8580048 8654117 8565084
3265 8565084 8492343 8450380 8493206 8308454 8336570 8159483 7977780 7735405 7690981 7573076
3255 7573076 7427173 7687564 8027790 8158169 8011609 7976947 7823480 7926198 7950756 7800144
3245 7800144 7366337 7185086 7337076 7632897 7840260 7900187 7776143 7684674 7497802 7698561
3235 7698561 7871294 7683237 7639273 7882122 7929165 7879211 8076807 7959601 7856268 7925703
3225 7925703 8046286 7999177 7791643 7635689 7939807 8127803 8194958 8513727 8362304 8443102
3215 8443102 8366029 8274462 8431826 8391506 8576989 8666232 9031911 9065478 9200874 9514241
3205 9514241 9587409 9697379 9765623 9912789 10127278 10221560 10286663 10364547 10227974 10257168 10532388
3194 10532388 10534393 10659429 10832919 10913819 11113715 11334067 11586357 11550359 11477142 11919227
3184 11919227 12095887 12509441 12657029 12755920 13321616 13382818 13552796 14109846 14352345 14662386
3174 14662386 15125265 15513721 15730694 15911384 16642645 17069319 17251103 17660736 18361909
3165 18361909 19069119 19654093 20333753 21021746 21345725 21694187 22281848 22488221 22772403
3156 22772403 23091679 23292655 23911689 24363664 25062377 25236385 25686173 26095766 26617615
3147 26617615 26945688 27473558 27980041 29011103 29538818 30093051 30976439 32215875 33715596
3138 33715596 34646307 35794553 37286918 38745173 40069464 41094518 42178709 43230802
3130 43230802 43780455 43960810 43737535 43432815 42695023 41970208 41157483 40537093 39749489
3121 39749489 39234508 39116784 38942524 38709914 39096723 39418340 39942726 40533291 41291628
3112 41291628 41753902 42134914 43043056 43713730 44487485 45303438 46197044 46969295 46910376 46511406
3102 46511406 46442781 46378826 45608274 44891446 43708971 42534234 41287422 39951006 38698668
3093 38698668 37327096 36561481 35779545 34852204 34042513 33386247 33123168 32930567 32911940
3084 32911940 32799551 32354038 32243270 32011486 31730039 31088428 30645522 30148605 29403890
3075 29403890 28471462 27568913 26616223 25486095 24481969 23351327 22389086 21448346 20462893
3066 20462893 19391342 18673514 18013637 17558179 16913248 16023055 15408817 14537495 13956044
3057 13956044 13498611 13116592 12736431 12067011 11815804 11625274 11193180 10861380 10767788 10373541
3047 10373541 9942470 9531038 9221511 8936166 8829948 8468277 7929717 7836631 7489330 6976383
3037 6976383 6610638 6605889 6677235 6287263 6136367 5856410 5921349 5725283 5341604 5069707
3027 5069707 4879834 4821232 4440086 4347585 4571007 4400253 4375240 4309298 4094997 4178106
3017 4178106 4257219 3911136 3605682 3809946 3773616 3728659 3578469 3513842 3364633 3254909
3007 3254909 3440587 3324380 3055581 3197236 3160868 2751853 2570157 2655918 2481980 2088018
2997 2088018 2215893 2371547 2542531 2414769 2093285 1801595 1717352 1952934 1745533 1818439
2987 1818439 1688752 1872040 1572558 1557395 1868946 1777822 1468412 1207538 1397318 1367387
2977 1367387 1508323 1444889 1270813 1184334 1318861 1442313 1291510 1138711 1140857 947995
2967 947995 815559 751750 911488 1070951 1087703 841471 661771 721010 585785 589996 740990
2956 740990 715350 479355 401985 427323 687487 592595 313063 479907 545004 253232 592710
2945 592710 495495 324410 191037 100505 -14651 -150379 -195041 -198221 -195979 -6242 189649
2934 189649 200903 327039 398589 289465 120193 49334 88185 223066 210916 251644 29291
2923 29291 -3633 240557 315006 446202 251416 -17117 330138 497303 34327 -106996
2913 -106996 -107668 -40566 50618 122383 202663 247189 81406 106908 -6834 19219 29562 -208593
2901 -208593 -348808 -170526 5769 -55766 -176510 45776 89471 -51092 -87528 -401938
2891 -401938 -160137 -139234 -136366 136722 76697 67592 75670 -47776 18476 -165739 -67427
2880 -67427 46520 78782 10430 -141826 -289962 -307576 -326203 -16244 107029 -22598 -121012
2869 -121012 -147551 -438 -175106 -349923 -75387 -115030 29402 -80919 -338626 -593883
2859 -593883 -421128 -172786 -197407 -246308 -231196 16605 -62981 -145956 -31401 -37615 -226186
2848 -226186 -137618 -88456 -47867 -131003 -320237 -102180 -178746 -402754 -213354 -209855 -377703
2837 -377703 908 -132122 -159560 -142209 -98010 -210733 -272128 -35397 -112005 -218851 -149272
2826 -149272 192668 21137 -78476 -200709 61200 196800 244667 89344 39242 -78718
2816 -78718 -156232 -77464 -261023 -83646 59454 -9768 203722 369179 -128933 -435385
2806 -435385 -480743 -316283 -244297 -454892 -370324 -249601 22074 249331 245700 -138940 -176688
2795 -176688 -106037 -70351 -48006 -164875 42337 -15025 -112706 -33755 -232438 -258740 -128133
2784 -128133 -328931 -100171 -194113 -166169 -286919 -622164 -609236 -542850 -517659 -417451 -331586
2773 -331586 -56293 21995 -133077 -202745 -224428 -437310 -536691 -337249 -278291 -408900 -579844
2762 -579844 -387901 -147309 -192315 -287629 -503283 -535902 -325539 -255319 -291987 -347045 -135205
2751 -135205 -338583 -389180 -304848 -182686 -544489 -453754 -492580 -358367 -98913 -135159 -342736
2740 -342736 -232665 -330350 -392811 -298740 -80797 -260455 -561522 -664837 -500040 -521174
2730 -521174 -644772 -570590 -582649 -555335 -579406 -373353 -276734 -294375 -423711 -344999 -278279
2719 -278279 -68808 -314573 -340392 -347363 -140398 -246589 -398306 -389022 -254296 -367746 -335203
2708 -335203 32965 -203250 -318143 -176986 -272894 -261284 -187590 -476947 -681520 -461641
2698 -461641 -474901 -378325 -328633 -267937 -229597 -37000 -327682 -458934 -396380 -552515 -236186
2687 -236186 -330067 -792264 -571026 -398723 -336913 -408124 -385736 -342294 -239885 -396703 -571575
2676 -571575 -556110 -734483 -596766 -425141 -280971 -352121 -679109 -956337 -649694 -216263
2666 -216263 17849 -324334 -549565 -440752 -325906 -525642 -519109 -425612 -219852 -504267
2656 -504267 -517652 -650612 -630915 -380663 -544301 -676432 -749762 -505377 -192814 -434640
2646 -434640 -361511 -451393 -317780 -397775 -623347 -536721 -480142 -523647 -570167 -419135 -263958
2635 -263958 -233898 -231841 -410128 -373680 -426963 -199039 -276091 -445337 -194524 -322790 -174995
2624 -174995 -136910 -46067 -276993 -380259 -406611 -347709 -380948 -172021 -72856 -88167 -298567
2613 -298567 -436993 -445904 -231092 -183905 -132385 23729 69581 169342 128448 5182 149981
2602 149981 260819 490057 539413 247060 104556 87402 49486 227692 7618 -209738
2592 -209738 77438 49548 76988 -51336 47584 100312 141529 124781 -57035 -92378 -182258
2581 -182258 -77219 -65621 -171883 -465507 -348829 -83832 -51307 9643 -54903 -261418
2571 -261418 -260937 35957 251004 -2198 -310916 -384475 -198037 -4829 49753 -255850 -21591
2560 -21591 -63721 -108137 -112706 -178058 -25362 128950 220008 323899 119168 -35908 147700
2549 147700 -41362 -106895 3322 -44731 35437 -81576 -163121 -189390 -40160 -133367 49731
2538 49731 97982 -15939 -5567 -101650 -208647 -131518 17076 -136102 -192579 -154626 24589
2527 24589 283666 569348 354213 380817 369714 498224 216411 350965 109887 -35426
2517 -35426 -104508 69521 314788 224824 308766 193224 359881 455771 257286 125623 187893
2506 187893 318325 381276 82145 301733 465914 80046 178394 275636 400108 667623
2496 667623 529051 218037 201862 143088 304489 167424 320234 353840 379476 509545
2486 509545 628827 492338 720702 738954 414783 343107 580440 611586 476407 212726
2476 212726 419421 708977 425755 512692 465796 386615 669313 954113 832019 402061
2466 402061 547958 443599 552995 668846 760535 888075 722786 737974 791422 874146
2456 874146 824159 803101 451791 427016 362374 510105 932608 882840 762177 640332 593023
2445 593023 669258 845217 1035369 722901 885637 653158 551806 885466 1434441 1701829
2435 1701829 1256473 927066 746661 897858 996872 1184370 997828 892611 869299 811867
2425 811867 1283307 1406611 1391019 1099016 1186996 1204547 1399790 1778847 1964936 1806792
2415 1806792 2209881 2193687 1744959 1731192 1699275 1667958 1751891 1952141 1975959 1933292 1857492
2404 1857492 1635372 1836406 1724586 2090526 2000555 1829826 1809783 1981483 2286064 2044484
2394 2044484 2300226 2421681 2595813 2587142 2549180 2680359 2772314 2924971 2964524 3172088
2384 3172088 3361829 3498291 3606763 3702420 3745654 3856678 3896609 4130507 4156608 4330647
2374 4330647 4481613 4438297 4756323 4911466 5152358 5592710 5915821 5978436 6661154 7060359
2364 7060359 7373891 7355301 7867622 8398104 8875151 9583225 10352144 10815541 11608049 12388540
2354 12388540 13450515 14282314 15155239 16514448 17908104 19372816 20814258 22916126
2346 22916126 24946767 26696037 28782666 30991359 33434775 36573061 40085205 45105926
2338 45105926 51664844 60432835 71730814 84369633 95128497 103580885 110040517 113752825
2330 113752825 113644780 104888926 89397938 75101066 64702984 56675656 50000927 44655983
2322 44655983 40215113 36479052 33625589 30658060 27934657 25197597 22785735 20702236
2314 20702236 18476985 16560522 14798637 13339723 11951201 11109619 10110947 9310414 8843670
2305 8843670 8103731 7170163 6604694 6344111 6034846 5810430 5501615 5169113 4769838 4440812
2295 4440812 4145648 3587232 3483058 3422733 3283361 3031772 2795552 2743183 2575299 2351992
2285 2351992 2493852 2221667 1812254 1678792 1572424 1627895 1433657 1373705 1009588 922819
2275 922819 747465 644741 851294 612254 587041 648732 802313 884328 945750 871867 888225
2264 888225 753444 649325 502487 700555 598051 302695 547356 344611 146946 273955
2254 273955 419491 86204 293249 392117 234973 149854 192680 116981 200875 93600 10327
2243 10327 -93807 18068 130235 149996 -253578 -198512 -331467 -339145 -174581 -274699 -328387
2232 -328387 -109610 -240480 -180772 -8062 39619 -60604 -132566 -324095 -375117 -43870
2222 -43870 -20142 -219583 -171105 -39380 -230340 -69070 -79611 15641 -307980 -389228 -536642
2211 -536642 -402528 -157399 -253220 -354794 137995 -254220 -487061 -355202 -410116 -392128
2201 -392128 -260992 -257671 -278994 -498277 -877276 -621558 -589588 -447424 -205690 -418149
2191 -418149 -414543 -491161 -687803 -555042 -495794 -490706 -562615 -479494 -440380 -406744 -574982
2180 -574982 -642510 -466412 -527793 -574505 -534202 -562659 -461012 -360103 -258685 -365125 -241057
2169 -241057 -205181 -416080 -594180 -505143 -478147 -466177 -703777 -649576 -470625 -439444 -193086
2158 -193086 -539303 -739282 -748925 -311056 -205456 -452977 -629434 -507330 -529669 -443942
2148 -443942 -560870 -553910 -611697 -725667 -593899 -397865 -432908 -393525 -148963 8851 27914
2137 27914 -357709 -354118 -230427 -439490 -239995 -287269 -444600 -329625 -201161 -232090 -381295
2126 -381295 -413595 -507237 -258597 -161545 -254818 -288574 -474477 -452283 -531679 -543209 -597959
2115 -597959 -543621 -584784 -416427 -509709 -632372 -504283 -577744 -614965 -539739 -630948 -724612
2104 -724612 -357578 -412470 -395883 -195286 -236329 -365158 -533112 -688636 -681700 -260212 -363042
2093 -363042 -619432 -510239 -401335 -353307 -487522 -513780 -368579 -215339 -125286 -165657
2083 -165657 -400979 -287783 -253615 -241747 4155 71656 -312270 -508383 -499999 -262482 -167397
2072 -167397 -353118 -298194 -54243 -264532 -253932 177766 35968 -86570 318820 404502
2062 404502 113432 -57016 130869 -21427 -25385 -80709 -139484 -193611 -143696 -301537 -290333
2051 -290333 -107927 -48965 -105020 -261810 -395852 -236415 1112 -150562 -407061 -277871
2041 -277871 -241694 -500661 -676356 -605117 -326300 -224100 -248156 -157380 -397651 -185082
2031 -185082 -126636 -278183 -138130 -300499 -331919 -189274 -426247 -505951 -555853 -664255
2021 -664255 -434102 -114093 -222029 -304687 -417085 -479506 -237623 -74779 -414675 -302498
2011 -302498 -297346 -405640 -545298 -632190 -512515 -651073 -612760 -458864 -500179 -707414 -648909
2000 -648909 -349229 -214853 -371445 -423469 -515931 -626548 -618825 -269841 -412135 -396161 -254714
1989 -254714 -298460 -474156 -393829 -483018 -234611 -128153 -307518 -372105 -246458 -74529
1979 -74529 -136672 -545866 -621447 -746806 -870985 -937451 -693913 -420965 -409593 -385058 -321500
1968 -321500 -261096 -243381 -304302 -102714 -272343 -268469 -350223 -536638 -598708 -653879 -803803
1957 -803803 -590573 -162148 -226632 -352084 -208915 -410316 -440682 -285384 -190163 -462240
1947 -462240 -560400 -786455 -682903 -300900 -309852 -433917 -295860 -297520 -95077 -56396 -63233
1936 -63233 27736 -420252 -647126 -438309 -300633 -377016 -33014 -71002 -22280 -111268 -340831
1925 -340831 -546515 -489448 -415824 -320344 -258935 -3114 -139556 -358500 -375359 -393730 -430634
1914 -430634 -128551 -102354 -291070 -153903 -130799 -153109 -63304 118277 45494 -133977 -387591
1903 -387591 -549515 -291659 -536369 -514741 -420200 -369487 -240556 -123555 -227260 -263842
1893 -263842 -90872 -73041 -222624 -387036 -206050 -239122 -207362 -123793 -371719 -243741
1883 -243741 -95797 64025 -107007 -240112 -209251 -298083 -393252 -367674 -191699 -302249
1873 -302249 -344178 -468506 -425305 -10375 -76628 -470930 -401280 -291250 -114389 122734
1863 122734 -98197 -72870 -27951 -289619 -399144 -188129 -78832 71722 -59140 -157123
1853 -157123 -90650 -65067 3622 -365724 -332822 -254367 -341868 -142475 -155124 -275504 -419376
1842 -419376 -421477 -462471 -317627 -147591 -137475 -69120 -18760 -117712 -63756 51766 94660
1831 94660 255108 282068 61576 -155325 -318037 159473 226094 91439 -294166 -182064
1821 -182064 195492 200261 155651 -124435 -108194 -446050 -298288 13140 7581 -116220 -77040
1810 -77040 -97693 -138142 -292055 -71186 -367238 -413263 -51624 -154117 -136492 -212541 -413025
1799 -413025 -354058 -328351 -365149 -291742 -224198 -198396 -20477 138363 -60436 -295306 -271106
1788 -271106 -357187 -219331 -165234 27361 183525 20447 -189777 -19563 -19361 155342 180624
1777 180624 -38427 51046 -17278 -31747 19984 6166 258779 307934 263700 159275 44026
1766 44026 15575 -187651 -266649 -171872 6900 -84109 123375 323368 37157 101485 43492
1755 43492 16335 28462 11016 70778 -42232 4235 32605 96095 -59898 -237956 -212132
1744 -212132 -265564 -103412 -6911 -370 -184726 105064 75331 -106037 2972 -67185 -138643
1733 -138643 -300342 -57124 -67931 -110300 37729 152979 -296278 -180918 50337 -15609
1723 -15609 -93568 -12774 -57116 -174673 -193080 -302414 -211846 -230028 -37062 68547 -52544
1712 -52544 -222973 -441361 -44952 213862 32066 176131 -125168 -429428 99224 -77841
1702 -77841 -53545 -137091 -249870 -176536 -107007 43216 -264853 -522470 -114113 133729 160559
1691 160559 88382 169352 167049 181240 -73151 -232214 -261262 -147473 -128892 -215363 -16571
1680 -16571 326328 215318 -30281 -132391 -146489 -61858 -292037 -470292 -199163 195000
1670 195000 206846 69410 -125313 -305311 -317545 290301 -21788 44597 175828 -99200
1660 -99200 -120599 -67724 -143992 -169855 -237576 -128496 -205789 -370637 -244926 -252244 -299603
1649 -299603 -244856 -35229 -124706 -397488 -376584 -158556 -62514 111573 542612 195582
1639 195582 -15636 32711 -28744 -290065 35278 88079 148946 -61283 -302882 -213581 -202724
1628 -202724 80453 45121 344678 118883 -207119 -147913 -52094 -104206 -493 -63853 179118
1617 179118 263243 111637 111195 -9351 173070 245004 171831 110360 127155 138073 246370
1606 246370 456963 389854 87836 -319487 -196693 65115 92004 25990 156466 253399
1596 253399 -41468 -85756 106473 73725 -24494 -58097 -93938 43792 -55878 -182776 26037
1585 26037 201088 -77297 -194953 -229899 -373170 -132559 -108477 -46270 -154644 -287577
1575 -287577 -84669 -2636 77413 -36831 -54081 74941 175440 222488 79287 -95493
1565 -95493 -6889 34605 -112007 -135295 -205965 58888 -40362 -38193 212926 96794 61929
1554 61929 -75888 -97614 101852 -19530 -394257 -301766 -126311 -27669 73813 243328
1544 243328 -170720 -210652 -41042 -78789 24133 148522 332599 274395 236686 61528
1534 61528 30823 22769 228462 -55775 -111073 105074 79977 -74555 -95014 60631 228618
1523 228618 172747 -338723 -305394 57165 16315 -75889 -278989 -351343 -406615 -117777 173382
1512 173382 139067 213705 -35601 -84665 -24969 55778 27709 5324 -75636 -17101 -234406
1501 -234406 -71219 75087 106368 73594 -275385 -448045 -56904 213907 206778 204167 114351
1490 114351 221911 17230 187285 264297 176831 216748 168458 -17745 -55597 -174347 8863
1479 8863 16105 -25846 -183678 -178315 162364 303739 155866 110364 15536 -132849 -300653
1468 -300653 -342183 -117034 -78097 -262491 -50902 14744 9572 4309 57964 7454 191352
1457 191352 280893 497460 539400 175086 94430 73384 170405 -155188 241951 479874 192270
1446 192270 65413 -298602 -239139 -243237 -154021 -55112 -189526 -137094 -30491 50549 38097
1435 38097 -15243 -96357 -252901 -213445 -134943 127245 212666 -33070 140363 130844 178019
1424 178019 110158 179350 1745 -87110 6090 109165 67651 248664 342973 522981 295440
1413 295440 221805 -11738 -64477 -226196 -107791 36945 141772 -14006 -44957 74064
1403 74064 149560 29098 -50050 4435 -191162 -212967 18734 -31463 -118674 147739 -26640
1392 -26640 -145622 56063 158020 242777 61705 -90387 465997 382371 119351 34704
1382 34704 107555 293181 183074 -84855 78379 86143 -76014 148849 -40309 -193408
1372 -193408 125560 53641 212997 305212 137989 212113 215893 380579 556393 536436 401987
1361 401987 276245 63817 103145 507676 427096 113223 -39624 -1533 -36955 -142682
1351 -142682 -74313 -109488 -223324 -344497 -208142 -72412 -299904 -165213 -362630 -19187
1341 -19187 348849 138018 -152971 103919 3937 -146250 154488 270942 316137 237739
1331 237739 3035 -18767 65815 44808 107271 -12607 -93855 -143314 -226100 68618 -218600
1320 -218600 -240629 81099 -233406 -204643 -107764 -258870 -169936 -166117 -168816 -184363 -157874
1309 -157874 1988 83488 -138879 115399 415291 307067 760 -216024 -194140 -249061
1299 -249061 -33662 105290 -131360 -8724 80444 33463 65429 -90821 -83455 189733 268313
1288 268313 218877 -132262 -140818 -8116 193495 84569 -185335 52702 227522 251283
1278 251283 295933 130795 -5201 -10558 127035 526421 506010 407074 255389 367355 417768
1267 417768 216056 254074 474095 454880 387634 305505 116956 8680 -19327 -166301 -216976
1256 -216976 -56270 203695 346539 437716 269937 274503 76837 225866 -110947 -201250
1246 -201250 51878 -5080 -108659 -84412 -101017 70819 50746 49002 -182457 -188522 18598
1235 18598 79046 483660 262848 165875 103099 -68201 60306 127175 189374 61716 15276
1224 15276 95221 252272 273888 130044 71729 195317 74190 170066 306877 357309 97306
1213 97306 100662 335626 335571 276852 42503 13696 230006 365937 179026 133553 403027
1202 403027 204910 149015 338617 367884 226519 118655 378688 360308 267132 226004 334763
1191 334763 221564 221464 224587 178068 341348 95352 -87540 186425 181858 221371 87812
1180 87812 94341 142142 138749 192336 343314 364800 328748 213073 397927 578491 369396
1169 369396 282572 364936 335607 413004 186251 92225 -181541 188581 488580 158141 -70756
1158 -70756 134286 141249 47756 -83202 -220685 -232511 -253268 45985 57393 337561 222446
1147 222446 -28648 -116792 -68997 60482 -86369 -106672 147866 413591 41194 103249
1137 103249 298694 254492 112215 -292430 -79402 331521 533988 161921 203862 111353
1127 111353 60620 97371 196273 249338 248973 334527 132520 418630 568648 486706 361551
1116 361551 -82625 68572 140439 264826 307591 251610 272376 450970 438978 133289 236596
1105 236596 334488 241995 123719 10394 222618 5606 -119332 182064 -24060 114709
1095 114709 249975 155631 236699 206701 223429 174141 -133682 -120202 -22303 285591 217597
1084 217597 -158944 -102877 197791 125320 102975 75192 -13044 121247 335911 153539 201373
1073 201373 47166 -17710 -17944 -602 154522 -36226 121093 176415 53848 135398 -185866
1062 -185866 -144914 -90127 -207627 -86087 98062 335704 168811 67253 238050 376996
1052 376996 107419 360329 355633 207257 211562 25605 76497 -347823 -475385 -63886 263796
1041 263796 651561 471394 214597 22728 70419 292523 260184 236304 263648 501757
1031 501757 211775 128190 130029 319494 302576 302315 195538 407883 413088 138271 68759
1020 68759 138021 327252 76080 93451 332880 199855 64208 -7293 -86615 66368 -184783
1009 -184783 39413 409421 269880 248793 364804 226032 205301 199280 174811 161481 135739
998 135739 239450 158678 -53388 -26985 -23599 237288 80147 27407 16883 47815 32188
987 32188 39591 238590 237486 250825 230030 103300 91963 2083 166963 296591 231390 113505
975 113505 329517 -67649 -97010 -214050 -360195 -3696 53925 -15018 233195 338218
965 338218 193718 51105 95414 24030 45037 20301 -130465 -90885 -116817 -342573 -32395
954 -32395 136988 118101 157288 298281 278148 -144000 -265409 -145931 16352 57893 -77833
943 -77833 -14520 226417 204539 272994 153471 374528 540427 554746 267023 274090 147905
932 147905 112305 -7446 130741 137177 240428 226508 144662 101419 -172276 -77714 281953
921 281953 174096 -74637 -60844 97002 135425 310899 439169 490736 409128 315522 185457
910 185457 106020 220363 560410 258468 73796 213003 118322 52778 137830 -135846 -213170
899 -213170 8840 -62250 70331 291706 420844 222586 166508 152166 22240 167464
889 167464 125981 390339 306601 115499 233304 152067 171706 284335 119942 184557 94710
878 94710 -117343 -297139 -182985 252002 324314 57839 -43038 256639 121770 260603
868 260603 208443 169026 403744 442007 123623 45979 10099 155020 67048 -159409 -272366
857 -272366 19300 136822 -27038 -35665 131318 -8497 178068 83546 134606 208087 314496
846 314496 327693 153718 5647 -42413 167842 184925 259329 219604 68139 -212896 -94650
835 -94650 -84334 135098 -47000 60058 132340 6790 -148769 143552 344929 -62103
825 -62103 193873 145109 15597 107125 66075 71017 -57139 -203516 -93835 247554 357854
814 357854 175936 104973 247873 212826 98585 301793 120529 -130220 68529 50301
804 50301 84675 -175699 -190537 -66246 108555 137803 -121047 -43213 7703 15752 129153
793 129153 46967 17342 314112 359753 229162 84942 102736 118818 174432 -2793 184429
782 184429 233767 172815 132076 -291599 -66868 484724 241498 -27257 -33620 -17977 36326
771 36326 148816 193762 156851 295420 280846 -83876 -89459 -70547 106114 195486 -53266
760 -53266 10192 -11737 155111 146365 -16530 -150243 -328632 -246104 108617 215615 23904
749 23904 59661 54231 206171 398377 125393 93518 48611 157487 321024 359494 34983
738 34983 -84155 233697 -3980 102705 -8872 303277 73597 -187747 28479 214691
728 214691 649621 223635 87528 204104 152114 116353 194910 173804 -5073 18520 -99586
717 -99586 -268410 -42153 -171928 -143606 80504 204224 131240 -80114 -151622 29697 227926
706 227926 -117417 -268017 -66626 140892 192939 194356 112858 185930 -181065 -36977 174378
695 174378 168713 252040 201715 34553 -69959 -31566 117784 -100003 -346689 -169698 -77084
684 -77084 -57938 -184464 -20170 -2436 96978 65955 36641 -22600 -252937 -122678 -165873
673 -165873 -214983 -75345 116520 -307265 -542464 -177450 -188097 33304 25631 79595 -73189
662 -73189 -169541 20097 64136 231672 292391 169874 271609 331724 493916 466309 -54220
651 -54220 -2127 -123308 -627345 -259731 35333 -198296 -53304 384031 306161 269213 156608
640 156608 94330 14274 50435 370810 566146 540288 154745 -288424 98105 536823 287125
629 287125 -98645 -203267 -327301 -215794 -238611 157481 198579 76307 51439 158057
619 158057 312152 111403 51335 69731 195662 -164934 -72225 -13124 -254898 -302643 -219522
608 -219522 -244633 -164626 -150047 -266796 -72790 155791 352935 -34421 -260655 -373553
598 -373553 -264490 -48294 199595 179166 -196269 -361054 -357911 -234506 -130452 131890
588 131890 16202 -244415 -323677 -70565 87296 -50481 -20652 62833 -75332 -42063 -94680
577 -94680 -85334 -81072 -6316 -48854 179077 -72840 -94491 144753 239352 111239 -7693
566 -7693 34627 -222911 -511647 -460344 -357311 -132540 16867 81202 143114 -178741 -69257
555 -69257 -228503 -434394 -554624 -610236 -194549 75882 212127 -100266 -127601 -227427 -265098
544 -265098 -65388 -37445 -128848 -37094 227465 25540 31386 46860 -121276 84232 400697
533 400697 -162859 -143863 140157 108606 171846 251462 428155 220757 333056 61085 93990
522 93990 185287 203939 76715 -4567 14177 -92404 -8856 -12275 74375 61015 -157638 -49340
510 -49340 182701 40738 -144589 -179496 123865 319452 17821 -66656 95995 -127609
500 -127609 -291340 -172147 -96960 -11660 -80900 -123288 -162085 32452 122021 -9675 -86027
489 -86027 -109831 113157 250369 109038 107510 -68254 -189011 -108783 -58606 120358 217092
478 217092 48159 -2931 -144309 -30428 -43645 -238604 -29275 263402 51513 -138103
468 -138103 -21872 -66435 128227 70216 -285131 -396974 -250135 -219817 -238928 -104084 -97189
457 -97189 -264313 -410430 -470923 -130867 -82813 -75593 12375 -39927 -117403 -33001 -230716
446 -230716 -283941 -107532 -275768 -206685 -57078 -217515 -93843 -438335 -347339 -248084 -272884
435 -272884 -468735 -439858 -131048 -86355 -154563 -103824 -101976 -60590 -225961 594 -24177
424 -24177 28562 -34548 149214 44648 -46768 186434 167799 -48719 -65322 -25548 -32175
413 -32175 53870 -25043 104997 190079 -68192 -39479 92423 42782 -60939 -19294 -175347
402 -175347 -49343 962 -336331 -237269 -212025 -505768 -484701 -293898 -57781 243501 146047
391 146047 -105162 -383993 -299086 113015 371958 -49637 237756 320352 132915 -134769
381 -134769 -124523 -217159 -242154 -274916 -231086 -156922 -238948 -307161 -146027 -177752 -301134
370 -301134 -222143 -177520 -172391 -292915 -177244 -268283 -444273 -214014 -407018 -245612 5616
359 5616 208409 -31059 -188736 -506832 -410879 -294467 -347371 -106706 -70183 178342 101530
348 101530 -104331 -12596 62874 185233 98238 -55903 -146227 -149619 -276923 -207096 -212842
337 -212842 -260476 -192050 -303369 -316695 -330712 -252686 -201728 -390795 -379278 -300289 -430150
326 -430150 -348210 14131 -270569 -423422 -376275 -8782 106798 99367 151575 4321 109043
315 109043 52425 136211 53591 -60127 -179745 -260435 -390951 -304151 -79082 -262667 -460470
304 -460470 -261933 -264491 -156181 -12225 234458 303897 162384 194465 -46832 -186950 -234088
293 -234088 -244830 -81582 -162051 -80551 -68270 -87437 -148591 -43632 53454 -59230 -568369
282 -568369 -457606 -269508 -611672 -474915 -257586 -237117 -120130 -163769 -21821 36778
272 36778 -237094 -91366 30399 -138396 -235040 -126782 -91405 -330889 -265758 -324675 -79747
261 -79747 98961 -113738 -46015 -49701 -134507 78405 -73819 -215857 161597 209193 -98666
250 -98666 -355291 -417147 -170636 11573 90934 2491 -99779 -331852 -57145 12141 -331848
239 -331848 -464219 -431650 -343734 -468126 -498153 -530091 -295035 -42128 -296655 -386914 -357706
228 -357706 -333139 -170660 136770 240355 -147950 -197619 -153382 -203281 -254952 -157996 -55130
217 -55130 -2452 -103927 -90847 -4962 -269521 -227418 -207860 -137810 -441960 -420664 -329614
206 -329614 -264626 -276888 -206401 -19041 -291086 -299781 -252664 -339159 -438980 -355135 -343396 -554800
194 -554800 -800728 -641303 -452740 -447293 -414503 -179406 -192561 -296621 -229670 -73040 -304237
183 -304237 -356878 -451347 -216127 -184600 -247540 -131881 -125202 -264565 -356196 -285996 -168357
172 -168357 65182 -26464 -148073 -97333 -248087 -352286 -319346 -264173 -166508 -170277 -236272
161 -236272 -78216 -154660 -217377 -132637 -153629 -166259 -171599 -354366 -116624 82080 -44416
150 -44416 301146 237352 -82263 -295127 -319017 -116065 -260990 -373593 -314140 -182935 62554
139 62554 -115255 -458483 -171219 -213663 -383346 -356234 -339651 -311243 -228055 26447 5240
128 5240 -134493 -167199 -39744 3994 117973 -136751 -25516 51227 -119799 -339300 -611064
117 -611064 -616452 -370366 -322299 -467436 -339856 -389231 -431149 -322608 -375055 -230975 -357223
106 -357223 -401835 -337106 -178188 -293101 -150947 -230988 -303651 -246741 -129209 -157114 -417779
95 -417779 -249281 -53645 -19674 -107714 -154154 -431396 -284252 -241934 -272905 -360901 -396715
84 -396715 -307806 -220461 -329503 -284843 -181766 4048 -67495 -122887 -133577 -158348 -357264
73 -357264 -346256 -316226 -371760 -384319 -443036 -490539 -631407 -578875 -516203 -369907 -320308 -305002
61 -305002 -247938 -167143 -201978 -339376 -164454 -163590 -209841 -194773 -173840 47653 -88519 -394449
49 -394449 -548918 -519011 -188678 -94554 -332797 -398177 -474578 -260621 -229929 -109835 -225511
38 -225511 -195314 -186011 -165155 -21434 -58666 -45210 -161849 -60345 -327953 -428738 -231093
27 -231093 -229730 -333186 -461153 -437501 -236774 -255751 -283241 -405828 -259961 -190524 -286801
16 -286801 -557654 -544435 -286083 -287172 -393663 -315201 -105160 -324001 -287793 -172115 -285263
5 -285263 -93570 -26459 -288236 -426491 -623667
0 -623667
$$ Imaginary data points
##PAGE= N=2
##DATA TABLE= (X++(I..I)), XYDATA
16383 -1776599 -1724611 -1455494 -1689402 -1750323 -1479527 -1375810 -1460999 -1383118 -1291240 -1622036
16373 -1622036 -1485350 -1232722 -1333639 -1341110 -1112162 -1146580 -1236133 -1163146 -1039678 -917504
16363 -917504 -954325 -924218 -813869 -698633 -784392 -802477 -999254 -1046071 -924544 -775899
16353 -775899 -702798 -437125 -677047 -930527 -754247 -513301 -455325 -360498 -350826 -363505 -502452
16342 -502452 -548372 -137922 -142017 -196990 -403633 -294597 -436123 -230783 -12633 -314231
16332 -314231 -337332 -56503 48308 212608 235835 76325 242805 58170 181542 202956
16322 202956 136034 68703 256377 194520 361688 299271 377381 555212 571629 547207 541456
16311 541456 756199 689932 522393 516921 755996 774071 883612 950697 872563 811422 894308
16300 894308 894480 1142128 1193011 1224370 1428299 1633209 1393920 1287880 1327176 1327625 1256327
16289 1256327 1209790 1470317 1382727 1282515 1251034 1260590 1395372 1700356 1883006 1641105
16279 1641105 1572954 1593336 1731740 1867701 1813788 1734716 1663101 1764648 1518868 1572841
16269 1572841 1684889 1799294 1774558 1581560 1668245 1966451 1947202 2022385 1868193 1814218
16259 1814218 2084111 2216626 2159050 2356947 2432377 2032719 2067865 2194138 2212057 2318071
16249 2318071 2402349 2165813 2255351 2270648 2158208 2445271 2372869 2388135 2392482 2136361 2031484
16238 2031484 2207913 2431813 2453994 2666645 2611094 2433096 2229302 2433795 2703802 2819747
16228 2819747 2767803 2742551 2778989 2848228 2568554 2546346 2552035 2438118 2469116 2555246 2820032
16217 2820032 2841109 2699843 2742228 2883502 3052928 3242832 2893098 2965631 3197726 3131688
16207 3131688 3122418 2945687 2995160 3026049 2920255 3110165 3188566 2976981 2839881 3003142
16197 3003142 3016977 2911216 2917281 3213605 3597554 3298076 2987256 3038915 3021615 3189628
16187 3189628 3235747 3070961 3065726 3067103 3269508 3472573 3360263 3317559 3383700 3281170 3350068
16176 3350068 3401277 3534166 3546130 3301782 3330332 3555234 3578354 3446776 3288206 3317196
16166 3317196 3544962 3477901 3311567 3162030 3186223 3382227 3458966 3390023 3324313 3314636 3301599
16155 3301599 3169624 3161569 3327741 3432498 3527507 3474954 3557254 3593207 3694153 3747761 3806246
16144 3806246 3692682 3704281 3874163 3686289 3591253 3317057 3464586 3464621 3460110 3615166 3359813
16133 3359813 3195424 3376406 3433144 3302985 3423712 3706317 3707438 3525317 3752230 3855249
16123 3855249 3928193 3876552 3780298 3542307 3596666 3708070 3597378 3381497 3650614 3600637
16113 3600637 3513204 3572614 3646727 3676372 3585774 3781463 4125204 4081779 3670746 3714286 3845690
16102 3845690 3821533 3541863 3347025 3669857 4005670 3761171 3442287 3484620 3963406 3844737
16092 3844737 3771689 4045752 4068426 3897973 3667231 3513334 3671151 3613019 3620652 3684679
16082 3684679 4028275 4127295 4046175 3845853 3999373 3990284 3980333 4041404 3935281 3822011 3631249
16071 3631249 3541190 3657072 3286891 3423983 3611598 3529009 3847744 4050550 3782508 3468323
16061 3468323 3707377 3808023 3731624 3723108 3728712 3818859 3830505 3884941 3913458 3804201 3912090
16050 3912090 3758507 3781192 3876126 3903081 3946991 3998461 4129538 3946605 3692266 3640421
16040 3640421 3712360 3845297 3905871 3880121 3966626 3890340 3621049 3796844 3936530 4042990
16030 4042990 3967338 3916817 4162854 3938792 3810418 3631583 3491897 3960347 4263506 4403368
16020 4403368 4246111 3966199 3882937 4101245 4078031 4124606 4004513 3796296 3741725 3871553
16010 3871553 3512488 3373940 3821931 3828372 3758302 4133325 3976793 4006285 4010139 3964303 4058561
15999 4058561 4135622 4181765 4093007 3917253 3974607 3907044 3901933 3989123 4074477 4259774 4219576
15988 4219576 4050763 3854181 3900903 3923818 3821699 3844720 4123065 4119308 3696322 4043916
15978 4043916 3818770 3954288 4242261 3964436 4232993 4185955 4098849 4088404 3942951 3605096
15968 3605096 3473673 3464380 3706127 3742721 3760746 3904115 3868557 3863142 3866125 3667824 3587728
15957 3587728 3808742 3844065 3599787 3993643 4127420 4145879 4071215 3984121 3772491 3789192
15947 3789192 3699411 3788548 3664766 3703659 3920237 3948198 3684080 3689450 3781385 3810140 4032298
15936 4032298 3984390 3875037 4047841 4094846 4000759 3770555 3698724 4073297 4115612 3941803
15926 3941803 3716496 3638686 3755368 3646675 3565248 3776894 3958699 3849005 3775207 3606796
15916 3606796 3553737 4003324 4166375 4173241 3788882 3700186 3763692 3883176 3786901 3738895 3695330
15905 3695330 3795954 3649255 3855733 4022864 3759390 3641687 3742530 3632883 3699238 3889344
15895 3889344 3983670 4056761 4110945 4182202 4034377 4003627 4043960 4049226 3662371 3732997 3848127
15884 3848127 3683945 3698719 3790934 3984892 4095120 4027602 3961601 4171370 4100443 3428988
15874 3428988 3626245 3753198 3583816 3623704 3879424 4049020 3824789 3749161 3859425 3973060
15864 3973060 3828215 3773385 3869898 3882348 3721796 3742365 3709647 3684191 3750583 3948284 4012317
$$ [...]
##END NTUPLES=NMR SPECTRUM
##END=
