##TITLE=1H_DE-80H_X3
 200.13MHz, d2o
 8 sc
 
 19ns.26.2.2025
##JCAMPDX= 6.0         $$ Bruker NMR JCAMP-DX V2.0
##DATA TYPE= NMR SPECTRUM
##DATA CLASS= NTUPLES
##ORIGIN= UXNMR, Bruker Analytische Messtechnik GmbH
##OWNER= pz
$$ XWIN-NMR		Version 3.5
$$ Wed Sep 17 14:37:49 2025 Russian Standard Time (UT+4h)  Yarkov@DPX200
##.OBSERVE FREQUENCY= 200.1313
##.OBSERVE NUCLEUS= ^1H
##.ACQUISITION MODE= SIMULTANEOUS
##.ACQUISITION SCHEME= undefined
##.AVERAGES= 8
##.DIGITISER RES= 18
##SPECTROMETER/DATA SYSTEM= spect
##.PULSE SEQUENCE= zg30
##.SOLVENT NAME= CDCl3
##.SHIFT REFERENCE= (INTERNAL, CDCl3, 0, 15.4836)
##AUDIT TRAIL= $$ (NUMBER, WHEN, WHO, WHERE, WHAT)
$$ ##TITLE= Audit trail, XWIN-NMR		Version 3.5
$$ ##JCAMPDX= 5.01
$$ ##ORIGIN= Bruker BioSpin GmbH
$$ ##OWNER= Yarkov
$$ C:/Bruker/XWIN-NMR/data/yarkov2/nmr/H-C/1/pdata/1/auditp.txt
$$ ##AUDIT TRAIL=  $$ (NUMBER, WHEN, WHO, WHERE, WHAT)
(   1,<2025-09-17 14:36:58.89 +0400>,<Yarkov>,<DPX200>,
      <created by zg, POWCHK disabled, PULCHK disabled
       configuration hash MD5:
       00 E9 B6 7A A2 85 ED C7 34 08 36 98 17 FE 4E 26
       data hash MD5: 16K
       E5 D6 61 48 21 B5 43 BF 6C C2 92 36 52 6D 22 3D>)
(   2,<2025-09-17 14:37:03.65 +0400>,<Yarkov>,<DPX200>,
      <Start of raw data processing
       efp BC_mod = 2 LB = 0.25 FT_mod = 6 PKNL = 1 PHC0 = -1352.778 PHC1 = -0.009078503 SI = 16K 
       data hash MD5: 16K
       50 C6 CB 6D 32 CC CD 7B A8 0D D5 12 19 2C 6F 80>)
(   3,<2025-09-17 14:37:12.17 +0400>,<Yarkov>,<DPX200>,
      <abs ABSG = 5 
       data hash MD5: 16K
       4A 9F BE 69 BF 82 05 43 8F 00 E0 91 F4 17 02 8A>)
$$ ##END=
$$ 
$$ hash MD5
$$ E3 B0 9F 21 4E 4B 9B 14 FE 9B BF 0F 02 C3 AF 63
##$RELAX= 
##$RELAX= 
##$RELAX= 
##$RELAX= 
##$RELAX= 
##$RELAX= 
$$ Bruker specific parameters
$$ --------------------------
##$DU= <C:/Bruker/XWIN-NMR>
##$EXPNO= 1
##$NAME= <H-C>
##$PROCNO= 1
##$TYPE= <nmr>
##$USER= <yarkov2>
##$AMP= (0..31)
100 100 100 100 100 100 100 100 100 100 100 100 100 100 100 100 100 100 
100 100 100 100 100 100 100 100 100 100 100 100 100 100 
##$AQSEQ= 0
##$AQ_mod= 1
##$AUNM= <au_zg>
##$AUTOPOS= <>
##$BF1= 200.13
##$BF2= 200.13
##$BF3= 200.13
##$BF4= 200.13
##$BF5= 200.13
##$BF6= 200.13
##$BF7= 200.13
##$BF8= 200.13
##$BYTORDA= 1
##$CFDGTYP= 0
##$CFRGTYP= 5
##$CHEMSTR= <none>
##$CNST= (0..31)
1 1 145 1 1 1 1 1 1 1 1 1 1 1 1 1 1 1 1 1 1 1 1 1 1 1 1 1 1 1 1 1 
##$CPDPRG= <>
##$CPDPRG1= <>
##$CPDPRG2= <>
##$CPDPRG3= <>
##$CPDPRG4= <mlev>
##$CPDPRG5= <mlev>
##$CPDPRG6= <mlev>
##$CPDPRG7= <mlev>
##$CPDPRG8= <mlev>
##$CPDPRGB= <>
##$CPDPRGT= <>
##$D= (0..31)
0 0.7 0 0 0 0 0 0 0 0 0 0.03 0 0 0 0 0 0 0 0 0 0 0 0 0 0 0 0 0 0 0 0 
##$DATE= 1758105418
##$DBL= (0..7)
120 120 120 120 120 120 120 120 
##$DBP= (0..7)
150 150 150 150 150 150 150 150 
##$DBP07= 0
##$DBPNAM0= <>
##$DBPNAM1= <>
##$DBPNAM2= <>
##$DBPNAM3= <>
##$DBPNAM4= <>
##$DBPNAM5= <>
##$DBPNAM6= <>
##$DBPNAM7= <>
##$DBPOAL= (0..7)
0.5 0.5 0.5 0.5 0.5 0.5 0.5 0.5 
##$DBPOFFS= (0..7)
0 0 0 0 0 0 0 0 
##$DE= 6
$$ [...]
##$SUBNAM3= <"">
##$SUBNAM4= <"">
##$SUBNAM5= <"">
##$SUBNAM6= <"">
##$SUBNAM7= <"">
##$SUBNAM8= <"">
##$SUBNAM9= <"">
##$SW= 18.0517328524113
##$SWIBOX= (0..15)
0 0 2 0 0 0 0 0 0 0 0 0 0 0 0 0 
##$SW_h= 3612.71676300578
##$TD= 16384
##$TD0= 1
##$TE= 0
##$TE2= 300
##$TE3= 300
##$TEG= 300
##$TL= (0..7)
0 120 120 120 120 120 120 120 
##$TP= (0..7)
150 150 150 150 150 150 150 150 
##$TP07= 0
##$TPNAME0= <>
##$TPNAME1= <>
##$TPNAME2= <>
##$TPNAME3= <>
##$TPNAME4= <>
##$TPNAME5= <>
##$TPNAME6= <>
##$TPNAME7= <>
##$TPOAL= (0..7)
0.5 0.5 0.5 0.5 0.5 0.5 0.5 0.5 
##$TPOFFS= (0..7)
0 0 0 0 0 0 0 0 
##$TUNHIN= 0
##$TUNHOUT= 0
##$TUNXOUT= 0
##$USERA1= <user>
##$USERA2= <user>
##$USERA3= <user>
##$USERA4= <user>
##$USERA5= <user>
##$V9= 5
##$VALIST= <valist>
##$VCLIST= <CCCCCCCCCCCCCCC>
##$VD= 0
##$VDLIST= <DDDDDDDDDDDDDDD>
##$VPLIST= <PPPPPPPPPPPPPPP>
##$VTLIST= <TTTTTTTTTTTTTTT>
##$WBST= 1024
##$WBSW= 4
##$XGAIN= (0..3)
0 0 0 0 
##$XL= 0
##$YL= 0
##$YMAX_a= 41424
##$YMIN_a= -25627
##$ZGOPTNS= <>
##$ZL1= 120
##$ZL2= 120
##$ZL3= 120
##$ZL4= 120
##$ABSF1= 15.48356
##$ABSF2= -2.56829
##$ABSG= 5
##$ABSL= 3
##$ALPHA= 0
##$AQORDER= 0
##$ASSFAC= 0
##$ASSFACI= 0
##$ASSFACX= 0
##$ASSWID= 0
##$AUNMP= <proc_1d>
##$AZFE= 0.1
##$AZFW= 0.1
##$BCFW= 0
##$BC_mod= 2
##$BYTORDP= 0
##$COROFFS= 0
##$CY= -3
##$DATMOD= 1
##$DC= 0
##$DFILT= <>
##$DTYPP= 0
##$F1P= 0
##$F2P= 0
##$FCOR= 1
##$FTSIZE= 16384
##$FT_mod= 6
##$GAMMA= 0
##$GB= 0
##$INTBC= 1
##$INTSCL= 3.241238e-09
##$ISEN= 128
##$LB= 0.25
##$LEV0= 0
##$LPBIN= 0
##$MAXI= 10000
##$MC2= 0
##$MEAN= 0
##$ME_mod= 0
##$MI= 1.114404
##$NCOEF= 0
##$NC_proc= -10
##$NLEV= 6
##$NOISF1= 3.799351
##$NOISF2= 2.8
##$NSP= 0
##$NTH_PI= 0
##$NZP= 0
##$OFFSET= 15.48356
##$PC= 1
##$PHC0= -1352.778
##$PHC1= -0.009078503
##$PH_mod= 1
##$PKNL= yes
##$PPARMOD= 0
##$PSCAL= 0
##$PSIGN= 0
##$REVERSE= no
##$SF= 200.130007634287
##$SI= 16384
##$SIGF1= 3
##$SIGF2= 2
##$SINO= 0.751879
##$SIOLD= 32768
##$SREGLST= <19F.Aceton>
##$SSB= 0
##$STSI= 16384
##$STSR= 0
##$SW_p= 3612.71676300578
##$SYMM= 0
##$S_DEV= 0
##$TDeff= 16384
##$TDoff= 0
##$TI= <>
##$TILT= no
##$TM1= 0
##$TM2= 0
##$TOPLEV= 0
##$USERP1= <user>
##$USERP2= <user>
##$USERP3= <user>
##$USERP4= <user>
##$USERP5= <user>
##$WDW= 1
##$XDIM= 16384
##$YMAX_p= 300985732
##$YMIN_p= -2258174
$$ End of Bruker specific parameters
$$ ---------------------------------
##NTUPLES= NMR SPECTRUM
##VAR_NAME=  FREQUENCY,     SPECTRUM/REAL,   SPECTRUM/IMAG
##SYMBOL=    X,             R,               I
##VAR_TYPE=  INDEPENDENT,   DEPENDENT,       DEPENDENT
##VAR_FORM=  AFFN,          ASDF,            ASDF
##VAR_DIM=   16384,         16384,           16384
##UNITS=     HZ,            ARBITRARY UNITS, ARBITRARY UNITS
##FACTOR=    0.220516191357247, 1,           1
##FIRST=     3098.72490264693, 0,            0
##LAST=      -513.991860358848, 0,           0
##MIN=       -513.991860358848, -2258174,    0
##MAX=       3098.72490264693, 300985732,    0
$$ Real data points
##PAGE= N=1
##DATA TABLE= (X++(R..R)), XYDATA
$$ [...]
7369D22975K92352j60214l61499r2641O35390J33592N05834m25276k5901J74175
7359A098787l41498o46k05155j51851j30862l0090O06490J54594P9140p4300O73603
7348A678212k34535k72582M7876n48769n02140L57729q4365K51449m46577k45308
7338I90P59498m30716K27726m31660p1473M94697J2576M26519k53652k54563N4468
7327E34410n3740k21246m5059j96499j51970J76151L6351K23657j18595L43827
7317E27287n60057K00669K81835n29861N9548M02297M25569j67020o7762L26738
7307H99243M1941m5295m69755j81788N38878o2676K35728L32269l84940k36256
7297F67349K4193J74253M17735q89737j10465R70040q241k11897N487o1446k99850
$$ plain form
7369 422975 715327 555113 193614 100973 736363 869955 1375789 950513 924612 1098787
7359 1098787 757289 756643 551488 399637 268775 238685 845175 999769 1078909 1004609 1678212
7348 1678212 1443677 1171095 1218971 670202 168062 525791 441426 692875 246298 990
7338 990 760488 329772 557498 125838 54365 549062 561638 988157 734505 479942 534410
7327 534410 480670 259424 214365 17866 -134104 42047 78398 302055 183460 527287
7317 527287 -32770 167899 449734 -80127 -20579 381718 807287 640267 572505 899243
7307 899243 941184 895889 426134 244346 783224 720548 956276 1288545 903605 667349
7297 667349 691542 865795 1283530 393793 283328 1253368 1245127 1033230 1038717 977271 677421
7286F77421J31342L58043r2591k41712L84029q70552J80200J62479N32773M35069
7276A656501p91036r9802J13399n89411j15549K63235M93325j20515M13006M20042
7266A643195J9256k87216l17243j24822j45357J74101L74928j71077m08316K34473
7256I91922J73577J74343n5122L2806L0735k21324m51303o9208K12585m69594
7246C49417K96097K21558L6374k31961M59390K72478k41550L2970k6595j87536
7236I80642L61699K96465n22134m54100L84395K45448j07469K80163j06622k2863
7226A335624k68496k78252L26842M72861j70786L9475m30457j2282N76139k69893
7216A320775J63921K41163n00856O3391P7762L65290K55923J92768j8931P5133
$$ plain form
7286 677421 808763 1166806 1074215 832503 1216532 345980 526180 688659 1221432 1656501
7276 1656501 865465 765663 879062 289651 174102 437337 930662 810147 1223153 1643195
7266 1643195 1662451 1375235 1057992 933170 787813 961914 1336842 1165765 757449 991922
7256 991922 1165499 1339842 1284720 1317526 1348261 1126937 675634 606426 819011 349417
7246 349417 645514 867072 903446 671485 1130875 1403353 1161803 1194773 1168178 980642
7236 980642 1342341 1638806 1116672 662572 1046967 1292415 1184946 1465109 1358487 1335624
7226 1335624 1067128 788876 1115718 1588579 1417793 1457268 1026811 1014529 1590668 1320775
7216 1320775 1484696 1725859 1225003 1288394 1366156 1731446 1987369 2180137 2161206 2236339
7206B236339j72489L34867q548l75843m95043K63806M8879j53882k66398M59351
7196A871039J64814J68612J24177j26648J2068P3560M2343j14454j61329N31374
7186B585556K60881o4035o1814P812J23376j72064k88558L76555L50746N24484
7176C642939p3148l40151m91437K98605L37663J30340r8575K38288r8510J01877
7166C647891k04353j83012N17074l38081L0344J54464M26211N83112K40801k96569
7156D577882j82801j77891R42512M44562O3281p3536K72593l35101M84758M16403
7146F432662N40755j55567O30299L52958L33864j71349J04171R71214L28014K46937
7136I613958P30307R52176K31484P08048R87096K89998K10788J315146l1365N53476
$$ plain form
7206 2236339 2063850 2398717 2390169 2014326 1519283 1783089 1831968 1678086 1411688 1871039
7196 1871039 2035853 2204465 2328642 2201994 2214062 2287622 2329965 2215511 2054182 2585556
7186 2585556 2846437 2782402 2720588 2728400 2851776 2679712 2391154 2767709 3118455 3642939
7176 3642939 3569791 3229640 2738203 3036808 3374471 3504811 3406236 3644524 3546014 3647891
7166 3647891 3443538 3260526 3777600 3439519 3469863 3624327 4050538 4633650 4874451 4577882
7156 4577882 4395081 4217190 5159702 5604264 5667545 5594009 5866602 5531501 6016259 6432662
7146 6432662 6973417 6817850 7448149 7801107 8134971 7963622 8067793 9039007 9367021 9613958
7136 9613958 10344265 11296441 11527925 12235973 13223069 13513067 13723855 15039001 15007636 15561112
7126A5561112Q25213N75586J176775j00733j56568O70805Q39218j95266J56265
7117A9352407J58210L38822r0311p22554K26378M24034j111585r26529m22666
7108A7226206n38891k25635m60774p66282l23954j827535j184813J1628l87669
7099A1522281l44581q34329l00554K17090p10402r75694n35309j03642m59471
7090G475389k95402J62784m78722o16098o83365N46999l5453O8383l86524j13151
7080E644840o7189n1610l78954n65599l66215L0555M01146K0003M9910l97939
7070D318948K64292m34364k00719J80336P471J77048k91833n48022k72556J57872
7060C358473L76209l52827J45063l52564l96705L88674j57915o0724M66593J75162
$$ plain form
7126 15561112 16386325 16961911 18138686 18037953 17881385 18552190 19391408 19196142 19352407
7117 19352407 19510617 19849439 19759128 19036574 19262952 19686986 18575401 17648872 17226206
7108 17226206 16687315 16461680 16000906 15234624 14910670 13083135 11898322 11909950 11522281
7099 11522281 11177700 10343371 10042817 10259907 9549505 8573811 8038502 7934860 7475389
7090 7475389 7179987 7342771 6864049 6247951 5564586 6111585 6076132 6144515 5757991 5644840
7080 5644840 5577651 5526041 5147087 4581488 4215273 4245828 4646974 4666977 4716887 4318948
7070 4318948 4583240 4148876 3948157 4128493 4135964 4313012 4021179 3473157 3200601 3358473
7060 3358473 3734682 3381855 3526918 3174354 2777649 3166323 3008408 2947684 3414277 3589439
7050C589439n53723j22048l77608k17659J69431M84043l3658j51631k19747R0960
7040B657799J94623j53523M95336K65934l69375l53891K28561M06208j94999j42788
7030C033885M0457L61292q3887K08776j21980l06984O4705M0678l52970m3222
7020B840750N6672M8247J89934j47820j39545L0973J44952l8189M24027J33738
7010C543739k3370K80893J23429K62500L70956M26271k1453M13261O960K70665
7000E653851M12917R93141N37647N78317J091773O97497K43272M61833k36556
6991A0433692k26071j16108p32822L13002K51497K19663N77474Q0208J62392k4100
6981A0938827q0994l9941j323938r25635j088342p13334l5259m12782r99109j79563
$$ plain form
7050 3589439 3035716 2913668 2536060 2318401 2487832 2971875 2938217 2786586 2566839 2657799
7040 2657799 2852422 2698899 3194235 3460169 3090794 2736903 2965464 3371672 3176673 3033885
7030 3033885 3074342 3435634 3351747 3560523 3438543 3131559 3196264 3236942 2883972 2840750
7020 2840750 2897422 2945669 3135603 2987783 2848238 2879211 3024163 2985974 3410001 3543739
7010 3543739 3520369 3801262 3924691 4187191 4558147 4984418 4962965 5376226 5383186 5653851
7000 5653851 6066768 7059909 7597556 8175873 9267646 9965143 10208415 10670248 10433692
6991 10433692 10207621 10091513 9358691 9671693 9923190 10142853 10720327 10800535 10962927 10938827
6981 10938827 10857833 10817892 9493954 8568319 7479977 6766643 6731384 6318602 5319493 5139930
6971E139930j15240j33134p75560L0460J668l19853m72461j38529O37149J8251
6961C872681p36739J1912O7721L6918K08440k78783q5382M73929l26636l36438
6951B907623J80408j90037M52876M02287J37715j80610N19529N79377J43342K1191
6941D973701N67481Q62226P5009R14549M33442M97543P99982L88088O83454L07031
6931A0502506N22916l15956m09435q19026m39008K26964J78229L87776J05148
6922I940114M15654M02585J30432m39157m42985j944785o95840k83037j018709
6913F064272J85639p40810l3061p95730n79105L83278l32053n79056L45670L58715
6903D277759l72097k11877r8732l26016L64587j53359r8880q6195J73935O0646
$$ plain form
6971 5139930 5024690 4891556 4115996 4146456 4148124 3828271 3355810 3217281 3854430 3872681
6961 3872681 3135942 3147854 3215575 3252493 3460933 3182150 3096768 3570697 3244061 2907623
6951 2907623 3088031 2897994 3350870 3753157 3890872 3710262 4229791 4809168 4952510 4973701
6941 4973701 5541182 6403408 6478417 7392966 7826408 8323951 9123933 9512021 10195475 10502506
6931 10502506 11025422 10709466 10300031 9481005 9041997 9268961 9447190 9834966 9940114
6922 9940114 10355768 10758353 10888785 10449628 10006643 8061858 7366018 7082981 6064272
6913 6064272 6249911 5509101 5476040 4680310 4101205 4484483 4152430 3573374 3919044 4277759
6903 4277759 3905662 3693785 3595053 3269037 3633624 3480265 3381385 3295190 3469125 3529771
6893C529771j13720j55306K55071q72883k83146J74885q6209M13639N8550L27856
6883C248508l43914l30204k21880N19362m52215j20665p1230N38563m01744l90525
6873A974056J2677o9141K59547O91087j26069l40431p0513j43768k02748M05327
6863B390024j24837k08366K02525l02374L01961l6747k01396l44847L93309M17952
6853B487204P3784l71137J51971R82897n25698j46112J73062j97705q4327l9264
6843B504675R5203K65997J26968n12110j536M93429j53058n52882j56555j05860
6833B004271j88454L1076L34595J51950j00785l71171j07500o8342r2260R886
6823A603266P4869O46749O76786k18534q34289J15141L02654J2963j14205l52602
$$ plain form
6893 3529771 3416051 3260745 3515816 2642933 2359787 2534672 2448463 2862102 2920652 3248508
6883 3248508 2904594 2574390 2352510 2871872 2419657 2298992 2227762 2766325 2364581 1974056
6873 1974056 1986733 1917592 2177139 2868226 2742157 2401726 2331213 2187445 1984697 2390024
6863 2390024 2265187 2056821 2259346 1956972 2258933 2222186 2020790 1675943 2069252 2487204
6853 2487204 2560988 2189851 2341822 3324719 2799021 2652909 2825971 2628266 2543939 2504675
6843 2504675 2599878 2865875 2992843 2480733 2479197 2972626 2819568 2266686 2110131 2004271
6833 2004271 1815817 1846893 2181488 2333438 2232653 1861482 1753982 1685640 1593380 1603266
6823 1603266 1678135 2324884 3001670 2783136 1948847 2063988 2366642 2379605 2265400 1912798
6813A912798p1434L17300J85767o1364K48950j77789K7622N141m34j79856K85080
6802B491781l55371j8693M94164m343J46996l33738K4415P36997m09029P9044
6792B852223k0472n2614p6218n8149J51669K79120J74577r9563n29260J59575
6782B780888J30774K67083l3244j1715r8283L02711n99156j61996L50945O4347
6772B992354J69478M57950n30452l51360O29265n24428P53991J63003r5787j87540
6762C476474M26487j46320o9636j01427P64593L67038R0674L32746K09306M77767
6752E827702O87674J48117P79601O40552P82412Q46972M60313L38403N18487P84384
6742A1814617Q34969M52189j58368p85327p68994k3512j9482L57343L93266L80501
$$ plain form
6813 1912798 1841364 2158664 2344431 2283067 2532017 2354228 2381850 2386991 2386557 2206701 2491781
6802 2491781 2136410 2117717 2611881 2607538 2754534 2420796 2445211 3182208 2773179 2852223
6792 2852223 2831751 2779137 2702919 2644770 2796439 3075559 3250136 3150573 2621313 2780888
6782 2780888 2911662 3178745 3145501 3133786 3035503 3338214 2739058 2577062 2928007 2992354
6772 2992354 3161832 3619782 3089330 2737970 3367235 2842807 3596798 3759801 3664014 3476474
6762 3476474 3902961 3756641 3687005 3585578 4350171 4717209 4807883 5140629 5349935 5827702
6752 5827702 6515376 6663493 7443094 8083646 8866058 9713030 10173343 10511746 11030233 11814617
6742 11814617 12649586 13101775 12943407 12158080 11389086 11365574 11346092 11703435 12096701 12477202
6732A2477202O71187O34627k6876L17444q18995j693159n50126j14163l07169
6723A0589972J52123J26728Q05904J82557J31940O03605J098437R49434m36152
6714A4204548K81501n87378j339807o83752l64915m64791N79808J18926K2480
6705A1766620L75442O02163n14779l28756p28304j390330j193938q72146r0025
6696G625947n12708j17404o77849n95272n43492O86538p2730j16368p1766l18220
6686E286676M47926K14547o12935k99118r48295k0931K54221n30971K82106M64926
6676D538152J96955m13105l94459M0708K93208j57575m95622n250L66622j69729
6666C799905J12224O11972J45525l37227r7492L4434K99635l4834k86543J5610
$$ plain form
6732 12477202 13148389 13783016 13756140 14073584 13254589 11561430 11011304 10897141 10589972
6723 10589972 10742095 10868823 11674727 11857284 11989224 12592829 13691266 14640700 14204548
6714 14204548 14486049 13898671 12558864 11875112 11510197 11045406 11625214 11744140 11766620
6705 11766620 12142062 12744225 12229446 11900690 11172386 9782056 8588118 7715972 7625947
6696 7625947 7113239 6995835 6317986 5722714 5179222 5865760 5793030 5676662 5604896 5286676
6686 5286676 5734602 5949149 5336214 5037096 4088801 4067870 4322091 3791120 4073226 4538152
6676 4538152 4735107 4322002 3927543 3968251 4261459 4103884 3608262 3603012 3969634 3799905
6666 3799905 3912129 4524101 4669626 4332399 4234907 4269341 4568976 4534142 4247599 4263209
6656D263209p4417l22359m23007K93275J77921o05159n057m7844L34944L74254
6646C965760p76770l62896O21494j27353j63860L62342N146l22256J37430l1623
6636C307414K27748J69886J61226l55904l99715M69348k9796n2601K8675O9934
6626C596215L64150J31557J37433j64435J77503o2898l8277n33349M54368J9304
6616D081571l13616K10714m74599M24809K86520j28447K1124M02805L8635Q1849
6606D631365n05816J0447J93062J21738R6097m24458N87363P25116j87778j98716
6596E048420L23759K38137m76866L77382l7898J82712P58528j99617K03841O83570
6586G101968M43553k54031K5675K21950J008465R6038O93664J67343l06666O96013
$$ plain form
6656 4263209 4188792 3866433 3443426 3736701 3914622 3309463 3304406 3256562 3591506 3965760
6646 3965760 3188990 2826094 3447588 3320235 3156375 3518717 3523863 3201607 3339037 3307414
6636 3307414 3535162 3705048 3866274 3510370 3110655 3580003 3550207 3497606 3526281 3596215
6626 3596215 3960365 4091922 4229355 4064920 4242423 4179525 4141248 3607899 4062267 4081571
6616 4081571 3767955 3978669 3504070 3928879 4215399 4086952 4108076 4510881 4549516 4631365
6606 4631365 4125549 4135996 4329058 4450796 4546893 4122435 4709798 5434914 5247136 5048420
6596 5048420 5372179 5610316 5133450 5510832 5472934 5655646 6414174 6214557 6418398 7101968
6586 7101968 7545521 7291490 7317165 7539115 8547580 8643618 9337282 9504625 9197959 9893972
6576I893972j50850O01353K00996J33645P57548R93851L88281R32364J054792
6567A4805952Q33993Q33464J993357J454596Q59907J50013J27353J3374r84632
6558B0087377j478885j328558m92938q63117j166909o56475j338301r95220k97634
6549A1469340m3836l38331k71106j30244l61617o44227r4190k41167n89006m15506
6539H340110o10903L79407o24796j98546K81461K27863n98423o50566l1672k40403
6529F273532k54845r9519j87881K39862N74358l84379j81438n91109K74760n81196
6519E082145k42333L95052P6331J55393j43247k66229j11266K56273P2075R3370
6509E367564n57623P23563n7296K9341l67344O4438K96044k46113L33885M47243
$$ plain form
6576 9893972 9743122 10344475 10545471 10679116 11436664 12430515 12818796 13751160 14805952
6567 14805952 15639945 16473409 18466766 19921362 20781269 20931282 21058635 21072009 20087377
6558 20087377 18608492 17279934 16786996 15923879 14756970 14100495 12762194 11766974 11469340
6549 11469340 11425504 11087173 10816067 10685823 10324206 9679979 9585789 9344622 8755616 8340110
6539 8340110 7729207 8108614 7483818 7285272 7566733 7794596 7196173 6545607 6513935 6273532
6529 6273532 6018687 5919168 5731287 5971149 6545507 6161128 5979690 5388581 5663341 5082145
6519 5082145 4839812 5234864 5311195 5466588 5323341 5057112 4945846 5202119 5274194 5367564
6509 5367564 4809941 5533504 5476208 5505549 5138205 5202643 5498687 5252574 5586459 6033702
6499F033702J57275p42611r4175R1854j08730L43917K00371l02048k10361k29740
6489E139454J39805J56048M40554J00405J19049k59917q4965M15013m72097j44935
6479E548414K60138k55231l67208Q65793N83989O98155K33645r0881l93966j14897
6469F967951L81486L63938K06446K66103J6718j62548q34446K12771N71054k93054
6459G696419K22516n8635o0187K29278Q71161K92070J02279K66973K0928J35629
6449I718431J80507K56618l68577L32078p6389j16210L4262k7518K51535L54843
6439A0539580n0221K33018K43022j89762L0971L81055n41116r200R57209J01572
6429A1696128N42258k62191J55626M51775N91942O50469k07515q53907M48286
$$ plain form
6499 6033702 6190977 5448366 5354191 5446045 5337315 5681232 5881603 5579555 5369194 5139454
6489 5139454 5279259 5435307 5875861 5976266 6095315 5835398 5750433 6165446 5693349 5548414
6479 5548414 5808552 5553321 5186113 6051906 6635895 7334050 7567695 7476814 7082848 6967951
6469 6967951 7349437 7713375 7919821 8185924 8202642 8040094 7205648 7418419 7989473 7696419
6459 7696419 7918935 7860300 7800113 8029391 8900552 9192622 9294901 9561874 9582802 9718431
6449 9718431 9898938 10155556 9786979 10119057 10042668 9926458 9960720 9933202 10184737 10539580
6439 10539580 10489359 10722377 10965399 10775637 10806608 11187663 10646547 10637347 11594556 11696128
6429 11696128 12238386 11976195 12131821 12583596 13175538 13826007 13618492 12764585 13212871
6420A3212871M91060J88628K07113l50476Q69401M27710M42064N39770K55065
6411A6283206P26024J165201O53536J230597J057431Q55284K029631J032196J273412
6402B6306518K609350K661943L641605M898763N902894N460203M520583N538156
6394F1540015N568846K888501J114130l394409q224498o372431m301382l703809
6386D5114963l302815j794727j448897o96135r68337m80051o64318j97997l42695
6377C5218991l65196o53868o80803L26047J032539P37010N60426O80429J298439
6368C8154014J320611Q28290O59195j46577O52365L86803O27879R72401L79526
6359D3834507R13631K28964J31822P19683N40232J573294K298358K172899L503912
$$ plain form
6420 13212871 13703931 13892559 14099672 13749196 14618597 15046307 15488371 16028141 16283206
6411 16283206 17009230 18174431 18827967 20058564 21115995 21971279 24000910 25033106 26306518
6402 26306518 28915868 31577811 35219416 40118179 46021073 51481276 56001859 61540015
6394 61540015 67108861 69997362 71111492 67717083 59492585 53120154 48818772 45114963
6386 45114963 41812148 40017421 38568524 37872389 36904052 36424001 35759683 35561686 35218991
6377 35218991 34853795 34199927 33519124 33845171 34877710 35614720 36175146 36855575 38154014
6368 38154014 39474625 40302915 40962110 40815533 41467898 41854701 42482580 43454981 43834507
6359 43834507 44748138 44977102 45108924 45828607 46368839 47942133 50240491 52413390 55917302
6350E5917302L915905L781088M280403L904232L712266K474212K01169j125803
6342G7060774k650286m203445l331632k671569j621103j29830j72892P10938K233277
6333F5224232J871358K428550L668189L733898L828128L551199L371130J546645
6325H9223329l55104q22069k418380l205545n132590m952773l966810l677087
6317F4692971k913332k112161q79510j255448j108053n1808M99857O80621J510505
6308E9063642K121256K181909L315092L645501L779785M201665L647875K076132
6300H4032857J276111J5166j557038k869399l076733l306264m257517m002386
6292F6254797l147347j992127j158260r25705p68139J36892J529622K324027K536485
$$ plain form
6350 55917302 59833207 63614295 67894698 71798930 75511196 77985408 78186577 77060774
6342 77060774 74410488 70207043 66875411 64203842 62582739 62452909 62280017 62990955 65224232
6333 65224232 67095590 69524140 73192329 76926227 80754355 84305554 87676684 89223329
6325 89223329 88868225 88046156 85627776 82422231 77289641 72336868 68370058 64692971
6317 64692971 61779639 59667478 58787968 57532520 56424467 56372659 56872516 57553137 59063642
6308 59063642 61184898 63366807 66681899 70327400 74107185 78308850 81956725 84032857
6300 84032857 85308968 85324134 83767096 80897697 77820964 74514700 70257183 66254797
6292 66254797 63107450 61115323 59957063 59031358 58263219 58400111 59929733 62253760 64790245
6283F4790245K355549K174808J484893O82210j190992k512028l547532m673316
6275E9563837l668458l969719l662009k578442j932312j264957j362962j517806
6267C9607172q71981p77624r46063j39673q84125j277198j167813l97402k08680
6258C2936613o77500q65133r70100o88595j429160j546972r42893q96291m17570
6249B4502399n03865l52917j034804o42826n18716j424608j116385j026485j364901
6240A6516892r8370o21315j404841q30593q87201k70807J59407o92770k49033
6231A1621369k25456k60137l12765J00098L65332l16183L43548o27139m56708
6222A0231959R2435L96269q10376n29025k11191q57J3873K21213j03751J39502
$$ plain form
6283 64790245 67145794 69320602 70805495 71487705 70296713 67784685 64237153 59563837
6275 59563837 55895379 51925660 48263651 45685209 43752897 42487940 41124978 39607172
6267 39607172 38735191 37957567 37011504 36871831 35987706 34710508 33542695 33145293 32936613
6258 32936613 32259113 31393980 30423880 29735285 28306125 26759153 25816260 24919969 24502399
6249 24502399 23998534 23645617 22610813 21967987 21449271 20024663 18908278 17881793 16516892
6240 16516892 16418522 15797207 14392366 13561773 12674572 12403765 12563172 11870402 11621369
6231 11621369 11395913 11135776 10823011 10923109 11288441 10972258 11315806 10688667 10231959
6222 10231959 10324394 10720663 9910287 9381262 9170071 9169214 9183087 9404300 9300549 9440051
6212I440051J13397j14130L19647j41093J08131o3428P51560K61173O7572o2057
6202A0680823J4627O31534J54452J17329m37569l19144K69836p066l98050j89225
6192A0517547O85038K16985k13189k68663j94716J86001p29329M54752k22338
6183A0432088O04861r1842n31620M33019L74340P2048l44182m47153m90055j28254
6173I883250K29765L23327k3006M40160J74215l26443l4976M31250l91103M18245
6163A1124684n35451n15822K35523M25183l71787r95427o0360K35968q9454l45460
6153I107597r02301o39624M55131n0021q10647k71373p7448k20139K11008q7674
6143F714509n65369l76312K53193k83429K37401k10619k28526R0660K10114m20021
$$ plain form
6212 9440051 9553448 9439318 9758965 9617872 9726003 9662575 10414135 10675308 10742880 10680823
6202 10680823 10695450 11326984 11481436 11598765 11161196 10842052 11111888 11104822 10706772 10517547
6192 10517547 11202585 11419570 11206381 10937718 10743002 10929003 10199674 10654426 10432088
6183 10432088 11036949 10945107 10413487 10846506 11220846 11292894 10948712 10501559 10011504 9883250
6173 9883250 10113015 10436342 10413336 10853496 11027711 10701268 10666292 11097542 10706439 11124684
6163 11124684 10589233 10073411 10308934 10734117 10362330 9366903 9306543 9542511 9453057 9107597
6153 9107597 8205296 7565672 8020803 7970782 7160135 6888762 6811314 6591175 6802183 6714509
6143 6714509 6149140 5772828 6026021 5742592 5979993 5769374 5540848 5631508 5841622 5421601
6133E421601l08384N1260K4992n42329l93446L11165L28851J90231j50437O02569
6123E536073m37770j026893j06111N20566m19170j00590J14341L27643J74823
6114D582912M77906r50191q4307P23508j18176J54670n2445P1683j89021K21440
6104D837979p7957j28544L90212k37810J49990r0383k22383N5167j01028K40170
6094D815413k43398M8191K5615k79544N6795o2731L20705r0827k93488J57001
6084D453732K61658l26627N5855K65520m7569M70650J30916j61846p9571K99838
6074E322556L64786J22708J24109M89733K88299P5633k36820L91118m8318n18934
6064F374870J31170L5747o60579J37279j78570J95570j64464J01365J50401l50336
$$ plain form
6133 5421601 5113217 5164477 5189469 4647140 4253694 4564859 4893710 5083941 4933504 5536073
6123 5536073 5098303 4071410 3965299 4485865 4066695 3966105 4080446 4408089 4582912
6114 4582912 5060818 4110627 4026320 4749828 4631652 4786322 4733877 4805560 4616539 4837979
6104 4837979 4760022 4631478 5021690 4783880 4933870 4843487 4621104 4676271 4575243 4815413
6094 4815413 4572015 4620206 4645821 4366277 4423072 4360341 4681046 4590219 4296731 4453732
6084 4453732 4715390 4388763 4444618 4710138 4662569 5133219 5264135 5102289 5022718 5322556
6074 5322556 5687342 5810050 5934159 6423892 6712191 6787824 6551004 6942122 6893804 6374870
6064 6374870 6506040 6541787 5881208 6018487 5839917 6035487 5871023 5972388 6122789 5772453
6054E772453k05353J08023R25982k50001n0762M05965L6391k363l44074n8054
6044F338207m1124J37719N45410K38946N199P4334L8620J74001m37014n17173
6034F557125K53391L49731J61663L19476l48950l3638J93737K42572K81709n52221
6024G424595j08952M33236l58846K5885l41068n81680K04504j12444r3254Q1529
6014F573505J78801k95217J77948M12988q0494o0796j22749K48156M27847j52758
6004G307231J25800j98009L87120M72568j596l56066l23040J08034M22031K74345
5994H218418M56302k97808J244373N03502J95022o3109L91513Q38018L53517L86756
5984A2226504K85014P04706P56001L99301J194219J318408Q77646J250838P79334
$$ plain form
6054 5772453 5567100 5675123 6601105 6351104 6300342 6706307 6742698 6740335 6396261 6338207
6044 6338207 6297083 6434802 6980212 7219158 7224357 7298691 7337311 7511312 7074298 6557125
6034 6557125 6810516 7160247 7321910 7641386 7292436 7258798 7452535 7695107 7976816 7424595
6024 7424595 7315643 7748879 7390033 7415918 7074850 6493170 6697674 6585230 6491976 6573505
6014 6573505 6752306 6457089 6635037 7048025 6967531 6906735 6783986 7032142 7459989 7307231
6004 7307231 7433031 7235022 7622142 8094710 8093114 7737048 7414008 7522042 7944073 8218418
5994 8218418 8674720 8376912 9621285 10124787 10319809 10256700 10648213 11486231 11839748 12226504
5984 12226504 12511518 13216224 13972225 14371526 15565745 16884153 17761799 19012637 19791971
5975A9791971J444495M20039l34707j79293o63433o57735q59077j135059j449825
5966A6377376j685126p83966j03910m23536m50946j326512n84729M0170L42426
5957A1401247j60421q80732o36823k77666l6626J45578L2511k66113l09586l39905
5947H671464L60001p6017K39394N3312L68154q31043Q7277k34462m89724L8361
5937H186717j35073J81376J91399o396k82861J6571K24429o71882k33704R19626
5927H390202J88469j24056P4222j24792m230j0803O86018K0769K63836P7170k03135
5916I233670j84060K25561L22988M90453k06358p00708J99813J23334j46802p0596
5906I287295n88919J6895L11165P6947P94329L35090m94146j28917Q51205p41803
$$ plain form
5975 19791971 21236466 21656505 21321798 21142505 20479072 19821337 18962260 17827201 16377376
5966 16377376 14692250 13908284 13804374 13380838 12929892 11603380 11018651 11058821 11401247
5957 11401247 11240826 10360094 9723271 9445605 9408979 9554557 9587068 9320955 9011369 8671464
5947 8671464 9031465 8955448 9194842 9248154 9616308 8785265 8872542 8638080 8148356 8186717
5937 8186717 8051644 8233020 8424419 8418023 8135162 8151733 8376162 7704280 7470576 8390202
5927 8390202 8578671 8454615 8528837 8404045 8399815 8389012 9075030 9095799 9359635 9436805 9233670
5916 9233670 9049610 9275171 9598159 10088612 9882254 9181546 9381359 9504693 9357891 9287295
5906 9287295 8698376 8715271 9026436 9103383 9897712 10232802 9738656 9609739 10460944 9719141
5896I719141p45969k92667J82151j78538n86019R3661j92466l14382N25528N1023
5886H261463J58685Q6034K28909k59615M8444L73034m75117n44079n62702M21747
5876G736803L20053M10130m21431Q6172N6710M40500k59264l52442N0924R0169
5866H158324m90999j07726M28478J98805j89658n67212j26652J02559K79294j44471
5856G540742L00387j31899L73555L38439o13360k79741K69147l25719Q65678J26734
5846H463963l6465k84606O09907j80292M19350J76531M17242M69811O91061O78173
5836A1424675r3471Q1838K87316m60864l28120k30201J9142p16487m6147O58080
5826A0595761n32115n39588k54908j26167n33549N26743Q4739R4791p01293K65568
$$ plain form
5896 9719141 8973172 8680505 8862656 8684118 8098099 8191760 7999294 7684912 8210440 8261463
5886 8261463 8420148 8506182 8735091 8475476 8523920 8896954 8421837 7877758 7315056 7736803
5876 7736803 8056856 8466986 8045555 8131727 8188437 8628937 8369673 8017231 8068155 8158324
5866 8158324 7667325 7559599 7988077 8186882 7997224 7430012 7303360 7405919 7685213 7540742
5856 7540742 7841129 7709230 8082785 8421224 7807864 7528123 7797270 7471551 8337229 8463963
5846 8463963 8427498 8142892 8752799 8572507 8991857 9168388 9585630 10055441 10746502 11424675
5836 11424675 11331204 11413042 11700358 11239494 10911374 10681173 10700315 9983828 9937681 10595761
5826 10595761 10063646 9524058 9269150 9142983 8609434 9136177 9220916 9315707 8614414 8879982
5816H879982Q626m21214p50918M36204k48114m83760j86282J08234n18565Q22834
5806G647027K07962j54342N11706k82577J29832R2816J97439r4265J78787m21178
5796H013207K95944J96583k20046J00733k40662l78283k95048K20577M80001K497
5786H175503J02255J70602k77766q8835K01152k81966J74951J90195M5500l36667
5776H074924m1318M23557K97780j839L21389l48099l17514O9024M15301k82355
5766H610850l93037k58043L689N43421N95640Q1400k67212M31734k09313j29874
5756I009255M9546j52010p425Q5698P20374L32643L6074K18282L52100M05234
5746A1049771K83686L91757J46075l0308j65239P60163O78655j68359K88118K47443
$$ plain form
5816 8879982 8888608 8467394 7716476 8152680 7904566 7420806 7234524 7342758 6824193 7647027
5806 7647027 7854989 7700647 8212353 7929776 8059608 8152424 8349863 8255598 8434385 8013207
5796 8013207 8309151 8505734 8285688 8386421 8145759 7767476 7472428 7693005 8173006 8175503
5786 8175503 8277758 8448360 8170594 8081759 8282911 8000945 8175896 8366091 8411591 8074924
5776 8074924 8033606 8457163 8754943 8753104 9074493 8726394 8408880 8477904 8893205 8610850
5766 8610850 8217813 7959770 7963459 8506880 9102520 9183920 8916708 9348442 9139129 9009255
5756 9009255 9058801 8906791 8899366 8985064 9705438 10038081 10074155 10292437 10644537 11049771
5746 11049771 11333457 11725214 11871289 11840981 11675742 12435905 13114560 12946201 13234319 13481762
5736A3481762k66123k13848l01298K18420j9871P9302j15269J44681k51533j05674
5726A2650549m10436J55890K22497q4508J39660K9726J58903M65027P6103l49276
5716A3054135K96165R16320Q08235J004962O38345L54194J54913Q49620O37592
5707A8714481L97977k69103q04743n81394p09273L01440L1231n67068K79292k55759
5697A6537081n50892k74887q4693K26844K12962J26379K19260p5397m24964L49362
5687A6261055j68707L45763K24280M39792P22146R11388K26739K88457K06640
5678A9457553P57046P49151Q08099m06382l92783o48121k63844m33251n67429
5669A9060039k92766q22229Q852k34519L53921K05373J57794k34635r9825K43275
$$ plain form
5736 13481762 13215639 13001791 12700493 12918913 12899042 12978344 12863075 13007756 12756223 12650549
5726 12650549 12240113 12396003 12618500 12533992 12673652 12703378 12862281 13327308 13403411 13054135
5716 13054135 13350300 14266620 15074855 16079817 16718162 17072356 17227269 18076889 18714481
5707 18714481 19112458 18843355 18038612 17457218 16747945 17049385 17080616 16513548 16792840 16537081
5697 16537081 15986189 15711302 15626609 15853453 16066415 16192794 16412054 16336657 15911693 16261055
5687 16261055 16092348 16438111 16662391 17102183 17824329 18735717 18962456 19250913 19457553
5678 19457553 20214599 20963750 21771849 21365467 20972684 20324563 20060719 19627468 19060039
5669 19060039 18767273 17945044 17953896 17719377 18073298 18278671 18436465 18201830 18102005 18345280
5659A8345280m72661M39195l69430k8382K6946k90000j73894K41866J279122O1059
5649A9059101K51652O08932J89301Q81028P74371J86495O73529Q45832p22489
5640B2747752j00052Q79227M90264N22546M36903P41495K55606P53666Q53688
5631B7581095N20849O46613J069422R05846P94934Q09163J601544J455988J612270
5622C6997724J861914J265801J965065K235226K456399K590985K689160L422488
5614E5484762L499036M066701M697537M642501M921797N737462N873491O554412
5606I5477699O855136P303661P414699O290286N065906L739917L732386K520127
5598A38399817j01967o35866k678229l976361n395844n791710n689993o323275
$$ plain form
5659 18345280 17872619 18311814 17942384 17914002 17940948 17650948 17477054 17718920 18998042 19059101
5649 19059101 19310753 19919685 20108986 20990014 21764385 21950880 22624409 23470241 22747752
5640 22747752 22647700 23526927 24017191 24539737 24976640 25718135 25973741 26727407 27581095
5631 27581095 28101944 28748557 29817979 30723825 31518759 32327922 33929466 35385454 36997724
5622 36997724 38859638 40125439 42090504 44325730 46782129 49373114 52062274 55484762
5614 55484762 58983798 63050499 67748036 72390537 77312334 83049796 88923287 95477699
5606 95477699 102332835 109636496 117051195 123341481 128407387 132147304 135879690 138399817
5598 138399817 138297850 137661984 134983755 131007394 125611550 119819840 114129847 107806572
5590A07806572o649867o445349o469224o331382n854650n730444n130066m259921
5582F0935669l775199l777691k680357k980676l180171k285015j865650j420008
5574C8970902j879420j540169p85479j375518r28478p61677q61652j186295p32231
5565B8919983r60650m51633L64278m34074r25936j048941j037663l50865k94466
5556B3780033n52715p1733n80839q58510l86059m56922m42361j46024j004647
5547A9280223m59919k32617j234348l81602n77377q82876Q9388k77464o98826
5538A4624582n86874k22430m34381l72336j95714l788l02369l10823o11869m98579
5528A1085419m07726q89491j52175L71891N3608l25039L15121m93703k35671L09668
$$ plain form
5590 107806572 101156705 94711356 88242132 81910750 76056100 70325656 65195590 60935669
5582 60935669 57160470 53382779 50702422 47721746 44541575 42256560 40390910 38970902
5574 38970902 37091482 35551313 34765834 33390316 32461838 31700161 30838509 29652214 28919983
5565 28919983 27959333 27507700 27871978 27437904 26511968 25463027 24425364 24074499 23780033
5556 23780033 23227318 23155585 22574746 21716236 21330177 20873255 20430894 20284870 19280223
5547 19280223 18820304 18587687 17353339 16971737 16394360 15511484 15600872 15323408 14624582
5538 14624582 14037708 13815278 13380897 13008561 12812847 12809059 12506690 12195867 11583998 11085419
5528 11085419 10677693 9788202 9636027 10007918 10061526 9736487 10051608 9557905 9322234 9631902
5518I631902p230m6914j25071n58266O82149K51811m03548j9570l24375l94357
5508H686531O6508K10236M90767M09685J16471k74611J82873Q8854m37989j41026
5498I398299k03142l91845K62845J2170K53456m06509n47005K92490o42124m2501
5488G986134K01341n5537Q6538J6386k8048M14363J45062j69668n6720o6141M75493
5477H949203m15970n00360K55541L81505j74231l19943L73139L46305J45376l65406
5467H675159o92377n8420J95934l96251l33944R1697K31576l18890l7368K65361
5457G622477L45607N31446J85907J13375m70370P9830J37018K80426M08752n47649
5447H686819J31774J97908k01401J53262M40583L56836J48718p24228l77115P49099
$$ plain form
5518 9631902 9624672 9577758 9452687 8894421 9576570 9828381 9424833 9405263 9080888 8686531
5508 8686531 8753039 8963275 9454042 9863727 9980198 9705587 9888460 9977314 9539325 9398299
5498 9398299 9195157 8803312 9066157 9078327 9331783 8925274 8378269 8670759 8028635 7986134
5488 7986134 8187475 8131938 8218476 8234862 8206814 8621177 8766239 8596571 8539851 8473710 8949203
5477 8949203 8533233 8032873 8288414 8669919 8495688 8175745 8548884 8895189 9040565 8675159
5467 8675159 7982782 7924362 8120296 7724045 7390101 7481798 7713374 7394484 7357116 7622477
5457 7622477 7968084 8499530 8685437 8798812 8328442 8408272 8545290 8825716 9234468 8686819
5447 8686819 8818593 9016501 8815100 8968362 9408945 9765781 9914499 9190271 8813156 9562255
5437I562255N68371R7634P46295K09984o04071J11441Q87367M03121N10016J89026
5427A2681439J55631L39845J039693l7768M18715K32421N6563j11110J703l85428
5417A4391704l51597P415l15023o40160q50962p96636p34424l82823p46816l9982
5407I540696M14816m76804l88200j01851j5421j77896L06863K8094j93063l2938
5397H904296k05278L30779k25051j80103M76272n1989n36447m1234l42285L53913
5387H482873K13946K75396l88915p29593Q7764j33099l22886M15248j19042N8221
5377G839913m72744J44492J7417j58957k96593R0523J3792j24827O1653J34150
5367G248819K78389p4428l68264l64251M02213Q73913k75584l79106Q07304o0645
$$ plain form
5437 9562255 10130626 10228260 10974555 11184539 10580468 10691909 11579276 11982397 12492413 12681439
5427 12681439 12837070 13176915 14216608 14178840 14597555 14829976 14886539 14775429 14777132 14391704
5417 14391704 14040107 14047522 13732499 13092339 12241377 11444741 10710317 10327494 9580678 9540696
5407 9540696 9955512 9478708 9090508 8988657 8973236 8795340 9102203 9130297 8937234 8904296
5397 8904296 8699018 9029797 8804746 8624643 9100915 9048926 8512479 8471245 8128960 8482873
5387 8482873 8696819 8972215 8583300 7853707 7941471 7808372 7485486 7900734 7781692 7839913
5377 7839913 7367169 7511661 7529078 7370121 7073528 7164051 7177843 7053016 7114669 7248819
5367 7248819 7527208 7452780 7084516 6720265 7122478 7996391 7720807 7341701 8149005 8088360
5357H088360j75259q30834J9226L60391K00365l84636l00970M22407j69568j36293
5347G093189L01675n31324p2381N47213k32894K99374j28515p01191K6776L81246
5337F983168L72222M12002k06183o28714J79628J45514P02654J51982p30512L88190
5327G769951k50051j86952O22162Q2682K0482M75408j38367k8259j21898k637
5317H242521m3693M81666p10374j27511L61087j06760o1010l56771K67597L38254
5307H285006l61343P1206K8926J23728J95702j51255N52060J20690m40412n69439
5297G854869N8671L35116L41476M40574j2931q75274K99528P03003J977j25237
5287I021772r5698j35084J23697M65630j73157j16779L60401J35781L04092J87882
$$ plain form
5357 8088360 7913101 7082267 7101493 7461884 7662249 7277613 6976643 7399050 7229482 7093189
5347 7093189 7394864 6863540 6791159 7338372 7105478 7404852 7276337 6575146 6601922 6983168
5337 6983168 7355390 7767392 7561209 6932495 7112123 7257637 7960291 8112273 7381761 7769951
5327 7769951 7519900 7332948 7955110 8037792 8058274 8533682 8395315 8367056 8245158 8242521
5317 8242521 8198828 8680494 7970120 7842609 8203696 8096936 8035926 7679155 7946752 8285006
5307 8285006 7923663 7994869 8023795 8147523 8343225 8191970 8744030 8864720 8424308 7854869
5297 7854869 7913540 8248656 8590132 9030706 9017775 8142501 8442029 9145032 9147009 9021772
5287 9021772 8926074 8790990 8914687 9380317 9207160 9090381 9450782 9586563 9890655 10078537
5277A0078537j95100Q3188M63994M48641J42231j82481O36327O73957k26706k07584
5267A1715004j41023p2025J59253J4338R41220k43149O39837P08243p6555j19812
5257A3525331j25415L1593m37177J17569m69486l74851r6250M00694O3370n96678
5247A2038700L65406L4014m10125L6641q9378J71196o5260K08315L16766J45318
5237A2751593k4780K85020O39810J22754N72013P36786k7962N32137O95492J160655
5227A7443518L59380M258L72117L48485k07162N15800L46276l8163m2907M55408
5217A9557010P59122J1680L90955K41034O24928M37486o07249l71320M4331j17950
5207B0970027m29156l27641R63k5154j82187m28669o54123J38219M76182n01556
$$ plain form
5277 10078537 9883437 9966625 10430619 10879260 11021491 10839010 11475337 12149294 11922588 11715004
5267 11715004 11573981 11501956 11661209 11675547 12616767 12373618 13013455 13721698 13645143 13525331
5257 13525331 13399916 13431509 12994332 13111901 12642415 12267564 12171314 12572008 12635378 12038700
5247 12038700 12404106 12438120 12027995 12064636 11975258 12146454 12081194 12289509 12606275 12751593
5237 12751593 12726813 13011833 13651643 13774397 14346410 15083196 15055234 15587371 16282863 17443518
5227 17443518 17802898 17807156 18179273 18527758 18320596 18836396 19182672 19144509 19101602 19557010
5217 19557010 20316132 20327812 20718767 20959801 21584729 22022215 21414966 21043646 21087977 20970027
5207 20970027 20540871 20213230 20214193 20189039 20006852 19578183 18924060 19062279 19538461 19036905
5197A9036905Q12520P69351k16392k31056M45168J039257L17352M07502J261536
5188B3642143M26235P70708P50115J273805J324067J27753M21854L00110O01282
5179B9638072J238623J18906J035497Q40436J753673Q74492L29508K13499o5513
5170C5977193J62410O92772k88855l90712k4537k63018j35671K60731M42507M20881
5160C6853701J080867Q13037J235420J068204J880521K017548K395755L125379
5152E0470432K660151K681674L987135L655053M103641M386705N562894O664834
5144H4172519Q326680Q988262Q385312R128714R103972P785644K900898k9561
5136A38762440o292115j1526357p814811m095485q38124J634086L898654L869408
$$ plain form
5197 19036905 19849425 20618776 20402384 20171328 20616496 21655753 21973105 22380607 23642143
5188 23642143 24068378 24839086 25589201 26863006 28187073 28314826 28736680 29036790 29638072
5179 29638072 30876695 30995601 32031098 32871534 34625207 35499699 35829207 36042706 35977193
5170 35977193 36139603 36832375 36543520 36152808 36128271 35865253 35729582 35990313 36432820 36853701
5160 36853701 37934568 38747605 39983025 41051229 42931750 44949298 47345053 50470432
5152 50470432 53130583 55812257 59799392 63454445 67558086 71944791 77507685 84172519
5144 84172519 92499199 101487461 109872773 119001487 128105459 135891103 138792001 138762440
5136 138762440 132470325 120943968 113129157 109033672 108195548 109829634 113728288 117597696
5128A17597696N667838O728550M385994l34266k247295j0665640j6191945j2692728
5120I2248204r025510o717721o460243m815183m249647m003584l216467k449991
5112E1309858k748487k526020k187140j714355j220200j244553j743127j631525
5104C6294451j531506q21164p53186m27548p38593j425539j15994m93452p60057
5095B9227412p26926K41419n01417r13528k61768l02091k50030l68977N7019O5699
5085B6266812l5129k75807m55702l48997L3733m6125K9832N55522K83753l09925
5075B5697967P22938J45397R8635r7222l53448Q2824k57588n38411o55491p64801
5065B4080800n40251j20335m82050m79197j88901j54041k92666j01645n02553
$$ plain form
5128 117597696 123265534 129994084 134380078 134045812 131798517 121132877 104940932 92248204
5120 92248204 83222694 76504973 70044730 65229547 60979900 56976316 53759849 51309858
5112 51309858 48561371 46035351 43848211 42133856 40913656 39669103 37925976 36294451
5104 36294451 34762945 33941781 33188595 32761047 32022454 30596915 30480921 29987469 29227412
5095 29227412 28500486 28741905 28240488 27326960 27065192 26763101 26513071 26144094 26201113 26266812
5085 26266812 26231683 25955876 25500174 25151177 25184910 25138785 25168617 25724139 26007892 25697967
5075 25697967 26420905 26566302 26664937 26567715 26214267 26297091 26039503 25501092 24845601 24080800
5065 24080800 23540549 23420214 22938164 22458967 22270066 22116025 21823359 21721714 21219161
5056B1219161k75049j5153j23595o14871k963N0604j68910k5063j9661Q45097
5046B0869597L54426j83031N4751K33044J098556O1269k76739J21318m94261K28566
5036B2067496L10178M53396k8304k54909J12904P8324K69267K76146L5064L329
5026B3322891N88525K26524l97873p3742R82519L48668L1770L87092J9201J024923
5016B6460498N89180J478183J203863P24414J85134j8131k70765J80881P09484
5007C1242741K51586m00127j54708j02281n6863M94999M4559k99364j857K96283
4997C1314968M67745P99132M34665j83532j25640n7081Q60967K92445K44265J65208
4987C4213142J085632Q32600J09831L39645K85337N96668Q31269P15339Q76423
$$ plain form
5056 21219161 20944112 20928959 20805364 20190493 20187530 20238134 20069224 20044161 20024500 20869597
5046 20869597 21224023 21040992 21095743 21328787 22427343 22488612 22211873 22333191 21838930 22067496
5036 22067496 22377674 22831070 22802766 22547857 22660761 22739085 23008352 23284498 23319562 23322891
5026 23322891 23911416 24137940 23740067 23666325 24648844 24997512 25029282 25416374 25435575 26460498
5016 26460498 27049678 28527861 29731724 30456138 30641272 30623141 30352376 30533257 31242741
5007 31242741 31494327 31094200 30939492 30837211 30780348 31275347 31319906 31020542 31018685 31314968
4997 31314968 31782713 32581845 33016510 32832978 32707338 32650257 33511224 33803669 34047934 34213142
4987 34213142 35298774 36131374 36241205 36580850 36866187 37462855 38294124 39009463 39885886
4978C9885886O49272J246304J000125Q29606R00595M83751J044115O01363O05496
4969D7246513L06267Q18165M58131K2601L94504O67618M35671J958080J137651
4960E3445201P89829J400552J908092J592150J266298J815192K314120K337211
4952F6868645K849441K598809K968595L145550L149875L125394L187399M046624
4944I1940332L526462L900028N068177N188617N585857O759460O489769O324974
4936A34783676P019831Q381086P963551Q390604R070772R635092R762679Q823444
4928B03830735Q114150O352120N000979K255527k54713k626083n058463o227422
4920B11386830o709942p307946o357430o526479n994699n847784o498210o584857
$$ plain form
4978 39885886 40535158 41781462 42781587 43611193 44511788 44995539 46039654 46641017 47246513
4969 47246513 47552780 48370945 48829076 48851677 49246181 49913799 50349470 52307550 53445201
4960 53445201 54235030 55635582 57543674 59135824 60402122 62217314 64531434 66868645
4952 66868645 69718086 72316895 75285490 78431040 81580915 84706309 87893708 91940332
4944 91940332 95466794 99366822 104434999 109623616 115209473 121968933 128458702 134783676
4936 134783676 141803507 150184593 158148144 166538748 175609520 185244612 195007291 203830735
4928 203830735 211944885 218297005 223297984 225553511 225298798 222672715 217614252 211386830
4920 211386830 204676888 197368942 191011512 184485033 178490334 172642550 166144340 159559483
4912A59559483p025893p626675p421564p151907o731858n555572n516146n370630
4904A07159238n790827m203879m369569m476853l875032m064470l532078l320931
4896G3525599k471374k141649k537754j927759j681315k271281j353094j695032
4888E7446341k338781j344162q22855j472441j322141j99465j84492r26246n43100
4879D8292658n82690n46293j73954N5787n79085L5857P20409R88252J370832P02028
4869E0283801J100920J078898P98519L70802Q27969J0298j64922o26263j698786
4860E1981236j632221k168164k027924j729414j668406j985696j615934j747202
4852C7406275r74812k65131j000819j201287j007125q02025m21733j56253p04338
$$ plain form
4912 159559483 152533590 144906915 137485351 130333444 123601586 118046014 112529868 107159238
4904 107159238 101368411 97164532 92794963 88318110 84443078 80378608 76846530 73525599
4896 73525599 71054225 68912576 66374822 64447063 62765748 60494467 59141373 57446341
4888 57446341 55107560 53763398 52940543 51468102 50145961 49946496 49762004 48835758 48292658
4879 48292658 47709968 47163675 46989721 47045508 46466423 46502280 47222689 48210941 49581773 50283801
4869 50283801 51384721 52463619 53262138 53632940 54460909 54471207 54306285 53680022 51981236
4860 51981236 50349015 48180851 46152927 44423513 42755107 40769411 39153477 37406275
4852 37406275 36431463 36166332 35165513 33964226 32957101 32155076 31733343 31577090 30872752
4843C0872752o62611p34691k82581m23164l42528m34866n49211p2238o1101n30438
4833B6779323m25718m44580n507k2257p49750p6736l20154k58992l14443j20538
4823B4040648J70795K10714m0149J83729k15700q11351K96130l83569M85096O41523
4813B4577866J19844J91504o9416p41123J56089L06596j26435L64633L78243N44762
4803B5702563M00207K46386k67498J63177Q98551K25306N37103P51507j29951
4794B8527351J54283k79995L76179M99971L34400j90105p9319l71132n45091k07218
4784B8219324K34863K42300M30277R12249q22555l31702K18784j65616P87233
4775B9725157L20104M88377l18514M54271Q24307J79489Q93804K85155J05670
$$ plain form
4843 30872752 30210141 29475450 29192869 28769705 28427177 27992311 27443100 27370862 27309761 26779323
4833 26779323 26353605 25909025 25903518 25881261 25131511 25054775 24734621 24475629 24161186 24040648
4823 24040648 24211443 24422157 24382008 24565737 24350037 23538686 23834816 23451247 23936343 24577866
4813 24577866 24697710 24889214 24819798 24078675 24234764 24541360 24414925 24779558 25157801 25702563
4803 25702563 26102770 26349156 26081658 26244835 27143386 27368692 27905795 28657302 28527351
4794 28527351 28681634 28401639 28777818 29277789 29612189 29422084 29342765 28971633 28426542 28219324
4784 28219324 28454187 28696487 29126764 30039013 29216458 28884756 29103540 28937924 29725157
4775 29725157 30045261 30533638 30215124 30669395 31493702 31673191 32566995 32852150 32957820
4766C2957820M7136J53585K81034M75122K63547J70862k84097M23131L84596M49914
4756C5322650M84616L46270J070567P96002P27064R55365L19534O71296Q58114
4747D1551478J241161O61109O99669J478417J395702J675489J999552K893784
4739E3596361K964541L611771M595492M370398M689036N491433N685903O613461
4731I1618396P414243R578830J1981792J5677709K0182829K1956556K1476812
4724A99887167K2334031K1671191J6350509P222397k823691k3097598l4014740
4717B07529266k6620761k0774390j6139189j3731144r898653q323672p571868
4710A04469589o450482n909032n869245n029003m127551l485815k394803k085419
$$ plain form
4766 32957820 33004956 33158541 33439575 33914697 34178244 34349106 34065009 34488140 34872736 35322650
4756 35322650 35807266 36153536 37224103 38020105 38747169 39702534 40022068 40693364 41551478
4747 41551478 42792639 43453748 44153417 45631834 47027536 48703025 50702577 53596361
4739 53596361 56560902 60172673 64768165 69138563 73827599 79319032 85004935 91618396
4731 91618396 99032639 108611469 120593261 136270970 156453799 178410355 199887167
4724 199887167 222221198 243892389 260242898 267465295 264641604 241544006 207529266
4717 207529266 180908505 160134115 143994926 130263782 120365129 112041457 104469589
4710 104469589 98019107 92110075 86240830 81211827 77084276 73598461 71203658 69118239
4702F9118239j315150j158851j399604o21247l72660o24451r4026L95751P0386
4693F3998387L94475O75351J515530J896989Q89429J994918K559646K091980K443406
4684G8460111J652842O85725n96072L56924k66808l45873J313338P55288J528821
4675H3544296K751516L281520L664854L264442L157872L075813K738594K115425
4667A07594332J417700J303561K244554L391887L383154M560924N581114O454929
4659A35932155Q330529J0401053J2586456J5499994J8779171K0447040K0359368
4652B42335766J9625650J8648781J4151739O223796j640260j3088486k2731460
4645B63525526k4363634k1031789j8530795j5180016j1303555r797174q528842
$$ plain form
4702 69118239 67803089 66644238 65244634 64623387 64250727 63626276 63532250 63928001 63998387
4693 63998387 64392862 65068213 66583743 68480732 69370161 71365079 73924725 76016705 78460111
4684 78460111 80112953 80798678 80202606 80559530 80292722 79946849 81260187 82015475 83544296
4675 83544296 86295812 89577332 93242186 96506628 99664500 102740313 105478907 107594332
4667 107594332 109012032 110315593 112560147 115952034 119335188 123896112 129477226 135932155
4659 135932155 144262684 154663737 167250193 182750187 201529358 221976398 242335766
4652 242335766 261961416 280610197 294761936 300985732 299345472 286256986 263525526
4645 263525526 239161892 218130103 199599308 184419292 173115737 163318563 154789721
4638A54789721o344666o381884o122073n367000m181806n138664n302559m670301
4630A11280768m302866k819267k335670l233092l694573l007142l647750l693051
4622H4547357l933852l223441k756397k219444j877899j640529j442370k344866
4614F5108559k321326j946358k186823k596316k404087k374900j925418j441965
4606D7911366j773186j754651j017643n29698p87351k18041l47412k45891l6616
4597D1200877l81507N08462N31885N98010N38172P33176j27790k37264m07018
4588D2957003m04077q53863q28247o04012k93924M15404K99984l41504J13968
4579D0460732J072298P41286J121327P73303J089796J633401J713989M45539Q72675
$$ plain form
4638 154789721 148445055 142063171 135941098 130574098 126392292 121253628 115951069 111280768
4630 111280768 106977902 104158635 101822965 98589873 94895300 91888158 88240408 84547357
4622 84547357 80613505 77390064 74633667 72414223 70536324 68895795 67453425 65108559
4614 65108559 62787233 60840875 58654052 56057736 53653649 51278749 49353331 47911366
4606 47911366 46138180 44383529 43365886 42836188 42048837 41830796 41483384 41237493 41200877
4597 41200877 40819370 41327832 41859717 42457727 42995899 43729075 43601285 43364021 42957003
4588 42957003 42552926 41699063 40870816 40266804 39972880 40388284 40688268 40346764 40460732
4579 40460732 41533030 42274316 43395643 44168946 45258742 46892143 48606132 49051671 49924346
4570D9924346O5407L4975j099246k052443k901257k373164p23605j807134q86476
4561C8181403q43258l31714m65319m76653m38104J10391M8986J03199P68149P27128
4551C7384208J219495J039948J385554J855924J758555J645718K330754J414259
4543E0034415J402683K400676J830706K110062K419258J836277J533880K486559
4535F6054516L216379J879989K047697L353777L314532L141670L432207L079138
4527H9519905L904273K969572K640320J248849J527357L004583M562956N563031
4519A14940846P107983R205520J1041081J1745216J0521352R648733P595650L726929
4511A85533310j099331p260281j4799340j8542167j6427210j2667646j0632644
$$ plain form
4570 49924346 49989753 50024728 48925482 46873039 43971782 41598618 40875013 39067879 38181403
4561 38181403 37338145 37006431 36541112 36064459 35626355 35736746 35785732 35888931 36657080 37384208
4551 37384208 38603703 39643651 41029205 42885129 44643684 46289402 48620156 50034415
4543 50034415 51437098 53837774 55668480 57778542 60197800 62034077 63567957 66054516
4535 66054516 69270895 71150884 73198581 76552358 79866890 83008560 86440767 89519905
4527 89519905 93424178 96393750 99034070 100282919 101810276 104814859 109377815 114940846
4519 114940846 122048829 131254349 142295430 154040646 164561998 174210731 181806381 185533310
4511 185533310 184433979 177173698 162374358 143832191 127404981 114737335 104104691
4504A04104691r330434p785711n898151n559229n914484n065260m367025m259621
4496E5924776m205865l842358k966836k435290k213772j219709j953475j674104
4488C5413367j372831j158980r9523j282201o19165q76261k67252R54295j68843
4479C0522606k01819L81056P14875Q69303N35117L613O3854n87500j247678j810637
4469B9242790j191557q55821j092639p18427k95678K75858j45839M30927m54361
4460B5195253J36806N2323k84947r51943n01090j146550j073858j022449o56016
4451A9747529m99728l12542p48983k14537K24171k33027j7028L85024L48148m07244
4441A8271783J11635Q16652Q95228J77417R22704J142191L82697j17779j48577
$$ plain form
4504 104104691 94774257 86988546 81090395 75531166 69616682 64551422 60184397 55924776
4496 55924776 51718911 47876553 44909717 42474427 40260655 39040946 37087471 35413367
4488 35413367 34040536 32881556 32782033 31499832 30880667 30004406 29737154 30691449 30522606
4479 30522606 30320787 30701843 31416718 32286021 32821138 32824751 32888605 32301105 31053427 29242790
4469 29242790 28051233 27195412 26102773 25384346 25088668 25364526 25218687 25649614 25195253
4460 25195253 25332059 25384382 25099435 24147492 23646402 22499852 21425994 20403545 19747529
4451 19747529 19247801 18935259 18186276 17971739 18195910 17962883 17945855 18330879 18679027 18271783
4441 18271783 18383418 19200070 20095298 20272715 21195419 22337610 22720307 22602528 22453951
4432B2453951p31790l90270o55331r88202m94434p25488p65085K84877l88099
4423A7600129L7171M49784p66991L8952k72026m35099L83555k35659q56760r76063
4413A4966993n32029l23397o57259J63290R2496k0965K47555l75954k87963j00856
4403A3171911n26812l3836k47420o30136q67M63422n55939L59945J87369j98144
4393A1989493Q8528M7081o57854j66033N37459n59078L78923k45358o282R7836
4383A1504715l11840j91207L75820k20365r5863K59496O74241j9831m03175p6536
4373A1495455n07823n11525j15101j46532j780l5644l09055k9376k70830l38083
4363I229706l5761L1014j74469o0058j9987p4442o454M76536M46950j96699M21076
$$ plain form
4432 22453951 21722161 21331891 20676560 19688358 19193924 18468436 17703351 17988228 17600129
4423 17600129 17637300 18087084 17320093 17359045 17087019 16651920 17035475 16799816 15943056 14966993
4413 14966993 14434964 14111567 13454308 13617598 13710094 13689129 13936684 13560730 13272767 13171911
4403 13171911 12645099 12611263 12363843 11733707 11732840 12196262 11640323 12000268 12187637 11989493
4393 11989493 12078021 12125102 11467248 11301215 11838674 11279596 11658519 11413161 11406879 11504715
4383 11504715 11192875 11001668 11377488 11157123 11061260 11320756 11994997 11975166 11571991 11495455
4373 11495455 10987632 10476107 10361006 10214474 10212694 10177050 9867995 9838619 9567789 9229706
4363 9229706 9193945 9224959 9050490 8990432 8970445 8896003 8889549 9366085 9813035 9616336 10037412
4352A0037412m82138K88184r1201j25083J60473M72663O725l27215N7288l53692
4342I643416J36087J20731r6800q71029K89864J99242J29842J09633k06673j57380
4332I296933p82404M47392L08633n79333Q820K33433M18176N7589j67795K6360
4322I267804j42741m83246L17347M53789k904p09053j49055P78148J34497j30073
4312I334513k0590K80665J26771l38578Q6025M3324M75288M92654R8373K36342
4302A0814787o8074M07004k1456L9129M34972k33248L16341q31945k9085Q37169
4292A1665594j39172K64738k74955n6114O24182J15799j1358L34357J1426P0258
4282A2604755K06814m44377M02035N85712M72416j20157L62745k20468Q3532K78734
$$ plain form
4352 10037412 9555274 9843458 9752257 9627174 9787647 10260310 10267035 9939820 9997108 9643416
4342 9643416 9779503 9900234 9803434 8932405 9222269 9421511 9551353 9660986 9454313 9296933
4332 9296933 8514529 8961921 9270554 8691221 8700041 8933474 9351650 9409239 9241444 9267804
4322 9267804 9125063 8641817 8959164 9412953 9410049 8700996 8551941 9330089 9464586 9334513
4312 9334513 9313923 9594588 9721359 9382781 9468806 9512130 9987418 10480072 10578445 10814787
4302 10814787 10746713 11153717 11132261 11171390 11606362 11373114 11689455 10857510 10828425 11665594
4292 11665594 11526422 11791160 11516205 11460091 12084273 12200072 12188714 12523071 12534497 12604755
4282 12604755 12811569 12367192 12769227 13354939 13827355 13707198 14069943 13849475 13933007 14211741
4272A4211741L85162P3986J22623N8530p31215L64893K61722J8842O15772L98092
4262A5780148j82767J50010R9325L86134j79129j47414p8249N98664j69905j89066
4252A6067751K52746J003679l09915n19552O03317k19426J63087L11011l86398
4243A6966300L78853r3699j70787N43032O10060j48633N41445P6273K48142M89583
4233A9440569O73385m89271j12974N36258n02809o16010K38157l33197k19703
4224A8614405L40946l99454l95424j19121J45702l95378K63032n33168J45829
4215A7667369K50217N5022n05177p11563j09822k2463N52755K62285m34992J25433
4205A7129064j11171K03438J33041n42689J57139J39415k08345L93088k96914
$$ plain form
4272 14211741 14596903 14670889 14793512 14852042 14120827 14485720 14747442 14766284 15382056 15780148
4262 15780148 15597381 15747391 15846716 16232850 16053721 15906307 15828058 16426722 16256817 16067751
4252 16067751 16320497 17324176 17014261 16494709 17098026 16878600 17041687 17352698 16966300
4243 16966300 17345153 17251454 17080667 17623699 18233759 18085126 18626571 18702844 18950986 19440569
4233 19440569 20113954 19624683 19511709 20047967 19545158 18929148 19167305 18834108 18614405
4224 18614405 18955351 18555897 18160473 18041352 18187054 17791676 18054708 17521540 17667369
4215 17667369 17917586 17972608 17467431 16755868 16646046 16623583 17176338 17438623 17003631 17129064
4205 17129064 17017893 17221331 17354372 16811683 16968822 17108237 16899892 17292980 16996066
4196A6996066K40109N50860L13043o7521Q46798R4709r55022j83809j8102p62541
4186A7054590l1839k48097L04243J48877K87153q9481P12622Q28043j80835L86498
4176A9171774J111329Q36672M02936K88931l71147R7426k80224k03309m06767
4167B0647621j97714j205165q93180n83653r03054m12051p16840q50848j60162
4158A4724954J29690k37514Q6855q3803L90198L88205N31931J33412J6894m76790
4148A5604032J90222m50554k76440O9736k10702l52653l26601k2474Q23949Q50260
4138A5898775k48358q0783M9835l53816K36619R4002o4099m82928r19157j41288
4128A3988802j062399k4714p08308m44794J68353L53983j27631k61661j46070
$$ plain form
4196 16996066 17236175 17787035 18100078 18032557 18879355 18974064 18019042 17835233 17817131 17054590
4186 17054590 17022751 16774654 17078897 17227774 17514927 17425446 18138068 18966111 18785276 19171774
4176 19171774 20283103 21119775 21522711 21811642 21440495 21537921 21257697 21054388 20647621
4167 20647621 20449907 19244742 18351562 17767909 16864855 16452804 15735964 14885116 14724954
4158 14724954 14854644 14617130 14703985 14620182 15010380 15398585 15930516 16063928 16080822 15604032
4148 15604032 15794254 15343700 15067260 15136996 14926294 14573641 14247040 14224566 15048515 15898775
4138 15898775 15650417 15569634 15619469 15265653 15502272 15596274 15532175 15049247 14130090 13988802
4128 13988802 12926403 12901689 12193381 11748587 11916940 12270923 12143292 11881631 11735561
4119A1735561L71281k7043J0381P3705k57734l4294K32718L6213m50194j09298
4109A1581296J91880m58742r61183j96069j31100j045309J85325k30973l04992
4100H630133K24795J98342l86178j98249l15979J55156m1451j55664J49105m0744
4090H219266N82215m97727p1034K58286J54399k57876J8657P85158l89933L94885
4080I196296O8278k22468l84719m1365j61620n04163n44920l01819J58382J73222
4070G435104n40822K86129o00282l83168J83911J22978L23310l07461q1753q55467
4060E582479l2199n84336K53515K61092O4582l73287m24552M67406j91938j85145
4050D837617q7612M07025L49843M58134L864k34184k36413m7063K1608j05033
$$ plain form
4119 11735561 12106842 12079799 12090180 12163885 11906151 11871857 12104575 12140788 11690594 11581296
4109 11581296 11773176 11314434 10353251 10157182 10026082 8980773 9166098 8935125 8630133
4100 8630133 8854928 9053270 8667092 8468843 8152864 8308020 8266569 8110905 8260010 8219266
4090 8219266 8801481 8303754 8232720 8491006 8645405 8387529 8406186 9191344 8801411 9196296
4080 9196296 9264574 9042106 8657387 8616022 8454402 7950239 7405319 7103500 7261882 7435104
4070 7435104 6894282 7180411 6580129 6196961 6380872 6503850 6827160 6519699 6437946 5582479
4060 5582479 5550280 4965944 5219459 5480551 5545133 5171846 4747294 5214700 5022762 4837617
4050 4837617 4750005 5157030 5506873 5965007 5968871 5734687 5498274 5451211 5472819 5367786
4040E367786k39431L64482k8269Q0483m31197k00280L09713J89926K63768k45221
4030E431760Q00007M21700j03572Q1989J08936l34079j2919m7196J29719P1476
4020F547821m88719L70594M85041K0061j82907M15481J78538J3836P00544k66754
4010G793536m24392l49934o8009k76319j70382l29126K28012j51253K67084j39355
4000F379862n3743m61198L82243P3475q1766K6258k4846j55547J90358k02180
3990F072916j34284o18950J35804M733J31111m12187J21794M22703k96301k16034
3980E211305k22520k83081j89653Q9811k00963L63629L57347n72257k46214l04225
3970D003179n84083O5033L11512K61223l85496l92951M52012j51146l99163J52825
$$ plain form
4040 5367786 5128355 5492837 5464568 5545051 5113854 4913574 5223287 5413213 5676981 5431760
4030 5431760 6231767 6653467 6549895 6631884 6740820 6406741 6393822 6346626 6476345 6547821
4020 6547821 6059102 6429696 6914737 6934798 6751891 7167372 7345910 7359746 8060290 7793536
4010 7793536 7369144 7019210 6951201 6674882 6504500 6175374 6403386 6252133 6519217 6379862
4000 6379862 6326119 5864921 6247164 6320639 6238873 6265131 6240285 6084738 6275096 6072916
3990 6072916 5938632 5319682 5455486 5460219 5591330 5179143 5300937 5723640 5427339 5211305
3980 5211305 4988785 4705704 4516051 4605862 4404899 4768528 5125875 4553618 4307404 4003179
3970 4003179 3419096 3484129 3795641 4056864 3671368 3278417 3730429 3579283 3180120 3332945
3960C332945P3717K21156L51806Q1044l27272j38248L09788O962l3372J11633
3950C990159K9756o689p3650L43486M3747J66957L53848N3760r6086L39672l55180
3939D789780k40461j42382O01484K03328j30276r6141M85943L2362N38906M51368
3929F493911j22828m77621J84905l09514K71968k17317P25029k34225n16520M51323
3919F249111r5981p0600N1738K23328M15984m56563r5823j695P5606P98360m49839
3908F643626k00230R8447J60582O92576j0638r6462R0351j81043N04333j97957
3898G503585j60140P9861J63274N02489K33201k59616K1868J09590k27334k65036
3888G701742n64385l61837J1937K65657J70630l16551N38996P57838r0032j79160
$$ plain form
3960 3332945 3406662 3627818 3979624 4060668 3733396 3595148 3904936 3911898 3878526 3990159
3950 3990159 4019915 4013226 3939576 4283062 4326809 4493766 4847614 4901374 4805288 5144960 4789780
3939 4789780 4549319 4406937 5008421 5211749 5081473 4985332 5471275 5503637 6042543 6493911
3929 6493911 6371083 5893462 6078367 5768853 6040821 5823504 6548533 6314308 5797788 6249111
3919 6249111 6153130 6082530 6134268 6357596 6773580 6317017 6221194 6219499 6295105 7093465 6643626
3908 6643626 6443396 6541843 6702425 7395001 7384363 7287901 7378252 7197209 7701542 7503585
3898 7503585 7343445 7423306 7586580 8089069 8322270 8062654 8084522 8194112 7966778 7701742
3888 7701742 7137357 6775520 6787457 7053114 7223744 6907193 7446189 8204027 8113995 7934835
3878G934835p7087K80333o25576m52676J72697n5391L91891K12007n03057k97127
3868F980849K2270K79098K50631l9309j23379K33991j29357J8096m47224K32797
3858G278463j845J70341j4320J25609L29399m62041l45820L21980J84323o1904
3848G524185j31280Q8663p8614J58999K77118q7018M9632j65162k66250L43753
3838G714026j62538J73774K2504k91052M37710k81575m7325r358K20417n58185
3828G218398o7059m3659l31684R8418L42802l08236M18833j64513M53424k40996
3818G375728l38082J0866K89201K8600M02874k39206p4371p2188m44411j70502
3808F768509O34193k58863l3633j9784M7302n01525K17720K80975q8263J77992
$$ plain form
3878 7934835 7857748 8138081 7512505 7059829 7232526 7177135 7569026 7781033 7277976 6980849
3868 6980849 7003119 7282217 7532848 7493539 7370160 7604151 7474794 7492890 7045666 7278463
3858 7278463 7276618 7446959 7432639 7558248 7887647 7425606 7079786 7401766 7586089 7524185
3848 7524185 7392905 7481568 7402954 7561953 7839071 7752053 7801685 7636523 7370273 7714026
3838 7714026 7551488 7725262 7747766 7456714 7894424 7612849 7565524 7556166 7776583 7218398
3828 7218398 7151339 7107680 6775996 6874414 7217216 6908980 7327813 7163300 7616724 7375728
3818 7375728 7037646 7048512 7337713 7366313 7769187 7529981 7455610 7383422 6939011 6768509
3808 6768509 7402702 7143839 7110206 7090422 7137724 6636199 6853919 7134894 7046631 7224623
3798G224623k32231j08055N71209L30821k51567j23319q5402L73845P7333K02932
3788G980189j84816n53345M60181j80460P6873M291m4915L23211k37460p2484
3778G571265j15905L13476K54372J36181K03171k30575L4976K17086j90889m49671
3768G743487J99866L57134k15868o96721K3165N58788K7937k51028l90821K09481
3758G565420N59938m7787m93012M53963O2377R463m61309L19248O1497N09819
3748H539617L41502o14763R1499K2840j75539L89510l25760L15141J58456N1297
3738H793800j85613m06217n0772K85026l2841M08551p3004j77507j48837L80011
3728H792597l06379j72506k03200M8988m88575P24465L49120r0624L31325l53974
$$ plain form
3798 7224623 6992392 6884337 7455546 7786367 7534800 7411481 7326079 7699924 7777257 7980189
3788 7980189 7795373 7242028 7702209 7521749 7598622 7602913 7557998 7881209 7643749 7571265
3778 7571265 7455360 7768836 8023208 8159389 8362560 8131985 8166961 8384047 8193158 7743487
3768 7743487 7943353 8300487 8084619 7387898 7411063 7969851 7997788 7746760 7355939 7565420
3758 7565420 8125358 8077571 7584559 8038522 8100899 8110362 7649053 7968301 8029798 8539617
3748 8539617 8881119 8266356 8357855 8380695 8205156 8594666 8268906 8584047 8742503 8793800
3738 8793800 8608187 8201970 8151198 8436224 8403383 8811934 8738930 8561423 8412586 8792597
3728 8792597 8486218 8313712 8110512 8159500 7670925 8395390 8744510 8653886 8985211 8631237
3718H631237j42698L25485r2411n12021N75436L29798J79899o35292j79098M81937
3708H962272j74023j83845O2470K82757n68450j60854l4086q562N42138j52410
3698H567407M5310k58630K65214M32424j92190k91344j7207m54996L16803L32630
3688H745421M92343j55461n30115J25652R0184j92461M62198j56625q2066N3716
3678H852786k73892O06139L54987n24065n22214J44379n71097l22181N60627K41365
3668H546834J84511q3989O129M97993m56783L35229K07512n24114N81659M3478
3658I338459r3234r947o86231J65531Q88728O50597m84977p9378J59295L73743
3648A0222586J6847p72324L9966K34460L31838k23983q89707j63138P70577p9683
$$ plain form
3718 8631237 8488539 8814024 8721613 8209592 8785028 9114826 9294725 8659433 8480335 8962272
3708 8962272 8788249 8604404 8666874 8949631 8381181 8220327 8186241 8177679 8719817 8567407
3698 8567407 8612717 8354087 8619301 9051725 8859535 8568191 8550984 8095988 8412791 8745421
3688 8745421 9237764 9082303 8552188 8677840 8768024 8575563 9037761 8881136 8799070 8852786
3678 8852786 8578894 9185033 9540020 9015955 8493741 8638120 8067023 7744842 8305469 8546834
3668 8546834 8731345 8647356 8653485 9151478 8694695 9029924 9237436 8713322 9294981 9338459
3658 9338459 9245225 9235278 8549047 8714578 9603306 10253903 9768926 9689548 9848843 10222586
3648 10222586 10239433 9467109 9507075 9741535 10073373 9849390 8959683 8796545 9567122 9487439
3638I487439M17648J7095n0479J80992l06915j12677L42033r8156J39574R2336
3628A0108890l35468K41967M28539O5745M60828j55688j87821L20888J23317m33096
3618A0638101N3409l36316q8215J094140J69004j54060j02466J23830L2150m66402
3608A0963175k58004M65608j46531O54m4476R66799P6967m45413K54852R4167
3598A1927798L55756J68334M6543m98000L98292M99110K89744l21250K12620j29628
3588A2949319R3904k03761K55669K93894L74571J05150J63525l57914N1993M24485
3578A4150835O2293M25675j04177Q86163J39435l52493k69825K4127L70054L9372
3568A5371459M47549J47154q02783N48552N33286M81772o20916R3513K40693K56116
$$ plain form
3638 9487439 9905087 9922182 9871703 10052695 9745780 9633103 9975136 9876980 10016554 10108890
3628 10108890 9773422 10015389 10443928 10509673 10970501 10814813 10626992 10947880 11071197 10638101
3618 10638101 10691510 10355194 10266979 11361119 11530123 11376063 11273597 11397427 11429577 10963175
3608 10963175 10705171 11170779 11024248 11024902 10980426 11947225 12024192 11578779 11833631 11927798
3598 11927798 12283554 12451888 12498431 12000431 12398723 12897833 13187577 12866327 13078947 12949319
3588 12949319 13043223 12839462 13095131 13389025 13763596 13868746 14032271 13674357 13726350 14150835
3578 14150835 14213128 14638803 14534626 15420789 15560224 15207731 14937906 14962033 15332087 15371459
3568 15371459 15819008 15966162 15163379 15711931 16245217 16726989 16106073 16199586 16440279 16696395
3558A6696395P14082P2632L6818K98027J48388J50816K82822n4512O46775o9510
3548A8922733L31248Q95840K11680O4359P55658L13900J43690J64997J14225K65908
3538B2184238M30805O1394L81822L91399j5953J96661K33746P22314L53207L0395
3528B4970028K85709O15627L12036Q44599N0350O84723N84542K28962R54981N64465
3518C0096022R62010J042321K09620N80325M24633P05854P24704M68056R71144
3509C6184689O93145O65169L32861L85580O09611O26866J445044J143740N09051
3500D2595756M02428J039074J122780J416981R98734R63132J751742J683999J735224
3491E3709850J664202J926392J831437K041350K734706K760108L348055L796678
$$ plain form
3558 16696395 17410477 17483109 17519927 17817954 17966342 18117158 18399980 18345468 18992243 18922733
3548 18922733 19253981 20149821 20361501 20425860 21181518 21495418 21639108 21804105 21918330 22184238
3538 22184238 22615043 22676437 23058259 23449658 23433705 23630366 23864112 24586426 24939633 24970028
3528 24970028 25255737 25871364 26183400 27027999 27078349 27763072 28347614 28576576 29531557 30096022
3518 30096022 31058032 32100353 32309973 32890298 33314931 34020785 34745489 35213545 36184689
3509 36184689 36877834 37543003 37875864 38261444 38871055 39497921 40942965 42086705 42595756
3500 42595756 42998184 44037258 45160038 46577019 47575753 48538885 50290627 51974626 53709850
3491 53709850 55374052 57300444 59131881 61173231 63907937 66668045 70016100 73812778
3483G3812778L097512L788577M141660M143387L735114L285096L979752L243631
3475A03227507L437477L028756K514654K242258K267896J192811K0425l49829
3467A17581955j749251k777088k995219l453913l879007l424700k706336k512280
3459I4084161l273000k648337k702262j927805j903549r84553p78251j089814
3451G8776590o27532k89256m19858j372667j108114j997138k708030l554527k635520
3442F4063948j087887j630051j597281j944524j466478j391264j415424j093714
3434E2437325m37600j021268j044767q45016j151133j501459q23394r50295o02575
3425D4059818n40111o36055l98440r12102m98424j81157l34887K09853l35555
$$ plain form
3483 73812778 76910290 80698867 84840527 88983914 92719028 96004124 99983876 103227507
3475 103227507 106664984 109693740 112208394 114450652 116718548 117911359 117931784 117581955
3467 117581955 115832704 113055616 110060397 106606484 102727477 99302777 96596441 94084161
3459 94084161 90811161 88162824 85460562 83532757 81629208 80644655 79866404 78776590
3451 78776590 78149058 77859802 77439944 76067277 74959163 72962025 70253995 66699468 64063948
3442 64063948 62976061 61346010 59748729 57804205 56337727 54946463 53531039 52437325
3434 52437325 51999725 50978457 49933690 49088674 47937541 46436082 45612688 44662393 44059818
3425 44059818 43519707 42883652 42485212 41573110 41074686 40893529 40558642 40768495 40432940
3416D0432940n74141P862q00012j429972j176414q58192p34831j546009j351377
3407C1969854m60633r18936o68490r20897l49162k57827l36048m12665o88528
3398B6956668p87757r6889r52025K10802k91422o71884j10556p18437j46577l09241
3388B3082682j28832k88967j87643j68171Q6246n43524l54954m97423j86424L01678
3378B1114668M8852l68198q89595p7924P0562l06133m40794k2898N72772J96871
3368A9898183p32323o53718k92705l12182r0005l58264j21590N9127n99279m02750
3358A6394494K7646J21815j92465k8886m46078M05963J67199o9308l99030p68209
3348A5213141q2791q8958O586j85397o2001P99378k07805k31682m44327p09814
$$ plain form
3416 40432940 39858799 39866661 39066649 37636677 36460263 35602071 34867240 33321231 31969854
3407 31969854 31509221 30590285 29921795 29000898 28651736 28393909 28057861 27645196 26956668
3398 26956668 26168911 26072022 25119997 25330799 25039377 24367493 24256937 23538500 23391923 23082682
3388 23082682 22953850 22664883 22477240 22309069 22395315 21851791 21496837 20999414 20812990 21114668
3378 21114668 21163520 20795322 19905727 19827803 19898365 19592232 19151438 19128540 19701312 19898183
3368 19898183 19165860 18512142 18219437 17907255 17817250 17458986 17337396 17396523 16797244 16394494
3358 16394494 16422140 16543955 16351490 16322604 15876526 16282489 16449688 16380380 15981350 15213141
3348 15213141 15130350 15041392 15047978 14862581 14800580 15599958 15392153 15160471 14716144 14006330
3338A4006330k72703K3381P4291J23793J84811L96721J39656j73111n19961q52563
3328A3130645N28304k07781r1193l7963Q9680K00433r8947q1487k91800j69539
3318A2970352L01848m02757J9574q9906K0495j21842O9051r7193j83866k52511
3308A2233245P3953r6468P3060j20685K10295m9371m42295j27027q2315O4085
3298A1736477l67645j9350M35012K95789l21669n34002r3264l87560P906k24951
3288A0526743K57423j65248m56783j67029P7649M81969q2399j05932k64836k4769
3278A0076788k45781Q6699m36863p134n1341J75016k61970K16972K48331l49982
3268I450735k65447K0152j11605J88654L5159k8345n32983N42963p2852j35246
$$ plain form
3338 14006330 13733627 13757008 13831299 13955092 14139903 14536624 14676280 14503169 13983208 13130645
3328 13130645 13658949 13451168 13359975 13322012 13411692 13612125 13513178 13431691 13139891 12970352
3318 12970352 13272200 12869443 12889017 12799111 12819606 12697764 12766815 12669622 12485756 12233245
3308 12233245 12307198 12210730 12283790 12163105 12373400 12324029 11881734 11754707 11672392 11736477
3298 11736477 11368832 11349482 11784494 12080283 11758614 11224612 11131348 10743788 10751694 10526743
3288 10526743 10784166 10618918 10162135 9995106 10072755 10554724 10472325 10366393 10101557 10076788
3278 10076788 9831007 9917706 9480843 9473709 9422368 9597384 9335414 9552386 9800717 9450735
3268 9450735 9185288 9205440 9093835 9282489 9317648 9289303 8756320 9299283 9226431 9091185
3258I091185q0336K0283l39720J93167O66038k44798m82692r3493J88074l09658
3248H608050K33566J5874Q0974L39592l80761L78987L86408o24787j43409J89721
3238I084215K19746j8953J84573l03681N455r6844M48409j67777o7390j17906
3228I169847j2694J63561J51185N45104k05666k76306j27455J16237m32525P54939
3218I846227j63612L25795J90831k86367O65048Q7831k56071k53596n3936O78155
3208A0780305N38356o19402n7176k14495R90732L83922j79751n2258J00353J86846
3198A1857432K12867N09557m8327l44919K17722N56595k81745R2042L82815P10583
3188A3864622m78726j49501N61429m43286L29545P50016O11194p04654R8034P01992
$$ plain form
3258 9091185 9010849 9031132 8691412 8884579 9550617 9305819 8823127 8729634 8917708 8608050
3248 8608050 8841616 8857490 8938464 9278056 8897295 9276282 9662690 9037903 8894494 9084215
3238 9084215 9303961 9285008 9469581 9165900 9171355 9074511 9522920 9355143 9287753 9169847
3228 9169847 9157153 9320714 9471899 10017003 9811337 9535031 9407576 9523813 9091288 9846227
3218 9846227 9682615 10008410 10199241 9912874 10577922 10665753 10409682 10156086 10102150 10780305
3208 10780305 11318661 10699259 10642083 10427588 11418320 11802242 11622491 11570233 11670586 11857432
3198 11857432 12070299 12579856 12531529 12186610 12404332 12960927 12679182 12771224 13154039 13864622
3188 13864622 13385896 13236395 13797824 13354538 13684083 14434099 15045293 14340639 14438673 15140665
3178A5140665J097969K95303k89580K17322M97041r23M47163P06977J52663M11765
3168A8676365O07124K78209J000708J075281P96995M77439l0330L92363Q51254
3159B4125408M67615K96921P12179L60343M78495M10575l6799j90012O93399R63530
3149B8281654K37711K60788P53264L59088O56635Q36837P09300R60819J138672
3140C4194768J127545J092933J201178P79674R31181J815235J927925J793116
3132D4863555J424260R68402O22097Q28729N88948N66516j73706j050114m50572
3123D8188115p82873j091560j268795n68329m60510l61140K84820r0676M4866
3114D3893918O89963N95392J5265N58262J567426O02939O60770Q67917J024905
$$ plain form
3178 15140665 16238634 16533937 16244357 16461679 16958720 16957797 17404960 18111937 18264600 18676365
3168 18676365 19283489 19561698 20562406 21637687 22434682 22912121 22881791 23274154 24125408
3159 24125408 24593023 24889944 25602123 25962466 26440961 26851536 26814737 26624725 27318124 28281654
3149 28281654 28519365 28780153 29533417 29892505 30549140 31385977 32095277 33056096 34194768
3140 34194768 35322313 36415246 37616424 38396098 39327279 41142514 43070439 44863555
3132 44863555 46287815 47256217 47878314 48707043 49295991 49862507 49688801 48638687 48188115
3123 48188115 47405242 46313682 45044887 44476558 44016048 43654908 43939728 43849052 43893918
3114 43893918 44583881 45179273 45194538 45752800 47320226 47923165 48583935 49451852 50476757
3105E0476757J066671n7323Q41462N22453k101m64279l50673q07458q53876j191273
3095D9180360j190062r68909j613245j567396k165078j060296q38513j162007
3087C8614854p34088m11195k93233o21399l54666k1438l4279n66444j65340k07623
3077C5205149j29046m14748j61620j169748j289202j421374j112750o79976j235819
3068B7590866j197649j552610j614669p89933l83498l53349j145526j348667r65966
3059A8238999k85628k79231n88248m09179o63704p08070m04406m71877k62929
3050A4165727M994j60891o44264n19457m28564p62428p55535j56245k96030p73324
3040I673983j12133k98439m80490J26096k15761p64108L62744k78024j57632k65274
$$ plain form
3105 50476757 51543428 51486105 52327567 52850020 52847919 52383640 52032967 51225509 50371633 49180360
3095 49180360 47990298 47021389 45408144 43840748 41675670 40615374 39776861 38614854
3087 38614854 37880766 37469571 37176338 36554939 36200273 36178835 36144556 35578112 35412772 35205149
3077 35205149 35076103 34661355 34499735 33329987 32040785 30619411 29506661 28826685 27590866
3068 27590866 26393217 24840607 23225938 22436005 22052507 21699158 20553632 19204965 18238999
3059 18238999 17953371 17674140 17085892 16676713 16013009 15304939 14900533 14428656 14165727
3050 14165727 14170721 14009830 13365566 12846109 12417545 11655117 10899582 10743337 10447307 9673983
3040 9673983 9561850 9263411 8782921 8909017 8693256 7929148 8291892 8013868 7856236 7590962
3030G590962R8225o685l2168l99263m26951n83709l31091m69964l52336O93402
3020E780422J08664J57217m55996n27634k68807N48789k09092j13954l23116l38398
3010D358095M96827l73710J98296l88669j2270J4892q34384r74318J53402P41875
3000C380036K32310l54631J54225j012694K33702O35095k09117p9282j11053J8370
2990B886961K10858m0362L67046k45938n90064j55820L69735j27202m78885k52959
2980A943370J63432M68338o19454k46525K24297j16368k66629j68856J22598K38484
2970A742687j08036R24k91301L81311k84292k99245J22694K56299j68703K66883
2960A619221L27335o37047o31886L10064L15805K79787L22970l38211n73455j57472
$$ plain form
3030 7590962 7689187 7682502 7650334 7251071 6824120 6240411 5909320 5439356 5087020 5780422
3020 5780422 5889086 6046303 5590307 5062673 4793866 5342655 5133563 5019609 4696493 4358095
3010 4358095 4854922 4481212 4679508 4290839 4278569 4293461 3459077 2484759 2638161 3380036
3000 3380036 3612346 3257715 3411940 2399246 2632948 3268043 3058926 2979644 2868591 2886961
2990 2886961 3097819 3057457 3424503 3178565 2588501 2432681 2802416 2675214 2196329 1943370
2980 1943370 2106802 2575140 1955686 1709161 1933458 1817090 1550461 1381605 1504203 1742687
2970 1742687 1634651 1635575 1344274 1725585 1441293 1142048 1264742 1521041 1352338 1619221
2960 1619221 1946556 1309509 677623 987687 1303492 1583279 1906249 1568038 994583 837111
2950H37111k67774J02590m56924K91683R00577J12613q98434m20352O43514P04929
2940A549533p13393k97769k11609K00516j50040k2602L33004l3846m48322l9053
2930A66419K90679j32246L54366m2829k95084k70541M67688j49174O1397m25771
2920B4904K99311m48146j95642N63974J2774K69519j99963J95814p076k19293
2910B96176j24491k55954J52038j34397j68465j10400O9293J25201K81423n70103
2900d39679J20844J03584J02412J65602J59207K40463k08265p0543m46391m4644
2890c17410J5806N29789O0740j60643p2211l48207l0084K93230P3579Q4376k18551
2879h9586k40274l63151L70148K30658L35376j6661j58782K36650l18230K4741
$$ plain form
2950 837111 569337 671927 215003 506686 1407263 1519876 621442 201090 844604 1549533
2940 1549533 836140 538371 326762 527278 377238 354636 687640 653794 205472 166419
2930 166419 457098 324852 679218 636389 341305 70764 538452 389278 450675 24904
2920 24904 324215 -123931 -319573 244401 257175 526694 326731 522545 515469 296176
2910 296176 171685 -84269 67769 -66628 -235093 -345493 -276200 -150999 130424 -439679
2900 -439679 -318835 -215251 -112839 52763 211970 452433 244168 173625 -272766 -317410
2890 -317410 -301604 228185 288925 128282 56071 -292136 -322220 -28990 44589 128965 -89586
2879 -89586 -329860 -693011 -322863 -92205 243171 226510 67728 304378 -13852 10889
2869A0889K18678O94n07488q1478R0337L54302N9359R3386j38726j1823j18663
2858c0533n2310K23088m43962L55890j20759L29635J41413q33567P70664R8470
2848D38029k03274l90179J29359N3711O04319R9529k87223r0907k19099k36105
2838a01840j05806N93492n41019L05403m78787K52408K17486K05575j01196n22209
2828b76493l88492j29962j0584j00759K80881K83127J67392j46915M45549j44179
2818b0435k35695J57477J55099N7034m27104l80395K92133j72185K67525J154
2808c05392q6073k54795k9772Q32495l61903K15339J11783K07622k05846j96878
2798g3420j17380L2509l8677K51221m25923k83395L65075J61639K9518k7025L64322
$$ plain form
2869 10889 229567 230261 -277227 -358705 -268368 85934 145293 238679 99953 88130 -30533
2858 -30533 -82843 140245 -303717 52173 -68586 261049 402462 -431105 339559 438029
2848 438029 234755 -155424 -26065 27646 631965 731494 444271 353364 134265 -101840
2838 -101840 -207646 385846 -155173 150230 -328557 -76149 141337 346912 245716 -276493
2828 -276493 -664985 -794947 -805531 -906290 -625409 -342282 -174890 -321805 123744 -20435
2818 -20435 -256130 -98653 56446 113480 -313624 -694019 -401886 -574071 -306546 -305392
2808 -305392 -391465 -646260 -676032 156463 -205440 9899 121682 329304 123458 -73420
2798 -73420 -190800 -158291 -196968 54253 -371670 -655065 -289990 -128351 -98833 -125858 238464
2787B38464k01593j23321j68848J90731J06126K89497n20105L25427k9209j95175
2777h8006p4718j36192j23121N39600j74809p23469r281Q7113n33746K60452O32473
2766c43704J74965l55121J08564K89585k0133m27753K08787o66458k64024O61717
2756f33575K43081L02927j05450L2301j60047J11835N34951M92630n41099l28379
2746e0825K63689L04117l04492j96080m61921K52360k47560J94296j04229K75161
2736g5484M418n15496Q1126j18254J11405J22111L60374m05950n8313L12781j42604
2725c23886K44863j58565l56093j35496J00754J81211N51293l94539L41746K80448
2715C31736k75335l57052J0814m72709L2179K88263M97723N5458o30396L23183
$$ plain form
2787 238464 36871 -86450 -255298 -64567 41559 331056 -189049 136378 107169 -88006
2777 -88006 -162724 -298916 -422037 117563 -57246 -780715 -789996 -702883 -1236629 -976177 -343704
2766 -343704 -168739 -523860 -415296 -125711 -145844 -573597 -364810 -1031268 -1295292 -633575
2756 -633575 -390494 -87567 -193017 -160716 -320763 -208928 326023 818653 277554 -50825
2746 -50825 212864 516981 212489 16409 -445512 -193152 -440712 -246416 -350645 -75484
2736 -75484 -71066 -586562 -505436 -623690 -512285 -390174 -29800 -435750 -494063 -181282 -323886
2725 -323886 -79023 -237588 -593681 -729177 -628423 -447212 104081 -290458 51288 331736
2715 331736 56401 -300651 -289837 -762546 -730367 -442104 55619 111077 -519319 -196136
2705a96136R9792K92818m18529j01308l4257R2684L74008l24766l97405P8491
2695e34608l66873L44647l86043Q5710N19252k44180J53921j16172K23056J07343
2685b13947k67334M60198k998k75224M1128j40792l48688L00516J51807m4425
2675c39759M09657n43574l70330L11399J47541l96363J91817L36216m06588J33893
2665e26091N11380m6922o04882j82012N90940R14485m10119o18958K20044l3362
2655a85497j06189j16975J45824k81400N72558k56730n50172L29634K15177k50083
2645d83853K29960J78560o22663l5544M2571L32941j88683k69367K24604J5810
2635e75664K01367M48546p60847J73060J99452L56637n37123l15954K83842L44325
$$ plain form
2705 -196136 -96344 196474 -222055 -323363 -357620 -264936 109072 -215694 -613099 -534608
2695 -534608 -901481 -556834 -942877 -857167 -337915 -582095 -428174 -544346 -321290 -213947
2685 -213947 -481281 -21083 -24081 -299305 -258177 -398969 -747657 -447141 -295334 -339759
2675 -339759 69898 -473676 -844006 -532607 -385066 -781429 -589612 -253396 -659984 -526091
2665 -526091 -14711 -61633 -666515 -848527 -257587 656898 246779 -372179 -152135 -185497
2655 -185497 -291686 -408661 -262837 -544237 28321 -228409 -778581 -448947 -233770 -483853
2645 -483853 -253893 -75333 -697996 -733540 -690969 -358028 -546711 -816078 -591474 -575664
2635 -575664 -374297 74249 -686598 -513538 -314086 42551 -494572 -810526 -526684 -182359
2625a82359L38625p30416M35109l34660k54276K16660K00557K31450J70689j86110
2615i4731Q3322j58099q3624k51924n08350L5581L31354K78160Q9578N37917J65465
2604D24649l79742K21708N50874m87295K10342J62131j99805O33554j13117j23034
2594I00265l15567N4902P4920n9140R9986m99536K18348K47697l05654k30621
2584A85600r3166m87539K66197J11807N23058L450n64095P6213K56534K10314
2574D88373r5384l50475O44762k13951J15822N4696k09512N0189k09639M38707
2564G13588j53554J07420m70696J31718o8020j61466L53005J19988j42203L3544
2554D63324N4896k98931M48225j03110m04423j20853L79434k35640k76061j26681
$$ plain form
2625 -182359 156266 -574150 -139041 -473701 -727977 -511317 -310760 -79310 91379 -94731
2615 -94731 -11409 -169508 -253132 -505056 -1013406 -977825 -646471 -368311 -278733 259184 424649
2604 424649 44907 266615 817489 330194 540536 702667 502862 1136416 1023299 900265
2594 900265 584698 639600 714520 655380 755366 255830 474178 721875 416221 185600
2584 185600 92434 -395105 -128908 -17101 505957 509407 -54688 21525 278059 488373
2574 488373 392989 42514 687276 473325 589147 643843 434331 484520 274881 713588
2564 713588 560034 667454 196758 328476 260456 98990 451995 571983 429780 463324
2554 463324 518220 219289 667514 564404 159981 39128 418562 182922 -93139 -219820
2544b19820m87495P04536P1274R9813l7144J84644K40986l32332N7427O887p7887
2533B10889K37045l71354l2690L11793l52533l5409L60829J9332L46270K62927
2523I57099k95297Q8892n38500o4705P22647P4594n15865l60402M51797L75302
2513H95562k13559n64638n9719l12879K34034N38271J6309r03694n6516R64879
2503E38050J44438L5540M88365K66992q6939n95374J44201K66151j55555l01840
2493G44029L5308O6874L95844P32123n34699j25909l33927p27179L13131J45412
2483G11007J82110N19104m86112l71631j64880P08230l21821K81955O69981L7552
2473A765495q86502n57125L49195k87495K35746J66921j63995p2267J38977K34507
$$ plain form
2544 -219820 -707315 -2779 68495 168308 131164 315808 556794 224462 281889 288776 210889
2533 210889 447934 76580 43890 355683 3150 -32259 328570 347902 694172 957099
2523 957099 661802 750694 212194 147489 870136 944730 428865 68463 520260 895562
2513 895562 682003 117365 57646 -255233 -21199 517072 533381 -370313 -426829 538050
2503 538050 682488 718028 1206393 1473385 1386446 791072 935273 1201424 1045869 744029
2493 744029 779337 846211 1242055 1974178 1439479 1313570 979643 252464 565595 711007
2483 711007 893117 1412221 926109 554478 389598 1097828 776007 1057962 1727943 1765495
2473 1765495 878993 321868 671063 383568 619314 786235 622240 549973 688950 923457
2463I23457M55918m26639L35773K23050l45982l94215K76107l089m55206L88332
2453I77506L49427L95008j59512j62326J45434O12508k63339L85531J30349l43988
2443B066598j10819K8768O1359j62173K78647k58202L7474L09250m8036M04050
2433B606916j37860K54645o10826k15154Q7939L30622j93041j33040M91218m89819
2423A991600K95933Q8499J46940M36292n2027j64202J90868K21651K55772j28494
2413C282832M60753J6828r1469k5629L498l3788L26385R6116J19581j14718n9581
2402C980808K27455J74201O4375k21694m59085O69169N59571J30216l39443L73290
2392E158863K15410j61738j78552j60176k8561N08056K76917N8885O00951M35019
$$ plain form
2463 923457 1379375 952736 1288509 1511559 1165577 771362 1047469 1044380 589174 977506
2453 977506 1326933 1721941 1562429 1400103 1545537 2158045 1894706 2280237 2410586 2066598
2443 2066598 1955779 1984547 2045906 1883733 2162380 1904178 1941652 2250902 2202866 2606916
2433 2606916 2469056 2723701 2112875 1897721 1985660 2316282 2123241 1990201 2481419 1991600
2423 1991600 2287533 2376032 2522972 2959264 2907237 2743035 2933903 3155554 3411326 3282832
2413 3282832 3743585 3760413 3668944 3643315 3646813 3613025 3939410 4035526 4155107 4040389 3980808
2402 3980808 4208263 4382464 4446839 4225145 3766060 4435229 4994800 5125016 4785573 5158863
2392 5158863 5374273 5212535 5033983 4873807 4845246 5353302 5630219 5689104 6290055 6725074
2382F725074l00914j02175J13931p0320k5722K62786J131685J0361K51049N48093
2372H543848M96416R7757R68020L93381n6044N21342N00151Q61110J028787J90717
2362A3545485M49201N77603N14086J373457R68107P97777J284287J858502P44239
2353B2112744J092305K145696J436596K202568K761034L167135K794628M301491
2345D2014197M006360M551195M557622M382870M502890O135480O209164P332903
2337H3692681J0479345J4832584J8073959K1644509J9540660J8991237K0758270
2330B08013245J7716935P206200p57313k1575204l8430465k6629085j9896389
2323A25647924j6154037j3416769j0275619q624459p227146o425589n199097n679892
$$ plain form
2382 6725074 6424160 6321985 6435916 6365596 6339874 6602660 7734345 7744706 7995755 8543848
2372 8543848 9040264 9138021 10106041 10499422 10443378 10964720 11464871 12325981 13354768 13545485
2362 13545485 13994686 14572289 15086375 16459832 17427939 18225716 19510003 21368505 22112744
2353 22112744 23205049 25350745 26787341 28989909 31750943 34918078 37712706 42014197
2345 42014197 46020557 50571752 55129374 59512244 64015134 70150614 76359778 83692681
2337 83692681 94172026 109004610 127078569 148723078 168263738 187254975 208013245
2330 208013245 225730180 232936380 232179067 210603863 172173398 145544313 125647924
2323 125647924 109493887 96077118 85801499 77177040 69949894 63524305 58325208 52645316
2315E2645316m916427m408655l198280l562544l878883l512818k449387k095439
2307B4622883j813334k391574j716580j239425j631534j475508n21100o46177
2299A3187651j166167q48627m26817M2350q20707o50523p67835j78441j84770
2290H186114k17424m06512j005359j93876m2270m08047q12908l77480n67009m28585
2280C726644j49825N03040k81486k36718J20325j07715m39564n87603K56816M06408
2270C210322l33715n67947o06616l29964M70281M51417n38120l31183J99052l92562
2260A230965j12792M54894K66625n64135n46089l35932J19109L68558K09405k56444
2250H34164k03189k08239M19014r9929l00708o6251j68746j43752L36789j7402
$$ plain form
2315 52645316 47728889 43320234 40121954 36559410 32680527 29167709 26718322 24622883
2307 24622883 22809549 20417975 18701395 17461970 15830436 14354928 13833828 13187651
2299 13187651 12021484 11172857 10746040 10788390 9967683 9317160 8549325 8370884 8186114
2290 8186114 7968690 7562178 6556819 6362943 6320673 5912626 5099718 4722238 4155229 3726644
2280 3726644 3576819 4079859 3798373 3561655 3681980 3574265 3134701 2547098 2803914 3210322
2270 3210322 2876607 2308660 1702044 1372080 1842361 2293778 1755658 1424475 1623527 1230965
2260 1230965 1118173 1573067 1839692 1275557 729468 393536 512645 881203 1090608 834164
2250 834164 630975 422736 841750 741821 441113 374862 206116 62364 399153 381751
2240C81751N2709k19917M26294o9412L21970m8098n85437J09492k2819m40153
2230i3620M07806l11033m68613l7526Q76031k36442k82752q4706J06681j34108
2220b58282J03734O5569K7054J96651K5234m74859o74064L13861J99165K45401
2210b30536j35369K4438N51628k20018Q7151l87601o78813J4889J12429O36818
2200b24984J25573r8740j82355L32867j34149P4130p7112N25754N040n67637k1545
2189b43158J01241N255p4882p0704j04808n24845Q29512k33743m64060n04010
2179a284202Q1112P84792J96948N09887r9823k20337k28511p05934k50241N82050
2169f34259K23354K09594P8441j12683O622j89092k86801P917R7137K09296l02977
$$ plain form
2240 381751 434460 214543 640837 571425 893395 845297 259860 369352 346533 -93620
2230 -93620 314186 3153 -465460 -502986 373045 136603 -146149 -230855 -124174 -258282
2220 -258282 -154548 -88979 -61925 134726 159960 -314899 -988963 -675102 -475937 -230536
2210 -230536 -365905 -341467 210161 -9857 77294 -310307 -989120 -974231 -861802 -224984
2200 -224984 -99411 -198151 -380506 -47639 -181788 -107658 -184770 340984 346024 -221613 -243158
2189 -243158 -141917 -136662 -211544 -282248 -387056 -911901 -82389 -316132 -780192 -1284202
2179 -1284202 -1203090 -418298 -221350 288537 188714 -31623 -260134 -966068 -1216309 -634259
2169 -634259 -410905 -201311 -122870 -235553 -228931 -418023 -704824 -696907 -599770 -390474 -693451
2158f93451m4381l46976L14479j48600J09869O67295l18849R26693k94633m15766
2148b44320n52040L8720J49290J85013k89321K7320q4893j32234M42859K45949
2138b13657K30697j11458l56842J5k06785n81069l723J08309j65608M54721J54723
2127f90677j02934J03206p0464l00668m60939L96325n0509K6493J17199J47171
2117h85797J11067L6778q4379k7632J71212K51931N6675k99493l04892n8985K14989
2106h18526R21548j54490j76748k48113l39123J5428K1445M38590k21016P7812
2096d83193L10351j86900k67229J22714J88550l24637k61055p4355M34734k7996
2086e69016k73695L28897O6078k44897j28608L06160M8916j32130j3487k56081
$$ plain form
2158 -693451 -737832 -1084808 -770329 -918929 -809060 -141765 -460614 466079 171446 -244320
2148 -244320 -796360 -757640 -608350 -423337 -712658 -685338 -770231 -902465 -459606 -213657
2138 -213657 17040 -94418 -451260 -451245 -658030 -1239099 -1242822 -1134513 -1300121 -845400 -690677
2127 -690677 -793611 -690405 -760869 -1061537 -1522476 -1126151 -1176660 -1150167 -1032968 -885797
2117 -885797 -774730 -737952 -822331 -849963 -678751 -426820 -370145 -669638 -974530 -1033515 -818526
2106 -818526 103022 -51468 -228216 -476329 -815452 -800024 -778579 -339989 -561005 -483193
2096 -483193 -172842 -359742 -626971 -504257 -315707 -640344 -901399 -975754 -541020 -569016
2086 -569016 -842711 -513814 -447736 -692633 -821241 -515081 -466165 -598295 -611782 -867863
2076h67863M43059L57444m21904m63153k31050J93477M97778O7164J42688M66787
2066A84427P3105n10594k49325Q78009m76419k0007M48644l32584k20360j32439
2056c57543L47464k15755k58597L58909r5183j50866n52762j90024L97041n61358
2046a278674K38265L82970j61172j47452j2565J86521J4930P2421J08454P3806
2036e22496k05968J56786j75795m99098O40937O52109k74580m29449k40430p4153
2026i72137P08016J16444q24987J07276R74508k42490l69947n02099M29269l03753
2016h79900n18904K32932m4853q5275N02547J10835m3747j90443L04178K46380
2006c66250K10557l80700J07589m16167k50562M38657K03569J16143j95753j09119
$$ plain form
2076 -867863 -424804 -67360 -489264 -952417 -1183467 -989990 -492212 -425048 -282360 184427
2066 184427 257532 -253062 -502387 375622 -100797 -120804 327840 -4744 -225104 -357543
2056 -357543 -10079 -225834 -484431 -125522 -220705 -371571 -924333 -1114357 -717316 -1278674
2046 -1278674 -1040409 -657439 -818611 -966063 -978628 -792107 -777177 -704756 -596302 -522496
2036 -522496 -728464 -571678 -747473 -1246571 -605634 46475 -228105 -657554 -897984 -972137
2026 -972137 -264121 -147677 -972664 -865388 109120 -133370 -503317 -1005416 -576147 -879900
2016 -879900 -1398804 -1165872 -1210725 -1296000 -793453 -682618 -726365 -916808 -612630 -366250
2006 -366250 -155693 -536393 -428804 -844971 -1095533 -656876 -453307 -337164 -532917 -642036
1996f42036j35637K7706L52552K18488n62669O32370K49326j5925m18648m39410
1986g33883j46956L82962o2400n93083J74500N26638K29635m78525o20132M00998
1976i20246j23484J74553J42370n4129J18702k14613j68347L28569l51850R7929
1966i70546m6787J35602l35867O9297j01353q8232M38205K28870O5731K55660
1956c49420r9598J8153L6193n06704J32763J94043n6436R9225K81372n01591k28108
1945i80108j97306J88778L07224j74245O85041j96000o7995p8434p6100j89970
1935g79115N4032L79704K78472l65409k80989J0907K84579K2420m11023K33425
1925e72997k62625K92632L4735Q9494k46919p0970J04956n469L0506M34147p1484
$$ plain form
1996 -642036 -777673 -749967 -397415 -178927 -741596 -109226 140100 124175 -294473 -733883
1986 -733883 -880839 -497877 -560277 -1153360 -978860 -452222 -222587 -701112 -1321244 -920246
1976 -920246 -1043730 -869177 -726807 -780936 -662234 -876847 -1045194 -716625 -1068475 -970546
1966 -970546 -1017333 -881731 -1217598 -1148301 -1249654 -1337886 -899681 -670811 -605080 -349420
1956 -349420 -449018 -430865 -394672 -901376 -768613 -574570 -631006 -531781 -250409 -752000 -980108
1945 -980108 -1177414 -988636 -681412 -855657 -170616 -366616 -434611 -513045 -589145 -779115
1935 -779115 -725083 -345379 -66907 -432316 -713305 -702398 -417819 -395399 -806422 -572997
1925 -572997 -835622 -542990 -508255 -418761 -665680 -736650 -631694 -637163 -606657 -172510 -243994
1914b43994j48665j37750l02414L27618p6463j65953J55191K32545j39361k32098
1904g31344l78344J32763O35287L8922k2845L25893k071k73317j762K08737j11941
1893a80022m4495J36915j6140p32308l95204J183270Q3562o43558k14920K68284
1883e54616j16257l49021n6616M46720K98223J93561k55559j08492k39712N13033
1873b28736k30799j6632N8934k09401O85111k16875j34499L6591j18023K54835
1863a19494J58091O8210q08920k9056M16940o77725J2858k97592j55208Q43423
1853e88473J9696k00162k16213n2570J77292m0765J53670J27038L20595k94711
$$ plain form
1914 -243994 -392659 -530409 -832823 -505205 -581668 -747621 -592430 -359885 -499246 -731344
1904 -731344 -1109688 -976925 -341638 -302716 -325561 332 -1739 -275056 -276818 -68081 -180022
1893 -180022 -224517 -87602 -103742 -836050 -1231254 -47984 35578 -607980 -822900 -554616
1883 -554616 -670873 -1019894 -1076510 -629790 -331567 -138006 -393565 -502057 -741769 -228736
1873 -228736 -459535 -476167 -417233 -626634 58477 -158398 -292897 -256306 -374329 -119494
1863 -119494 38597 106807 -702113 -731169 -314229 -991954 -979096 -1276688 -1431896 -588473
1853 -588473 -568777 -768939 -985152 -1037722 -860430 -901195 -747525 -620487 -299892 -594603
$$ [...]
##END NTUPLES=NMR SPECTRUM
##END=
