##TITLE=1H_DE-80H_X3
 200.13MHz, d2o
 8 sc
 
 19ns.26.2.2025
##JCAMPDX= 6.0         $$ Bruker NMR JCAMP-DX V2.0
##DATA TYPE= NMR SPECTRUM
##DATA CLASS= NTUPLES
##ORIGIN= UXNMR, Bruker Analytische Messtechnik GmbH
##OWNER= pz
$$ XWIN-NMR		Version 3.5
$$ Fri Aug  1 10:42:53 2025 Russian Standard Time (UT+4h)  Yarkov@DPX200
##.OBSERVE FREQUENCY= 200.1313
##.OBSERVE NUCLEUS= ^1H
##.ACQUISITION MODE= SIMULTANEOUS
##.ACQUISITION SCHEME= undefined
##.AVERAGES= 8
##.DIGITISER RES= 18
##SPECTROMETER/DATA SYSTEM= spect
##.PULSE SEQUENCE= zg30
##.SOLVENT NAME= CDCl3
##.SHIFT REFERENCE= (INTERNAL, CDCl3, 0, 15.5684)
##AUDIT TRAIL= $$ (NUMBER, WHEN, WHO, WHERE, WHAT)
$$ ##TITLE= Audit trail, XWIN-NMR		Version 3.5
$$ ##JCAMPDX= 5.01
$$ ##ORIGIN= Bruker BioSpin GmbH
$$ ##OWNER= Yarkov
$$ C:/Bruker/XWIN-NMR/data/yarkov2/nmr/H-C/1/pdata/1/auditp.txt
$$ ##AUDIT TRAIL=  $$ (NUMBER, WHEN, WHO, WHERE, WHAT)
(   1,<2025-08-01 10:41:45.43 +0400>,<Yarkov>,<DPX200>,
      <created by zg, POWCHK disabled, PULCHK disabled
       configuration hash MD5:
       00 E9 B6 7A A2 85 ED C7 34 08 36 98 17 FE 4E 26
       data hash MD5: 16K
       10 84 EF DC 2A 2F 72 A5 55 21 B6 DD 48 6F 13 4E>)
(   2,<2025-08-01 10:41:51.32 +0400>,<Yarkov>,<DPX200>,
      <Start of raw data processing
       efp BC_mod = 2 LB = 0.25 FT_mod = 6 PKNL = 1 PHC0 = -1362.596 PHC1 = 17.79091 SI = 16K 
       data hash MD5: 16K
       38 D6 D2 E3 CC FD 4F CA D3 2D AD 18 36 FB 4B F3>)
(   3,<2025-08-01 10:41:55.59 +0400>,<Yarkov>,<DPX200>,
      <abs ABSG = 5 
       data hash MD5: 16K
       77 16 B9 AC 20 06 D5 AD 29 A7 B5 93 84 74 18 25>)
(   4,<2025-08-01 10:42:08.78 +0400>,<Yarkov>,<DPX200>,
      <pk PHC0 = 2.4 PHC1 = 0 
       data hash MD5: 16K
       5F 43 34 26 30 B8 B7 1C 9D 39 42 B3 55 E9 DE 5B>)
(   5,<2025-08-01 10:42:15.25 +0400>,<Yarkov>,<DPX200>,
      <abs ABSG = 5 
       data hash MD5: 16K
       09 AF 8F 7D 9F B5 EF 47 03 9A 8F 72 34 C3 54 A8>)
$$ ##END=
$$ 
$$ hash MD5
$$ 2D A3 5C BE 17 C2 68 E3 D7 5A 1A E4 AA 06 7A 4F
##$RELAX= 
##$RELAX= 
##$RELAX= 
##$RELAX= 
##$RELAX= 
##$RELAX= 
$$ Bruker specific parameters
$$ --------------------------
##$DU= <C:/Bruker/XWIN-NMR>
##$EXPNO= 1
##$NAME= <H-C>
##$PROCNO= 1
##$TYPE= <nmr>
##$USER= <yarkov2>
##$AMP= (0..31)
100 100 100 100 100 100 100 100 100 100 100 100 100 100 100 100 100 100 
100 100 100 100 100 100 100 100 100 100 100 100 100 100 
##$AQSEQ= 0
##$AQ_mod= 1
##$AUNM= <au_zg>
##$AUTOPOS= <>
##$BF1= 200.13
##$BF2= 200.13
##$BF3= 200.13
##$BF4= 200.13
##$BF5= 200.13
##$BF6= 200.13
##$BF7= 200.13
##$BF8= 200.13
##$BYTORDA= 1
##$CFDGTYP= 0
##$CFRGTYP= 5
##$CHEMSTR= <none>
##$CNST= (0..31)
1 1 145 1 1 1 1 1 1 1 1 1 1 1 1 1 1 1 1 1 1 1 1 1 1 1 1 1 1 1 1 1 
##$CPDPRG= <>
##$CPDPRG1= <>
##$CPDPRG2= <>
##$CPDPRG3= <>
##$CPDPRG4= <mlev>
##$CPDPRG5= <mlev>
##$CPDPRG6= <mlev>
##$CPDPRG7= <mlev>
##$CPDPRG8= <mlev>
##$CPDPRGB= <>
##$CPDPRGT= <>
##$D= (0..31)
0 0.7 0 0 0 0 0 0 0 0 0 0.03 0 0 0 0 0 0 0 0 0 0 0 0 0 0 0 0 0 0 0 0 
$$ [...]
##$SUBNAM3= <"">
##$SUBNAM4= <"">
##$SUBNAM5= <"">
##$SUBNAM6= <"">
##$SUBNAM7= <"">
##$SUBNAM8= <"">
##$SUBNAM9= <"">
##$SW= 18.0517328524113
##$SWIBOX= (0..15)
0 0 2 0 0 0 0 0 0 0 0 0 0 0 0 0 
##$SW_h= 3612.71676300578
##$TD= 16384
##$TD0= 1
##$TE= 0
##$TE2= 300
##$TE3= 300
##$TEG= 300
##$TL= (0..7)
0 120 120 120 120 120 120 120 
##$TP= (0..7)
150 150 150 150 150 150 150 150 
##$TP07= 0
##$TPNAME0= <>
##$TPNAME1= <>
##$TPNAME2= <>
##$TPNAME3= <>
##$TPNAME4= <>
##$TPNAME5= <>
##$TPNAME6= <>
##$TPNAME7= <>
##$TPOAL= (0..7)
0.5 0.5 0.5 0.5 0.5 0.5 0.5 0.5 
##$TPOFFS= (0..7)
0 0 0 0 0 0 0 0 
##$TUNHIN= 0
##$TUNHOUT= 0
##$TUNXOUT= 0
##$USERA1= <user>
##$USERA2= <user>
##$USERA3= <user>
##$USERA4= <user>
##$USERA5= <user>
##$V9= 5
##$VALIST= <valist>
##$VCLIST= <CCCCCCCCCCCCCCC>
##$VD= 0
##$VDLIST= <DDDDDDDDDDDDDDD>
##$VPLIST= <PPPPPPPPPPPPPPP>
##$VTLIST= <TTTTTTTTTTTTTTT>
##$WBST= 1024
##$WBSW= 4
##$XGAIN= (0..3)
0 0 0 0 
##$XL= 0
##$YL= 0
##$YMAX_a= 203478
##$YMIN_a= -211311
##$ZGOPTNS= <>
##$ZL1= 120
##$ZL2= 120
##$ZL3= 120
##$ZL4= 120
##$ABSF1= 15.48686
##$ABSF2= -2.564989
##$ABSG= 5
##$ABSL= 3
##$ALPHA= 0
##$AQORDER= 0
##$ASSFAC= 0
##$ASSFACI= 0
##$ASSFACX= 0
##$ASSWID= 0
##$AUNMP= <proc_1d>
##$AZFE= 0.1
##$AZFW= 0.1
##$BCFW= 0
##$BC_mod= 2
##$BYTORDP= 0
##$COROFFS= 0
##$CY= -3
##$DATMOD= 1
##$DC= 0
##$DFILT= <>
##$DTYPP= 0
##$F1P= 0
##$F2P= 0
##$FCOR= 1
##$FTSIZE= 16384
##$FT_mod= 6
##$GAMMA= 0
##$GB= 0
##$INTBC= 1
##$INTSCL= 3.241238e-09
##$ISEN= 128
##$LB= 0.25
##$LEV0= 0
##$LPBIN= 0
##$MAXI= 10000
##$MC2= 0
##$MEAN= 0
##$ME_mod= 0
##$MI= 1.114404
##$NCOEF= 0
##$NC_proc= -7
##$NLEV= 6
##$NOISF1= 3.799351
##$NOISF2= 2.8
##$NSP= 0
##$NTH_PI= 0
##$NZP= 0
##$OFFSET= 15.5684
##$PC= 1
##$PHC0= -1360.196
##$PHC1= 17.79091
##$PH_mod= 1
##$PKNL= yes
##$PPARMOD= 0
##$PSCAL= 0
##$PSIGN= 0
##$REVERSE= no
##$SF= 200.129990654116
##$SI= 16384
##$SIGF1= 3
##$SIGF2= 2
##$SINO= 0.751879
##$SIOLD= 32768
##$SREGLST= <19F.Aceton>
##$SSB= 0
##$STSI= 16384
##$STSR= 0
##$SW_p= 3612.71676300578
##$SYMM= 0
##$S_DEV= 0
##$TDeff= 16384
##$TDoff= 0
##$TI= <>
##$TILT= no
##$TM1= 0
##$TM2= 0
##$TOPLEV= 0
##$USERP1= <user>
##$USERP2= <user>
##$USERP3= <user>
##$USERP4= <user>
##$USERP5= <user>
##$WDW= 1
##$XDIM= 16384
##$YMAX_p= 361460760
##$YMIN_p= -480824
$$ End of Bruker specific parameters
$$ ---------------------------------
##NTUPLES= NMR SPECTRUM
##VAR_NAME=  FREQUENCY,     SPECTRUM/REAL,   SPECTRUM/IMAG
##SYMBOL=    X,             R,               I
##VAR_TYPE=  INDEPENDENT,   DEPENDENT,       DEPENDENT
##VAR_FORM=  AFFN,          ASDF,            ASDF
##VAR_DIM=   16384,         16384,           16384
##UNITS=     HZ,            ARBITRARY UNITS, ARBITRARY UNITS
##FACTOR=    0.220516191357247, 1,           1
##FIRST=     3115.70382314845, 0,            0
##LAST=      -497.012939857334, 0,           0
##MIN=       -497.012939857334, -480824,     0
##MAX=       3115.70382314845, 361460760,    0
$$ Real data points
##PAGE= N=1
##DATA TABLE= (X++(R..R)), XYDATA
$$ [...]
6014G506970k61525l89202n19144n64362m91368m70154m62788j83582k67418k16625
6004C680802j92037j46719p4185j34880j13521o1024m7146n0224k7372q666j6228
5993B808800J04479O4319L1614O5026K13867K6017M132J2029o2070k24860k31700
5982B811653l07868k63291j57063j58592l4211j50381j08115l0164m0348N0280
5972A611900p7254n8785j85591m5638k3701K462m2338O438N245q1560n781K0984
5960A126381m7901n8581M53q0713p010P867J8120J4179J1493m3435J9923j08511
5948H52265K4546L2207J9158K9812n7191r1600o5842N0501K7759o609n2706M0809
5936H03109m4123P362P7286m6228J7474J7188o9647j3625M6575k0692N9548N6349
$$ plain form
6014 7506970 7245445 6856243 6337099 5772737 5281369 4811215 4348427 4164845 3897427 3680802
6004 3680802 3488765 3342046 3267861 3132981 3019460 2958436 2911290 2861066 2833694 2825028 2808800
5993 2808800 2913279 2977598 3009212 3074238 3288105 3314122 3318254 3330283 3268213 3043353 2811653
5982 2811653 2503785 2240494 2083431 1924839 1890628 1740247 1632132 1601968 1561620 1611900
5972 1611900 1534646 1475861 1290270 1244632 1220931 1223393 1181055 1187493 1192738 1111178 1105397 1126381
5960 1126381 1078480 1019899 1020352 939639 932629 940496 958616 972795 984288 940853 960776 852265
5948 852265 876811 909018 928176 957988 900797 809197 743355 793856 821615 815006 762300 803109
5936 803109 758986 766348 843634 797406 814880 832068 762421 748796 795371 774679 834227 890576
5924H90576k4726j308n154n0338m198J9239o5426n6642M146K7112K7415L784J4430
5911G78910r9086J8879K8133L9661n9213Q992L4943M0309M2921l4551J9424p0134
5899G49188q6422k7734N9358n9606m6022k3991M0140q124p6930o9698P357J3459
5887D70975n63M3097k4760l4784q294K7489o1363j050M673P671O8991n4719j6068
5874D21295l7490k8687j35P715p579m5148j0986O7845L1737r3478o9703N6600
5862B91986K9383k5272k2190j6945l2359j5998P387m641m157r94L4944k0723j6124
5849B04297O5578l5773m9907Q568K7637P4809j5041j08708L4397O1201m1985l3601
5837A91472M1672P8067m0755K852q794Q554j374k0125K014m2342l723M6373L0605
$$ plain form
5924 890576 865850 864542 859388 809050 804852 824091 758665 702023 706169 733281 760696 764480 778910
5911 778910 679824 698703 726836 766497 707284 716276 751219 791528 834449 799898 819322 749188
5899 749188 662766 635032 694390 634784 588762 564771 604911 596787 519857 450159 457516 470975
5887 470975 470412 513509 488749 453965 445671 473160 411797 410747 415420 423091 492082 437363 421295
5874 421295 383805 355118 354983 362698 355119 309971 298985 366830 398567 305089 235386 291986
5862 291986 321369 296097 273907 256962 224603 208605 215992 211351 207194 206200 241144 220421 204297
5849 204297 269875 234102 184195 192763 220400 295209 280168 171460 205857 267058 225073 191472
5837 191472 233144 311211 270456 273308 264514 273068 271694 251569 253583 211241 207518 253891 284496
5824B84496l2605m912j742p2378P9443L6230M5135o3915o4907L457M9908P6340
5812C34550m5122m2398n1838J03547n3605J1780O5217O522L3662j4215k4077k1983
5800C02040k4947P9708K3739o8581J1203n2677N2666l1485l3337j8298P1009j2243
5788B98797l7269k1504L472K3631O736l6990l5532O079R66N4778R309j5204O4814
5775C22083L527P676J7584L9451q2909o4285P0266O8652L8295k9839o2546J182
5763C29137K1251J4332M6278o396k2848o2994J2861j1108J339n8862L6485K3785
5751C23260n0220J8749L4034L7794m8783n8930M1072M5685K796j6982o625L0410
5739C52260L7728O6081m4903m1756q1872J3711K9829k267L9557k6390K1540n4151
$$ plain form
5824 284496 251891 246979 245237 172859 252302 288532 333667 269752 204845 208302 258210 334550
5812 334550 289428 247030 195192 298739 245134 256914 322131 328653 362315 348100 324023 302040
5800 302040 277093 356801 380540 311959 323162 270485 323151 291666 258329 240031 311040 298797
5788 298797 261528 240024 243496 267127 273863 236873 201341 207420 208386 263164 272473 257269 322083
5775 322083 325610 333286 350870 390321 307412 243127 313393 382045 420340 390501 327955 329137
5763 329137 350388 364720 410998 404602 381754 318760 331621 320513 321852 262990 299475 323260
5751 323260 273040 291789 325823 363617 314834 255904 296976 342661 345457 328475 321850 352260
5739 352260 389988 456069 411166 369410 287538 301249 331078 328811 368368 341978 363518 309367
5727C09367K6812k6716r174j8052J13296r00j8080L7217o4709o6652K7867K4082
5715C34358k7402R621j1231O148N3099L5538j2723O8462p2553m6004P8206L747
5703D19266k7635J2811K3632J086M9875N344q93r3157J0043l4416J03325l1148
5691D38133K5093o2017j4640Q0490k7899m357m8589J4899O7021M0651l2616j9310
5679D56859N7635R5099q8031J6453J0380n9988J1304J15158O356l0086j3667L1528
5667F09000N9036k1357o6867N3179M0589j1859n2273L377J00089P1726n0319o5165
5655F69156j9649Q081K938L1976O4593J4758j9557l7747M6673L8418m935j3138
5643G81567Q7159o09R379j4764o8086J01582P3215k142p5990l1089N6588Q3032
$$ plain form
5727 309367 336179 309463 300289 282237 395533 394633 376553 413770 349061 282409 310276 334358
5715 334358 306956 316577 305346 311494 364593 400131 387408 455870 383317 337313 415519 419266
5703 419266 391631 404442 428074 429160 479035 484379 483486 390329 400372 365956 469281 438133
5691 438133 463226 401209 386569 467059 439160 434803 386214 401113 468134 508785 476169 456859
5679 456859 514494 609593 521562 538015 548395 488407 499711 614869 621225 591139 577472 609000
5667 609000 668036 646679 579812 632991 673580 661721 609448 612825 712914 784640 734321 669156
5655 669156 649507 657588 660526 692502 757095 771853 752296 714549 761222 799640 794705 781567
5643 781567 868726 868117 877496 862732 794646 896228 969443 967301 891311 860222 916810 999842
5631I99842N7402r8021q7898M9419l3120n7507k8362Q4126p057o265m1770j2150
5619H18639J0494K9212m2775K5761O0322J0954o3046K2236M9224k5096K0047Q2213
5607I98185k1816J4884P941m4155N4119j04067O425r545K5937J4808r395K0014
5595I53335L4528M2602l6689k1821N4899Q1191J9286l0677N0748O3884O1672N7812
5583A330770j478o3676N187L8585m8847M663L0203O2944J628m7683j7211O6239
5571A361324Q2054N1477J4530R3649M4218J6863J05514R2097O2871M4086J7936
5560A986619N8092K3970l7570L5195N3396R6702K1549M6031J138R9139O4335K2698
5548B471294R0481R0309O0843J2279N9671J29554J09395R9483J21758J60949K26062
$$ plain form
5631 999842 1057244 959223 871325 920744 887624 830117 801755 885881 878824 872559 830789 818639
5619 818639 829133 858345 815570 841331 901653 912607 849561 871797 921021 895925 915972 998185
5607 998185 976369 991253 999194 955039 1009158 905091 911516 901971 927908 942716 933321 953335
5595 953335 987863 1030465 993776 971955 1026854 1108045 1127331 1096654 1147402 1211286 1272958 1330770
5583 1330770 1329292 1265616 1270803 1309388 1260541 1265204 1295407 1358351 1359979 1312296 1295085 1361324
5571 1361324 1443378 1494855 1509385 1603034 1647252 1664115 1769629 1861726 1924597 1968683 1986619
5560 1986619 2044711 2068681 2031111 2066306 2119702 2216404 2237953 2283984 2285122 2384261 2448596 2471294
5548 2471294 2561775 2652084 2712927 2725206 2784877 2914431 3023826 3123309 3245067 3406016 3632078
5537C632078J06260J23647K28604J28810M1095N3725J3455P1927L902J18451J37046
5526D659000M1879K3649J80194J69178J73230K13815K65777K07088K43957L64030
5516F541797L72627L36083L75435M23489L66768M77523L82218M58166L70165K24666
5506A0328937J44273K3798O4333Q2648N8853R0963R3000J90742J57358K07294
5496A1442199L05161L42169M62201L22460K93945M49758N00834N56190M57041
5487A5131958M84367M91688N46653N36415N48310M43353M63456M45225K97916
5478A9389341J10680P4823N1343J03241J26078J93774J74823J99770K27388K89479
5468B0940740L50675L27014M43473M49070N40878N61496M81610O08256O13143
$$ plain form
5537 3632078 3738338 3861985 4090589 4219399 4260494 4314219 4327674 4399601 4403503 4521954 4659000
5526 4659000 4700879 4724528 4904722 5073900 5247130 5460945 5726722 5933810 6177767 6541797
5516 6541797 6914424 7250507 7625942 8049431 8416199 8893722 9275940 9734106 10104271 10328937
5506 10328937 10473210 10497008 10561341 10643989 10702842 10793805 10886805 11077547 11234905 11442199
5496 11442199 11747360 12089529 12551730 12874190 13168135 13617893 14118727 14674917 15131958
5487 15131958 15616325 16108013 16654666 17191081 17739391 18182744 18646200 19091425 19389341
5478 19389341 19500021 19574844 19626187 19729428 19855506 20049280 20224103 20423873 20651261 20940740
5468 20940740 21291415 21618429 22061902 22510972 23051850 23613346 24094956 24703212 25316355
5459B5316355M94821M28600L83326L35790K06935K16607Q4472m9707j09636r2802
5449B7214761j28245j41273o4636j15897N5185J33176P6349J65312J78115K25226
5439B7598073K09277K29024K66487K65231K27903K89435K99078K25030J84666
5430B9794204J24456O5700l6788j16157j92111k40954m30703n03104l77710l54189
5420B7732644l54504k86821k02669j83194r2246j10550j93777j72227j32498m8211
5410B5955947o7983j77873q5210r3090k13947k37743j97138k59803l07225l08542
5400B4007393l87229n28970o21935q25462o91343n94512n19403m71077m41676
5391A8925786l82439l46020l28981l64921m12713m54565l26893k76144l49775
$$ plain form
5459 25316355 25811176 26239776 26623102 26958892 27165827 27382434 27466906 27417199 27307563 27214761
5449 27214761 27086516 26945243 26880607 26764710 26819895 26953071 27029420 27194732 27372847 27598073
5439 27598073 27807350 28036374 28302861 28568092 28795995 29085430 29384508 29609538 29794204
5430 29794204 29918660 29984360 29947572 29831415 29639304 29398350 28967647 28464543 28086833 27732644
5420 27732644 27378140 27091319 26888650 26705456 26613210 26502660 26308883 26136656 26004158 25955947
5410 25955947 25887964 25710091 25624881 25531791 25317844 25080101 24882963 24623160 24315935 24007393
5400 24007393 23620164 23091194 22469259 21643797 20952454 20357942 19838539 19367462 18925786
5391 18925786 18543347 18197327 17868346 17503425 17090712 16636147 16309254 16033110 15683335
5382A5683335l01097k12349j46408j72728j42097j6133j01209j28468j38690r4833
5372A4229323j72015l70288o25296p66705p62554o80306n09673n08573l18065
5363I515848m80618m45507l66113l14388j84518l34190k54628k26117j97547j25657
5353F586565j46447j49530p7781j20740j33312j3877o4822k1972p4835j09307
5343E673942j83055k60071k46189k70969k24866j35934j57889j76085j10417j39579
5333C768888j56171j74123q5932p4450l9780q4445m2589m2792j84044r1700j13380
5322B679482N715p7886r1463R284m5641Q002q7536n1223m7905q4039p5058P383
5310B149115o8041p0259m097M3876p5190j1672k4383q0125J5358p658q6491J6642
$$ plain form
5382 15683335 15382238 15169889 15023481 14850753 14708656 14692523 14591314 14462846 14324156 14229323
5372 14229323 14057308 13687020 13061724 12295019 11532465 10852159 10342486 9833913 9515848
5363 9515848 9035230 8589723 8223610 7909222 7724704 7390514 7135886 6909769 6712222 6586565
5353 6586565 6440118 6290588 6212807 6092067 5958755 5944878 5880056 5858084 5783249 5673942
5343 5673942 5490887 5230816 4984627 4713658 4488792 4352858 4194969 4018884 3908467 3768888
5333 3768888 3612717 3438594 3352662 3278212 3238432 3153987 3111398 3068606 2884562 2792862 2679482
5322 2679482 2685197 2607311 2515848 2525132 2479491 2487493 2399957 2348734 2300829 2216790 2141732 2149115
5310 2149115 2081074 2010815 2006718 2050594 1975404 1963732 1939349 1859224 1874582 1866924 1780433 1797075
5298A797075N1881l7416n3422J527m5263O4836m1334o4481Q855o5438L2465o3554
5286A585731j1676L8488q979m5066m7562J541N0486r1781p9811R140k916m7588
5274A350007R597l7694m5157j1583K6509k485k1675r291M653k6739o3216L268
5262A176194m2040K6816J0813k6255k5066L3920J0488P5203l764n6126k3868k3489
5250A132826L0099N1244l5737k6733k3528J6564K1618q3946j6945o123k829M9832
5238A106342l8869k0187N4042O515J1241j9858q1426L9767o1366K0407L3595N2018
5226A102221J1477o0306M3440j202J8018n951o2371J9831K7266l0091L1755j6005
5214A078082L0800P923k2666l9330P072n5392L9372K1702j0192k0988K3734j06014
$$ plain form
5298 1797075 1848956 1811540 1758118 1759645 1714382 1779218 1737884 1673403 1682258 1616820 1649285 1585731
5286 1585731 1574055 1612543 1603564 1558498 1510936 1512477 1562963 1471182 1391371 1400511 1397595 1350007
5274 1350007 1359604 1321910 1276753 1265170 1291679 1289194 1267519 1258228 1262881 1236142 1172926 1176194
5262 1176194 1134154 1160970 1171783 1145528 1120462 1154382 1164870 1240073 1236309 1180183 1156315 1132826
5250 1132826 1162925 1214169 1178432 1151699 1128171 1144735 1166353 1082407 1065462 1059339 1056510 1106342
5238 1106342 1067473 1047286 1101328 1107843 1119084 1099226 1017800 1057567 996201 1016608 1050203 1102221
5226 1102221 1113698 1053392 1096832 1095630 1113648 1107697 1045326 1065157 1092423 1062332 1094087 1078082
5214 1078082 1108882 1116805 1094139 1054809 1061881 1006489 1045861 1067563 1057371 1036383 1060117 954103
5202I54103P0396O6156N1976R5666j11948M955L4879m0504K9225J5958M4125L9238
5190A254225n3594O0808O9499j8266n5348M8843J5592j418j8695q388K8939Q4003
5178A406200M0687P2004m5261n2247M0849J1934L2070N418O0648K525K8708J02957
5166A706492Q0583q781K7624J1538L1799O3694O0004P6513l0450M0751O8592J29970
5154B258329K1632L2897Q0020Q5866Q6067J36086N6276J56370J59573J01279O0925
5143C235320M9364J82267J19190J64451J80888J62980J68373J97054J88602K13420
5133D861909K40250J94224J96862K93405J99840L40500L36092K96853L13474K55077
5123G528486K40439K64082K85956K25392J18034J86360K01422J77096J60411J46867
$$ plain form
5202 954103 1024499 1090655 1142631 1238297 1126349 1131304 1166183 1125679 1154904 1170862 1214987 1254225
5190 1254225 1200631 1261439 1330938 1312672 1257324 1306167 1321759 1320341 1301646 1293258 1322197 1406200
5178 1406200 1446887 1518891 1473630 1421383 1462232 1474166 1506236 1511654 1572302 1574827 1603535 1706492
5166 1706492 1787075 1778294 1805918 1817456 1849255 1912949 1972953 2049466 2019016 2059767 2128359 2258329
5154 2258329 2279961 2312858 2392878 2478744 2564811 2700897 2757173 2913543 3073116 3174395 3235320
5143 3235320 3284684 3466951 3586141 3750592 3931480 4094460 4262833 4459887 4648489 4861909
5133 4861909 5102159 5296383 5493245 5786650 5986490 6326990 6663082 6959935 7273409 7528486
5123 7528486 7768925 8033007 8318963 8544355 8662389 8848749 9050171 9227267 9387678 9534545
5113I534545J18421K32389J81936J90064J98162K45260K68961K21186L09494L08273
5103A1808691L99363M46217L29234M30528M98032M30392M53680N63848N73928
5094A5933913N35515M81579M59787N13028M50144L47320L12213L01008J88235
5085A9522742J91621J31456J31296R8323J25584O0679O3189J91240J03667J25043
5075B0744840J15912J65315K38493K30822K49875J49049K15518K66978K19062
5066B2595864K37071K52332K91888L75537L18565L06650L18518K58977K51038
5057B5206440K79487K35285J52190J11751J34820o33l1877J2007n341K9337J07478
5046B6230944p806M5886J32440J05574Q9024Q9060J50277J07268J69107J77970
$$ plain form
5113 9534545 9652966 9885355 10067291 10257355 10455517 10700777 10969738 11190924 11500418 11808691
5103 11808691 12208054 12654271 12983505 13414033 13912065 14342457 14796137 15359985 15933913
5094 15933913 16469428 16951007 17410794 17923822 18373966 18721286 19033499 19334507 19522742
5085 19522742 19714363 19845819 19977115 20075438 20201022 20261701 20324890 20516130 20619797 20744840
5075 20744840 20860752 21026067 21264560 21495382 21745257 21894306 22109824 22376802 22595864
5066 22595864 22832935 23085267 23377155 23752692 24071257 24377907 24696425 24955402 25206440
5057 25206440 25485927 25721212 25873402 25985153 26119973 26119340 26087463 26099470 26094129 26123466 26230944
5046 26230944 26223138 26269024 26401464 26507038 26596062 26685122 26835399 26942667 27111774 27289744
5036B7289744J72672K52485L33911L03202M83103O19536P06883N68637J2143l42877
5026C0399439j23707J75601M01577L88356K91443L18309N93086Q67969J193530
5017C4505603J757981K135138J874881K2107k369309l148189k478416j727040
5009C0572756j368877r95854p11083n86066n48083p49323j077196j250554j043288
5000B2242432r90062q81711q48143p08573p06265o88439n20176n95023n63661
4991A5740379m74657m01699m39087l88271k96318l31041k33966l21759k05322
4982A2648259k38908k49246j55567k41298j50941k02414j65823j58809j65151
4973A0920102k25330j96233k33842k73972j21205l23212l22760j90653k23866
$$ plain form
5036 27289744 27462416 27714901 28048812 28352014 28835117 29454653 30161536 30730173 30742316 30399439
5026 30399439 30275732 30451333 30852910 31241266 31532709 31851018 32444104 33312073 34505603
5017 34505603 36263584 38398722 40273603 40295710 37926401 34778212 32299796 30572756
5009 30572756 29203879 28208025 27496942 26910876 26362793 25613470 24536274 23285720 22242432
5000 22242432 21252370 20370659 19522516 18813943 18107678 17419239 16899063 16304040 15740379
4991 15740379 15265722 14864023 14424936 14036665 13740347 13409306 13175340 12853581 12648259
4982 12648259 12409351 12160105 12004538 11763240 11612299 11409885 11244062 11085253 10920102
4973 10920102 10694772 10498539 10264697 9990725 9869520 9546308 9223548 9032895 8809029
4964H809029k17502j57786j40782q3781j16075o7265l1600o5813n3284r1200k62145
4953G521796l17805l31807j90459j47676p1947r8610j67594r1036j36633j07793
4943E860436K4410k7016o1322l9594m1221k7957k1400m0306j23022j70158j94382
4932E138468j92225j02180j34792r1458o9836r1169r3149r7353l3507n4971k4806
4921D153022n6044j05604l1938n9678l4453m070j8216n0163n8098L2057q5391
4910C681424j9559l0855l8303j8101l8219r2809Q3342r3454n3575l2716K469j1379
4898C338265j23085j28659p3061l3578n683o6306n5015r5071n6763j36139o9655
4887B495250n4918o1411l0588L47j55504j10116O0404p2918l4207q1618o1287
$$ plain form
4964 8809029 8591527 8433741 8292959 8209178 8093103 8025838 7994238 7928425 7875141 7783941 7521796
4953 7521796 7203991 6872184 6681725 6534049 6462102 6363492 6195898 6104862 5968229 5860436
4943 5860436 5884846 5857830 5796508 5756914 5715693 5687736 5666336 5626030 5503008 5332850 5138468
4932 5138468 4946243 4844063 4709271 4617813 4547977 4456808 4363659 4266306 4232799 4177828 4153022
4921 4153022 4096978 3991374 3959436 3899758 3865305 3861235 3843019 3792856 3734758 3766815 3681424
4910 3681424 3661865 3631010 3592707 3574606 3536387 3443578 3526920 3433466 3379891 3347175 3349644 3338265
4898 3338265 3215180 3086521 3013460 2979882 2974199 2907893 2852878 2757807 2701044 2564905 2495250
4887 2495250 2440332 2378921 2348333 2348680 2193176 2083060 2143464 2070546 2036339 1954721 1893434
4876A893434j0109J0070r1784j22757l4017j7730k2380L5632j1891l3338j9778
4865A575352n8346L5414n9981l5740n8608K5534p3810o5456m710m4267j1481M156
4853A228057P643k422r2002o2663k5715m7113j153n1203k6100L0280m3462r4695
4841H19452L191P6117M5070m5711R6456n888j08496n470n4244p4761L5042j5014
4829G65744L7144p9955p7559o955M10n4903M8081R388M047k2366l9335k4670n714
4816E53357K1866o0322L234N0684R69j4307k0845q956p0738J8216L6340o6620
4804D42878J5332j6798p1840p464O52K6301p472L8800n354n861q688P8991M4478
4791E23955j15959l0863Q1763Q704L5926p8900k4105K0155m3089R542M5293p896
$$ plain form
4876 1893434 1883325 1893395 1801611 1678854 1644837 1627107 1604727 1640359 1628468 1595130 1575352
4865 1575352 1517006 1552420 1492439 1456699 1398091 1423625 1349815 1284359 1279649 1235382 1223901 1228057
4853 1228057 1235700 1233278 1141276 1078613 1052898 1005785 1004632 953429 927329 957609 914147 819452
4841 819452 822643 898760 943830 898119 994575 988687 880191 874721 820477 745716 780758 765744
4829 765744 802888 722933 645374 638419 638829 583926 632007 641395 645442 623076 583741 559071 553357
4816 553357 575223 514901 518135 568819 569788 555481 534636 525680 454942 473158 509498 442878
4804 442878 458210 441412 369572 362108 362760 389061 381589 420389 415035 409174 400486 479477 523955
4791 523955 407996 377133 458896 467600 503526 424626 400521 420676 377587 387129 432422 424526
4779D24526j2581k89l5571l8475M5719k394O664n5807K6174p565J4573P7713J1450
4766D54137N388L2143k609o5245k1805K793J4910j5470j4861k4164J7385O4234
4754D46836n585l7487q050n4771l4769m7993j4825N9967Q666M9152k0463l3994
4742C06684Q7563q929r485l9549l0333j5659M8097N665k3785K7888m355l5253
4730C08549j3768P1600O623l9525m1253k923J05587K1759j9383j0469L2148N053
4718D23998O8854r7532m9383j8867n7106K9257J5975N443l9113l6954K2714O6910
4706C34196j0383m9321K1723K1183P8165J5345k9792m180Q38L7523J089m6716
4694C69670j5695j3382J7327j0732r630j6606N940k2712O329L7009k2o3716j2446
$$ plain form
4779 424526 411945 411656 376085 337610 383329 380935 387599 331792 357966 350401 364974 442687 454137
4766 454137 459525 491668 489059 423814 402009 404802 419712 404242 389381 365217 382602 446836
4754 446836 441251 403764 395714 340943 306174 258181 243356 303323 311989 361141 340678 306684
4742 306684 394247 385318 375833 336284 305951 290292 338389 344054 320269 348157 343802 308549
4730 308549 294781 366381 373004 333479 292226 289303 394890 416649 397266 386797 418945 423998
4718 423998 492852 395320 345937 327070 269964 299221 315196 320639 281526 244572 267286 334196
4706 334196 323813 274492 296215 317398 395563 410908 381116 376936 377774 415297 416386 369670
4694 369670 353975 340593 357920 347188 337558 320952 326892 304180 310509 347518 347496 283780 271334
4681B71334L2970J8965j3430K0247o667N25k3536o4039L9472L7040p1741l6146
4669B04994P6108K1901J8952m1258j8591K2309j0297O4890K1826Q813n0914q667
4657C10066P6853r484J3146j7907J0408L1731o110m5425J8215j2059k948o09m2227
4644C23650o397k6368K2035P1169l41q9235k973L208L1205n0868L8622K583K648
4631C18938K4251L2599j16276M0783L8576k3660O5887k6699k7371l8814l7873
4620B50341p561Q4687K1763m9463m1177L0915M5924j5265M7378k626o9443L071
4608B98544M283l694L2296k1158J3464r755O1478o5820p48O3241k12M6521O656
4595D25096j2556j05152k0463K9038J3695J1282m1665k347M1776j0363J8801K1953
$$ plain form
4681 271334 304304 323269 309839 330086 323419 323944 300408 236369 275841 312881 241140 204994
4669 204994 281102 303003 321955 280697 262106 284415 274118 339008 360834 369647 318733 310066
4657 310066 386919 377435 390581 372674 383082 414813 408703 363278 381493 369434 366486 365877 323650
4644 323650 317253 290885 312920 384089 383748 294513 291540 294748 325953 275085 313707 316290 318938
4631 318938 343189 375788 259512 300295 338871 315211 381098 354399 327028 288214 250341
4620 250341 242780 327467 349230 299767 258590 289505 335429 320164 367542 364916 295473 298544
4608 298544 302827 299133 331429 310271 323735 313980 375458 309638 308890 372131 371919 418440 425096
4595 425096 412540 307388 286925 315963 329658 340940 299275 296928 338704 328341 347142 369095
4583C69095L5748o2997M1435k90n875k9479Q5950k1579J2172K5229o823q18L4670
4570D76438L2382M9383n1628p91o885J6684P5577M2551m8227n646R156K614l3543
4557E58065N2472N5928k630K3674O935k8943k4117Q48M8133m5337k0009P3805
4545F98824P2420P830O250l8836J1248M2265L1391R499J22847K1776N0601L2099
4533A068214q753J13394O3355J10618J79790Q3281O6879J23652J433o4204o4782
4522A672877j62793n6746n5880j13760m2769j71808j00698l1630Q830j9228O812
4511I33207k3197m81J107k6650o603m1570J1620J5402j5226k9348l2059L8001
4499H24203o5600n2623M1392J9226o390k9057J0715N0356J7381o562j5463J1761
$$ plain form
4583 369095 404843 341846 383281 382991 377116 347637 433587 412008 424180 449409 442586 441768 476438
4570 476438 508820 558203 506575 505784 498899 515583 591160 633711 585484 579838 588994 591608 558065
4557 558065 610537 666465 663835 687509 694444 665501 641384 642232 690365 645028 625019 698824
4545 698824 771244 779074 785324 746488 757736 800001 831392 840891 963738 985514 1036115 1068214
4533 1068214 1059461 1172855 1236210 1346828 1526618 1609899 1676778 1800430 1801863 1737659 1672877
4522 1672877 1510084 1453338 1397458 1283698 1240929 1069121 968423 936793 945623 926395 933207
4511 933207 910010 909529 910636 883986 877383 835813 847433 862835 847609 818261 786202 824203
4499 824203 758603 705980 747372 766598 760208 731151 741866 792222 809603 803041 787578 799339
4487G99339M3790p491n0671K0523l3178J0863M275j6185N1001P7635k0952J9689
4475H98638M2351l4040r536K6480m4956O3738O3994J9768K1096J2147M9474K9193
4463A138347K7442Q1538J9695J3543N5089k0129Q1949K3375k6183l8614J4228
4452A370280K1406n3631M381J7538N5088o1727K7620L8718O4901l8539k3882L117
4440A425270j3425o1835J09031L2303M6078q2939Q3947L6314O899j4085J5098
4429A582656L1652n3811l433Q8348p376M7936l945k080L9952R355J7073O4056
4417A810383J1209O6997J09642J29097N8794O821O0230N5751J01141O2802L0265
4406B503132L160Q4371Q8160n978J25292J39498J04562L5914J11139J35765J04039
$$ plain form
4487 799339 843129 835638 784967 805490 772312 783175 787450 771265 822266 899901 878949 898638
4475 898638 940989 906949 897413 923893 878937 942675 1006669 1026437 1047533 1059680 1109154 1138347
4463 1138347 1165789 1247327 1267022 1280565 1335654 1315525 1397474 1420849 1394666 1356052 1370280
4452 1370280 1391686 1338055 1342436 1359974 1415062 1353335 1380955 1419673 1484574 1446035 1422153 1425270
4440 1425270 1411845 1350010 1459041 1491344 1537422 1454483 1538430 1574744 1581643 1567558 1582656
4429 1582656 1614308 1560497 1557064 1645412 1638036 1685972 1682027 1679947 1719899 1729254 1746327 1810383
4417 1810383 1821592 1888589 1998231 2127328 2186122 2192943 2253173 2308924 2410065 2472867 2503132
4406 2503132 2506292 2590663 2678823 2672845 2798137 2937635 3042197 3078111 3189250 3325015 3429054
4395C429054J39716K08606J69440K09968K06345J64920K07635K50280K70993K47080
4385E504037K92886K11034L48227L92045L35028L67052M12722M33760M31226N16653
4375I244670O17492O18126O24490N31210O14891N51338N87024N70906N82452O12628
4365A5155227P06922P38919Q85948R33247R29081R28688R16424P96175P23473
4356B2714104M73004M75687L19264M85531L87290N27795O31188N91230O64361
4347B7269454P68359O78667O53515N71295M00951R2062o2300k96012k32187l11004
4337B9532800k72926j40508m1872m124Q4650N0817Q4729P6271j10496l08025m18746
4326B8532570n58472o48981n89262n14141n03125l43656m13643k87037k50668
$$ plain form
4395 3429054 3568770 3777376 3946816 4156784 4363129 4528049 4735684 4985964 5256957 5504037
4385 5504037 5796923 6007957 6356184 6748229 7083257 7450309 7863031 8296791 8728017 9244670
4375 9244670 9862162 10480288 11104778 11635988 12250879 12802217 13389241 13960147 14542599 15155227
4365 15155227 15862149 16601068 17487016 18420263 19349344 20278032 21194456 21990631 22714104
4356 22714104 23187108 23662795 23982059 24467590 24854880 25382675 26013863 26605093 27269454
4347 27269454 28037813 28716480 29369995 29941290 30342241 30434303 30372003 30075991 29843804 29532800
4337 29532800 29259874 29119366 29077494 29073370 29158020 29208837 29293566 29369837 29259341 28951316 28532570
4326 28532570 27974098 27325117 26735855 26221714 25718589 25374933 24961290 24674253 24423585
4317B4423585j08389j29765K1378j60728j64292j72269j21328j99792j62074j40057
4307B3086269n4647m2379M6338L8530J48124J77655J56570J12246K11482K88395
4297B4168583K77144L60729L49077L11168L29865K89042M00008M57881M17258
4288B7360755L90416M81666N73981N25928O84594P83156P62447Q73417Q97578
4279C3333938Q06641P09678P31204Q37477Q85020P94276P09576Q21587Q21434
4270D0450831R05435R16345Q63117Q69202J006929R69159J104593J094696J231817
4261D9412124J372992J666902J789604K235466K564091L006785L350863L790514
4253F9189341L663777M145983M441969N058298N255263O748887Q132708J1044710
$$ plain form
4317 24423585 24315196 24185431 24206809 24046081 23881789 23709520 23588192 23388400 23226326 23086269
4307 23086269 23031622 22989243 23035581 23074111 23222235 23399890 23556460 23668706 23880188 24168583
4297 24168583 24445727 24806456 25155533 25466701 25796566 26085608 26485616 26943497 27360755
4288 27360755 27751171 28232837 28806818 29332746 30017340 30800496 31562943 32436360 33333938
4279 33333938 34140579 34850257 35581461 36418938 37303958 38098234 38807810 39629397 40450831
4270 40450831 41356266 42272611 43135728 44004930 45011859 45981018 47085611 48180307 49412124
4261 49412124 50785116 52452018 54241622 56477088 59041179 62047964 65398827 69189341
4253 69189341 72853118 76999101 81441070 86499368 91754631 98503518 106636226 117680936
4245A17680936J4068295J8435196K0604718K3078608K9231837M3554667M3946858
4238C10601115K0795912l3645911n9452770m2428197k9694652k0800251j6223085
4231A29152161j1591898r557339p574703p013612n432843n119988m308405m245058
4223G4308315l838279l755024l031416k773449k336954k495069k233416k294039
4215E1550669k005602k062838j846705j904770j598569j551468j312217j325280
4207C7943220j218543j345894j162816j288040j070884j095758q84225q97122
4199B8979938q67593q14512q06017p86173n70995o19074n39464o20192n91556
4190B2764362n40755m54261m93094l91115m09417l46176k87904k76804l77826
$$ plain form
4245 117680936 131749231 150184427 170789145 193867753 223099590 266654257 310601115
4238 310601115 331397027 297751116 238298346 195870149 166175497 145375246 129152161
4231 129152161 117560263 108002924 100428221 93414609 87981766 82861778 78553373 74308315
4223 74308315 70470036 66715012 63683596 60910147 58573193 56078124 53844708 51550669
4215 51550669 49545067 47482229 45635524 43730754 42132185 40580717 39268500 37943220
4207 37943220 36724677 35378783 34215967 32927927 31857043 30761285 29877060 28979938
4199 28979938 28112345 27297833 26491816 25705643 25134648 24515574 23976110 23355918 22764362
4190 22764362 22223607 21769346 21276252 20885137 20475720 20129544 19841640 19564836 19187010
4181A9187010k57812k28295k02697k24154k08950l18101l31222k00532j51609
4172A7063638k54890l88123l24750k85638k79958l13215l08155l23049k87299
4163A4298561k27347k58877k49936k21482k46573k69794k78292k52410k91898
4154A2001952k53118j30069j35075j88744j06330j13272j17598j46367n9637j13686
4144A0638056o0229j11364j21713l1572k7549j00838n1478r3620j5754p3024J674
4133I952589j3301K1236p509M8514j4593L5235P3337J32249J29946M6921O8512
4122A0473136Q1329R9135J1366Q1635R4148Q1254K05646J41240K40936R4948K46396
4111A1851169K59197R7043J20442K38585K29297K58208J33799J59729J14394J69708
$$ plain form
4181 19187010 18929198 18700903 18498206 18274052 18065102 17747001 17415779 17215247 17063638
4172 17063638 16808748 16420625 16095875 15810237 15530279 15217064 14908909 14585860 14298561
4163 14298561 14071214 13812337 13562401 13340919 13094346 12824552 12546260 12293850 12001952
4154 12001952 11748834 11618765 11483690 11294946 11188616 11075344 10957746 10811379 10751742 10638056
4144 10638056 10577827 10466463 10344750 10313178 10285629 10184791 10133313 10039693 10023939 9950915 9952589
4133 9952589 9939288 9960524 9953015 10001529 9986936 10022171 10095508 10227757 10357703 10404624 10473136
4122 10473136 10554465 10653600 10664966 10746601 10840749 10922003 11127649 11268889 11509825 11604773 11851169
4111 11851169 12110366 12207409 12327851 12566436 12795733 13053941 13187740 13347469 13461863 13631571
4101A3631571J18086J63316M9196O6022R4856P8481R9447J41835J71444J93387
4091A4807641J80768J94235K09753K09664J89873J97859Q6478J15168J97030K52613
4081A6641082J36436J94128K19162L23065K39086K59007L60357L87755L67673
4072A9127751L04552M80482M14699L75665M72277M13759M70538M31754M23222
4063B2914699M41374N65478N36317M01087M21508L76802L22624K86336L25249
4054B6591474K68455J75499J51715J78501J98685L06262L12391L20423L02457
4045B8805862L44991L55082L67358M56670L47197M37063N17952N32850N31199
4036C2696224O00449N73791O23866N46325N17945M99599M92451M84461L64811
$$ plain form
4101 13631571 13749657 13912973 13962169 14028191 14123047 14201528 14300975 14442810 14614254 14807641
4091 14807641 14988409 15182644 15392397 15602061 15791934 15989793 16076271 16191439 16388469 16641082
4081 16641082 16777518 16971646 17190808 17513873 17752959 18011966 18372323 18760078 19127751
4072 19127751 19432303 19912785 20327484 20703149 21175426 21589185 22059723 22491477 22914699
4063 22914699 23356073 23921551 24457868 24858955 25280463 25657265 25979889 26266225 26591474
4054 26591474 26859929 27035428 27187143 27365644 27564329 27870591 28182982 28503405 28805862
4045 28805862 29150853 29505935 29873293 30329963 30677160 31114223 31632175 32165025 32696224
4036 32696224 33296673 33870464 34494330 35040655 35558600 36058199 36550650 37035111 37399922
4027C7399922K82861K57643K63444J46792J59105J32245P6934l093O2569O2621
4017C8841043J20594J93887J28209N1913J05671J30349J28306N8826J01785J38949
4007C9999532J77070J67786K33846K54993K34856K29411J90211J52111J85205
3998D1825021J49464K23361K55127K58141J53572K28415K60701L49099L28509
3989D4031410K74656L41477M56164N26032O17760O11477P89595R16024J047691
3980D9612286J147394J380497J485674J620169J755675K008003K216439K263468
3972F3489605K441264K442964K432508K144981J768796J439337J064618P26371
3964G7950444L50640M6171j01633j73808l39964k28889j53835l2492j3444m4233
$$ plain form
4027 37399922 37682783 37940426 38203870 38350662 38509767 38642012 38718946 38715853 38778422 38841043
4017 38841043 38961637 39155524 39283733 39335646 39441317 39571666 39699972 39758798 39860583 39999532
4007 39999532 40176602 40344388 40578234 40833227 41068083 41297494 41487705 41639816 41825021
3998 41825021 41974485 42197846 42452973 42711114 42864686 43093101 43353802 43702901 44031410
3989 44031410 44306066 44647543 45103707 45629739 46247499 46858976 47648571 48564595 49612286
3980 49612286 50759680 52140177 53625851 55246020 57001695 59009698 61226137 63489605
3972 63489605 65930869 68373833 70806341 72951322 74720118 76159455 77224073 77950444
3964 77950444 78301084 78347255 78245622 78071814 77731850 77502961 77349126 77316634 77303190 77258957
3954G7258957k52529m22938p51619j182513j624296j957930k448192k632602k870935
3945F3115403l087420l014015k953718k805067k585825k438183k185878k034777
3937D2010520j916896j758068j625310j444185j310928j212403j292565j160513
3929C0289652j147454j065892r40545q15055q04324p42007p49493o04660n77130
3920B2843092n74099n19378m93214n86800m04734l94342m38871m14094m18315
3911A8599245m32095l72935m12550k76260l39258l48140l30897l23600k44378
3902A5519132k34039j61358k51627k24730k27528k19357j01181j40633j97540
3893A3761139k17471m3807p2976j58020j3394L554L386N1538L4548p0390j6784
$$ plain form
3954 77258957 77006428 76583490 75831871 74649358 73025062 71067132 68618940 65986338 63115403
3945 63115403 60027983 57013968 54060250 51255183 48669358 46231175 44045297 42010520
3937 42010520 40093624 38335556 36710246 35266061 33955133 32742730 31450165 30289652
3929 30289652 29142198 28076306 27135761 26320706 25516382 24774375 24024882 23420222 22843092
3920 22843092 22268993 21749615 21256401 20669601 20264867 19870525 19431654 19017560 18599245
3911 18599245 18167150 17794215 17381665 17105405 16766147 16418007 16087110 15763510 15519132
3902 15519132 15285093 15123735 14872108 14647378 14419850 14200493 14099312 13958679 13761139
3893 13761139 13543668 13499861 13426885 13268865 13255471 13259025 13262411 13313949 13348497 13278107 13261323
3882A3261323O4160N604J3027R2739R6851J18567M9831R3552J61956J13646J13935
3871A4185191M976J33235J07192M4379k7672o1645o1938r3767q1451m9672j17018
3860A3981810q0739M57O9195N9146N1705k4377J1152P2040J64055J41653N1034
3849A4497131J41296J32881J86066J40025K60044L25293K29992K55956K85194
3840A6453878L46305M55725M62035L81689M49579N21893N87244O44843P19129
3831B1022320Q43420R02499J052831J090704J166435J280100J419246J550167
3823C0327722J473567J525552J693064J634881J548273J455099J347483J225279
3815D2230920R74618P28286M66231J81954R0086O411j09990j73408j67453j03661
$$ plain form
3882 13261323 13325483 13331087 13344114 13436853 13533704 13652271 13702102 13795654 13957610 14071256 14185191
3871 14185191 14190167 14323402 14430594 14474973 14447301 14385656 14323718 14229951 14148500 14098828 13981810
3860 13981810 13901071 13901528 13970723 14029869 14081574 14057197 14068349 14140389 14304444 14446097 14497131
3849 14497131 14638427 14771308 14957374 15097399 15357443 15682736 15912728 16168684 16453878
3840 16453878 16800183 17255908 17717943 18099632 18549211 19071104 19658348 20303191 21022320
3831 21022320 21865740 22768239 23821070 24911774 26078209 27358309 28777555 30327722
3823 30327722 31801289 33326841 35019905 36654786 38203059 39658158 41005641 42230920
3815 42230920 43205538 43933824 44400055 44582009 44672095 44678506 44568516 44395108 44227655 44123994
3805D4123994j12672k74892n35893p13257o74885n48233m28370m15032l92647
3796D0028113l75160l82512m09850l81294l67453l41690j91109j73780j10957
3787C7294308J4072K23233L50992M30284O81664P88563R20482J223702J560732
3778D3488032J740437J958955K280996K658694K948129L347178L791084M238368
3770F6451873M541299M968132N269020N353801N442441N388525N194603M849229
3762A07458923M379502L809692L158478K590455J961409J294947P14294J85407
3754A25553107l55773p47863j235744j678622j905471k261652k569815k843204
3746A11954963l132878l429919l739824m006028m180511m324594m440936m504128
$$ plain form
3805 44123994 44011322 43736430 43200537 42487280 41812395 41264162 40835792 40420760 40028113
3796 40028113 39652953 39270441 38860591 38479297 38111844 37770154 37579045 37405265 37294308
3787 37294308 37308380 37531613 37882605 38312889 38994553 39783116 40703598 41927300 43488032
3778 43488032 45228469 47187424 49468420 52127114 55075243 58422421 62213505 66451873
3770 66451873 70993172 75961304 81230324 86584125 92026566 97415091 102609694 107458923
3762 107458923 111838425 115648117 118806595 121397050 123358459 124653406 125367700 125553107
3754 125553107 125197334 124449471 123213727 121535105 119629634 117367982 114798167 111954963
3746 111954963 108822085 105392166 101652342 97646314 93465803 89141209 84700273 80196145
3738H0196145m460067m275431m046199m002666l668749l466266l306687l025696
3730D9944384k787844k495732k336660k111834j898939j830100j697684j566850
3722C3218741j406643j284724j125998j079025j010978q59145p81817p04150o24404
3713B4341857n23478n56037l94666m01591l16450l10072j81500r7855j15878r9044
3703B1345286K4429R8699J2306J05293J43047J25343O9215L5401m1331J5610j25321
3692B1807977k78876l06730k88015l84690m40923m86678n70365m99416o15171
3683A7937113n91631m99621o00277m85924m90954n86767n06236m75489m03596
3674A3296618m54582m37666l71601l47656l32840l48187l22428k46459k57509
$$ plain form
3738 80196145 75736078 71460647 67414448 63411782 59743033 56276767 52970080 49944384
3730 49944384 47156540 44660808 42324148 40212314 38313375 36483275 34785591 33218741
3722 33218741 31812098 30527374 29401376 28322351 27311373 26452228 25670411 24966261 24341857
3713 24341857 23818379 23262342 22867676 22466085 22149635 21839563 21658063 21560208 21444330 21345286
3703 21345286 21369715 21468414 21480720 21586013 21729060 21854403 21923618 21959019 21917688 21933298 21807977
3692 21807977 21529101 21222371 20934356 20549666 20108743 19622065 19051700 18552284 17937113
3683 17937113 17345482 16845861 16245584 15759660 15268706 14681939 14175703 13700214 13296618
3674 13296618 12842036 12404370 12032769 11685113 11352273 11004086 10681658 10435199 10177690
3665A0177690l10353k32082j42587j42077j78407j94588k03806j14779j46638
3656H512373j11034j03449j21768p3447k8630j28330m0626r1230K1685m9447L8897
3645G824994q637r7502p8417m8616n4016m1768j10965j26552o8601q3433J4392
3634G120879r2310o7115q3954o6256K5518n1884j26220M386m2795O8876J464L604
3622F694193N3765j9232o6846R7662J3003l7785J0302L4423P1617P6128j5354
3611F911876R9628K1152N6737J02257J05227P3168J37784J15957O2950J31217
3601G817953J52214J55366J50718K51922K33842K27680L70910M17686M02756M26533
3591A0607580M28186N22734N39280N01477M98190M83043L62269M29126L52146
$$ plain form
3665 10177690 9867337 9635255 9492668 9350591 9172184 8977596 8773790 8659011 8512373
3656 8512373 8401339 8297890 8176122 8102675 8074045 7945715 7905089 7813859 7835544 7786097 7824994
3645 7824994 7816357 7718855 7640438 7591822 7537806 7496038 7385073 7258521 7189920 7106487 7120879
3634 7120879 7028569 6961454 6877500 6811244 6836762 6784878 6658658 6663044 6620249 6689125 6690589 6694193
3622 6694193 6747958 6728726 6661880 6759542 6772545 6734760 6745062 6779485 6851102 6927230 6911876
3611 6911876 7011504 7032656 7089393 7191650 7296877 7370045 7507829 7623786 7686736 7817953
3601 7817953 7970167 8125533 8276251 8528173 8762015 8989695 9360605 9778291 10181047 10607580
3591 10607580 11035766 11558500 12097780 12599257 13097447 13580490 13942759 14371885 14724031
3582A4724031K37976K34328K03298J54250K21036K57444K86927J55827K69179
3573A6744296K40887K16922J83196P7970N9195l9020j19542n9362k5405r5492
3563A7183645j05242p3297j6348M4585R3829J46070K33336L01000K90997L52071
3553A8450646L60120M63785N30195O66817P45333Q70418R12236J106985J257859
3544B5364394J295689J576058J761617J973234K158799K454055K719444L061478
3536D2364768L347264L722911M042385M356425M646503M800183M904329M895494
3528G7080262M773858M665470M443033M159360L865371L725173L698337L624271
3520A10035135L553238L568244L496191L326534K943211K430719J660521R69916
$$ plain form
3582 14724031 14962007 15196335 15399633 15553883 15774919 16032363 16319290 16475117 16744296
3573 16744296 16985183 17202105 17385301 17463271 17522466 17483446 17363904 17304542 17279137 17183645
3563 17183645 17078403 17005106 16988758 17033343 17127172 17273242 17506578 17807578 18098575 18450646
3553 18450646 18810766 19274551 19804746 20471563 21216896 22087314 22999550 24106535 25364394
3544 25364394 26660083 28236141 29997758 31970992 34129791 36583846 39303290 42364768
3536 42364768 45712032 49434943 53477328 57833753 62480256 67280439 72184768 77080262
3528 77080262 81854120 86519590 90962623 95121983 98987354 102712527 106410864 110035135
3520 110035135 113588373 117156617 120652808 123979342 126922553 129353272 131013793 131983709
3512A31983709J57104o96101j433799k015215k308629k693021k830364l033930
3504A17129754l051337l057549l220312l401627l526334l788746l939863m243508
3496H8900478m336501m326526m258998m201731l954455l748523l438300l123492
3488E7511952k814507k540003k280934k036575j722851j451834j388002j166048
3480D2111198j060640q42545p34735o29899m98016l74465l41547k06833j38735
3471C7283783l3902O2511K6384Q4672J80919K16763M33119N26156N89795P27497
3461D0097697J007274J176625J466529J792412K021981K500860L051547K641651
3453E5756576Q77363j286998j917937j136221k20227j36913r38280k448502l092460
$$ plain form
3512 131983709 132140813 131444712 130010913 127995698 125687069 122994048 120163684 117129754
3504 117129754 114078417 111020868 107800556 104398929 100872595 97083849 93143986 88900478
3496 88900478 84563977 80237451 75978453 71776722 67822267 64073744 60635444 57511952
3488 57511952 54697445 52157442 49876508 47839933 46117082 44665248 43277246 42111198
3480 42111198 41050558 40208013 39473278 38843379 38345363 37970898 37629351 37422518 37283783
3471 37283783 37249881 37312392 37338776 37423448 37604367 37821130 38254249 38780405 39370200 40097697
3461 40097697 41104971 42281596 43748125 45540537 47562518 50063378 53114925 55756576
3453 55756576 56633939 55346941 53429004 52292783 52072556 51935643 50997363 48548861 45456401
3444D5456401k774525k233754j778453j465452j251206j015580j003493p47285
3436C3186653n07207m00857j16982Q0221M10797P54948J102203J377274J945322
3427C7832372K654744K775195J791389m33637j804017j127106j40432K27355k02984
3418D1572879j483248k730817k669224k282807j741430j428254j102312j041663
3410B7093124r09898p15470o02929m96289m68475m06732l74679k82275k17263
3401B2619114j74838n4681n9691k4004l0707J6281O2936P0954N8986O9690R9785
3390B2653825J43655K03525K73074L68464L89128O14769O39854P60434R99801
3381B7046529J119811J243194J434780J573177J790978J952654K146006K324915
$$ plain form
3444 45456401 42681876 40448122 38669669 37204217 35953011 34937431 33933938 33186653
3436 33186653 32679446 32278589 32161607 32241828 32652625 33407573 34509776 35887050 37832372
3427 37832372 40487116 43262311 45053700 44620063 42816046 41688940 41548508 41775863 41572879
3418 41572879 40089631 37358814 34689590 32406783 30665353 29237099 28134787 27093124
3410 27093124 26183226 25467756 24864827 24368538 23900063 23493331 23118652 22836377 22619114
3401 22619114 22444276 22389595 22329904 22305900 22275193 22291474 22354410 22425364 22484350 22554040 22653825
3390 22653825 22797480 23001005 23274079 23642543 24031671 24646440 25286294 26046728 27046529
3381 27046529 28166340 29409534 30844314 32417491 34208469 36161123 38307129 40632044
3373D0632044K606852L068137L513883L961184M383634M816375N290328N516270
3365G3788707N652477N615569N223582M638839L581799K439565J075556l42539
3357A01673555j558356k718122l788366m417263m863628m828458m683123m446199
3349G0370040l998352l639284l196524k695688k216765j964981j714263j560292
3341D9383891j416085j139887r89751p88801r27472j389634j752042j821572j617010
3332C7541637j354660j108320r72794q80568p47183n55046m37945m16996k52156
3323C0815969j76226j25699j0708J61708L72697N75404O59822R53224J080526
3314C4306717Q40516O82834P29959R40185L89638j261837k906772l079968k538330
$$ plain form
3373 40632044 43238896 46307033 49820916 53782100 58165734 62982109 68272437 73788707
3365 73788707 79441184 85056753 90280335 94919174 98500973 100940538 102016094 101673555
3357 101673555 100115199 97397077 93608711 89191448 84327820 79499362 74816239 70370040
3349 70370040 66371688 62732404 59535880 56840192 54623427 52658446 50944183 49383891
3341 49383891 47967806 46827919 45838168 45049367 44121895 42732261 40980219 39158647 37541637
3332 37541637 36186977 35078657 34105863 33225295 32478112 31923066 31485121 31068125 30815969
3323 30815969 30639743 30514044 30503336 30665044 31037741 31613145 32272967 33226191 34306717
3314 34306717 35147233 35830067 36560026 37500211 37889849 36628012 33721240 30641272 28102942
3305B8102942k059097j605535j231096j067497q36801o70951n13501n01460m39451
3296A9177553l43291j95713j42119j03677O8885J93360L72817O05062P53578R29316
3286B1315771P70564M74740O13090N54196j7933j497739k319234j950965j521483
3277A6421007j108737q98193o97649o16359m95174m40753l54942l50797l45246
3268A1113157l10091k90751k64722k45995k14081k20699j45826j89479l44427
3259H887086k57588j48388j27607j86602k44398j28786j73338j50366j84672k44692
3249G040649q8499n9486q6308j22695j09712J7126j09217p9462p2762q8966n5849
3238F184819p8058o9222p0757j9247p1496q0068r364l8958M2799L0355p9028l605
$$ plain form
3305 28102942 26043845 24438310 23207214 22139717 21302916 20631965 20118464 19617004 19177553
3296 19177553 18834262 18638549 18496430 18392753 18461638 18654998 19027815 19632877 20386455 21315771
3286 21315771 22086335 22561075 23174165 23728361 23710428 22212689 19893455 17942490 16421007
3277 16421007 15312270 14414077 13716428 13100069 12604895 12164142 11809200 11458403 11113157
3268 11113157 10803066 10512315 10247593 10001598 9787517 9566818 9420992 9231513 8887086
3259 8887086 8629498 8481110 8353503 8166901 7922503 7793717 7620379 7470013 7285341 7040649
3249 7040649 6952150 6892664 6806356 6683661 6573949 6591075 6481858 6402396 6329634 6240668 6184819
3238 6184819 6106761 6037539 5966782 5947535 5876039 5795971 5786607 5747649 5790448 5820803 5741775 5738170
3226E738170L1459M377N7938n947n836q2484R4l6095q1056N0670K4103r934J6608
3213E702067q2718q9905l2601j2217J09105m7397K3930l085O4801L3406o2296
3202E603090M132m7907N0010M2646l4674m0096j4413o4577J818K084J6457M9742
3190E568312P0466N8926K5198l6781Q472M9673p3984L9702K7318M0053j0471k3491
3178E743393R3943J28004J11982J03568Q2945J41691R2414J28068J57726J65937
3168F949671J20631J22507K03148J57933J35900O9429J08954J17207J70733K19580
3158H375693J62947J76674J94138K35479K69220K75484L01966L52625L38117L04383
3148A0986726L20508L93212M08532M07106M49988N18556M98411O44420O91336
$$ plain form
3226 5738170 5769629 5774006 5831944 5825997 5820161 5737677 5737771 5701676 5620620 5671290 5695393 5685459 5702067
3213 5702067 5619349 5529444 5496843 5484626 5593731 5546334 5570264 5567179 5631980 5665386 5603090
3202 5603090 5607222 5559315 5609325 5651971 5617297 5577201 5562788 5498211 5500029 5502113 5518570 5568312
3190 5568312 5638778 5697704 5722902 5686121 5694593 5744266 5670282 5709984 5737302 5777355 5766884 5743393
3178 5743393 5837336 5965340 6077322 6180890 6263835 6405526 6497940 6626008 6783734 6949671
3168 6949671 7070302 7192809 7395957 7553890 7689790 7759219 7868173 7985380 8156113 8375693
3158 8375693 8538640 8715314 8909452 9144931 9414151 9689635 9991601 10344226 10682343 10986726
3148 10986726 11307234 11700446 12108978 12516084 12966072 13484628 13983039 14627459 15318795
3139A5318795O76493P89878Q31002Q54244Q88660Q70652Q20247Q63974R40260
3130B2854205R92496J034656J145120J238751J461245J601631J568921J737781
3122C3634806J961919J940478K153152K488791K789135L004805L412779L963597
3114E5349462M514185N105378N754252O314215P062185P851739Q707215R827419
3106A10486050J1128009J2672445J4642779J7169968K0188266K3457532K6545606
3099B36290655K9355431L1371426L0621606K4042804R778838r137599k4929606
3092C27393555l2323630l2207571k8584602k4100428j9807043j6362207j3664479
3085A60343595j1758339j0218802r070144q131118p291480o367883n539771m684794
$$ plain form
3139 15318795 15995288 16785166 17616168 18470412 19359072 20229724 21049971 21913945 22854205
3130 22854205 23846701 24881357 26026477 27265228 28726473 30328104 31897025 33634806
3122 33634806 35596725 37537203 39690355 42179146 44968281 47973086 51385865 55349462
3114 55349462 59863647 64969025 70723277 77037492 84099677 91951416 100658631 110486050
3106 110486050 121614059 134286504 148929283 166099251 186287517 209745049 236290655
3099 236290655 265646086 297017512 327639118 351681922 361460760 352323161 327393555
3092 327393555 295069925 262862354 234277752 210177324 190370281 174008074 160343595
3085 160343595 148585256 138366454 129296310 121165192 113873712 107505829 101966058 97281264
3077I7281264l887587l368619k940539k454267k115255k002648j961831j948920
3069G6601598k028521k034862j966800j962807j788861j585987j354370j037129
3061F2842261p34938m18696q6533K74212P92659J082202J435349J806936K222314
3052F9215766K401711K403093K174761J620924O04236p97696k129755l284822
3044G2208218l861860m081129l985023l675011l326450l107604k748816k418752
3036D5003573k214696k009964j818653j602344j532411j339110j104684r09267
3028C2472444r55824q94113r94964r25961j051393j179851j186064j152411j042603
3019B3089260q83279q10363p65088o52123p03446n90438n96732n78826n14122
$$ plain form
3077 97281264 93393677 90025058 87084519 84630252 82514997 80512349 78550518 76601598
3069 76601598 74573077 72538215 70571415 68608608 66819747 65233760 63879390 62842261
3061 62842261 62107323 61688627 61602094 61876306 62668965 63751167 65186516 66993452 69215766
3052 69215766 71617477 74020570 76195331 77816255 78420491 77622795 75493040 72208218
3044 72208218 68346358 64265229 60280206 56605195 53278745 50171141 47422325 45003573
3036 45003573 42788877 40778913 38960260 37357916 35825505 34486395 33381711 32472444
3028 32472444 31516620 30622507 29627543 28701582 27650189 26470338 25284274 24131863 23089260
3019 23089260 22205981 21395618 20630530 19978407 19274961 18684523 18087791 17508965 16994843
3010A6994843m96868m54008m94084n01213m30122l70721l56845m17001k86167
3001A3187814l72945k81188k14016l90808k28071l11964k75495k09037k59814
2992A0644476k74950j94860j14926k11487j91129k54375j01689j31687k07110
2983H962263j22592m8575j22362j84663j50343j24593q2424j31380k13957o4656
2973G716718l8687q8308r4541j16809j83057j35641J0392k9677m1308j77545j48690
2962F672847j10242m171n9060q9635j29352j64560r6663r7145j26341q2096p9646
2951E633936o9677J7988o2768q4924o4585p0706j2693j15997o7694o1427j51839
2940D889614p2627j9100n6502j9677j25057j45341m6456o6303J0250n9635l3178
$$ plain form
3010 16994843 16497975 16043967 15549883 15048670 14618548 14247827 13890982 13473981 13187814
3001 13187814 12814869 12533681 12319665 11928857 11700786 11388822 11113327 10904290 10644476
2992 10644476 10369526 10174666 10059740 9848253 9657124 9402749 9301060 9169373 8962263
2983 8962263 8839671 8791096 8668734 8484071 8333728 8209135 8126711 7995331 7781374 7716718
2973 7716718 7678031 7589723 7495182 7378373 7195316 7059675 7070067 7040390 6999082 6821537 6672847
2962 6672847 6562605 6558434 6499374 6409739 6280387 6115827 6019164 5922019 5795678 5713582 5633936
2951 5633936 5564259 5582247 5519479 5434555 5369970 5299264 5286571 5170574 5102880 5041453 4889614
2940 4889614 4816987 4797887 4741385 4721708 4596651 4451310 4404854 4338551 4348801 4289166 4255988
2929D255988m1411p4487j09382j17313R445J3879m6527n1463p7229m8408K2077
2918C735169j7946o1013o9739l6567m4982q6274K1370k3414q2691O907J9993p3394
2906C287419j42170l9811j087m5153j4349j4070o3202n1215n8262q2424M1963
2895B817639m1247r2905k497n0673k9563r633j9457p5092j06239K4723K335q0711
2883B336680o7501o9560m3903l4564q8105j09540j6120P923R597j9987M2636K4072
2871A971628J28350k0843l2658j0506m3188M2l074L7046l4125J2367L0684K0576
2859B056299r3549j5739k518P3497K6796q0202m1596J2856r5314r117M5844L9848
2847A917105M838K4994m4732M8056K4267m3420R651o6925r8700O4706K166j5902
$$ plain form
2929 4255988 4214577 4140090 4030708 3913395 3922840 3936719 3890192 3838729 3761500 3713092 3735169
2918 3735169 3717223 3656210 3586471 3549904 3504922 3418648 3440018 3416604 3333913 3340820 3360813 3287419
2906 3287419 3145249 3105438 3104351 3059198 3044849 3030779 2967577 2916362 2858100 2775676 2817639
2895 2817639 2776392 2683487 2680990 2630317 2600754 2591121 2571664 2496572 2390333 2415056 2417391 2336680
2883 2336680 2269179 2199619 2155716 2121152 2033047 1923507 1907387 1915310 1924907 1904920 1947556 1971628
2871 1971628 2099978 2079135 2046477 2035971 1992783 1992825 1989751 2026797 1992672 2005039 2035723 2056299
2859 2056299 1962750 1947011 1944493 2017990 2044786 1964584 1922988 1935844 1840530 1831413 1877257 1917105
2847 1917105 1921943 1946937 1902205 1950261 1974528 1931108 1940759 1873834 1775134 1839840 1842006 1826104
2835A826104J8795O4829k2545K9855K5355l6070M804K0215M3304L9614L6926J2072
2823B063258j4167R5907R9854L3009O3977N4024O4057J01777J76203K04468P7663
2812C020030R8834J83358L9055m2010j39231j30433k00938j53966j54645p9201
2802B440853l0021q2247j09559l1467o4524j1010J5777j12863j13018o828j8150
2791A876943n7390q2060N9815l8066n4760Q0965q0124m9337m6867K9286k3586
2780A614819p6262K861o8682o644Q2676O6408L445K5200p4010k7032k2536j8869
2768A501374j1871O1194J259L8526l8806j5293K9640j6402r2320l3130P573J4379
2756A446123m3515o387M7566n5776j7029m7830m6604l3538K876P2912m5662N9067
$$ plain form
2835 1826104 1844899 1909728 1887183 1917038 1942393 1906323 1911127 1931342 1974646 2014260 2051186 2063258
2823 2063258 2049091 2144998 2244852 2277861 2341838 2395862 2459919 2561696 2737899 2942367 3020030
2812 3020030 3118864 3302222 3341277 3299267 3160036 3029603 2828665 2674699 2520054 2440853
2802 2440853 2410832 2328585 2219026 2187559 2123035 2112025 2127802 2014939 1901921 1895093 1876943
2791 1876943 1819553 1737493 1797308 1759242 1704482 1785447 1705323 1655986 1609119 1638405 1614819
2780 1614819 1538557 1541418 1472736 1466092 1548768 1615176 1618621 1643821 1569811 1542779 1520243 1501374
2768 1501374 1489503 1550697 1551956 1590482 1551676 1536383 1566023 1549621 1457301 1424171 1431744 1446123
2756 1446123 1402608 1396221 1443787 1388011 1370982 1323152 1276548 1243010 1245886 1318798 1273136 1332203
2744A332203J0241l8510p4957m3006M3102p7964j06525M5709J3483M0393l0248
2733A113921n8513p6608O6795K7400l7529l515k5861K4417o6288J5104j1925m7448
2721I19950O5793M7355n8268J0250o8749P4375l8736n089K971j5198k974k6760
2709I04920k6681O753j3720r40L4750J1316m4804l8081K5756N898j5518j7021
2697H32628o878j9191M5103M1310j04009L072k1565N446n192k9756J4604k2666
2685G32906k7754j0701l4016O5661N0758l4166n988K0812K7130N597j9457k3550
2673G47232k1114K2020r188O679M072N2819o7313j9958o4312l4271O2164K3092
2661G01922o9669N5606Q6216o101j6578o1843l0654M966j0207K660J2033M6757
$$ plain form
2744 1332203 1342444 1303934 1228977 1185971 1229073 1151109 1044584 1090293 1103776 1144169 1113921
2733 1113921 1055408 978800 1045595 1072995 1035466 1031951 1006090 1030507 964219 979323 967398 919950
2721 919950 985743 1033098 974830 985080 916331 990706 951970 946881 949852 934654 931680 904920
2709 904920 878239 884992 871272 870332 905082 916398 871594 833513 859269 865167 849649 832628
2697 832628 825750 806559 851662 892972 788963 792035 770470 775916 770724 740968 755572 732906
2685 732906 705152 694451 660435 726096 776854 742688 736700 757512 784642 790239 770782 747232
2673 747232 726118 748138 738950 745629 749701 802520 735207 715249 650937 616666 678830 701922
2661 701922 632253 687859 774075 767974 751396 689553 658899 663865 653658 656318 668351 715108
2649G15108k7818l3635M3150q1423m064K94M501r468m4218r084J029J1737J9051
2636E85160J0639j8614M0986J6236p0173l273M4779j9040L2693M3418P9987n515
2624G37283p2618n4560j1213J3010p8979K0665O47Q2292L0917M0525l2398n8559
2612F17012N2639M4145J1155m1404l0152N452q2861l4917l5902L2902M0749r87
2600E77831O330k6036l2881q625j6786L0071m9391q84o678m870j6251o0050M2944
2587D34724M7364k1524J5584L7940k0434O7236M3622m1743j1755o0374l2372o5564
2575C92704R502O6330R636M5382K2353j184p2155k8864M6132j3030l2854J1732
2563D55684N6951o3937k4521O9796j5893j996K8766N2097j00765j798O2250M1089
$$ plain form
2649 715108 687290 653655 696805 615382 611318 611612 616113 606645 562427 553343 554372 566109 585160
2636 585160 595799 577185 618171 634407 564234 560961 605740 586700 619393 662811 742798 737283
2624 737283 664665 610105 598892 611902 532923 553588 554235 636527 667444 707969 675571 617012
2612 617012 669651 713796 724951 683547 653395 658847 575986 541069 505167 538069 578818 577831
2600 577831 584161 558125 525244 516619 499833 529904 480513 479629 472951 468081 451830 391780 434724
2587 434724 482088 460564 476148 514088 493654 560890 604512 562769 551014 490640 458268 392704
2575 392704 402206 468536 478172 523554 545907 544723 472568 443704 489836 476806 443952 455684
2563 455684 512635 448698 424177 493973 478080 476084 504850 556947 456182 454384 516634 557723
2551E57723K97k4327l9460m5001k8635J0K7488k110M1929O416J4591o0933M644
2538D52632k0050r348q624L2857K3589m7099n8317j4860J40856J8240l1502R2196
2526E70570q0936l1350Q0311K5114K8472O75k4755K9466n6473n1350K945L7182
2514E29871J0696p5343q6117p4020R4238R8784o108L9281J6183n0939n9454K0613
2502D57685P028r9610M7346R3139N5132j10820m2450n0026M8604N9607O627o151
2490D66111k8105P0867K9882j07566n3035J1391k53J1207O9303k6462o0786O395
2478C88949O5916l0213N600O344k3053k4421N0356K375j37729P6358K3938m2625
2466C61795R494L0138m7543m1431O6430Q9812o9181n5625q7315P0101j4613n7448
$$ plain form
2551 557723 558020 533693 494233 449232 420597 420607 448095 445985 487914 494330 508921 447988 452632
2538 452632 432582 423234 414610 447467 471056 423957 365640 350780 491636 509876 478374 570570
2526 570570 489634 458284 538595 563709 592181 592856 568101 597567 541094 489744 492689 529871
2514 529871 540567 465224 379107 305087 399325 498109 492001 531282 547465 496526 437072 457685
2502 457685 464713 365103 412449 505588 560720 449900 407450 357424 406028 465635 472262 466111
2490 466111 438006 508873 538755 431189 378154 389545 389292 400499 469802 443340 382554 388949
2478 388949 454865 424652 430252 436596 413543 389122 439478 441853 304124 380482 404420 361795
2466 361795 371289 401427 353884 312453 378883 468695 399514 343889 256574 326675 312062 254614
2454B54614Q4239K1130m0566K2403J1062k809L2534r288J642J0752k3389p1019
2442B91305L9204m8086j7363J06675k2655m404k2653J0801K8517p4516L4056j376
2430C19505K2601M8320q935q3526J1460O9198k2228k4541N9562m7784k4111L1621
2418C51142j7944k3669J9364j8838j0789M806n1968k9842L4160P310J4915L6355
2406C15002k200k7712k305j7789K8146L2198O4958p8884p6922K1436J1919Q0547
2394C48394L8280m1804j23450J8272M4973K5942Q7066J9840k3935l8338j8261
2383C36979Q598l4944O4788o859k4640k4522l8995N4080J6571j3029m4735J0458
2371C03750j034N2472K7067k4117j3116j669R1670K7907q8819o264M8844j6828
$$ plain form
2454 254614 338853 359983 319417 341820 352882 350073 382607 373319 374961 385713 362324 291305
2442 291305 330509 282423 265060 371735 349080 344676 322023 332824 361341 286825 320881 319505
2430 319505 342106 390426 381491 297965 309425 378623 356395 331854 391416 343632 319521 351142
2418 351142 333198 309529 328893 310055 299266 304072 252104 222262 256422 263732 278647 315002
2406 315002 312802 285090 282785 264996 293142 325340 390298 311414 234492 255928 267847 348394
2394 348394 386674 344870 221420 239692 284665 310607 397673 417513 393578 355240 336979
2383 336979 345577 310633 375421 368562 343922 319400 280405 334485 351056 338027 293292 303750
2371 303750 302716 355188 382255 358138 345022 343353 435023 462930 374111 367847 416691 399863
2359C99863M229J9228q0021n4620N0181J2933J5324j9039n1613n7289P9045M1764
2347C59985m5441l0934K7485r937p8l8919L8048l3758J8068L3413k5504k4076
2335B68352J01732L1053n137j6449R923M0690l7398M1747o11q0806M7274P5027
2323D75397m1512k1174k5477K1292l5876J9055M4889L3002m529o6033j0072P9046
2311D68008K8836l2896M1418N0036j5562r4723k3451L4404O4668J060n1714O6767
2299E36851J3555L9802r823p086L2876J2989L1881M1519M0442N8950j886J5916
2287H05986J48534R2958P447J1945Q9306R2171M7405N3265J18321P6070O7880
2276A611288K29448K50509J04722K15900K61138L63653K51085K21291K54400L63669
$$ plain form
2359 399863 404092 423320 343299 288679 338860 351793 367117 348078 296465 239176 318221 359985
2347 359985 314544 283610 311095 301158 301080 262161 300209 266451 284519 317932 292428 268352
2335 268352 370084 401137 396000 379551 389474 430164 392766 434513 433902 353096 400370 475397
2323 475397 433885 412711 387234 408526 372650 391705 436594 469596 465067 399034 388962 468008
2311 468008 496844 463948 505366 555402 539840 445117 421666 456070 520738 521798 470084 536851
2299 536851 550406 590208 580385 573299 606175 619164 651045 692564 733006 791956 790070 805986
2287 805986 954520 1047478 1054925 1066870 1156176 1248347 1295752 1349017 1467338 1543408 1611288
2276 1611288 1840736 2091245 2195967 2411867 2673005 3036658 3287743 3509034 3763434 4127103
2266D127103K96076M47128N39118O98228R96182J207442J426356J704861J909901
2257A3352395K816668L498837K591548q26670m163096l536373k430290j579296
2249I723723j304252r66495p85424n29492m39095m27687l23430k91808k33860
2240D422180j40152l00455l91935l03915j84691k20316j76668j99348j50928q872
2230B344900j53858j18880j47295o2903n9425o0315j02714n2427p9818m3810N313
2219A468768j08289j15596j8211J4821m9301n4995M0471n1629k7394m4698l6293
2208A017654m7660m5070o2682J272l9815o8914M7406k8451k7642o9593n057q841
2196F62607l237L5933K7170j7691l3110L076o404k4630J2952l4805r1204O43N0158
$$ plain form
2266 4127103 4423179 4870307 5409425 6107653 7103835 8311277 9737633 11442494 13352395
2257 13352395 16169063 19667900 22259448 21432778 17269682 13733309 11303019 9723723
2249 9723723 8419471 7452976 6667552 6138060 5698965 5271278 4947848 4656040 4422180
2240 4422180 4282028 3981573 3589638 3285723 3101032 2880716 2704048 2504700 2353772 2344900
2230 2344900 2191042 2072162 1924867 1861964 1802539 1742224 1639510 1587083 1507265 1463455 1468768
2219 1468768 1360479 1244883 1226672 1241493 1192192 1137197 1177668 1126039 1098645 1053947 1017654
2208 1017654 969994 924924 862242 863514 823699 754785 802191 773740 746098 676505 671448 662607
2196 662607 659370 695303 722473 704782 671672 674748 668344 643714 656666 621861 530657 531300 581458
2183E81458J8445k657K0431k9170k1037J6636r932l9855j2056o6708J2597J2281
2171D80433k3438M050J4019K9838p4661l0323K9666K5434o721j3007m0415J9837
2159D14712L7405j26886l8995P2812N9459k6880K77k4012k7462j4770L9987J1038
2147C76685j7159o5869j4116P4835k0550J1670j2560J2924J6092q884j3904L375
2135C42539m841l252j0125k0156k1345k05R0944r3274J0157m979L3666N8433p3833
2122C03729N9551Q734l6332J2110k3274l927j5381L2391m0917m6116R331j0398
2110B49501q0143K4642j9607l9456J16238K9461l1842j413j6689k7708j1854P4161
2098B65291m5132K7570M7067l4831L1425p3187P41M9619k597j8106n780j8683
$$ plain form
2183 581458 599903 597246 617677 588507 567470 584106 574174 534319 522263 455555 468152 480433
2171 480433 456995 461045 475064 504902 430241 399918 429584 455018 448297 435290 394875 414712
2159 414712 452117 325231 286236 359048 418507 391627 391904 367892 340430 325660 365647 376685
2147 376685 359526 293657 279541 354376 333826 345496 332936 345860 361952 353068 339164 342539
2135 342539 337698 334446 324321 304165 282820 282615 373559 280285 290442 285463 319129 377562 303729
2122 303729 363280 372014 335682 347792 324518 320591 305210 337601 296684 250568 259899 249501
2110 249501 169358 194000 174393 134937 251175 280636 248794 247381 230692 202984 191130 265291
2098 265291 220159 247729 294796 259965 291390 218203 218944 268563 265966 247860 242080 223397
2086B23397J7425k9914k515Q412l4765L0042M7737n90L2053r4237l1143M2941
2074B08843L914m6737L3882m2006O2919M8250m6485R576l938n0852K9425L0276
2062B37067K2087m7859l3204L89k0380M2751j851j4867M1037k114j3792o012j7244
2049A86008K3904k9114J9517M653q2136r214J5780L0543L6903J8951k7833j8651
2037A69311k8413n3763M6396K4195M1005q2689M3272J5365j3863J1211J6860P002
2025A95889o4898M0204O508K9262k7807l8965O2540m8853l1211J8332j6839l582
2013A20580P2873n3314m5614K1250j1085O8881J1430j8206n244m5459k6932k0475
2001F8685k3374K9008J52889M5658r0553r502M2846P753j9009R486l4931k8565
$$ plain form
2086 223397 240822 210908 208393 216805 182040 212082 259819 259229 291282 197045 165902 208843
2074 208843 212757 166020 199902 157896 220815 269065 222580 232156 228218 177366 206791 237067
2062 237067 259154 211295 178091 178480 158100 200851 199000 184133 225170 223056 209264 203252 186008
2049 186008 209912 180798 200315 204968 122832 113618 129398 159941 196844 215795 187962 169311
2037 169311 140898 87135 133531 157726 198731 116042 159314 174679 160816 172027 188887 195889
2025 195889 130991 171195 177703 206965 179158 140193 202733 153880 122669 141001 124162 120580
2013 120580 193453 140139 94525 115775 104690 173571 185001 166795 161551 116092 89160 68685
2001 68685 45311 74319 227208 272866 182313 172811 215657 223410 204401 213887 178956 150391
1989A50391N9855K7944r720M1599L3138j8889j8620n1440n7278J1130K4755j459
1977A91406j7688n5899K3194l6483n2243O2760m8067L8K2282o4414M3113L0001
1965I8000j2190Q2134M8233J0367P830N3670l3272k6868O6902j6395r2903q2269
1953A03239k2696J7507p131J514L378P7934P7759J9011k8464K1751l5764q6752
1941A41286m4972N392k1281q1137j9836o311O2899N3562m1389N373O5700k7055
1929I2231Q741M6075J7300L1654K098l5993o9667j0999J5339J9499o8177k8705
1917A9396K5984M7814K5006J9979j4517j3999k054K8780l0377m6801k8108N4002
1905H5105P7368p5789k4643L3486N043M194N5642k6101n5899Q423L6371l274J5442
$$ plain form
1989 150391 210246 238190 228470 270069 303207 284318 265698 214258 156980 168110 192865 191406
1977 191406 173718 117819 141013 104530 52287 115047 66980 67018 89300 24886 67999 98000
1965 98000 85810 167944 216177 226544 234374 288044 254772 227904 294806 278411 185508 103239
1953 103239 80543 98050 90919 92433 95811 173745 251504 270515 242051 263802 228038 141286
1941 141286 96314 101706 80425 -712 -20548 -26859 36040 89602 48213 53586 119286 92231
1929 92231 100972 147047 164347 196001 198099 162106 92439 81440 96779 116278 48101 19396
1917 19396 45380 93194 118200 138179 123662 109663 107609 136389 106012 59211 31103 85105
1905 85105 162473 86684 62041 95527 100570 104764 160406 134305 78406 86829 123200 119926 135368
1892A35368p54J997j04147J9910M9250J4026n318J2799l0112l0178O7331o4152
1880F6020k2465Q4781l0548q47k4111Q270J8678M9873k951k6513K4871p3776l9086
1867C2196N5685J7583n1329m7437j4342R9811L6420l8109k241J506r268M4581
1855A25056L7681J8638p0717K7575O7688o7139j4231l6904N5610Q451n1354R442
1843A09796r0172K0340J2012l1954Q376L8621J0054n0469K8181K5600j3844J6363
1831H2904P9135K4390m8549r333l7582k7155Q9570l5022N986l8609K7512K6646
1819A39893p8715J3249q400K1069K1215K0338j3926j761m5377L6293n0638k7456
1807B5784O9573K5255n339M1997P875o6693J4744k5822k2855j9627L8978J3327
$$ plain form
1892 135368 134614 136611 32464 52374 101624 115650 110332 123131 93019 62841 130172 66020
1880 66020 43555 128336 97788 96941 72830 81100 99778 149651 146700 120187 145058 71282 32196
1867 32196 87881 105464 54135 6698 -7644 92167 128587 90478 88237 89743 80475 125056
1855 125056 162737 181375 110658 138233 205921 138782 124551 87647 143257 151708 100354 109796
1843 109796 19624 39964 51976 20022 28398 67019 77073 26604 54785 80385 66541 82904
1831 82904 162039 186429 137880 128547 90965 63810 153380 118358 124344 85735 113247 139893
1819 139893 61178 74427 66027 87096 108311 128649 114723 112962 67585 103878 53240 25784
1807 25784 95357 120612 115273 157270 165145 98452 113196 87374 64519 44892 83870 97197
1795I7197k3211J3271j4910j0962n241j9449l2776M2556L7335L8141k536l1141
1783H8274N372m0615n1408Q2805M2970j3872l7068l0744l1076m5989L8966K7612
1771C5227j3291M6972P6839r741k0332k4559k453Q378m0866j3789N7080K8295
1759A27760l7887M186j9285J309o21n1227m5871N5392J4458j0817M7558n2745
1747C2210j705q335j3988L0353j6896M2522K9939L4145L0443J7307J0456q511
1735A77940m4391n2074L7535J2064q5850j9176k0521k5600J12271k3510p7759
1724i071O1179J8765J8235k8987o0233q96Q74R4396k975j9615l3017L0134j7284
1711E1505J9025K5613l8254l6742J4861l1898o439R8855j8840J1736J851L193
$$ plain form
1795 97197 73986 87257 72347 61385 56144 36695 3919 46475 83810 121951 119415 88274
1783 88274 93646 53031 1623 84428 127398 113526 76458 45714 14638 -31351 7615 35227
1771 35227 21936 68908 145747 136006 115674 91115 88662 97040 56174 42385 99465 127760
1759 127760 89873 94059 74774 76083 75462 24235 -21636 33756 48214 37397 84955 32210
1747 32210 30505 22170 8182 38535 21639 64161 94100 128245 158688 175995 186451 177940
1735 177940 133549 81475 119010 131074 45224 26048 5527 -20073 92198 68688 -9071
1724 -9071 52108 70873 89108 60121 -112 -1008 -134 94262 91287 71672 38655 68789 51505
1711 51505 70530 96143 57889 21147 36008 4110 -2329 96526 77686 89422 91273 94466
1699I4466O4192n2349N692K3311m3322K1577n3759K554N2007J6087m1916j4196
1687G4344l4961k2746R835L8124m0211R931p218k6454k8153m6425N6584M2194
1675B4844O0974k6704o0599M2429N4792k502m6066N7620k1912l1110L8672j4531
1663G5907j9190q1271N124m68M5659M3460j9672q1161J9146Q7794K3518Q605l2433
1650G5018l2274j078k7010P205M2321l0922O8130q139l9006m2344l412N7607O0329
1637A26425l5909j22824K5769K2110Q4132M0707l9645o5276l6160K2189l3067
1626a1549K8220J1531r4195M1686M6604m2696J20K140L8112J9504L591l1819q091
1613C158J7455M1995O690o5786r535L4502M6459K2569J6918j6928q412O1600J5995
$$ plain form
1699 94466 158658 106309 112001 135312 91990 113567 59808 62362 114369 130456 88540 74344
1687 74344 39383 16637 26472 64596 24385 34316 27098 644 -27509 -73934 -17350 24844
1675 24844 85818 59114 -1485 40944 95736 93234 47168 104788 82876 51766 90438 75907
1663 75907 56717 -24554 -19430 -19898 25761 69221 49549 -31612 -12466 75328 98846 107451 75018
1650 75018 42744 41666 14656 21861 64182 33260 101390 93251 54245 11901 8489 66096 126425
1637 126425 90516 -32308 -6539 15571 99703 140410 100765 35489 -671 21518 -11549
1626 -11549 16671 28202 -65993 -24307 22297 -20399 -20279 -18139 19973 39477 43068 11249 3158
1613 3158 20613 62608 69298 3512 -6023 28479 74938 97507 114425 97497 89085 150685 166680
1600A66680p7831j5645n7403K0413J0282m8270K8092O528K2793m0155m0970k0968
1588d6454L5140O9435L6355m3168o683j6094n2442Q6647N5359K7762m5459q8468
1576A1930J1624k4029L8059K3600o7089J5024o422k755K5517N9893m282l8764
1564D2306k7850L9181M5286n0403m0204p198P5304K0625j0563k792j37076N1773
1552a611L5867o7257J7295M6679j03387q105O4691k384K0184j5540K6419q552
1540D299K4785l8936J4788K918k6102P7754l2609q329N3548m8521k892j3473q327
1527a097R056Q0137L7119K205j1898k9183l3077k499p2460J4349J1845M6256o943
1514D3810k9265p2711j1404J8901L0362K5032m0374M1912j8384J155P7362j4665
$$ plain form
1600 166680 88849 73204 15801 36214 46496 -1774 26318 32846 55639 15484 -25486 -46454
1588 -46454 -11314 58121 94476 51308 44625 28531 -23911 62736 118095 145857 100398 11930
1576 11930 23554 -475 37584 61184 -5905 9119 2697 -58 25459 85352 81070 42306
1564 42306 14456 53637 98923 48520 8316 1118 76422 97047 86484 83692 -53384 -1611
1552 -1611 34256 -33001 -15706 30973 -72414 -80519 -15828 -18212 1972 -13568 12851 4299
1540 4299 29084 -9852 4936 7854 -18248 59506 26897 18568 72116 23595 20703 7230 -1097
1527 -1097 7959 88096 125215 127420 115522 86339 53262 50763 -21697 -7348 4497 50753 43810
1514 43810 14545 -58166 -69570 -50669 -20307 4725 -35649 6263 -12121 -10966 66396 51731
1502E1731k055l590J3154k4029K097M1544p5405l9761L214M6680k3068k7031L0522
1489e997L8822K5870k0238l1370O8682n8081j4043j047O5331R860k9683M054m13
1476E1747J9304Q5187j6682j89686k0104J20181l0623K8558O898n0016J4395J6700
1464C5859k0277o7922R24j9210l3306J4664L8547R144m9688L8045K9426K1719
1452b075M4772J975m9313R55j237K515j1868l0523L3423k479L3792n6111J286
1439c4888L8028m7751L6113M9700L1960J130p7395q3132q554O1068L8452m8225
1427d3494J2145m2984m1426J18327o930k0744r175k204K8261j8542N2885L6199
1415F2318k5307M752q5393P3262q4435O7874Q6967m1003k1019j8802j4461o0857
$$ plain form
1502 51731 49676 46086 59240 35211 37308 78852 3447 -36314 -33100 13580 -9488 -36519 -5997
1489 -5997 32825 58695 38457 7087 75769 17688 3645 2598 67929 77789 48106 52160 51747
1476 51747 71051 156238 139556 -50130 -70234 49947 19324 47882 54780 4764 19159 35859
1464 35859 15582 -52340 -51416 -70626 -103932 -89268 -50721 -41577 -91265 -53220 -23794 -2075
1452 -2075 42697 44672 -4641 -3686 -4923 -2408 -14276 -44799 -11376 -13855 19937 -36174 -34888
1439 -34888 3140 -44611 -8498 41202 73162 74292 -3103 -86235 -94789 -33721 4731 -43494
1427 -43494 -31349 -74333 -115759 2568 -4362 -25106 -34281 -36485 -8224 -26766 26119 62318
1415 62318 37011 41763 -43630 29632 -54803 13071 100038 59035 38016 19214 4753 -56104
1403e6104M2186k2607J6602m938O2778M1054l5847j1046n5306j1738R1309j6073
1391D0270m2931M3757r53n2283j0503L3266k2568n8093K0131L7031M8694J4742
1379E0560m1720O6779m608K3080m5941k8104M2221N85n0358p9026J0423j8327
1367g4436J7636L675P9816J7313j1423l7905K4659O0621l5797l1078K1735L4618
1355F9434m6304k879l6862q6864M302R336J11271n3256l2244N741j6471L5710
1343c9086j6542O5869L7348o831m9422k684L9053J6070k8941p0728L4471L6738
1331A5315n427r998k3626q104K0576K8386J5992n9706K7389N013l1871L0932J4186
1318A9057K3746P048j6908j02537q535J01892m1127K3724K6852l3554N0810l9369
$$ plain form
1403 -56104 -13918 -36525 -19923 -24861 37917 78971 43124 32078 -23228 -34966 56343 40270
1391 40270 -2661 41096 40143 -12140 -22643 10623 -11945 -70038 -49907 -12876 35818 50560
1379 50560 8840 75619 71011 94091 48150 20046 62267 62852 12494 -66532 -56109 -74436
1367 -74436 -56800 -53125 26691 44004 32581 -5324 19335 79956 44159 13081 34816 69434
1355 69434 23130 20251 -16611 -103475 -99173 -89837 21434 -31822 -64066 -58325 -74796 -39086
1343 -39086 -55628 10241 47589 40758 -8664 -11348 27705 43775 14834 -55894 -21423 15315
1331 15315 9888 -110 -23736 -31840 -11264 17122 33114 -26592 797 5810 -26061 4871 19057
1318 19057 42803 49851 32943 -69594 -78129 23763 -17364 6360 33212 -342 50468 11099
1306A1099o7874j07562P8835j2684M2016l789o896J04410L2439m8210o1442R626
1294c0032L3606J3302K7319j3511j6147L4341M013k8511m0017L3047J6605R204
1282D3219Q667m3906p445n403m4230L2502K3091J7761J9393l0223L67l0065p0877
1269h7149P7387k631j2199K481J0302L8725k4989o666j2098j8263M0096o9000
1257f4004M173J29407j8960L7759L4413q0107R91n4453k8346J917K2940J4985
1245G15J6720r581r841K856L2465P246j3750n625m8706M463P39m330n1494o1000
1231a39123J08859L4770m6300O2213o998J3350l4907J3161J5007l3995L4806M8630
1219F9473k3437l6027l2629r075N6389k2860j0124j5433n615K2234m970k9604
$$ plain form
1306 11099 -56775 -164337 -85502 -98186 -56170 -59959 -66855 37555 69994 21784 -39658 -30032
1294 -30032 3574 16876 44195 30684 14537 48878 52891 24380 -15637 17410 34015 43219
1282 43219 51886 7980 535 -4868 -49098 -16596 6495 24256 43649 13426 13793 -16272 -87149
1269 -87149 -9762 -12393 -24592 -22111 -11809 26916 1927 -4739 -16837 -35100 4996 -64004
1257 -64004 -59831 69576 50616 88375 122788 42681 43672 -10781 -39127 -37210 -14270 715
1245 715 17435 7854 -1987 869 33334 40580 26830 21205 -27501 -23038 -22299 -26629 -78123 -139123
1231 -139123 -30264 4506 -41794 20419 13421 26771 -8136 5025 20032 -13963 20843 69473
1219 69473 46036 10009 -22620 -31695 24694 1834 -8290 -23723 -29338 -7104 -12074 -41678
1207d1678J8097R749L6345j0817n4009L8931N224R307K3832K6915m5136p5398
1195e8638P0415J5209k9933l5247l0281Q5672n5920R471j3664M3201j5714m2348
1183e7777J6020L4209m3286r261j2151L0010Q100j3131l9796M3555N2459J4004
1171B2955p4841o620K967K505N6916j3497L8922L4374N9310j00865j2399Q17o250
1158D294J3115M8284K4844j05817r530Q1398O00l9656l2493J9450l0676N956K4066
1145C835k2119k4350k6359P6835L8073o4749N1559P5143M198n4696k5594l9337
1133g561k6785N9634l0266k498J7587M5492j4792j26420K5679J7496M5577R6211
1121I9354l8034m4103K9031l1457K0998q8112L7482k2437K8604J1915K4525l1666
$$ plain form
1207 -41678 -23581 -13832 22513 11696 -42313 -3382 1842 11149 34981 61896 16760 -58638
1195 -58638 11777 26986 -2947 -38194 -68475 17197 -38723 -29252 -42916 285 -15429 -57777
1183 -57777 -41757 -7548 -50834 -60095 -72246 -42236 -34136 -47267 -87063 -43508 8951 22955
1171 22955 -51886 -58506 -55539 -53034 3882 -9615 29307 63681 122991 22126 9727 10544 4294
1158 4294 17409 65693 90537 -15280 -24810 56588 57188 17532 -14961 4489 -26187 -20231 3835
1145 3835 -18284 -42634 -68993 7842 45915 -18834 32725 107868 112066 57370 31776 -7561
1133 -7561 -34346 25288 -4978 -7476 10111 55603 40811 -85609 -59930 -42434 3143 99354
1121 99354 61320 17217 46248 14791 35789 -52323 -14841 -37278 -8674 3241 27766 -3900
1109c900l4214L0695n5576K7604Q0929l19J6800j14810n486O7806J8838q655r8356
1096g8644q67K947J364P4442L2562L6727l1974r3531M2272l9548K1482N9480j5064
1083A1648l3722m3870o0751Q934J2851J527N9829N3053k541j3458l5224J7301
1071b4423L2392M3085q8045m8182O8208O423j8289k5621J0676R0571j6831j1687
1059A8277k5657n5970L285N7702J0191m7978J7981l310J9854N403K6741m1865
1047a5346n249N3806j8003o081j7052l1655N4384N471l7337J5954m2170J1210
1035c2068m1437P4519O131k4180j0049k7076R63L2237J4996K3489K0884l5577
1023B832M575K9914j3544k0936J3848J2145K8866n3912o743J366j1472j7304o8109
$$ plain form
1109 -3900 -38114 -7419 -62995 -35391 45538 45219 62019 -52791 -58277 9529 28367 19712 -78644
1096 -78644 -79511 -76564 -75200 -758 31804 68531 36557 -56974 -14702 -54250 -32768 26712 11648
1083 11648 -22074 -65944 -126695 -117761 -104910 -103383 -43554 9499 6958 -6500 -41724 -24423
1071 -24423 7969 51054 -36991 -85173 -16965 -10542 -28831 -54452 -43776 46795 29964 18277
1059 18277 -7380 -63350 -60065 -2363 7828 -40150 -22169 -25479 -5625 -222 26519 -15346
1047 -15346 -20595 33211 15208 9127 -7925 -39580 14804 20275 -17062 -1108 -43278 -32068
1035 -32068 -73505 1014 7145 -17035 -27084 -54160 -53197 -20960 -5964 17525 38409 2832
1023 2832 7407 37321 23777 2841 16689 28834 57700 3788 -2955 -1589 -13061 -30365 -98474
1010i8474M7871r541P6162K2507n3521K9693r408j7145K2017P9859J1571r8716
998B875k4200K515P1063m9952l769J771J8191k3977k1529k5909J6134l1263m3892
985a11942Q6913J4515K049L76p420P8340j9244J4297k576m5753n1628m1434J8379
972f5128n962k315m396L3114M5884n1707q602P3647m4266J9319k0875r2825J5217
959a08895P5758J3007L3928m6212Q1978l6517n0843O5212m9206k5518Q3484l67
947C5809K0105o717m4279p7027O2226l6244L8037K071N2426m7191m0950J310l4025
934g4449r490P1074l9243k0302M0019K1294j12j8459k6354Q559M0396M2447P314
921D2694j717k3285N190K7701k3331O133k6609k3231N168n4729L9889R5716m6795
$$ plain form
1010 -98474 -50603 -60144 16018 38525 -14996 14697 5289 -11856 10161 90020 101591 2875
998 2875 -21325 -18810 52253 2301 -1468 303 18494 -5483 -27012 -52921 -36787 -68050 -111942
985 -111942 -25029 -10514 -8465 -8089 -15509 62831 43587 57884 55308 9555 -42073 -83507 -65128
972 -65128 -71090 -73405 -77801 -44687 1197 -50510 -59112 14535 -29731 -10412 -31287 -124112 -108895
959 -108895 -33137 -20130 13798 -32414 49564 13047 -37796 27416 -21790 -47308 36176 35809
947 35809 55914 49197 4918 -72109 -9883 -46127 -8090 -6019 46407 -784 -41734 -40424 -74449
934 -74449 -83939 -12865 -52108 -72410 -32391 -11097 -11209 -29668 -56022 -47463 -7067 35380 42694
921 42694 40977 17692 22882 50583 27252 33385 6776 -16455 -11287 -66016 -26127 69589 22794
908B2794j4503k5503r769o2107j4490R5162L3353p4324n140k1192K9527l1606
896g7798L4531L3362j560o3781j6675L189K9666M8087J509L4046r539K2772k8926
883H883l9520J5837m0279j6958k1498K3294K4502J8753k1266r013J9417N5895
871A8047K2801J5093P517j4353o5934o1455P3565K1440L068m4689m0282L064M7772
858a4346K2255o5499k4170J6418Q4445O7834J4086n6881l1947q116m1986n7480
846i5387j7772K5282N2508J4796M5805J3569q253j2859j1159O3275k8051m345
834C7409j8938J0937L0295m7745P7740j6054Q564l152j04728n0926m350m4997
822a25945K7090L8563o223N956j2469M1248r941k1172j3465j6213O0096L7308
$$ plain form
908 22794 8291 -17212 -26981 -89088 -103578 -8416 24937 -49387 -54527 -75719 -46192 -77798
896 -77798 -43267 -9905 -11465 -75246 -91921 -88732 -59066 -10979 -9470 24576 15037 37809 8883
883 8883 -30637 -14800 -55079 -72037 -93535 -70241 -45739 -26986 -48252 -57265 -37848 18047
871 18047 40848 55941 63458 49105 -16829 -78284 -4719 16721 19789 -24900 -65182 -62118 -14346
858 -14346 7909 -57590 -81760 -65342 19103 86937 101023 44142 12195 4079 -37907 -95387
846 -95387 -113159 -87877 -35369 -20573 25232 38801 30548 17689 6530 69805 41754 37409
834 37409 18471 29408 59703 11958 89698 73644 82208 79056 -25672 -76598 -80948 -125945
822 -125945 -98855 -60292 -66515 -60559 -73028 -31780 -41721 -62893 -76358 -92571 -32475 4833
810D833L5846J3180k401m8261q805J2945o6315k2989N5279O67k0231m7428K4677
797f9003Q6691M1329m4609k6406k817l5424P6990p533K6505n9095N0652O7179
785A04459k222j01205j9463k4626l5468k4596K6439M4942L038j7474n1387N8155
773c9408l6952l8970l550k3243R689R9549O7130j2794n9890J6574l4676J6018
761d0523J1068m1605k307P0495q216O253K4810M243l904m5692K9660q010j346
748e074L2426o0530M7935R2921o939n4420l4044L8175J2753J4515k5116k8159
736B4443L544P1696p3258p6926P644N2407k2359n5563J24098K8641j10160k6535
724e2328n7461M7969j7434q2145J0673J6048K5252L9840K3758K3863L9255l5565
$$ plain form
810 4833 40679 53859 51458 3197 -5608 7337 -58978 -81967 -26688 -26021 -46252 -93680 -69003
797 -69003 17688 59017 14408 -11998 -14815 -50239 26751 19218 45723 -13372 37280 104459
785 104459 102237 1032 -18431 -43057 -78525 -103121 -76682 -31740 -28702 -46176 -97563 -39408
773 -39408 -76360 -115330 -118880 -142123 -132434 -32885 34245 21451 -38439 -21865 -56541 -40523
761 -40523 -29455 -71060 -73367 -2872 -11088 -4835 19975 24218 20314 -25378 4282 -3728 -5074
748 -5074 27352 -33178 14757 107678 100739 46319 12275 50450 63203 77718 52602 24443
736 24443 27987 99683 26425 -50501 -42857 9550 -12809 -68372 55726 84367 -25793 -52328
724 -52328 -109789 -61820 -79254 -161399 -150726 -134678 -109426 -69586 -45828 -21965 17290 -18275
712a8275j8078K4818r1222K6161M1265N2926N816k1002l649m3375n9125l5546
700a39286Q1353M5388J3158o0974o5633R073K4476P454j2107N5389N2385R031
688A9707j494j6465K4544N7127k9406j04114K0503Q374K1430j6060q4827L4741
676f5940M0111j5850N685J0650l9230k2744P9762M8507m74n0291m1761J6444k8285
663f3416l6733J08007j4104r745L482J8685l6739j9091M8387K0387M3306p5400
651a2974o9275M893R321L8676L5252j3397K1912o4038J4853j4397L8912j0421
639b0683k2386J7067O149l544j138J7037K0670J3117R219J8925j2588o8281p561
626c3997L6364j5829q98M8179m6117o673M4878p3433L2500L4010j9519n0366l309
$$ plain form
712 -18275 -36353 -11535 -102757 -76596 -35331 17595 23411 2409 -1240 -44615 -103740 -139286
700 -139286 -57933 -12545 613 -60361 -125994 -116921 -92445 -84991 -97098 -41709 10676 19707
688 19707 18213 1748 26292 83419 54013 -50101 -29598 -21224 206 -15854 -100681 -65940
676 -65940 -25829 -41679 -35994 -25344 -64574 -87318 -7556 40951 40477 -9814 -51575 -35131 -63416
663 -63416 -100149 7858 -6246 -15991 -12509 6176 -30563 -49654 -1267 19120 62426 -12974
651 -12974 -82249 -77356 -68035 -29359 5893 -7504 14408 -49630 -34777 -49174 -10262 -20683
639 -20683 -43069 -26002 -19853 -23397 -24535 -7498 13172 26289 35508 54433 41845 -26436 -33997
626 -33997 2367 -13462 -14360 33819 -12298 -18971 25907 -47526 -15026 18984 -535 -50901 -54210
613e4210J9497n359r44K7693n717Q9858j1592k2620j3888k9563k4465N3995k9386
600f701L9796O467n905N743o1140K1605N829K296j5733m8856J7925N1046n7755
587d5383L1784J3532l2609j352n850M4388J7397M936j401k1554r798M835n5635
574e6710j0727O2769l2241N3620M232K444M319K1825K1792j0968n9346k9848N301
561b3538k371R029O0979j7750n1062l8380N3956P0290m4288n519j4543j3194n252
548b1643L6549o4610M2606m0471K9539m1810L7902J1058j7885L2672K3176l2808
536e725n6305L5830N2849k3338o255N281m4613K9409n5006Q1199O347n9707L4949
523e085K5011l0374M2L7737K1718K8210p0768k5568K0811l9135K5283k2985K5302
$$ plain form
613 -54210 -34713 -40072 -41016 -13323 -19040 70818 59226 36606 22718 -6845 -31310 22685 -6701
600 -6701 33095 39562 33657 39400 -21740 -135 5694 7990 -7743 -56599 -38674 12372 -45383
587 -45383 -13599 -67 -32676 -34028 -39878 4510 21907 26843 25442 3888 -5910 -1075 -56710
574 -56710 -67437 -4668 -36909 16711 20943 23387 27706 49531 71323 60355 1009 -28839 -23538
561 -23538 -25909 -16880 44099 26349 -24713 -63093 -9137 61153 16865 11346 -3197 -16391 -21643
548 -21643 14906 -49704 -7098 -47569 -18030 -59840 -21938 -10880 -28765 3907 27083 -5725
536 -5725 -62030 -26200 26649 3311 -2944 2337 -42276 -12867 -67873 13326 19673 -40034 -5085
523 -5085 19926 -10448 -10406 27331 49049 77259 6491 -19077 1734 -37401 -12118 -35103 -9801
510i801o4498P207J89M7529P3466J2977o4934P208J2767l2423m694M7110o9675
497c7572K1237L5302L4137J9188j16061Q8743n6594r4447M6662P8161p1518j3411
485f6173K5534J177K7346o0523N4177N0287L2762m140m9880k7589M5780j8093
473A0665n1813K1873Q723l4494J3170L4917K4629k7146J3765P098m126n9049k7002
460f8790m9597M940M2498K2492P3877K6641k9998r493J2944k5162K8659k6787
448B224J7770N0780M194p6984l2476o2701k7556P3516M3284o345k4577k6271M065
435f1077l444K0539j9695K919j2813R4963P005p0903J1972k6805k1530K284Q2944
422F359m5558M8250k8953l1357Q0956k5041m5835J0688j2868J2658n7112L5597
$$ plain form
510 -9801 -74299 -67092 -66903 -19374 54092 67069 2135 9343 22110 -10313 -15007 32103 -37572
497 -37572 -16335 18967 53104 72292 -43769 44974 -11620 -106067 -59405 18756 -52762 -66173
485 -66173 -40639 -39462 -12116 -72639 -18462 31825 64587 60447 10567 -17022 28758 10665
473 10665 -41148 -19275 -10552 -45046 -31876 3041 27670 524 14289 21387 17261 -41788 -68790
460 -68790 -118387 -113447 -70949 -48457 25420 52061 22063 12570 25514 352 29011 2224
448 2224 19994 70774 74968 -2016 -34492 -97193 -124749 -51233 -7949 -14294 -38871 -65142 -61077
435 -61077 -64521 -43982 -63677 -60758 -73571 21392 28397 -42506 -30534 -57339 -78869 -76585 6359
422 6359 -39199 9051 -19902 -51259 29697 4656 -41179 -30491 -43359 -30701 -87813 -52216
410e2216M6614l4547J0884j1653p67k3252P721k4182j0911j8433P6130j3750J9614
397b8748m3629K781P6403L4924k1201k7435m3139p47j3748Q643m36m0187k5801
384a22320M9852M2525j4921k2509l0365L4503k0891J2897Q0124j9372n1125O7111
372E509k8774M4481r202m4602k4211N680k9409J1713P7077m4299M7138k938m1771
359c3608o2885K4506q1462L3415m286Q6410o07n281N4886j28360j1354N3369R2664
346A7407j6166l9256K3508K105L8266O19m9020k5232k8322O261l412m4579L1041
333h6780L0239k4244N0213K9765J5440n5421O726J9442K7097l4042j5578O1313
321B4170n3749k2430J8024l9302N123J04J6459P968K100J2266k4053l5132L6819
$$ plain form
410 -52216 -5602 -40149 -29265 -40918 -41685 -64937 -57216 -81398 -92309 -110742 -34612 -48362 -28748
397 -28748 -72377 -69596 6807 41731 20530 -6905 -50044 -50791 -64539 -55896 -56332 -96519 -122320
384 -122320 -72468 -29943 -44864 -67373 -97738 -63235 -84126 -71229 8895 -10477 -61602 5509
372 5509 -23265 21216 12014 -32588 -56799 -51119 -80528 -68815 8262 -36037 11101 8163 -33608
359 -33608 -96493 -71987 -153449 -120034 -124320 -37910 -38517 -43798 11088 -117272 -128626 -75257 17407
346 17407 1241 -38015 -14507 -12402 25864 26483 -22537 -47769 -76091 -69830 -73242 -117821 -86780
333 -86780 -56541 -80785 -30572 -807 14633 -40788 -34062 -14620 12477 -21565 -37143 24170
321 24170 -29579 -52009 -33985 -73287 -68164 -68060 -51601 -43633 -41533 -29267 -53320 -88452 -51633
308e1633M198n3420N30L0540j0637L0895N3536M6351n5232k3431k2938m789q045
295f4075J877k077j0638k5201j502M8975l0578O217J13778K945m5728j2002K4157
282F148m04o7577j19544J6388Q3771P5581l6021l2013J7541M6176j4230n9235
270h3419O3674l467k8691m801k9055N7488k3028m8433N0006K9485k2410L0711
258a1940p0390R355P2108j137p944M64j4749j5912J6089o3329K4275j9169p5494
245a57773N942J32470l0697L0714q192q353n9796k9289N2213O0615J7121n1577
233d6602L5311l536j1486J3282q3564q506R677N4613M8662j0253n6177m2753N5240
220d6092J0899L878l6447l3236O4028j1850K6986L3119j5076r24n2309K3723K4832
$$ plain form
308 -51633 -47435 -100855 -100325 -69785 -80422 -49527 4009 50360 -4872 -28303 -51241 -56030 -64075
295 -64075 -62198 -64275 -74913 -100114 -101616 -52641 -83219 -77002 36776 39721 -6007 -18009 6148
282 6148 5744 -61833 -181377 -164989 -81218 -5637 -41658 -73671 -56130 -9954 -24184 -83419
270 -83419 -19745 -23212 -51903 -56704 -85759 -28271 -51299 -99732 -49726 -20241 -42651 -11940
258 -11940 -82330 -72975 -867 -2004 -9948 -9484 -24233 -40145 -24056 -87385 -63110 -82279 -157773
245 -157773 -151831 -19361 -50058 -19344 -27536 -35889 -95685 -124974 -72761 -12146 4975 -46602
233 -46602 -11291 -14827 -26313 -13031 -96595 -105101 -95424 -40811 7851 -2402 -58579 -101332 -46092
220 -46092 -35193 -31315 -67762 -100998 -36970 -48820 -21834 11285 -3791 -4715 -57024 -33301 -8469
207h469P57l0190k5364J6643l0378L2335L9260O210K460n082K9106k3470O773
194A0591Q256K972L7727n2615o8218N5938j9646o7907M2514l8438l2287L384M5836
181g1893m0294J7897J05434o1854K9887p764k5386k5035L2140O2759n065k4689
169a3863K2453N639k9387K9900l5765l8790O6314n599q6875O744L6260K5991p919
156b4897M890l7144n5151K8262M9359J4372L4113k4925k8925j0476J9123n87n6791
143h8777K7321M8005j6508J3073n7412j449k4057O0920M1099L921K1468m6491
131a8887k2433p314J9030k1401J3758l7300k4381N6452r518n1128O0013N158p6963
118a14914j0171K6404K1926O7403K8736m7803m5847j7947J8206O3493l410k2640
$$ plain form
207 -8469 -7712 -37902 -63266 -46623 -77001 -44666 -5406 804 3264 -1818 27288 3818 10591
194 10591 18847 21819 59546 6931 -61287 -5349 -24995 -92902 -50388 -88826 -121113 -117729 -71893
181 -71893 -112187 -94290 11144 -50710 -20823 -28587 -53973 -79008 -46868 15891 10826 -13863
169 -13863 8590 14229 -15158 14742 -21023 -59813 6501 902 -85973 -79229 -42969 -16978 -24897
156 -24897 -20007 -57151 -112302 -84040 -34681 -20309 13804 -11121 -40046 -50522 -31399 -31986 -88777
143 -88777 -61456 -13451 -29959 -16886 -74298 -75747 -99804 -38884 2215 6136 27604 -18887
131 -18887 -41320 -48634 -29604 -51005 -37247 -74547 -98928 -42476 -51994 -103122 -43109 -37951 -114914
118 -114914 -125085 -98681 -76755 -9352 19384 -28419 -74266 -92213 -74007 -10514 -13924 -36564
106c6564k2382m0130N2050j4835l4516O8549l3336L1511K5995o9335j3513J0283
94g6223n513n154K5809K8689k0329J153N5225j0521n1676J7354K0511M5074p774
81A6625R243L32P717k2818N4857m8165n4093L1194r442j5002p743J0262j5106
68d2139k175K9739m3952m8764L4907j4312M0229Q035k6435N5944r268k0566j6916
55e5673M3992L7154j6208o0197J6316J9682n8883L5573M250P779K2497J145j0121
42a2694l5899m376K8059m547K9493J1732l828l792j6666r848J6980j1236m6797
29f3419m898j7140J4250O676Q360j9156k7088O9291J9019R221n1494k8403j215
16h5996O8610m96l5515o01Qk2499N7791l648m5210K9801L9248J055j1302k8460
$$ plain form
106 -36564 -58946 -99076 -47026 -61861 -96377 -27828 -61164 -29653 -3658 -72993 -86506 -76223
94 -76223 -81736 -86890 -61081 -32392 -52721 -51568 3657 -6864 -58540 -41186 -20675 24399 16625
81 16625 25868 26200 33917 11099 65956 17791 -36302 -5108 -14550 -29552 -37295 -27033 -42139
68 -42139 -44314 -14575 -58527 -107291 -72384 -86696 -46467 -38432 -64867 -8923 -18191 -38757 -55673
55 -55673 -11681 25473 9265 -50932 -34616 -14934 -73817 -38244 -33994 -26215 -3718 -2573 -12694
42 -12694 -48593 -52969 -24910 -29457 36 11768 7940 4148 -12518 -22366 -5386 -16622 -63419
29 -63419 -68317 -85457 -71207 -64531 -56171 -75327 -102415 -33124 -14105 -4884 -56378 -84781 -85996
16 -85996 -17386 -17882 -53397 -53998 -53990 -76489 -18698 -22346 -67556 -37755 1493 2548 -8754 -37214
2c7214K6082j0286
0b1418
$$ plain form
2 -37214 -11132 -21418
0 -21418
$$ Imaginary data points
##PAGE= N=2
##DATA TABLE= (X++(I..I)), XYDATA
16383a521841J4467N5205k3327M2490j1610N7228L157k6954M9496K8191O3835
16372a269663Q1319J3277K5821L7402r32J0439J1295k6367k0117L7977P7183L8912
16360i83454O0604N0378K0801K8939R397K8660j1554R413M6839L2599P127L2271
16348f67980O4722O924L4238o558L0123J9679j0402j5887N2883J05758n079r553
16336d01132N7855N8448j2850J6797J7407J0568J635K3785K3698L2096K520m2686
16324b11859J02105Q3906K5257J9171M277q346Q410P101N4783K4146k2194M6793
16312A33550K3524N1412J5282k2261P9951M9385k8135k350J2906K0482K7881M1005
16300D02632J2042O2725k6798J0P2536N2807j8822n1117N1030L1358J7177J3751
$$ plain form
16383 -1521841 -1507374 -1452169 -1475496 -1433006 -1444616 -1387388 -1384231 -1411185 -1361689 -1333498 -1269663
16372 -1269663 -1188344 -1175067 -1149246 -1111844 -1112776 -1102337 -1091042 -1117409 -1137526 -1099549 -1022366 -983454
16360 -983454 -922850 -872472 -851671 -822732 -813335 -784675 -796229 -786816 -739977 -707378 -700251 -667980
16348 -667980 -603258 -596334 -562096 -568654 -538531 -518852 -529254 -545141 -492258 -386500 -391579 -401132
16336 -401132 -343277 -284829 -297679 -280882 -263475 -252907 -251272 -227487 -203789 -171693 -169173 -211859
16324 -211859 -109754 -25848 -591 18580 22857 14511 22921 30022 84805 108951 86757 133550
16312 133550 157074 208486 223768 201507 281458 330843 302708 300358 313264 333746 361627 402632
16300 402632 414674 477399 450601 450611 523147 575954 557132 506015 557045 588403 605580 619331
16288F19331J0550P0361J6828n988K2213k1132N9284M218l44N2510Q285N6524
16276H92640L5892p268J119J2574L4687P9202l7683k7038r249J5975N6597L1639
16264A079087L88K9507L7354J4400J4334l3363K8491K4362J5707k403K1680N5129
16252A284673N695k0140J0904O1079J0563j7961K7582K0468J1823M8041O073J9890
16240A468690l2867N9744L9369m7094K8552l0540M4636K2436Q263K5538L4109
16229A620836K4337r666J4321K9900j1716J0404K9588k3619L6754j0808K3932
16218A734263l4765l6204M4814n203K1651m0679Q7512k1321m7696N8947R8868
16207A860187l765M4774r024l7336K9571j207o2455K2537N2046L4343M148j7977
$$ plain form
16288 619331 629881 700242 717070 711082 733295 712163 771447 775665 775321 827831 836116 892640
16276 892640 928532 921264 922383 934957 969644 1048846 1011163 984125 974876 990851 1047448 1079087
16264 1079087 1079475 1108982 1146336 1160736 1175070 1141707 1170198 1194560 1210267 1207864 1229544 1284673
16252 1284673 1290368 1270228 1281132 1342211 1352774 1334813 1362395 1382863 1394686 1442727 1448800 1468690
16240 1468690 1435823 1495567 1534936 1487842 1516394 1485854 1530490 1552926 1561189 1586727 1620836
16229 1620836 1645173 1635507 1649828 1679728 1668012 1678416 1708004 1684385 1721139 1710331 1734263
16218 1734263 1699498 1663294 1708108 1702905 1724556 1683877 1771389 1750068 1702372 1761319 1860187
16207 1860187 1856422 1901196 1892172 1854836 1884407 1883200 1820745 1843282 1895328 1929671 1933819 1915842
16195A915842R5445k410l2010n6666K397L1577L9905j3940o204M6635K3382q684
16183B035269L3310N9631n9659J84K494q0467K3578O0113k1330L6190N4470m9262
16171B094521k3996N9561j1220j5091J593J621O0388j3629K8414k4256k7171j5048
16159B115687J9707O818O1589K82K4511l6615n751j0606k1697M4370P9930Q851
16147B287076o2212r445p3286O3500M3904k4260p5114P986K6548Q8324J12517
16136B385538J7194k0451p0845J2643J3257K8197j0368k4563l4620L1468L7975
16125B365425l7014J6635L5176n3555J0386J522o9233J5606N543k1765K7968K6330
16113B323024J2163O342K2514j6316k9728j9477N541M1442k61K9439J715L4365
$$ plain form
16195 1915842 2011287 2008877 1976867 1920201 1922598 1954175 1994080 1980140 1973936 2020571 2043953 2035269
16183 2035269 2068579 2128210 2068551 2068735 2071229 1990762 2014340 2074453 2053123 2089313 2143783 2094521
16171 2094521 2070525 2130086 2118866 2103775 2105368 2106989 2167377 2153748 2182162 2157906 2130735 2115687
16159 2115687 2135394 2142212 2203801 2204083 2228594 2191979 2186228 2175622 2153925 2198295 2278225 2287076
16147 2287076 2224864 2215419 2142133 2205633 2249537 2225277 2150163 2158149 2184697 2273021 2385538
16136 2385538 2402732 2382281 2311436 2324079 2337336 2365533 2355165 2330602 2295982 2327450 2365425
16125 2365425 2328411 2345046 2380222 2326667 2337053 2338575 2269342 2284948 2290491 2268726 2296694 2323024
16113 2323024 2335187 2341529 2364043 2347727 2317999 2298522 2304063 2345505 2345244 2374683 2376398 2410763
16101B410763N4770l4836p177M4188k099m7373l5615M626N5326j7991q4990N9220
$$ plain form
16101 2410763 2465533 2430697 2423520 2467708 2465609 2418236 2382621 2387247 2442573 2424582 2339592 2398812
$$ [...]
##END NTUPLES=NMR SPECTRUM
##END=
