##TITLE=1H_DE-80H_X3
 200.13MHz, d2o
 8 sc
 
 19ns.26.2.2025
##JCAMPDX= 6.0         $$ Bruker NMR JCAMP-DX V2.0
##DATA TYPE= NMR SPECTRUM
##DATA CLASS= NTUPLES
##ORIGIN= UXNMR, Bruker Analytische Messtechnik GmbH
##OWNER= pz
$$ XWIN-NMR		Version 3.5
$$ Thu Jul 31 09:42:52 2025 Russian Standard Time (UT+4h)  Yarkov@DPX200
##.OBSERVE FREQUENCY= 200.1313
##.OBSERVE NUCLEUS= ^1H
##.ACQUISITION MODE= SIMULTANEOUS
##.ACQUISITION SCHEME= undefined
##.AVERAGES= 8
##.DIGITISER RES= 18
##SPECTROMETER/DATA SYSTEM= spect
##.PULSE SEQUENCE= zg30
##.SOLVENT NAME= CDCl3
##.SHIFT REFERENCE= (INTERNAL, CDCl3, 0, 15.532)
##AUDIT TRAIL= $$ (NUMBER, WHEN, WHO, WHERE, WHAT)
$$ ##TITLE= Audit trail, XWIN-NMR		Version 3.5
$$ ##JCAMPDX= 5.01
$$ ##ORIGIN= Bruker BioSpin GmbH
$$ ##OWNER= Yarkov
$$ C:/Bruker/XWIN-NMR/data/yarkov2/nmr/H-C/1/pdata/1/auditp.txt
$$ ##AUDIT TRAIL=  $$ (NUMBER, WHEN, WHO, WHERE, WHAT)
(   1,<2025-07-31 09:41:47.93 +0400>,<Yarkov>,<DPX200>,
      <created by zg, POWCHK disabled, PULCHK disabled
       configuration hash MD5:
       00 E9 B6 7A A2 85 ED C7 34 08 36 98 17 FE 4E 26
       data hash MD5: 16K
       10 D5 51 1D 1E 07 44 33 25 A0 87 53 FB AE D1 0A>)
(   2,<2025-07-31 09:42:11.54 +0400>,<Yarkov>,<DPX200>,
      <Start of raw data processing
       efp BC_mod = 2 LB = 0.25 FT_mod = 6 PKNL = 1 PHC0 = -1346.296 PHC1 = -0.8090911 SI = 16K 
       data hash MD5: 16K
       FC 59 72 9C 9C 1F 5A 35 5D 54 D4 D6 AF 73 74 E6>)
(   3,<2025-07-31 09:42:18.15 +0400>,<Yarkov>,<DPX200>,
      <abs ABSG = 5 
       data hash MD5: 16K
       A2 F8 80 07 3C 05 D9 39 60 5B 87 FE 0D CE 64 DE>)
$$ ##END=
$$ 
$$ hash MD5
$$ 00 6F 39 FF EB A9 1E 87 2B 9C C2 9F 2C 2F 87 09
##$RELAX= 
##$RELAX= 
##$RELAX= 
##$RELAX= 
##$RELAX= 
##$RELAX= 
$$ Bruker specific parameters
$$ --------------------------
##$DU= <C:/Bruker/XWIN-NMR>
##$EXPNO= 1
##$NAME= <H-C>
##$PROCNO= 1
##$TYPE= <nmr>
##$USER= <yarkov2>
##$AMP= (0..31)
100 100 100 100 100 100 100 100 100 100 100 100 100 100 100 100 100 100 
100 100 100 100 100 100 100 100 100 100 100 100 100 100 
##$AQSEQ= 0
##$AQ_mod= 1
##$AUNM= <au_zg>
##$AUTOPOS= <>
##$BF1= 200.13
##$BF2= 200.13
##$BF3= 200.13
##$BF4= 200.13
##$BF5= 200.13
##$BF6= 200.13
##$BF7= 200.13
##$BF8= 200.13
##$BYTORDA= 1
##$CFDGTYP= 0
##$CFRGTYP= 5
##$CHEMSTR= <none>
##$CNST= (0..31)
1 1 145 1 1 1 1 1 1 1 1 1 1 1 1 1 1 1 1 1 1 1 1 1 1 1 1 1 1 1 1 1 
##$CPDPRG= <>
##$CPDPRG1= <>
##$CPDPRG2= <>
##$CPDPRG3= <>
##$CPDPRG4= <mlev>
##$CPDPRG5= <mlev>
##$CPDPRG6= <mlev>
##$CPDPRG7= <mlev>
##$CPDPRG8= <mlev>
##$CPDPRGB= <>
##$CPDPRGT= <>
##$D= (0..31)
0 0.7 0 0 0 0 0 0 0 0 0 0.03 0 0 0 0 0 0 0 0 0 0 0 0 0 0 0 0 0 0 0 0 
##$DATE= 1753940507
##$DBL= (0..7)
120 120 120 120 120 120 120 120 
##$DBP= (0..7)
150 150 150 150 150 150 150 150 
##$DBP07= 0
##$DBPNAM0= <>
##$DBPNAM1= <>
##$DBPNAM2= <>
##$DBPNAM3= <>
##$DBPNAM4= <>
##$DBPNAM5= <>
##$DBPNAM6= <>
##$DBPNAM7= <>
##$DBPOAL= (0..7)
0.5 0.5 0.5 0.5 0.5 0.5 0.5 0.5 
##$DBPOFFS= (0..7)
0 0 0 0 0 0 0 0 
##$DE= 6
$$ [...]
##$SUBNAM3= <"">
##$SUBNAM4= <"">
##$SUBNAM5= <"">
##$SUBNAM6= <"">
##$SUBNAM7= <"">
##$SUBNAM8= <"">
##$SUBNAM9= <"">
##$SW= 18.0517328524113
##$SWIBOX= (0..15)
0 0 2 0 0 0 0 0 0 0 0 0 0 0 0 0 
##$SW_h= 3612.71676300578
##$TD= 16384
##$TD0= 1
##$TE= 0
##$TE2= 300
##$TE3= 300
##$TEG= 300
##$TL= (0..7)
0 120 120 120 120 120 120 120 
##$TP= (0..7)
150 150 150 150 150 150 150 150 
##$TP07= 0
##$TPNAME0= <>
##$TPNAME1= <>
##$TPNAME2= <>
##$TPNAME3= <>
##$TPNAME4= <>
##$TPNAME5= <>
##$TPNAME6= <>
##$TPNAME7= <>
##$TPOAL= (0..7)
0.5 0.5 0.5 0.5 0.5 0.5 0.5 0.5 
##$TPOFFS= (0..7)
0 0 0 0 0 0 0 0 
##$TUNHIN= 0
##$TUNHOUT= 0
##$TUNXOUT= 0
##$USERA1= <user>
##$USERA2= <user>
##$USERA3= <user>
##$USERA4= <user>
##$USERA5= <user>
##$V9= 5
##$VALIST= <valist>
##$VCLIST= <CCCCCCCCCCCCCCC>
##$VD= 0
##$VDLIST= <DDDDDDDDDDDDDDD>
##$VPLIST= <PPPPPPPPPPPPPPP>
##$VTLIST= <TTTTTTTTTTTTTTT>
##$WBST= 1024
##$WBSW= 4
##$XGAIN= (0..3)
0 0 0 0 
##$XL= 0
##$YL= 0
##$YMAX_a= 342708
##$YMIN_a= -338760
##$ZGOPTNS= <>
##$ZL1= 120
##$ZL2= 120
##$ZL3= 120
##$ZL4= 120
##$ABSF1= 15.58383
##$ABSF2= -2.468021
##$ABSG= 5
##$ABSL= 3
##$ALPHA= 0
##$AQORDER= 0
##$ASSFAC= 0
##$ASSFACI= 0
##$ASSFACX= 0
##$ASSWID= 0
##$AUNMP= <proc_1d>
##$AZFE= 0.1
##$AZFW= 0.1
##$BCFW= 0
##$BC_mod= 2
##$BYTORDP= 0
##$COROFFS= 0
##$CY= -3
##$DATMOD= 1
##$DC= 0
##$DFILT= <>
##$DTYPP= 0
##$F1P= 0
##$F2P= 0
##$FCOR= 1
##$FTSIZE= 16384
##$FT_mod= 6
##$GAMMA= 0
##$GB= 0
##$INTBC= 1
##$INTSCL= 3.241238e-09
##$ISEN= 128
##$LB= 0.25
##$LEV0= 0
##$LPBIN= 0
##$MAXI= 10000
##$MC2= 0
##$MEAN= 0
##$ME_mod= 0
##$MI= 1.114404
##$NCOEF= 0
##$NC_proc= -6
##$NLEV= 6
##$NOISF1= 3.799351
##$NOISF2= 2.8
##$NSP= 0
##$NTH_PI= 0
##$NZP= 0
##$OFFSET= 15.53204
##$PC= 1
##$PHC0= -1346.296
##$PHC1= -0.8090911
##$PH_mod= 1
##$PKNL= yes
##$PPARMOD= 0
##$PSCAL= 0
##$PSIGN= 0
##$REVERSE= no
##$SF= 200.12999793147
##$SI= 16384
##$SIGF1= 3
##$SIGF2= 2
##$SINO= 0.751879
##$SIOLD= 32768
##$SREGLST= <19F.Aceton>
##$SSB= 0
##$STSI= 16384
##$STSR= 0
##$SW_p= 3612.71676300578
##$SYMM= 0
##$S_DEV= 0
##$TDeff= 16384
##$TDoff= 0
##$TI= <>
##$TILT= no
##$TM1= 0
##$TM2= 0
##$TOPLEV= 0
##$USERP1= <user>
##$USERP2= <user>
##$USERP3= <user>
##$USERP4= <user>
##$USERP5= <user>
##$WDW= 1
##$XDIM= 16384
##$YMAX_p= 383295547
##$YMIN_p= -177977
$$ End of Bruker specific parameters
$$ ---------------------------------
##NTUPLES= NMR SPECTRUM
##VAR_NAME=  FREQUENCY,     SPECTRUM/REAL,   SPECTRUM/IMAG
##SYMBOL=    X,             R,               I
##VAR_TYPE=  INDEPENDENT,   DEPENDENT,       DEPENDENT
##VAR_FORM=  AFFN,          ASDF,            ASDF
##VAR_DIM=   16384,         16384,           16384
##UNITS=     HZ,            ARBITRARY UNITS, ARBITRARY UNITS
##FACTOR=    0.220516191357247, 1,           1
##FIRST=     3108.42706149181, 0,            0
##LAST=      -504.28970151397, 0,            0
##MIN=       -504.28970151397, -177977,      0
##MAX=       3108.42706149181, 383295547,    0
$$ Real data points
##PAGE= N=1
##DATA TABLE= (X++(R..R)), XYDATA
$$ [...]
6094B913664n3365l4931n1194m4753j9313o610l1179j7414Q0670P9058Q9833J36083
6082C040549K20354K40566K60557K86421L55227L96688M05344L59800K65302K38104
6072F068912J97691K34999J68023l3694j91992k71232k92752k62192j76212j31701
6062E309850j10227n9520K6366m4182j7304K2534J5122J11937J35194K26374K67154
6051E883298L62583L32016L27293L82005L29484J05516j75950l42959m73602n39728
6041F189956n01752n23723m78188l86620k88356k44816j73166j12110q1947m9197
6031C350081l6725k1369j8177o9077m6412n4957m6702Q362O2735Q3380R1523J07822
6019C410484J17526J09059O0359n3011k83099k54122k60859k71586k27563k15652
$$ y = [2913664, 2860299, 2825368, 2774174, 2729421, 2710108, 2703498, 2672319, 2654905, 2735575, 2814633, 2904466, 3040549, 3260903, 3501469, 3762026, 4048447, 4403674, 4800362, 5205706, 5565506, 5830808, 6068912, 6266603, 6501602, 6669625, 6635931, 6443939, 6172707, 5879955, 5617763, 5441551, 5309850, 5199623, 5140103, 5166469, 5122287, 5104983, 5127517, 5142639, 5254576, 5389770, 5616144, 5883298, 6245881, 6577897, 6905190, 7287195, 7616679, 7722195, 7546245, 7203286, 6729684, 6189956, 5688204, 5164481, 4686293, 4299673, 4011317, 3766501, 3593335, 3481225, 3399278, 3350081, 3313356, 3291987, 3273810, 3204733, 3158321, 3103364, 3056662, 3065024, 3127759, 3211139, 3302662, 3410484, 3528010, 3637069, 3697428, 3644417, 3361318, 3107196, 2846337, 2574751, 2347188, 2131536]
6009B131536j55192j40182j21392n7826o3687p0655l1846j783o0375l2327j7744
5998A378527n9155k4951k0329o0967r5658n3169n0047l5854o5531m1716o81l4520
5986H35949j0549j3080l4539m6364l8842k488L05l2308q716J4889m0539k0796
5974F02922P181J1504m2235k0176j7677k5590k9947l0693Q918L6882Q485m1600
5962D67974m0836j302N8564m759L92J6925k333M2264o600j3365j7427r851K1331
5949E10977K4069l0490p367J4126j6049M406K5573P752k7652J4291J2406n4880
5937D77162j2276j7905l850L7611l3570K637j4039Q246J0994K7782P736q913l788
5924D77827K745L614L3658l5561k1123j3082o463q366P810n330j5804j9354k9708
$$ y = [2131536, 1976344, 1836162, 1714770, 1656944, 1593257, 1522602, 1490756, 1488973, 1428598, 1396271, 1378527, 1319372, 1294421, 1274092, 1213125, 1117467, 1064298, 1014251, 978397, 912866, 871150, 870469, 835949, 825400, 812320, 777781, 731417, 692575, 690087, 690392, 658084, 649368, 664257, 623718, 602922, 610103, 621607, 579372, 559196, 541519, 515929, 485982, 455289, 464207, 501089, 509574, 467974, 427138, 425836, 484400, 479641, 480033, 496958, 494625, 536889, 530289, 516924, 499497, 489646, 510977, 535046, 504556, 497189, 511315, 495266, 499672, 525245, 532997, 505345, 519636, 532042, 477162, 464886, 446981, 443131, 480742, 447172, 449809, 435770, 444016, 455010, 482792, 490528, 481615, 477827, 480572, 484186, 517844, 482283, 461160, 448078, 441615, 433249, 441059, 435729, 419925, 400571, 370863]
5911C70863L032R777p697j551J426l1328K189k7140k909L907k4606J9385j5349
5898B99999m5011J4394O14k1000q033K0362q278k7163k197k0257k9650l0768k900
5885A40112N4721J2551l224j2954p355J1366j3670o305j4323j2538j1265q944
5873A28172j3720J8815Q003o341m681l6847j5592j0737J0630J3016m5675j111
5861D3932L3394P389p933J8413k5609l3501P287J8547l510j1379j4469J1635J1318
5848E5514L234L0802l2542R896q389J0186m9253J8769J7035k4316J4682J9603
5836F5221q635j9062l424J7142J3024R018k0887J0358j0330n355k7030J6691J3162
5823D9893o884j0619l526k333k8657L5143k267q985j6018M3153K813k1995k2394
$$ y = [370863, 373895, 383672, 375975, 374424, 375850, 344522, 346711, 319571, 316662, 320569, 295963, 315348, 299999, 254988, 269382, 269996, 248996, 240963, 261325, 253047, 225884, 223687, 203430, 173780, 143012, 140112, 194833, 207384, 204160, 191206, 183851, 195217, 181547, 175242, 160919, 148381, 137116, 128172, 114452, 133267, 141270, 134929, 130248, 93401, 77809, 67072, 77702, 90718, 45043, 43932, 77326, 84715, 76782, 95195, 69586, 36085, 43372, 61919, 58409, 47030, 32561, 44196, 55514, 58748, 89550, 57008, 66904, 58515, 68701, 19448, 38217, 55252, 30936, 45618, 65221, 56586, 37524, 34100, 51242, 64266, 73284, 52397, 62755, 52425, 47070, 20040, 36731, 49893, 43009, 32390, 28864, 26531, -2126, 33017, 30750, 21765, 5747, 48900, 51713, 29718, 7324]
5810G324N355j6829R933Q012j6839k4132R15k6624j7874L5172M1753J1843j7845
5797A64M0751j8421J042Q63m2967K0569k8441k061K5954Q702p07J0694j0883l1045
5783b5786p600K7551K8217o388l2281J397L8385j7249n4200j3849K7941J2790
5771b1072n413J150L0l0757J3366K4148k3897j1339L3622M403j5675R639J0944
5758a0851l877N335j4214k8275k0123J4738J0547M0367j1020l7004P595K9794
5746a6988L804j7577J7142L0873J107l5883K5397q207j0316j4710k78O8J9148
5733f420j830j2984J6183n081o635k0841l133p298P556M58r390K5682L085L211
5719a7437K616M046k7140K8451L872q147L7222J5602k6560j4714K573L0709n738
$$ y = [7324, 12679, -4150, 5783, 13795, -3044, -27176, -26261, -52885, -70759, -35587, 6166, 18009, 164, 40915, 22494, 23536, 24399, -18568, 2001, -26440, -28501, -2547, 6155, 5448, 16142, 5259, -25786, -33386, -5835, 22382, 15994, -16287, -14890, 23495, 6246, -47954, -61803, -33862, -21072, -26485, -25335, -25305, -56062, -42696, -18548, -42445, -53784, -20162, -15759, -31434, -21795, -10851, -14728, -9393, -23607, -51882, -72005, -57267, -46720, -6353, -17373, -54377, -46782, -16988, -13184, -30761, -13619, 17254, 18361, -17522, 7875, -332, -10648, -25358, -25636, -25568, -6420, -8250, -21234, -5051, -10132, -16767, -37608, -40741, -48039, -40483, -40025, -49415, -23733, -20648, -17437, -14821, -10775, -37915, -9464, -5592, -13739, 23483, 39085, 12525, -2189, 384, 31093, 25355]
5706B5355k4687l0591N1440N32j1170J3809k9407L6196m4471k2005L0635l775
5694h139j8265L6663j7496j736L4505j5661r500J3684k8718k3668M712M716O929
5681b1974R925r523o923j8982K1602J8933K0255p348K6990k7576l5197k5039J1443
5668d3414P381K153K7457j7555J9310m3851j6084J7343J0118K4541j6916M5739
5656A6222j7560r383N01K647j9350j7172J6604J3735O409K228n953K2938J2331
5643B4197j3279J16n867j1222K4707L1306j9923J84j7629J6300p963o664J0228
5630B4491p738l566q76p46m019J2401N4723R591n031n855K3646r419M466k2369
5616F9699l506N7530J1737j6463K3669J4867J1904K5350q547K5713K7579j0798
$$ y = [25355, 668, -29923, 21517, 22049, 10879, 24688, -4719, 31477, -12994, -34999, -4364, -8139, -26404, 10259, -7237, -8973, 25532, 9871, 371, 14055, -14663, -38331, -33619, -28903, -21974, -12049, -21572, -28495, -47477, -25875, -6942, 13313, 5965, 32955, 5379, -29818, -54857, -43414, -36033, -33880, -6423, -23978, -4668, -48519, -64603, -47260, -37142, -12601, -29517, 16222, -1338, -10721, -10220, -7573, -26923, -44095, -27491, -13756, -7347, -5119, -11072, 11866, 24197, 10918, 11034, 5167, -6055, 18652, 49958, 30035, 30219, 12590, 28890, 20927, 14263, 24491, 16753, 13187, 12311, 11565, 7546, 19947, 74670, 84261, 79230, 73375, 97021, 87602, 92068, 69699, 66193, 123723, 135460, 118997, 142666, 157533, 169437, 194787, 186240, 211953, 239532, 228734]
5604B28734j7684l7725J1497L4436l67Q942M1645M9325O965J6366N1825M4505
5592D38464L9259l4958R142J2286M1597J4836M1795L0532K3383O0033j6699J4555
5580F74225P6223q222L196M4796L2617r133K0301L1081N7377M4817M4442M4540
5568A056260K2880N1163M3628K8652q28M0473M9871Q8841Q2966P8467N6523N6285
5556A655181K4838n1769r2365l6593r512j7086l1094n2442m3004k531q574L9308
5544A374357p187J9687L5841L8239N378N1638J09063J08000Q6068P6680J74864
5533B072628J30081J31404J08611J14135J3439j15827j63324k19640j83473j48417
5523A739617j28013j14302j00066q1771k1795j8445O705M1393L7571N3791M6452
$$ y = [228734, 211050, 173325, 184822, 219258, 218891, 227833, 269478, 318803, 325768, 342134, 393959, 438464, 477723, 442765, 451907, 464193, 505790, 520626, 562421, 592953, 616336, 676369, 659670, 674225, 750448, 742226, 745422, 790218, 822835, 813702, 834003, 865084, 922461, 967278, 1011720, 1056260, 1079140, 1130303, 1173931, 1202583, 1201755, 1242228, 1292099, 1380940, 1463906, 1542373, 1598896, 1655181, 1680019, 1628250, 1535885, 1499292, 1489780, 1472694, 1441600, 1389158, 1346154, 1343623, 1335049, 1374357, 1367170, 1386857, 1422698, 1460937, 1466315, 1517953, 1627016, 1735016, 1821084, 1897764, 2072628, 2202709, 2334113, 2442724, 2556859, 2570298, 2454471, 2291147, 2071507, 1888034, 1739617, 1611604, 1497302, 1397236, 1315465, 1293670, 1275225, 1281930, 1323323, 1360894, 1414685, 1461137]
5512A461137J6282J11136J31425J32721J31337J62634J69152J83991J77833J82509
5502B860157Q6819l8762j66951k54352k49333k63647k21111j43030j14741j14367
5492A380682j05564r174o327k7673j800k5770J710L2971M5766O9715R2499P6881
5480A523916R8534J60915J52790R2671J05641J09596Q0357q4183j55063k05904
5470A879270k01588j93269j52338j16453o1749r1769m8505k9517j9415L489p854
5459I60302j6114j5054N1814K0069P7595O0939N3538Q3657Q2163P7049Q9420Q2639
5447A608017J01020P4480j3702k0327M588j881j9404r980N575l7395m5527K3728
5435A669192O6373P2690O6343J05565J87935J94463J96763K66026K56756K90269
$$ y = [1461137, 1477419, 1588555, 1719980, 1852701, 1984038, 2146672, 2315824, 2499815, 2677648, 2860157, 2946976, 2908214, 2741263, 2486911, 2237578, 1973931, 1752820, 1609790, 1495049, 1380682, 1275118, 1265944, 1259617, 1231944, 1230144, 1204374, 1206084, 1239055, 1284821, 1354536, 1447035, 1523916, 1622450, 1783365, 1936155, 2028826, 2134467, 2244063, 2324420, 2240237, 2085174, 1879270, 1677682, 1484413, 1332075, 1215622, 1153873, 1062104, 1013599, 984082, 964667, 968156, 960302, 944188, 929134, 980948, 1001017, 1078612, 1139551, 1193089, 1276746, 1358909, 1435958, 1525378, 1608017, 1709037, 1783517, 1769815, 1749488, 1754076, 1752195, 1732791, 1722811, 1728386, 1690991, 1645464, 1669192, 1735565, 1808255, 1874598, 1980163, 2168098, 2362561, 2559324, 2825350, 3082106, 3372375]
5425C372375K20088J29748J8138q0136j72325r8810p6392q1861k9997Q768K4242
5414C233838N9782J6555p564j2681J2259P7164O2130J45813J29156K11176K32716
5403D160344K62067K90347L03995L34427L87076M36496L46632J80603j41123l25279
5393F235585m05857m36481k94307k43851k45445j68430j37906j09799q5504j01263
5383D006742j587O5491K3162L6122J10345J33053J18751O6867M046n7078n6674
5372D449240k3405o2747r0225q5146j70604k37757k90467l12706k77902k16050
5362B682231j78484j55464j51741r9135j07626p4720o8745n4349k6573K0289J4749
5351A800432K9483L440k0778L1973k0288q7187r6252q5010j13507j04057j16230
$$ y = [3372375, 3592463, 3722211, 3740349, 3660213, 3487888, 3389078, 3312686, 3230825, 3200828, 3209596, 3233838, 3293620, 3310175, 3302611, 3289930, 3302189, 3379353, 3441483, 3587296, 3716452, 3927628, 4160344, 4422411, 4712758, 5016753, 5351180, 5738256, 6174752, 6521384, 6701987, 6560864, 6235585, 5829728, 5393247, 5098940, 4855089, 4609644, 4441214, 4303308, 4193509, 4108005, 4006742, 4005155, 4070646, 4093808, 4129930, 4240275, 4373328, 4492079, 4558946, 4562992, 4505914, 4449240, 4425835, 4363088, 4272863, 4187717, 4017113, 3779356, 3488889, 3176183, 2898281, 2682231, 2503747, 2348283, 2196542, 2097407, 1989781, 1915061, 1846316, 1791967, 1765394, 1785683, 1800432, 1829915, 1833355, 1812577, 1844550, 1824262, 1737075, 1640823, 1555813, 1442306, 1338249, 1222019]
5340A222019q5595q8364q1016m7597n1393m3438n7507o2127j4645p045J2210r2828
5328F02674o0095O397L996l0116j5010j8472k6809k3295j4132r508j2914J817
5316D04533J2294l5441n1295j823j4454J5942k7903k4952K3750q22m4457j7238
5304B38134k5460m854N1311l5517k2631N474j580l6929M974O021l5430K5170K8115
5291A96798j0607l1951k4191l984J0765Q58r341j5j8803l5373J7954K6032J8224
5278A36366k4960k2976j3447m914K0303O102l8394L0338J6320k3174j7077k2251
5266D2236k7226J2101N0053J0483k9369j3748k4371j038J5838N594l4071k2003
5254a5521J7988J2887M5588n241j5724j7639j0303K7591p539l5190j4571J9805
$$ y = [1222019, 1136424, 1048060, 967044, 919447, 868054, 824616, 767109, 704982, 690337, 683292, 695502, 602674, 542579, 548976, 552972, 522856, 507846, 489374, 462565, 439270, 425138, 415630, 402716, 404533, 416827, 381386, 330091, 328268, 313814, 329756, 301853, 276901, 300651, 299829, 255372, 238134, 212674, 207820, 259131, 223614, 200983, 206457, 204877, 167948, 172922, 178943, 143513, 168683, 196798, 186191, 154240, 130049, 126065, 136830, 137688, 128347, 128332, 109529, 74156, 92110, 118142, 136366, 111406, 88430, 74983, 70069, 90372, 96474, 58080, 88418, 104738, 81564, 64487, 42236, 15010, 27111, 77164, 87647, 58278, 44530, 20159, 19121, 34959, 40553, 6482, -15521, 2467, 15354, 60942, 55701, 39977, 22338, 12035, 39626, 32087, -3103, -17674, 2131]
5242B131K7691J7723J182p223j9803J0248K8493j795l2891k5361k7768K121J1175
5229a4077j387j630k4994R410K4445K4894k7040j3875k883J2045j8258m784J0387
5216b7747m0224J4224K4606K5304R843j2252j4709n650L3194R130j3567j0609
5204h457k0143j3672L495j7518K267J7018J4947J1238k7876P259K8558j4252l8958
5191e6094Q72K5941J1179n346R430j6301O517Q340n747r241J5828q379l4983J5130
5177d2854j4857k977K5125N9931j4615m6145k7088J274P263K3028q077O325J4754
5164a8913l9891j696L928J4991J1219l814j2501K0879m200P82j0970k5558M5783
5151a9961l1508l189J0751M0629q13P087l529j2996k2416J296K9896j8192l461
$$ y = [2131, 29822, 47545, 48727, 41504, 21701, 31949, 60442, 58647, 25756, 395, -27373, -25252, -14077, -15464, -17094, -42088, -32678, -8233, 16661, -10379, -24254, -27137, -15092, -33350, -38134, -27747, -67971, -53747, -29141, -3837, 6006, -6246, -20955, -26605, 6589, 15719, 2152, -8457, -28600, -42272, -38777, -56295, -54028, -37010, -22063, -10825, -38701, -31442, -2884, -17136, -56094, -55222, -29281, -18102, -23448, -14018, -30319, -23802, -15462, -21209, -30450, -14622, -23001, -57984, -42854, -57711, -60688, -35563, 24368, 9753, -36392, -63480, -62206, -54943, -31915, -39992, -33667, -18913, -58804, -60500, -56572, -41581, -30362, -34176, -46677, -25798, -29998, -29216, -40186, -65744, -19961, -51469, -54658, -43907, -3278, -4091, 2996, -533, -13529, -35945, -34649, -4753, -22945, -26406]
5138b6406J3597K3234j0408k7564k1617M397J1592N504k6431K7769K8828N937
5126H432J5595o553l5525J145j3895K7044J5168n780Q909K227K962L837K765k6736
5112d05Q30R048R914K3618P722J2644k8227J9956l5509l828J1175q343J7816K0585
5098E6996J7148o496L761m6754q42K2530K0693K8139j0297o106M5378J5327p039
5085A32438j1119P859P170K3712J5839K4448L8842L3420m2210K0902M2263J8244
5073C11808j2384P529K9212J1325N4729N3029M5326J8120L3613O9505O3705L4911
5061G20428P6641R1835R2888J17767J23697J38563J41778J02371J42355K17351
5051A965674J82164K23216K91370K81717L49067L80538M63377N62347O66766P22221
$$ y = [-26406, -12809, 10425, 17, -27547, -49164, -44767, -33175, -27671, -54102, -26333, 2495, 8432, 24027, 17474, -18051, -16906, -30801, -3757, 11411, 5631, 14540, 16767, 19729, 23566, 26331, -405, 425, 9473, 19387, 43005, 50727, 63371, 35144, 55100, 19591, 15763, 26938, 18595, 36411, 56996, 74144, 67648, 71409, 24655, 23813, 46343, 67036, 95175, 84878, 78772, 124150, 139477, 132438, 121319, 129178, 136348, 160060, 175899, 200347, 239189, 272609, 230399, 251301, 293564, 311808, 299424, 306953, 336165, 347490, 402219, 455248, 500574, 518694, 552307, 621812, 685517, 720428, 797069, 888904, 981792, 1099559, 1223256, 1361819, 1503597, 1605968, 1748323, 1965674, 2147838, 2371054, 2662424, 2944141, 3293208, 3673746, 4137123, 4699470, 5366236, 6088457]
5041F088457P69213O39775M64874N71094P86006J032578J236251J096448J006534
5032A3691230J423936J837772J768303J104523p74425j961174k074742j985024
5024A3030399j546157j131668p09443m68547l93391o20487p87775p68463o96320
5015E908148n92997n27486l85403l47340k94835k03969k19350k47124j74682j71400
5005B743562k06517j44575j23801j35425j18308j03969p4993m6056o4003m7659
4995A678256q1906q0259q4452o6285o6946q0494q9635k5222n2480m0418m7119
4984I63040m1910r385J5271m3952k6097l2993j953m0264n4151J4264L1713n3384
4972G20199m9525j4737m8253k4543n7642l1399O860k3719l7067m2836K9982J7124
$$ y = [6088457, 6857670, 7497445, 7962319, 8533413, 9319419, 10351997, 11588248, 12684696, 13691230, 15115166, 16952938, 18721241, 19825764, 19051339, 17090165, 15015423, 13030399, 11484242, 10352574, 9643131, 9174584, 8781193, 8160706, 7372931, 6604468, 5908148, 5315151, 4787665, 4402262, 4054922, 3760087, 3556118, 3336768, 3089644, 2914962, 2743562, 2537045, 2392470, 2268669, 2133244, 2014936, 1910967, 1835974, 1789918, 1725915, 1678256, 1596350, 1516091, 1431639, 1365354, 1298408, 1217914, 1128279, 1103057, 1050577, 1010159, 963040, 921130, 911745, 927016, 883064, 856967, 823974, 822021, 781757, 727606, 741870, 773583, 720199, 670674, 655937, 607684, 583141, 525499, 494100, 500960, 477241, 440174, 397338, 427320, 444444]
4960D44444o2405P20K8772j6376k6302j1229k5844o696l0199J1871K3584j1009
4948C19331r193J7410j0915j0288J4208M515j650m889k1919J3859K2155M90R659
4935C42773k9126j0022M2201K9587j919K9997R373J7121J5918j819J3130L8449
4923D95663K7296j8349j6687J0749j4858k2898J8422n9497m2408K9819j0224l754
4911C93274K0404J233R721J7141j2430m3067k739J5235O136j3609l5485l8816
4899C16998J9026l4733o654r769j8874L8636k7356j5330M5688L2576J3740j0150
4887C43798j7784k1689K4028J5037p914l0134j7206N66L5551j2927m8685M5001
4875C07642P332J3484l8670n1498M3108P781P298M0245J2185j1563J4728j2233
$$ y = [444444, 382039, 382759, 411531, 395155, 368853, 357624, 331780, 325084, 294885, 306756, 330340, 319331, 310138, 327548, 316633, 306345, 320553, 325068, 323418, 318529, 296610, 310469, 332624, 333114, 342773, 313647, 303625, 345826, 375413, 373494, 403491, 412864, 429985, 445903, 444084, 457214, 495663, 522959, 504610, 487923, 498672, 483814, 460916, 479338, 419841, 377433, 407252, 397028, 393274, 413678, 414911, 424632, 441773, 429343, 386276, 383537, 398772, 404908, 391299, 355814, 316998, 336024, 301291, 294637, 284868, 265994, 304630, 277274, 261944, 307632, 340208, 353948, 343798, 326014, 304325, 328353, 343390, 335476, 305342, 288136, 288702, 324253, 311326, 262641, 307642, 314974, 328458, 289788, 238290, 281398, 289179, 296477, 336722, 348907, 337344, 352072, 339839]
4863C39839L172k696L5790L3540K5815l1723K5503M0562j4482l4700l1304J2698
4851D02014j7589K5464K1061r621L897k392O1648M0536J670j0450L4637K4216
4839E75091M14K0386K4772Q6074M4692L3374N3666K2326J813j1480j2239o067
4827H32822n206J6705J5052J9575j3727L5274k3967J6888L8974O4289M9005J5325
4815A061009K1534N0421M5663Q3266K4801M7547P7407N2970M7619N8915M2288
4804A613440L5719J7546M5154L3325O8073O7438M8720J6247M9965Q2422M1826
4793B119875N4401O5050P3463Q0513R1890O9835O6285J19542P2091J11284J27174
4782C051403J53566J74750K12910K54567K29699K63783K08600K86752K67595L02336
$$ y = [339839, 343011, 340315, 376105, 409645, 435460, 403737, 429240, 469802, 455320, 420620, 389316, 402014, 384425, 409889, 430950, 421329, 425226, 422834, 484482, 525018, 526688, 516238, 550875, 575091, 575505, 595891, 620663, 706737, 751429, 784803, 838469, 860795, 862608, 851128, 838889, 832822, 827616, 844321, 859373, 878948, 865221, 900495, 876528, 893416, 932390, 996679, 1045684, 1061009, 1082543, 1132964, 1178627, 1261893, 1286694, 1334241, 1411648, 1464618, 1512237, 1571152, 1613440, 1649159, 1666705, 1711859, 1745184, 1813257, 1880695, 1929415, 1945662, 1995627, 2078049, 2119875, 2174276, 2239326, 2312789, 2393302, 2485192, 2555027, 2621312, 2740854, 2812945, 2924229, 3051403, 3204969, 3379719, 3592629, 3847196, 4076895, 4340678, 4549278, 4836030, 5103625, 5405961]
4772E405961L18039L54992L76427M41593M85922N29276N09444N33996N89414N93444
4762A0138508O16834O98647P87534Q33280R05851R95643J065380J127753J284460
4753A8453890J502015J701939J973593K333301K577587K582517K209982J546016
4745C4880840J006612P17856O98866P12702N93333M66987M85339O34036Q66473
4736D1063044J051318J145114J208614J313979J544588J705427J852909J905713
4728E2790706J763465J686730J618020J733267J949523K267398K576203K758192
4720F9143504K847720L049539K973606K369210J084823n32706j761600k330138
4712G6843958k421161k368534k236857j992603j709482j470813j360912j536134
$$ y = [5405961, 5724000, 6078992, 6455419, 6897012, 7382934, 7912210, 8421654, 8955650, 9545064, 10138508, 10755342, 11453989, 12241523, 13074803, 13980654, 14976297, 16041677, 17169430, 18453890, 19955905, 21657844, 23631437, 25964738, 28542325, 31124842, 33334824, 34880840, 35887452, 36605308, 37304174, 38016876, 38610209, 39077196, 39562535, 40196571, 41063044, 42114362, 43259476, 44468090, 45782069, 47326657, 49032084, 50884993, 52790706, 54554171, 56240901, 57858921, 59592188, 61541711, 63809109, 66385312, 69143504, 71991224, 75040763, 78014369, 80383579, 81468402, 80935696, 79174096, 76843958, 74422797, 72054263, 69817406, 67824803, 66115321, 64644508, 63283596, 61747462]
4704F1747462j817042j958991j958269j856230j570351j263522j050837r06359
4696D9365861q51420p29436m58986k04792n4352j40991l82486n61712n63421o81230
4686D4737035j035139j772831k506553k922955k887560k569097k147895j752313
4678B7142692j417866j177944j074021j007295r77796r31387q96593q11267p48317
4669A8100206p44241o85953o61067o39101n97298n55888n45992n25855m91335
4660A2653476m99635m63663m08242m29326m07924l84825l59916l41486l15708
4651I042751k66108k85119k44111j82657j87858j52589j08137j32640j03604j19317
4641G260611j01262o2203p7887j13844j11614n7545k0896o7241o5116j6830r1502
$$ y = [61747462, 59930420, 57971429, 56013160, 54156930, 52586579, 51323057, 50272220, 49365861, 48514441, 47785005, 47326019, 47121227, 47066875, 46925884, 46543398, 45981686, 45418265, 44737035, 43701896, 41929065, 39422512, 36499557, 33611997, 31042900, 28895005, 27142692, 25724826, 24546882, 23472861, 22465566, 21487770, 20556383, 19659790, 18848523, 18100206, 17355965, 16670012, 16008945, 15369844, 14772546, 14216658, 13670666, 13144811, 12653476, 12153841, 11690178, 11281936, 10852610, 10444686, 10059861, 9699945, 9358459, 9042751, 8776643, 8491524, 8247413, 8064756, 7876898, 7724309, 7616172, 7483532, 7379928, 7260611, 7159349, 7097146, 7019259, 6905415, 6793801, 6736256, 6715360, 6648119, 6583003, 6566173, 6474671]
4630F474671p2389n1203r2460j56971j62262j84514j87265j75528j60550k05843
4620E025686j77880r8102j27457j34849j12217j15292q7751p0263j05775q0874
4610C915226m3712l4223l8656k4220m1820q4358n3428n9636r656j0306p6082n9471
4598C379658n4630l2922r1877r0699j01642j20551j12252r0059q5438r2657q4771
4587B422160m9976k0862o3054n8119p5538o5324m5026n7577n8442J894k7263l0305
4575A872568r936o9127p1584j3391R03k0326k4833k4601k9557l6821l5969j4564
4563A522762k2475l688j5605l2890k9930k6172J2494k9605n126l7620k6673j4864
4551A290608k7249q534j4811N417k8287j1477j683k4340Q498j8645k0176o587
$$ y = [6474671, 6402282, 6351079, 6258619, 6101648, 5939386, 5754872, 5567607, 5392079, 5231529, 5025686, 4847806, 4749704, 4622247, 4487398, 4375181, 4259889, 4172138, 4101875, 3996100, 3915226, 3871514, 3837291, 3798635, 3774415, 3732595, 3648237, 3594809, 3535173, 3525517, 3515211, 3439129, 3379658, 3325028, 3292106, 3200229, 3109530, 3007888, 2887337, 2775085, 2685026, 2599588, 2506931, 2422160, 2372184, 2351322, 2288268, 2230149, 2154611, 2089287, 2044261, 1986684, 1928242, 1930136, 1902873, 1872568, 1862632, 1793505, 1721921, 1708530, 1709433, 1689107, 1664274, 1639673, 1610116, 1573295, 1537326, 1522762, 1500287, 1496599, 1480994, 1448104, 1418174, 1392002, 1404496, 1374891, 1369765, 1332145, 1305472, 1290608, 1263359, 1254825, 1240014, 1245431, 1217144, 1205667, 1203984, 1179644, 1188142, 1169497, 1149321, 1142734]
4539A142734Q428k550J7565k5342k9075J2130K1053q928l5925j5942j1478j858
4527A070812L5113k7768m248n740k2933l5733j1819R93k8102N496L242J6463j4131
4514I81645r050j7912m5554Q053j6121k9402k7989J4429P921k1686R764k7064
4502H27034J772K584kk3918j2410J2558K1669l7674k7491n08k2551j8463j4760
4489G07840L8909Q406J46k3011m291k7967k4929k5527J2068K986j7333P360q365
4476F46292J147j3736l7755j3795Q404M0657l0297m2283J9352o443j2298K4035
4464E83280O755m1539r999K1015L3742j6962n799l2644R561k4915n903M256M5875
4451E66723q215o437k4182K820M631N908M9069J0921K40r442o93L2266p725N130
$$ y = [1142734, 1151162, 1148612, 1166177, 1140835, 1111760, 1123890, 1144943, 1136015, 1100090, 1084148, 1072670, 1070812, 1105925, 1078157, 1073909, 1068169, 1045236, 1009503, 997684, 998677, 970575, 976071, 979313, 995776, 981645, 972595, 954683, 909129, 917182, 901061, 871659, 843670, 858099, 866020, 844334, 854098, 827034, 828806, 831390, 831388, 807470, 795060, 807618, 829287, 791613, 764122, 763614, 741063, 722600, 707840, 746749, 755155, 755301, 732290, 727999, 700032, 675103, 649576, 661644, 664630, 647297, 654657, 646292, 647439, 633703, 595948, 582153, 590557, 631214, 600917, 558634, 577986, 571543, 559245, 583280, 590035, 548496, 538497, 559512, 593254, 576292, 570493, 537849, 547410, 522495, 516592, 520848, 566723, 558508, 552071, 527889, 530709, 535340, 541248, 590317, 601238, 601478, 592036, 591343, 623609, 615884, 621014]
4437F21014J0080L936J8967O539j2153k9484Q047J9861j7492J4253m817M330K3621
4424F66702K3672J363P346R179m8763j0338K2644J0711k0429L4949K2562p341
4412G12257J3279j2339K8583P6861O390p10k328M956k9552l440j2663k5367j3025
4399G42902r524j0259l9406o674j5138j4537L4131m867j544l6283j0401K0933
4387F49333R099n29K014k0700l809j1161k669j2132j1843Q941J9525j2248n7534
4374E56287j1517M64k0903j069K3570m537j2931j1960J5024j4481l1509K8587
4362E15025j6467m1716K0887L5511j2988k6910r130P610j0306N054K6483Q181
4350E01234J4930k127j0348L9792L8082J4872J7686L1036M067l0261q369m6799
$$ y = [621014, 631094, 635030, 653997, 660536, 648383, 618899, 626946, 646807, 629315, 643568, 638751, 643081, 666702, 690374, 691737, 699083, 708262, 659499, 649161, 671805, 682516, 662087, 697036, 719598, 712257, 725536, 713197, 741780, 818641, 825031, 824321, 821993, 826949, 797397, 793957, 781294, 755927, 742902, 733378, 723119, 683713, 677039, 661901, 647364, 681495, 676628, 675084, 638801, 628400, 649333, 658432, 657903, 659917, 639217, 635408, 624247, 621578, 609446, 597603, 606544, 626069, 613821, 556287, 544770, 545234, 524331, 523262, 546832, 542295, 529364, 517404, 532428, 517947, 486438, 515025, 498558, 456842, 477729, 513240, 500252, 473342, 464212, 471822, 461516, 466570, 493053, 501234, 516164, 514037, 503689, 543481, 581563, 596435, 614121, 645157, 649224, 618963, 610594, 563795]
4338E63795J4511J3209j1375l5037J1468k6394j1908J8400J7717o385k2194l9000
4326D86807j6760K900n245M5687k480J5923r54J314J3856J9128j487K1091m342
4313E75438j7116r398L6735r62k0247L9345k7406K3759l81q316O595K7158L3376
4300F58580J9749L0122J2925L0913J0082L4644l55j135M2716N0427O7379L3290
4288I89337K7193O0139K8789J6989Q3395P3309Q5812O5820O1699J07541J17332
4277A717355J24744R8741J51929J54290J68338J90025K14566J91940J45382K20520
4267C377830K27646K21387K98698K61955L29547L46565M50182N29985N02946N62879
4257G109620N45724N40580M86322L85360L03818K78354L08123L56534M78519N99353
$$ y = [563795, 578306, 591515, 580140, 545103, 556571, 530177, 518269, 536669, 554386, 548001, 525807, 486807, 470047, 472947, 467702, 513389, 510909, 526832, 525878, 527192, 541048, 560176, 558689, 579780, 575438, 558322, 548924, 585659, 584697, 564450, 603795, 576389, 600148, 599767, 591451, 598046, 625204, 658580, 678329, 708451, 721376, 752289, 762371, 797015, 796660, 795525, 838241, 888668, 956047, 989337, 1016530, 1076669, 1105458, 1122447, 1205842, 1279151, 1364963, 1430783, 1492482, 1600023, 1717355, 1842099, 1940840, 2092769, 2247059, 2415397, 2605422, 2819988, 3011928, 3157310, 3377830, 3605476, 3826863, 4125561, 4387516, 4717063, 5063628, 5513810, 6043795, 6546741, 7109620, 7655344, 8195924, 8682246, 9067606, 9371424, 9649778, 9957901, 10314435, 10792954, 11392307]
4247A1392307P11848Q19637R24895J053047R91816Q91771P96393N81370K96583
4238A8459667R5940J0792J8968R9488K22919M29862O30136P87385R00030R66788
4228B2621975R40140P40172M55521J17149k30542m96204n78640o42593n35492
4219B2391486l68574j77731L8229J51496K43357K98315K51153P8252j52886m03651
4209B2349446o58998q58302r30224r51451q69756p66298o40158m68915l19915
4200A5885429k84104k60903k46432k83674l42106m78739n76764o77063p01147
4191A2034497p11620o82652o16639n50165m83987m34981l62394l19048k70903
4182G602108k70148k68632k32843l14959l36645l55118l61543k69425l01097k60778
$$ y = [11392307, 12104155, 12923792, 13848687, 14901734, 15893550, 16785321, 17581714, 18163084, 18459667, 18555607, 18566399, 18585367, 18684855, 18907774, 19337636, 19967772, 20755157, 21655187, 22621975, 23562115, 24302287, 24757808, 24874957, 24644415, 24148211, 23569571, 22926978, 22391486, 22022912, 21845181, 21883410, 22034906, 22278263, 22576578, 22827731, 22905983, 22753097, 22349446, 21690448, 20832146, 19901922, 18950471, 18080715, 17314417, 16674259, 16205344, 15885429, 15601325, 15340422, 15093990, 14810316, 14468210, 13989471, 13412707, 12735644, 12034497, 11322877, 10640225, 10023586, 9473421, 8989434, 8554453, 8192059, 7873011, 7602108, 7331960, 7063328, 6830485, 6515526, 6178881, 5823763, 5462220, 5192795, 4891698, 4630920]
4172D630920k33324k28427j56889j56513j27084j03462j12102j22918j03228j12460
4162C174513p9154r8359j23772j30395m4174o3996j03340m3271q4192r6266n1722
4151B255872m9444l8301m0871r6346p5745n2066k5538p9810n7707p878m8944o3608
4139A619614l7933k1223q52j7303j7373l6076k8515k5065k6798J3763R644j5319
4127A416564p977k0741k6560k6590M551K0801j0766n1710o255l1013l9610k3100
4115A197594j6191m3960j5970l524l1585R285j0858p649L562k4725N203j5726
4103A045456l7754O882l7176p744K5578M514K7126J7115j5487J3426p614J2994
4091A047316j6711J0496J868m59r266Q152q520J3488Q668j1348M54L1859M2888
$$ y = [4630920, 4397596, 4169169, 4012280, 3855767, 3728683, 3625221, 3513119, 3390201, 3286973, 3174513, 3095359, 2997000, 2873228, 2742833, 2698659, 2634663, 2531323, 2488052, 2403860, 2307594, 2255872, 2206428, 2168127, 2127256, 2030910, 1955165, 1903099, 1877561, 1797751, 1740044, 1732166, 1683222, 1619614, 1581681, 1560458, 1559606, 1542303, 1524930, 1488854, 1460339, 1435274, 1408476, 1422239, 1431883, 1416564, 1408587, 1387846, 1361286, 1334696, 1339247, 1360048, 1349282, 1297572, 1291317, 1260304, 1220694, 1197594, 1181403, 1137443, 1121473, 1117949, 1086364, 1095649, 1084791, 1077142, 1080704, 1055979, 1061182, 1045456, 1007702, 1014584, 977408, 969664, 995242, 999756, 1026882, 1043997, 1028510, 1041936, 1034322, 1047316, 1030605, 1041101, 1042969, 1042510, 1033244, 1041396, 1032876, 1046364, 1055032, 1043684, 1044138, 1075997, 1118885]
4078A118885J4627N2353K6730K0122J5177L1979L5274O0123N6791K4195J2739
4067A468995O981K9027K5164K5747R4955O0936O6759K5017P2938N8997L7691P4748
4055B047955J1143K9285N9807j9208K1050M1112O8093J09578O4429Q4143Q2237
4044B599624O2107O9040K6591j6752J3319k1630l2229j9333L0643K2340O271O1066
4032B801057N0576M6457O2854K1454K1891l5671q327J984m1415J5397J5859P672
4020B959788L33M1592L4582M6559J3946m095M480q424L8182K8870M6979N9764
4008C262556O2288O8038M1468N4605L239P4325O9076M2083Q4255R1082P8026Q4729
3996D015770P7226Q4319R0902N6510J04856J02370Q7277O7034J03847J23107J24524
$$ y = [1118885, 1133512, 1185865, 1212595, 1232717, 1247894, 1279873, 1315147, 1375270, 1432061, 1456256, 1468995, 1475976, 1505003, 1530167, 1555914, 1650869, 1711805, 1778564, 1803581, 1876519, 1935516, 1973207, 2047955, 2059098, 2088383, 2148190, 2128982, 2150032, 2191144, 2259237, 2368815, 2433244, 2517387, 2599624, 2661731, 2730771, 2757362, 2740610, 2753929, 2732299, 2700070, 2680737, 2711380, 2733720, 2739991, 2801057, 2851633, 2898090, 2960944, 2982398, 3004289, 2968618, 2960291, 2962275, 2920860, 2936257, 2952116, 2959788, 2960121, 3001713, 3036295, 3082854, 3096800, 3092705, 3097185, 3088761, 3126943, 3155813, 3202792, 3262556, 3324844, 3392882, 3434350, 3488955, 3492194, 3566519, 3635595, 3677678, 3761933, 3853015, 3931041, 4015770, 4092996, 4177315, 4268217, 4324727, 4429583, 4531953, 4619230, 4686264, 4790111, 4913218, 5037742]
3985E037742J28877J24087R3755K01816J84902J52860J87856J22370J10151J21813
3975F466229J38768J25303Q4510R4183R1824Q0607R3999R0495Q9261N1986L4886
3964G442051Q3174R0789J40803J24545O3670L1233l8339m0545o896L8304M6634
3953G975423R3616R8009M2780P7954P1279P4550Q088k2214j1680L1651J4083J1012
3941H464551n9574q2429j02366j25827j01212l5168k2834N6875Q9653M1308J05575
3930H228552J73871K26969K23032L10046K73951K42545K54307J86244Q4529K4833
3920A0228879J1416j079j682O4895J02294J95659K33553K82311L13790L73564
3910A1803600M38158N07077N50229O25505P13667Q43992J007666J056357J126808
$$ y = [5037742, 5166619, 5290706, 5384461, 5586277, 5771179, 5924039, 6111895, 6234265, 6344416, 6466229, 6604997, 6730300, 6814810, 6908993, 7000817, 7081424, 7175423, 7265918, 7355179, 7407165, 7442051, 7525225, 7616014, 7756817, 7881362, 7945032, 7976265, 7937926, 7897381, 7890485, 7928789, 7975423, 8069039, 8167048, 8209828, 8287782, 8359061, 8433611, 8441699, 8419485, 8407805, 8439456, 8453539, 8464551, 8404977, 8322548, 8220182, 8094355, 7993143, 7957975, 7935141, 7992016, 8081669, 8122977, 8228552, 8402423, 8629392, 8852424, 9162470, 9436421, 9678966, 9933273, 10119517, 10204046, 10228879, 10240295, 10239216, 10237534, 10302429, 10404723, 10600382, 10833935, 11116246, 11430036, 11803600, 12241758, 12748835, 13299064, 13924569, 14638236, 15482228, 16489894, 17546251, 18673059]
3901A8673059J204246J181318J223667J340180J559965J862840K125317K393454
3893C1564046K624009K762000K532315J937666J135854N66915L30609L70355M79439
3884D4303208O32913R10518J267573J670877J984767K213026K223329K009755
3876E7215966J578047J093615O43232M36676L75803M06641P02402R78090J456538
3867F4887010K039397K649532L187354L505526L764594L861612L365258J974899
3859H9235182l13588k706306m163862m649230m226794l464339k683056j964797
3851F5063210j419146j029109o80236l58638k20942k57797m05729p43694j290112
3842E8657807j836903k287614k527128k362692j916666j378404r08813o11177
$$ y = [18673059, 19877305, 21058623, 22282290, 23622470, 25182435, 27045275, 29170592, 31564046, 34188055, 36950055, 39482370, 41420036, 42555890, 43122805, 43453414, 43823769, 44303208, 44936121, 45846639, 47114212, 48785089, 50769856, 52982882, 55206211, 57215966, 58794013, 59887628, 60530860, 60967536, 61343339, 61749980, 62452382, 63430472, 64887010, 66926407, 69575939, 72763293, 76268819, 80033413, 83895025, 87260283, 89235182, 88921594, 86215288, 82051426, 77402196, 73175402, 69711063, 67028007, 65063210, 63644064, 62614955, 61934719, 61576081, 61355139, 61097342, 60691613, 59947919, 58657807, 56820904, 54533290, 52006162, 49643470, 47726804, 46348400, 45439587, 44828410]
3834D4828410m15795l49495k80097k90610n90582j179038j871032k355298k538860
3825C4957603k447625k132969j834247j528399j253029j146425r95251r95238
3817B2624420r96951r22480q51283p52408o30310m88389m79294m35886l48332
3808A6719087l49363k44167k09764j88445j67974j50847j28655r4136j14663j29562
3798A4941511j69643k56049l10538m08328m48288m14021l99717l71223l21834
3789A1841870k51527j83672j50448r5997m1382q3828k4451p9480o2745q1461j26091
3778A0660788k1383l1094j01615p5218n8425l0913P036j00611j13128j40960j10114
3767I884363j28693j27905j53797q4998j15786o3796j9825m4692J5904Q4289K9980
$$ y = [44828410, 44412615, 44063120, 43783023, 43492413, 42901831, 41722793, 39851761, 37496463, 34957603, 32509978, 30377009, 28542762, 27014363, 25761334, 24614909, 23619658, 22624420, 21627469, 20704989, 19853706, 19101298, 18470988, 17982599, 17503305, 17067419, 16719087, 16369724, 16125557, 15915793, 15727348, 15559374, 15408527, 15279872, 15185736, 15071073, 14941511, 14771868, 14515819, 14205281, 13796953, 13348665, 12934644, 12534927, 12163704, 11841870, 11590343, 11406671, 11256223, 11160226, 11118844, 11035016, 11010565, 10931085, 10868340, 10786879, 10660788, 10639405, 10608311, 10506696, 10431478, 10373053, 10342140, 10349176, 10248565, 10135437, 9994477, 9884363, 9755670, 9627765, 9473968, 9388970, 9273184, 9209388, 9189563, 9144871, 9160775, 9245064, 9275044]
3756I275044Q1554P6630Q0401O2796K0072J7627Q8436J18026J66629K06903K15818
3745A0409936K78079L60879L86278L89232M14457M49626M86622N42416O43074
3736A4360599O69652P98461Q62746R90043J162550J277322J444643J673150J882204
3727B5121370K182017K438978K817122L128007L364817L625172L629106L484967
3719D9791556L198106K735940K113625J500223Q39570J98551l17253n74706o95602
3710E8790010o54354m20741q0414K59920M57683N65932M48482J45434l00836r49127
3700E8261989j531137k153732k650409l004250l314905l349341l337813l138974
3692C5781428k900682k596827k266891k015898j740626j537575j316914j198950
$$ y = [9275044, 9356598, 9433228, 9513629, 9576425, 9596497, 9614124, 9702560, 9820586, 9987215, 10194118, 10409936, 10688015, 11048894, 11435172, 11824404, 12238861, 12688487, 13175109, 13717525, 14360599, 15030251, 15828712, 16691458, 17681501, 18844051, 20121373, 21566016, 23239166, 25121370, 27303387, 29742365, 32559487, 35687494, 39052311, 42677483, 46306589, 49791556, 52989662, 55725602, 57839227, 59339450, 60179020, 60377571, 60060318, 59485612, 58790010, 58135656, 57714915, 57634501, 57894421, 58352104, 58918036, 59366518, 59511952, 59211116, 58261989, 56730852, 54577120, 51926711, 48922461, 45607556, 42258215, 38920402, 35781428, 32880746, 30283919, 28017028, 26001130, 24260504, 22722929, 21406015, 20207065]
3684B0207065j076326r42887q63604p97441p85381o83693o29613n48761n13142
3675A3366217m77010m07285l72990l22237k66526k99704k72279k53739k40339
3666A0454108k28581k32332k00163k05910j78054j72648j99290j95362j80906
3657H660862j73271j65726j69601j11751p7148j13911j11452r6812m9140p6341
3647G515709q6736o8160r4171p2548l429j8091m1074N573m872j310K7452J7381
3635G175724N662L5863M7732N0479L4043N9440N8658Q5751O8286J34666J04080
3624G860384J10783J47472J36574J29859R1641J05622M5469M3859M9815J0911
3614H732389Q944j1269K9496N1562L7206P8345M4555P3159J11046J10292P1959
$$ y = [20207065, 19130739, 18187852, 17324248, 16526807, 15741426, 15057733, 14428120, 13879359, 13366217, 12889207, 12481922, 12108932, 11786695, 11520169, 11220465, 10948186, 10694447, 10454108, 10225527, 9993195, 9793032, 9587122, 9409068, 9236420, 9037130, 8841768, 8660862, 8487591, 8321865, 8152264, 8040513, 7963365, 7849454, 7738002, 7641190, 7592050, 7515709, 7428973, 7360813, 7266642, 7194094, 7190665, 7172574, 7131500, 7137073, 7132201, 7130891, 7158343, 7175724, 7181386, 7217249, 7264981, 7315460, 7349503, 7408943, 7467601, 7553352, 7621638, 7756304, 7860384, 7971167, 8118639, 8255213, 8385072, 8476713, 8582335, 8627804, 8671663, 8721478, 8732389, 8741333, 8730064, 8759560, 8811122, 8848328, 8926673, 8971228, 9044387, 9155433, 9265725, 9337684]
3603I337684P1719Q9305J33980R4943J03470J52877K12929K21834K70692K88348
3593A0977781K81101L82083N15254N54676O70666P89714Q79252J001591J047017
3584A7099135J064835J111180J061220R37689P88429P73471O64470N51792M61320
3575B4513541M22957M29760M52137L59944K97046K17071J28617O977j92523l14755
3565B6320772m75491o25477p85366q83104r37063r96730j001446q97468p93157
3556A8925470o58707n94437m64672m16499k31303j37352q2398N2218J13655J52639
3546A6658614K85988L49190M44349N83769O78384P66053Q47837J027663J136926
3537B2778773J303507J515095J668765J895702K124790K381982K670511L012028
$$ y = [9337684, 9409403, 9498708, 9632688, 9727631, 9831101, 9983978, 10196907, 10418741, 10689433, 10977781, 11258882, 11640965, 12156219, 12710895, 13381561, 14171275, 15050527, 16052118, 17099135, 18163970, 19275150, 20336370, 21274059, 22062488, 22835959, 23500429, 24052221, 24513541, 24936498, 25366258, 25818395, 26178339, 26475385, 26692456, 26821073, 26828050, 26635527, 26320772, 25845281, 25219804, 24434438, 23551334, 22614271, 21617541, 20616095, 19718627, 18925470, 18266763, 17672326, 17207654, 16791155, 16559852, 16422500, 16340102, 16392320, 16505975, 16658614, 16944602, 17293792, 17738141, 18321910, 19000294, 19766347, 20614184, 21641847, 22778773, 24082280, 25597375, 27266140, 29161842, 31286632, 33668614, 36339125, 39351153]
3529C9351153L396811L836622M229253M677211N117469N480126N705773N800432
3521G7594850N691689N400973N176060M898855M589345M269154L788653L216590
3513A14626169K490964J684334R62755K79676l70229q65326j337876j782761k093153
3504A13594553k335200k661779k881403l215007l409138l535280l629998l639996
3496H8286752l594923l431619l135362k756703k263585j694259r29960l04279
3488G0176062L24285J131599K129434K689921K830773J954618J263083J604215
3480H4103990K553794L627959M107351L992185K996768K956135L419973L966044
3472A11724199M496447M719229M709703M467849M031524L444603K753640K214773
$$ y = [39351153, 42747964, 46584586, 50813839, 55491050, 60608519, 66088645, 71794418, 77594850, 83286539, 88687512, 93863572, 98762427, 103351772, 107620926, 111409579, 114626169, 117117133, 118801467, 119764222, 120043898, 119673669, 118808343, 117470467, 115687706, 113594553, 111259353, 108597574, 105716171, 102501164, 99092026, 95556746, 91926748, 88286752, 84691829, 81260210, 78124848, 75368145, 73104560, 71410301, 70480341, 70176062, 70500347, 71631946, 73761380, 76451301, 79282074, 81236692, 82499775, 84103990, 86657784, 90285743, 94393094, 98385279, 101382047, 104338182, 107758155, 111724199, 116220646, 120939875, 125649578, 130117427, 134148951, 137593554, 140347194, 142561967]
3464A42561967J826510J695449J966076K468995K928233L528216M277856M655409
3456A65908711M447228L249627J177148k05366j152419j864040l118082m803310
3448A63639497p199205r037322r493971r392270q644952p798441o820028n955409
3440I9297899n134136m470140l985134l572384l251642l049093k873675k850650
3432G0111045k880135k868688k889427k806072k663476k557913k436967k285305
3424D8723062k154668j931303j774824j576263j362225j189161j111570r55509
3416C6667539q28708p08569n81877n57077m61629l79527k75275j99737o6918K4658
3406C2632880J88451L33907M37677N29587N80232O12555N73240N16315M76144
$$ y = [142561967, 144388477, 146083926, 148050002, 150518997, 153447230, 156975446, 161253302, 165908711, 170355939, 173605566, 174782714, 174577348, 173424929, 171560889, 168442807, 163639497, 156440292, 147402970, 137908999, 128516729, 119871777, 112073336, 105253308, 99297899, 94163763, 89693623, 85708489, 82136105, 78884463, 75835370, 72961695, 70111045, 67230910, 64362222, 61472795, 58666723, 56003247, 53445334, 51008367, 48723062, 46568394, 44637091, 42862267, 41286004, 39923779, 38734618, 37623048, 36667539, 35838831, 35130262, 34548385, 33991308, 33529679, 33150152, 32874877, 32675140, 32608222, 32632880, 32821331, 33155238, 33592915, 34122502, 34702734, 35315289, 35888529, 36404844, 36880988]
3397C6880988L93919L43311K24772J18435n8811k26029m04245n22015n83277o00601
3387C5566447o46528o44453o17431m87951m35625l97666l81367l69915m16748
3378C1168763m99495n71526o60253p17586q02262q53678r01867r02019q91357
3369B4368720q16905p25664o05650n09624m30353l03756j64289k2713N9651Q7710
3359B0937127M1583l1330k1520j2520o244J41663K91601L60809M61167O37690
3349B2800026Q09178R54260J285425J662234K021320K242383K391283K278214
3341C6444323K213702J532274M59375r71284k388795k634661k409554j811503
3333C0433877j245688q88669o84745n75708m34006k65690j49057M0645K05015
$$ y = [36880988, 37274907, 37618218, 37842990, 37961425, 37902614, 37676585, 37272340, 36750325, 36167048, 35566447, 34919919, 34275466, 33658035, 33170084, 32734459, 32336793, 31955426, 31585511, 31168763, 30669268, 30097742, 29437489, 28719903, 27917641, 27063963, 26162096, 25260077, 24368720, 23551815, 22826151, 22220501, 21710877, 21280524, 20976768, 20812479, 20789766, 20849417, 20937127, 20978710, 20947380, 20925860, 20913340, 20907096, 21048759, 21340360, 21701169, 22162336, 22800026, 23609204, 24563464, 25848889, 27511123, 29532443, 31774826, 34166109, 36444323, 38658025, 40190299, 40649674, 39678390, 37289595, 34654934, 32245380, 30433877, 29188189, 28299520, 27614775, 27039067, 26605061, 26339371, 26190314, 26230959, 26435974]
3324B6435974L55146N10480P82829R83234J275331J666695K043994K454687K788193
3315C9296563K946450K914056K982509K275925J291057r79q57788o52781q5583
3306E0109429P88294J440372J984609K386128K633762K739640K795480K842627
3298F7720341K857563K681627K375012J894612J347481Q29812L39165o1411l91329
3289G9592873p44429j190797j597284k025763k374168k649675k810942k898955
3281F3300860k936902k995314k933471k858552k814295k656325k545579k418240
3273D1142182k288163k211178k120568j998421j991284j864222j713219j611538
3265B5343589j515371j414141j303342j186156j031589r27684q31964p60226o87544
$$ y = [26435974, 26791120, 27301600, 28084429, 29067663, 30342994, 32009689, 34053683, 36508370, 39296563, 42243013, 45157069, 48139578, 50415503, 51706560, 51705581, 50847793, 50195012, 50109429, 50897723, 52338095, 54322704, 56708832, 59342594, 62082234, 64877714, 67720341, 70577904, 73259531, 75634543, 77529155, 78876636, 79706448, 80045613, 79984202, 79592873, 78848444, 77657647, 76060363, 74034600, 71660432, 69010757, 66199815, 63300860, 60363958, 57368644, 54435173, 51576621, 48762326, 46106001, 43560422, 41142182, 38854019, 36642841, 34522273, 32523852, 30532568, 28668346, 26955127, 25343589, 23828218, 22414077, 21110735, 19924579, 18892990, 17965306, 17133342, 16373116, 15685572]
3256A5685572o36014o05963m81628m23775m44982l66389l37614l19992k53625
3247A1815590k45161k25985j95114j34382j31846o0362l2041j199N9558L7991
3237A0887049O5629Q7923N7324J7413n890o5559j09241j35233j71567j93500k24206
3226A0210142k79714k33387k50814k46387j97454k53668k29933k22931j93407
3217H102447j80852k17870k19093j63157j60881k08793j93288j64761j52367j86339
3207F255046j51385j56225j50376q5623j24797j17411q6324p9174p0264n7260
3197E176207j8863l7644k6677l9401n8404l4001j3767q533M4098L8458Q245J7132
3185E046850R755j1443j2034M0431L923K181r564L1280o584J9178N4757L1578
$$ y = [15685572, 15049558, 14443595, 13961967, 13538192, 13093210, 12726821, 12389207, 12069215, 11815590, 11570429, 11344444, 11149330, 11014948, 10883102, 10822740, 10790699, 10789500, 10849058, 10887049, 10952678, 11040601, 11097925, 11115338, 11109448, 11043889, 10934648, 10799415, 10627848, 10434348, 10210142, 9930428, 9697041, 9446227, 9199840, 9002386, 8748718, 8518785, 8295854, 8102447, 7921595, 7703725, 7484632, 7321475, 7160594, 6951801, 6758513, 6593752, 6441385, 6255046, 6103661, 5947436, 5797060, 5711437, 5586640, 5469229, 5382905, 5303731, 5233467, 5176207, 5157344, 5119700, 5093023, 5053622, 4995218, 4961217, 4947450, 4938917, 4983015, 5021473, 5029718, 5046850, 5056605, 5045162, 5033128, 5073559, 5077482, 5079663, 5070099, 5101379, 5094795, 5113973, 5168730, 5200308]
3173E200308M193N98O6052J6591N7990K8049k6402J8318J9829l3341k5749m2990
3161E283446p6063j15629l9605n2917k4688n8977m4642l0388K7815J8893K2026
3150D909271K7336M7116L0566L3996L7103O4609M817j9396J0092k753j9316k9189
3138E094252M7850j0016l4904p394l0661J8736M2644N8872P5101N8520P7550N2345
3126E442895L4353N5772Q7652Q3780L3806P2362J19391J10155L8603Q1747J29907
3115F290423J00453J28608J06376J43690J10551K03356J72755J89001J80389J84536
3105G810138J95660K39475K23879K21765K70347K48352K59773L18674L24431L85101
3095A0497595M02037M98354M92648N55322N73628O41317P28998Q08317R48426
$$ y = [5200308, 5204501, 5205099, 5271151, 5287742, 5345732, 5373781, 5347379, 5365697, 5385526, 5352185, 5326436, 5283446, 5207383, 5091754, 5052149, 4999232, 4974544, 4915567, 4870925, 4840537, 4868352, 4887245, 4909271, 4936607, 4983723, 5014289, 5048285, 5085388, 5149997, 5154814, 5135418, 5145510, 5142757, 5123441, 5094252, 5142102, 5132086, 5097182, 5089788, 5059127, 5077863, 5120507, 5179379, 5254480, 5313000, 5390550, 5442895, 5477248, 5533020, 5620672, 5704452, 5738258, 5810620, 5930011, 6040166, 6078769, 6160516, 6290423, 6390876, 6519484, 6625860, 6769550, 6880101, 7083457, 7256212, 7445213, 7625602, 7810138, 8005798, 8245273, 8469152, 8690917, 8961264, 9209616, 9469389, 9788063, 10112494, 10497595, 10899632, 11397986, 11890634, 12445956, 13019584, 13660901, 14389899, 15198216, 16146642]
3086A6146642J038803J109117J251616J344497J460122J573972J680628J899320
3078B7504717K028048K225980K442098K683372K994364L399979L787265M321938
3070E1387761M906187N554586O251433P028317P958593Q990019J0157078J1588275
3062A13822249J3174666J5427200J8636907K2544753K6175340K9075263L2215932
3055B71072310L5727407L6034819K8558303J1902708q510876k2345910k6785283
3048C25653478k5603966k3570840k3536117k4507701k4317278k2634632k0080047
3041A61402897j7220531j4556476j2240778j0338883q781224p628224o724143
3034H3912638n995658n400673m843159m403796m026421l687484l287431k908132
$$ y = [16146642, 17185445, 18294562, 19546178, 20890675, 22350797, 23924769, 25605397, 27504717, 29532765, 31758745, 34200843, 36884215, 39878579, 43278558, 47065823, 51387761, 56293948, 61848534, 68099967, 75128284, 83086877, 92076896, 102233974, 113822249, 126996915, 142424115, 161061022, 183605775, 209781115, 238856378, 271072310, 306799717, 342834536, 371392839, 383295547, 374784671, 352438761, 325653478, 300049512, 276478672, 252942555, 228434854, 204117576, 181482944, 161402897, 144182366, 129625890, 117385112, 107046229, 98265005, 90636781, 83912638, 77916980, 72516307, 67673148, 63269352, 59242931, 55555447, 52268016, 49359884]
3026D9359884k612473k437937k233896k025610j832514j664663j521429j419040
3018C3612322j407302j324544j267645j193152j174286j106491j062043r40605
3010B4136254q99274q55383q30200p56845p76917p21657o45347o14139o00915
3001A7435577n53778n32114n18683m85749m63463l85213l67878l69064m06816
2992A3352819l51168l74361l18055l20118l13208k97888l10501k99566k73348
2983A0494606k70071k55344k65424k57314k38590k46664j88593j88091j68201
2974H416314k07154j79619j54632j41316j47720j62487j77320j45612k03088j56500
2964F740866j51584j58776j31155j20503j21947r1509p4145r2536r0383p3880
$$ y = [49359884, 46747411, 44309474, 42075578, 40049968, 38217454, 36552791, 35031362, 33612322, 32205020, 30880476, 29612831, 28419679, 27245393, 26138902, 25076859, 24136254, 23236980, 22381597, 21551397, 20794552, 20017635, 19295978, 18650631, 18036492, 17435577, 16881799, 16349685, 15831002, 15345253, 14881790, 14496577, 14128699, 13759635, 13352819, 13001651, 12627290, 12309235, 11989117, 11675909, 11378021, 11067520, 10767954, 10494606, 10224535, 9969191, 9703767, 9446453, 9207863, 8961199, 8772606, 8584515, 8416314, 8209160, 8029541, 7874909, 7733593, 7585873, 7423386, 7246066, 7100454, 6897366, 6740866, 6589282, 6430506, 6299351, 6178848, 6056901, 5965392, 5891247, 5798711, 5708328, 5634448]
2954E634448k1510m5400k6978l7182o8833o6182o1629q4812r3205j17042j18569
2943D893106q1967j29284j06953p7644q7402q3916q3583l4421k2554l5559l4839
2932D114984m0662n8205o4572k6795j1759K140l4255n2659l7807m5825j5423k9502
2920C699660m6091m7286m2888R997O153k4641m5749k9836k4503l657n8244n6779
2908C336136m6645k7503O965k7903m8278l0986m7921n2442p7199o0024j7975q3174
2896B823051m3669o1232l5762o5015o7338l1788k4593l6339n9032q5779l6269
2885B276235k1617j8941q8977l3486K277j1310o766K1507j0651j0013m8514l1829
2873B017915L7557Q532m8324q997J9146j6196K3458Q77J9920K4419k7241k857
$$ y = [5634448, 5612938, 5567538, 5540560, 5503378, 5434545, 5368363, 5306734, 5221922, 5128717, 5011675, 4893106, 4811139, 4681855, 4574902, 4497258, 4409856, 4325940, 4242357, 4207936, 4185382, 4149823, 4114984, 4074322, 4016117, 3951545, 3924750, 3912991, 3915131, 3880876, 3828217, 3790410, 3744585, 3729162, 3699660, 3653569, 3606283, 3563395, 3573392, 3579545, 3554904, 3509155, 3479319, 3454816, 3451159, 3392915, 3336136, 3289491, 3261988, 3268953, 3241050, 3192772, 3161786, 3113865, 3061423, 2984224, 2924200, 2906225, 2823051, 2779382, 2718150, 2682388, 2617373, 2550035, 2518247, 2493654, 2457315, 2398283, 2312504, 2276235, 2254618, 2235677, 2146700, 2113214, 2115491, 2104181, 2097415, 2118922, 2108271, 2098258, 2049744, 2017915, 2055472, 2064004, 2015680, 2006683, 2025829, 2009633, 2033091, 2033968, 2053888, 2078307, 2051066, 2048209]
2861B048209K4325K0191k5450l2032J4582j0986n9092l7844M49J9978l9270l7885
2849A885175O712k5870n3952l9043k6379K315L3007m6100l7402K6676K5366l5354
2837A715151l935k2361M603l377L022J1721k31K7642k4191j5858j3497j802qj293
2823A675586j7428j6571M50j3861k5012k9746l7272n532k4375j4941j2731J6016
2811A494583L5934O195l2960l9721K9073m858j1936k0561K3534k6281M132M4128
2799A501262k3395j7159K3825j5686l4914M1169N3909M772j224M9338P285j4957
2787A574225L2146J5117J2861N0758L3061P009L9679N1937R4441P5777L3263J03781
2775B124055J56288J51822J44310J91523J82128J41093O0712n5718q6066j29656
$$ y = [2048209, 2072534, 2092725, 2067275, 2035243, 2049825, 2038839, 1979747, 1941903, 1942352, 1962330, 1923060, 1885175, 1891887, 1866017, 1812065, 1773022, 1746643, 1748958, 1781965, 1735865, 1698463, 1725139, 1750505, 1715151, 1711216, 1688855, 1693458, 1690081, 1693103, 1704824, 1704593, 1732235, 1708044, 1692186, 1678689, 1676887, 1676879, 1675586, 1658158, 1641587, 1642037, 1628176, 1603164, 1573418, 1536146, 1530614, 1506239, 1491298, 1478567, 1494583, 1530517, 1536712, 1503752, 1464031, 1493104, 1488246, 1476310, 1455749, 1479283, 1453002, 1457134, 1501262, 1477867, 1460708, 1484533, 1468847, 1433933, 1475102, 1529011, 1533783, 1532559, 1581897, 1589182, 1574225, 1606371, 1621488, 1634349, 1685107, 1718168, 1725177, 1764856, 1816793, 1911234, 1987011, 2020274, 2124055, 2280343, 2432165, 2576475, 2767998, 2950126, 3091219, 3151931, 3096213, 3010147, 2880491]
2765B880491j38984r4631j60348j64648j38130j24495j50563j28956o6196q3327
2755A630213m8846n7574o4746m4430k774n9762m8667k4617k9546n951k8349j1116
2743A203835k6858m3170L312l7100M895L1525j8758k5369o842Q120m0209k7132
2731A026249q64j6477j56o113k522o938k0741K9100J3281j9763k3068j2858m33
2718I58697p338K253j9837J2062l5860m2897J4563j7016m225n672k6410J1215
2706H39535N805j8893l3333j9422K3653J2468j3282l0883M4440J6859k6805j9825
2694G80317j5582N750K493l0367n500q808n9444j7738k957K849M5679K352m2803
2681F56241J1021j9285j0453J6151L0278j9133l5384n915L3302J3852k2040l0463
$$ y = [2880491, 2741507, 2646876, 2486528, 2321880, 2183750, 2059255, 1908692, 1779736, 1713540, 1630213, 1581367, 1523793, 1459047, 1414617, 1411843, 1352081, 1303414, 1278797, 1249251, 1243300, 1214951, 1203835, 1176977, 1133807, 1137119, 1100019, 1104914, 1136439, 1117681, 1092312, 1085470, 1093590, 1053381, 1026249, 1025385, 1008908, 1008752, 1002639, 1000117, 993179, 972438, 1001538, 1014819, 995056, 971988, 959130, 958697, 951359, 953612, 933775, 945837, 909977, 867080, 881643, 864627, 860402, 854730, 828320, 839535, 845340, 826447, 793114, 773692, 797345, 809813, 796531, 765648, 810088, 826947, 800142, 780317, 764735, 770485, 772978, 742611, 737111, 728303, 668859, 651121, 648164, 651013, 696692, 699044, 656241, 667262, 647977, 637524, 653675, 683953, 664820, 629436, 623521, 656823, 670675, 648635, 618172]
2669F18172k1354R379J4932K1733j0522J0128m6282o624R690k6998j1225K1229
2657E82258k221p252j7353K3287j4442J1363K0916k3810N156Q937M3487j5534
2645F14792l0916j351k2503q037J0816k3217K0611j3389M510j2683k7536M2900
2633E53997R953l460n087M608R328l7421l7406j5669J1204n971k1200R047j6086
2620D55837j8539K4067r089J2538J476k1344J5007k592M0075j4816j7708k0029
2608D44883Q250j1431l7451L6061J5961L5708k063l4414K1679j3286l0577J6827
2596D50147L2883K3171N358j4467L376M136K353k2400R129J2622k3642l2536Q57
2583D50987m149j5436k6467N856K0787k1623j6373j3293n121L2707k3039j9520
$$ y = [618172, 596818, 606197, 621129, 642862, 632340, 642468, 596186, 589562, 599252, 572254, 561029, 582258, 580037, 572785, 555432, 578719, 564277, 575640, 596556, 572746, 577902, 586839, 630326, 614792, 583876, 582525, 560022, 551985, 562801, 539584, 560195, 546806, 551316, 538633, 511097, 553997, 563950, 560490, 555403, 560011, 569339, 531918, 494512, 478843, 490047, 484076, 462876, 471923, 455837, 437298, 461365, 452276, 464814, 466290, 444946, 459953, 457361, 497436, 482620, 464912, 444883, 453133, 441702, 404251, 440312, 456273, 491981, 489918, 455504, 477183, 463897, 433320, 450147, 483030, 506201, 511559, 497092, 500468, 504604, 506957, 484557, 493686, 506308, 482666, 450130, 450987, 446838, 431402, 404935, 410791, 431578, 409955, 393582, 380289, 375168, 407875, 384836, 365316]
2571C65316m39L926q781l276K0701K0239k3202j7465J0423q205J6901K5260j4470
2558C86928N020j9540O773K7630k9838K9387N247j9225k1160R630K1533j435j3567
2545C87383J337j7158M465R886j9737J0333K6419j295j2967j3472J67k5626r593
2532C40142Q675K4236J3110m4543o335M4448m520K5446m4125k3655j7501M8671
2520C64049p991j0013r044j229L8770j4428m682L376k9672l0634K4900P591n847
2507C25146o168j8578j6446N227m880J2184J0235k2549L2330L8733l8797j5558
2495C00879L2218k5617p661n663j904l798R459J1401l5015L4453J4098m461k5853
2482B92536l978N725J0451K7538q846K5390j98o0994j7394j0554J1337J5471L3384
$$ y = [365316, 364877, 368803, 360022, 356746, 377447, 397686, 374484, 357019, 367442, 359237, 376138, 401398, 386928, 391948, 372408, 379181, 406811, 376973, 406360, 411607, 392382, 371222, 380852, 402385, 400950, 387383, 388720, 371562, 376027, 385913, 366176, 376509, 402928, 401633, 388666, 375194, 375361, 349735, 340142, 348817, 373053, 386163, 341620, 335285, 379733, 375213, 400659, 356534, 332879, 315378, 364049, 356058, 346045, 337001, 335772, 374542, 360114, 355432, 358808, 329136, 298502, 323402, 330993, 325146, 318978, 300400, 283954, 289181, 284301, 296485, 306720, 284171, 316501, 355234, 316437, 300879, 333097, 307480, 299819, 294156, 292252, 288454, 297913, 309314, 274299, 308752, 322850, 318389, 292536, 288558, 294283, 304734, 332272, 323426, 348816, 348618, 287624, 270230, 259676, 271013, 286484, 319868]
2469C19868r433k650k1121j4685P301o643K250J8035J2381m968l6643k974L7213
2456B97931j2935P932K8885l2340k2052m85R028p501j983j4239j44O281l005K585
2442B57958J6248n597k4166n577j4097P477K1571P578p935Q309j217J5480q371
2429B67661R725k3689j3554J4061k2896L49k7844R432j6481j6462Q649l9750M2718
2416A91919N6862k7723m138k2045n349L4099M9560J5350l4940J0383K0126K3253
2404C07357k7528l1853K5172K15l0823N157K9021J5878l4517q1j9228j555K17
2391B37432n742p468l502J0795J6181j0322J5446J0702J0842J5728K9218o90j7479
2378C01141k4309k9984j2290J48Q713n609j8196k0322K1061K0781L5491k5620
$$ y = [319868, 310435, 307785, 286664, 271979, 279280, 272637, 274887, 292922, 305303, 300335, 263692, 260718, 297931, 284996, 292928, 321813, 289473, 267421, 266936, 275964, 268463, 266480, 252241, 252097, 258378, 255373, 257958, 274206, 268609, 244443, 238866, 224769, 232246, 253817, 261395, 253460, 261769, 260552, 276032, 267661, 277386, 253697, 240143, 254204, 231308, 231657, 203813, 213245, 196764, 180302, 188951, 149201, 191919, 248781, 221058, 216920, 194875, 189526, 223625, 273185, 288535, 253595, 263978, 284104, 307357, 279829, 247976, 273148, 273363, 242540, 247697, 276718, 292596, 258079, 257998, 238770, 237215, 237432, 231690, 224222, 220720, 231515, 247696, 237374, 252820, 263522, 274364, 290092, 319310, 318620, 301141, 276832, 246848, 234558, 234706, 243419, 237810, 219614, 199292, 220353, 241134, 276625, 251005]
2366B51005j002J527p224k6563J7105J3114p109j5726L2796M5426j7456K2504
2354C08397j8570k4593J3690r945J3340o079k834K8683o467k9643J9257Q32k805
2341B83263N0918k924j6090L3270j4558k8532J2579K6876q478O118J5713Q573
2329C66728J7029M3542j2404l1112R436K5157O949O289L3715J5071K3627P3287
2317E77314K3531K9877K8724O2399L4644K6667L7075N2919O1697J12037P3898
2306A120782J02775J42265J55015J37063J46249J42257J62545J91397K43609J94720
2296B738677L12131M59645O21947P84561P56347P40712J064576J236721J067996
2287I783313L18852j095002j351295j301950j070058q79472o25164m81553l14405
$$ y = [251005, 250003, 251530, 244306, 217743, 234848, 247962, 240853, 225127, 257923, 303349, 285893, 308397, 289827, 265234, 278924, 268979, 282319, 276240, 273406, 302089, 295622, 265979, 285236, 286068, 283263, 334181, 331257, 315167, 348437, 333879, 305347, 317926, 344802, 336324, 342442, 358155, 366728, 383757, 427299, 414895, 383783, 393219, 418376, 425325, 431614, 465329, 480400, 504027, 577314, 600845, 630722, 659446, 721845, 756489, 783156, 820231, 873150, 934847, 1046884, 1120782, 1223557, 1365822, 1520837, 1657900, 1804149, 1946406, 2108951, 2300348, 2543957, 2738677, 3050808, 3510453, 4132400, 4916961, 5673308, 6414020, 7478596, 8715317, 9783313, 10102165, 9007163, 7655868, 6353918, 5283860, 4404388, 3779224, 3297671, 2983266]
2278B983266l04631k15542j67598j59836j49876p0134q1899j16221p9844j39971
2268A497714p9301j00863q1285q5116o8385l4554l3976o8430p3731j5478m4251
2257H12344l7064k2183J026q850q0269J9728j0985m9777k19k0474m3821n1171
2245E08285k7251op574O907o970k2584K5634j6137k5704n945j1405l7779j2641
2232C66830j8991J3315N469N026k99k0656L2846p663R922k5231J2177l1566o906
2219C34273n530N512j7251k812l1136k7746k5122J6958L3857k7414J52q387K0252
2206B65606j2341l8868L1625J3888k8649l4306L7477n190j7045K0743K094l5373
2194A99661L884J3109l3174M576P027j2973p148K4520K7379m5317J6156k0501
$$ y = [2983266, 2678635, 2463093, 2295495, 2135659, 1985783, 1915649, 1833750, 1717529, 1637685, 1497714, 1418413, 1317550, 1236265, 1151149, 1082764, 1048210, 1014234, 945804, 872073, 856595, 812344, 775280, 753097, 754123, 745273, 665004, 684732, 673747, 623970, 623751, 603277, 559456, 508285, 481034, 481028, 473454, 480361, 473391, 450807, 476441, 460304, 434600, 428655, 417250, 379471, 366830, 347839, 361154, 366623, 371649, 371350, 350694, 383540, 375877, 385799, 360568, 372745, 341179, 334273, 328743, 334255, 317004, 314192, 283056, 255310, 230188, 247146, 281003, 253589, 253741, 245354, 265606, 253265, 214397, 246022, 259910, 231261, 196955, 234432, 229242, 212197, 232940, 235034, 199661, 203545, 216654, 183480, 188056, 195083, 182110, 174962, 199482, 226861, 181544, 197700, 177199]
2182A77199j2892j8588J5218K9297m2497J2687J2408k0545K0231K2986r042K6450
2170B12912N464l9383j5645M840P482q102J3389J8741R385J5409N701N661l4459
2157B01395r164l6235M09k6285L177K5040k3462J9784J9010K103n076J6479k145
2144A85030k2740l744j0850q252J9374J2177k8199k2283n055m977M7168L968m5809
2131A15808p836n121N2389k876j9922p536k2998L5977l0768p970J0798l165j116
2118A05664N0M4682j6150m488k8118m5155M8859K378L909J0198J9584j6474j6594
2105A08345j8388l910L4047J3374l0132l232J7741k0655K1905l2925J745Q317
2093I6232k0163R382N692j1753J8058q799J3110J7743p138k6069J6268L5911j7434
$$ y = [177199, 164307, 145719, 160937, 190234, 147737, 160424, 172832, 152287, 172518, 195504, 186462, 212912, 218376, 178993, 163348, 168188, 175670, 167568, 180957, 199698, 209083, 224492, 230193, 235854, 201395, 192231, 155996, 156405, 130120, 133297, 158337, 134875, 154659, 173669, 175772, 170696, 187175, 185030, 162290, 158546, 147696, 139444, 158818, 170995, 142796, 120513, 115458, 110481, 157649, 161617, 115808, 107972, 102851, 155240, 152364, 132442, 124906, 101908, 137885, 107117, 99147, 109945, 106780, 105664, 105714, 150396, 134246, 129758, 101640, 56485, 105344, 107722, 111631, 121829, 141413, 124939, 108345, 89957, 86047, 120094, 133468, 103336, 100104, 117845, 97190, 119095, 86170, 87915, 96232, 76069, 85451, 91143, 79390, 97448, 88649, 101759, 119502, 112364, 86295, 102563, 138474, 121040]
2080A21040N392l3897O1J2483J8429n3000j6949M1504k2134K686K4564M3774j3746
2067A30207Q796n5029j5305J8206o38J7548k5199j7986O82Q327M2084k4586P111
2054I4218j4058J0544R308K238q666k7724k080p810J3809r074L2822M466r763
2041H8230j1895j5064L9597R576l4039q544K0750M620l8533J6686p298k1341J0628
2028E3373N4170J3825l709J2037k4535m7516J3385M5382J1179j3170l850L35p805
2015A03101J3533M619k9811l5644l2323l1904M6523K3237j6215L697J8141o304
2003F0650P770j7883L034n691o779J969J4644j9996r468j6171j0470K7415J1888
1990D0912N9186R319j0674l4675k9562l2994J2911J3495j3481O524K2607N376
$$ y = [121040, 126432, 92535, 92596, 105079, 123508, 70508, 53559, 95063, 72929, 75615, 100179, 143953, 130207, 139003, 83974, 68669, 86875, 86237, 103785, 78586, 60600, 61282, 69609, 111693, 87107, 94218, 80160, 90704, 100012, 102250, 93584, 65860, 63780, 55970, 69779, 60705, 93527, 97993, 88230, 76335, 61271, 100868, 110444, 76405, 67861, 88611, 93231, 54698, 71384, 64086, 42745, 53373, 107543, 121368, 117659, 129696, 105161, 57645, 71030, 116412, 127591, 114421, 110571, 110906, 103101, 116634, 121253, 91442, 55798, 23475, -8429, 38094, 61331, 45116, 48813, 66954, 60650, 68420, 50537, 53571, 47880, 41101, 43070, 57714, 37718, 28250, 12079, 1609, 29024, 40912, 100098, 109417, 98743, 64068, 34506, 1512, 14423, 27918, 14437, 20961, 43568, 48944]
1978D8944j4267J2246p855j5664k9251o070J8594K5329J339P152L0691K3083j2785
1965H1486J0340K122j5984j2893l0771L419j4137K5164l070K4042m478k8070J2652
1952D9822m519Q732K9899j2010k9806k2289L0052L135l3717L3773n659j2980O009
1939D0442K903R387K8887k9846j7827k3385j0465L4836l2613K1913j7395l2232
1927b5395K7253R474O985k4090j0903J5432J3847J9016k300K6737k1613K0568
1915E5011m747q860k1425J4516j2171K1415J3670k9526k4134L1503Q455K3837
1903F7544J154j3336k0488J6385m5965J4745K5664j9124J6409k5804N908K4386
1891D7478m80Q629K7548l1648L3564k7729J0662j4608J9735k7483j6338j3734
$$ y = [48944, 34677, 46923, 39068, 23404, -5847, -11917, 6677, 32006, 33345, 40497, 71188, 94271, 81486, 91826, 93948, 77964, 65071, 34300, 37719, 23582, 48746, 45676, 69718, 65240, 37170, 49822, 45303, 54035, 83934, 71924, 42118, 19829, 49881, 53016, 19299, 53072, 47413, 34433, 40442, 43345, 52732, 81619, 51773, 33946, 10561, 96, 34932, 2319, 24232, 6837, -25395, 1858, 11332, 18317, -5773, -16676, -1244, 12603, 31619, 29319, 56056, 34443, 55011, 50264, 41404, 19979, 34495, 22324, 43739, 57409, 27883, 3749, 35252, 43707, 67544, 68698, 55362, 34874, 51259, 5294, 20039, 45703, 26579, 42988, 17184, 23092, 47478, 46998, 55627, 83175, 51527, 85091, 57362, 68024, 53416, 73151, 45668, 29330, 15596]
1879A5596L2769K7746j8288L095k7319Q097J8463j6381K1636M203l72M329o139
1866F7435q499j8071r994k9649r461J9302J3787L2069k0188J2581k0371M7918
1854G6859j4364m5928Q175N259J682k8114j0596K5662K0263l2079k0495L3209
1842A9533K0751p488j3329N669L840J0910Q014k3164Q800J2542q39q913K1792
1829E8118j6794O345n344k9605j2867j2915J1458J8211k9385J2368K8633j6287
1817A1936N0360m353m2351k0470M2130j9967m5242O6904J3635l703k2088o338
1805B0453l906n823J6735J2768l9329j2046K7398R510p965P099l4445j9007J2302
1792a6256K3820J8830j7532n045j6704K0804J6517J5437q330L841k0040K2666
$$ y = [15596, 48365, 76111, 57823, 60918, 33599, 41696, 60159, 43778, 65414, 69617, 69245, 73574, 67435, 58936, 40865, 30871, 1222, -8239, 11063, 24850, 56919, 36731, 49312, 28941, 76859, 62495, 16567, 24742, 30001, 31683, 3569, -7027, 18635, 38898, 6819, -13676, 19533, 40284, 32796, 19467, 25136, 28976, 39886, 47900, 24736, 33536, 46078, 45239, 36326, 58118, 41324, 47669, 42325, 12720, -147, -13062, -1604, 16607, -12778, -410, 28223, 11936, 62296, 57943, 15592, -4878, 37252, 17285, -27957, 38947, 52582, 48879, 26791, 20453, 16547, 10724, 27459, 40227, 898, -11148, 16250, 25760, 17795, 24894, -9551, -28558, -16256, 7564, 26394, 8862, 3817, -12887, 7917, 24434, 39871, 31541, 35382, 15342, 38008]
1780C8008J079m133j2087j9867K2288k1045k9547N0150J4450p52q763k0923J7095
1767B5953P242n982j2481J2376k631K734j2208M202K0637L18n750N967p290j6203
1753A6884j8035J0045J6443N743m523k4453J591J1946k4947J1333K0718K4403
1741D7148k2184J0097l3705j9008r713K7147M980k7869L9220o433j2091j039J6895
1728A3445N889j3148j4959k5367K1656K0931K0366J256j2276n496o464j6200J8239
1715G872L5764l9116j1674L4067L9669k9526j3238J6753k5822k8658R574Q686
1703D351N297k112j9189K9626L256J1636M451M561l7578k3551J2160j7705j264
1690b6061K0645q103K4951K505J6345P796j5317J4324K744j6272J5439j2967q920
$$ y = [38008, 39087, 34954, 22867, 3000, 25288, 4243, -25304, 24846, 39296, 38544, 29781, 8858, 25953, 33195, 27213, 14732, 27108, 24477, 27211, 15003, 19205, 39842, 40160, 34410, 40377, 33087, 16884, -1151, 8894, 25337, 31080, 26557, 2104, 3695, 15641, -9306, 2027, 22745, 47148, 24964, 35061, 1356, -17652, -27365, -218, 4762, -23107, 16113, 9680, -2411, -3450, 13445, 19334, 6186, -8773, -34140, -12484, 8447, 28813, 30069, 17793, 12297, 5833, -10367, 7872, 43636, 4520, -7154, 26913, 66582, 37056, 23818, 40571, 14749, -13909, -4335, 4351, 9648, 7536, -11653, 17973, 21229, 32865, 37316, 41877, 4299, -19252, -7092, -24797, -26061, -5416, -13519, 11432, 13937, 30282, 38078, 22761, 37085, 39829, 23557, 38996, 26029, 17109]
1677A7109L0433K2255m3176j4918J422l332r168m2841K5298l672J9879K0914J6635
1664C6838m593l56l2435j2717K0232J7048l5745k1262o060J499o021Q84L1868
1651a0820j2582N020j0914j2858r20q763N3966K2162p386n091j8685j6653k476
1638b6000q955q008M6141J0752m5521K1366p81k8104j0204N619M061K422M3148
1625E936j0765j9852K2628J6914N799j8415J3313l8055p373L2770J3004k2831
1613f927j1746K2194J0395J9420k3368m2757j1390J5487k3875N160K4164J3754
1601i489J4800k3766L839J8477l488Q124K992j4867j3491l3241m726j5533K5553
1588d4816J7792K8728j7130r389P569L3254j1791N710j8872o532K2620m7384O349
$$ y = [17109, 47542, 69797, 26621, 11703, 13125, 9793, 625, -42216, -16918, -20590, -711, 20203, 36838, 32245, 31889, -546, -13263, 6969, 24017, -11728, -32990, -39050, -37551, -43572, -42688, -10820, -23402, -18382, -29296, -42154, -43074, -51837, 2129, 24291, 16905, 11814, -6871, -23524, -26000, -34955, -42963, 3178, 13930, -31591, -10225, -11006, -39110, -49314, -43695, -39634, -37212, 5936, -4829, -24681, -2053, 14861, 20660, 2245, 15558, -22497, -29870, 2900, 15904, -6927, -18673, 3521, 13916, 33336, 9968, -32789, -44179, -28692, -52567, -47407, -23243, -9489, 5311, -18455, -14616, 3861, 373, 8497, 11489, -3378, -16869, -50110, -54836, -70369, -44816, -27024, 1704, -15426, -24815, -17246, 16008, 4217, 9927, -8945, -15477, 7143, -40241, -33892]
1575c3892M974J6913j9257N900M969K3866J8026j8005P466k0244k8478O081J8606
1562a3075j250K987J8843j8602K455l3706r676K1563K5967J4266j1342k3134j1
1549b4715L2815l1317k5951K6646K5772J7046l8822j4122k3293k408L2790L0720
1537E161j3849o327N041r334J708k1777J7486M692j5945M2648N621l6128J727
1524a9276J8527J2936q588J0209J3800Q780n5629j9013K4036M8691L5895n0123
1512B0245m4905p568J3697p022N00l030L3194j8186N379j1862l8443K6097K7899
1499d005o59p657j9442R143k0807J2662k6151o7J2629j724K4741q007j5425p708
1485e2477L2946K1339j1510j8672R902P823N101j1484j3218j3413M002J6576J0006
$$ y = [-33892, -28918, -12005, -31262, -25362, -20393, 3473, 21499, 3494, 10960, -9284, -37762, -31681, -13075, -14325, -11338, 7505, -11097, -8642, -42348, -52024, -30461, -4494, 9772, -1570, -24704, -24715, 8100, -23217, -49168, -22522, 3250, 20296, -18526, -32648, -55941, -58349, -25559, 5161, -8688, -15015, -9974, -19308, -17600, -39377, -21891, -17199, -33144, 9504, 15125, -21003, -19276, -749, 12187, 3599, 13808, 27608, 36388, -19241, -38254, -14218, 34473, 70368, 20245, -24660, -32228, -18531, -25553, -25053, -28083, 5111, -13075, -7696, -19558, -58001, -31904, -4005, -4664, -12321, -31763, -22620, -43427, -30765, -56916, -56983, -44354, -46078, -21337, -29344, -44769, -52477, -19531, 1808, -9702, -28374, -18472, -10649, -5548, -17032, -30250, -43663, -39661, -23085, -13079]
1472a3079L6516p727J154j3426L197j4848K09N44j3281j9901r68K0875j1932K5000
1458g667j6458J3666M284J7747N958O129n0275r541M887R074L019j1439j4051
1445d4667j9115k2636L8504p588l1521M7889m390M1065N479k8071n011n557K5501
1432a0118M677n939J6848j017m4815j689j1525n170K5218l407n638j8715O255
1419e5035K1002r118K5693P470l2340Q616j0451o936N1257j5467q483L3147j8231
1406h876l070l0448O889J2405L451k4565R183p524K4090Q315j6270L6725p613
1393B692R579Q238k0557l6623J2853n2K0648J3371j4318k1622J5486J9972l069
1380F598j1548p003n1030k5554M0885K2026O622o301j7244j240j114J51K6943
$$ y = [-13079, 23437, 15710, 16864, 3438, 6635, -8213, -8004, -7460, -20741, -40642, -41610, -20735, -32667, -7667, -24125, -10459, -6175, 11572, 17530, 23659, -26616, -36157, -31270, -22196, -19177, -30616, -44667, -63782, -86418, -47914, -55502, -87023, -39134, -43524, -2459, 3020, -25051, -30062, -35619, -10118, -5441, -11380, 5468, 4451, -40364, -42053, -53578, -58748, -33530, -36937, -42575, -61290, -55035, -34033, -43151, -17458, -9988, -42328, -33712, -44163, -51099, 158, -15309, -23792, 9355, -8876, -11946, -42394, -35505, -23100, -19649, -44214, -35031, -42555, -18465, -10150, -26420, 10305, 2692, 12271, 20509, -48, -36671, -23818, -23870, -3222, 10149, -4169, -25791, -10305, 9667, 6598, -4950, -11953, -62983, -88537, -47652, -25626, -19004, -25305, -42549, -43789, -44903, -44752, -17809]
1367a7809k7707k9431M9315L3211k9083j6990J8226k8375J2599r387J7746o22
1355b8307k4915L8375K5928m3846j4636K6108J70o29P917R187j4143p653j8383
1342d4827j9072J5235K0729K4716l250j9033J1807n135K7210l4157m364L079J1333
1329a5729L2981j6415l1003j5063P136J467J5291K8696Q781k6235K536k710j1731
1316b1998j702J4705J2246k608j0410m9328P082k793K6039J411k4462J6617J5174
1303b0027q410k5143Q127K6863j3630o170M970J9070Q169R536k334k0603R657
1290i925J3232P040j4311j8145k2155k14k0318m828K2988l507K6568J4085j9398
1277b8888j1674k3591L796J9322l590L3377l923J998l5833J1395J7404Nj692q394
$$ y = [-17809, -45516, -74947, -25632, 7579, -21504, -38494, -20268, -48643, -36044, -45431, -27685, -28307, -53222, -14847, 11081, -32765, -47401, -21293, -21123, -21752, -13835, -4648, -18791, -26444, -44827, -63899, -48664, -27935, -3219, -6469, -25502, -13695, -18830, 8380, -25777, -30141, -27062, -15729, 17252, 837, -30166, -45229, -38093, -36626, -21335, 7361, 16142, -10093, -7557, -10267, -21998, -23700, -8995, 3251, 643, -9767, -59095, -52013, -54806, -28767, -27356, -51818, -35201, -20027, -28437, -53580, -45453, -18590, -32220, -38390, -33420, -14350, -6181, 3355, 1021, -19582, -9925, 3307, 10347, -3964, -22109, -44264, -44478, -64796, -69624, -46636, -50143, -23575, -9490, -28888, -40562, -64153, -60357, -41035, -44625, -11248, -15171, -13173, -49006, -37611, -20207, -20202, -21894, -30288]
1263c0288l0932J7812M5233m006Q382J0015L927j8967K0997l3651j8360K373J1417
1250a6048J1986N110j0488l962k3329L1701j5268n120k1631J8733J052l465j10
1237c0839K1790J6177l6216K0755j08k874k3269N746K6710l2360l8400M3817k3432
1224e2503M9619k712l3564j7096j9534K8417K3542k5537J2923K8859m073k7400
1212c9059q220O494q469J0271J9400L642j2896j9757j4696J1652J6695J1466l269
1199b6746J8889j7111P504j7215J823K3701J1873l6913r844K6395J0702r752J6232
1186d62q619k9503K4478J1184j2933J3635J0822j7892L000j6135l1865n60K2341
1173c2509j0087M007J4632l126n507R179j2546O264r627J7421K223o308J7141
$$ y = [-30288, -61220, -43408, 1825, -2181, 6201, 16216, 20143, 1176, 22173, -11478, -29838, -27465, -16048, -4062, 1048, -9440, -13402, -36731, -5030, -20298, -25418, -47049, -28316, -27264, -30729, -30839, -9049, 7128, -29088, -8333, -8441, -11315, -34584, -28838, -2128, -34488, -72888, -29071, -52503, -2884, -5596, -39160, -56256, -75790, -47373, -23831, -49368, -36445, -7586, -11659, -39059, -47279, -40785, -49254, -38983, -19583, -15941, -28837, -48594, -63290, -51638, -34943, -23477, -26746, -7857, -24968, -17464, -34679, -32856, -9155, 2718, -34195, -44039, -17644, -6942, -16694, -462, -9081, -38584, -14106, -2922, -15855, -2220, 8602, -9290, -6290, -22425, -54290, -54850, -32509, -42596, -38589, -23957, -27083, -32590, -23411, -35957, -29693, -39320, -21899, -19676, -25984, -8843]
1160h843m895j5017j6932K1351r020k1297Q899J2374J4174j938j199k4212j9856
1147f6411L0809j059J2278J3939J1653n738k7446m461K9967r423J4220j9275l8727
1134e9674N388K5601M3457K607k9059k6200l0857J7726O2123j4286l0459M871
1122b8762K6989j9359m346M59M977m34k395M835n674j518k5793J3000K2495J7334
1108A808k963M970J1947k1899J9130k0519k4519j2837j3701J226Q114N8159L1888
1095D0804l1388k7903R086J1228k416m4083J0246J6153J9081L0524J1225j2231
1083C0326k294k525j2559r373j7898k8166M775k5312N4386K9204j1658k158j9826
1070a3078m910J1726j3419m2556K9883K2515O645Q288k0451J9109J9139K3985
$$ y = [-8843, -13738, -28755, -45687, -24336, -33356, -54653, -45754, -33380, -19206, -21144, -22343, -46555, -66411, -35602, -36661, -24383, -10444, 1209, -4529, -31975, -36436, -6469, -15892, -1672, -20947, -59674, -54286, -28685, 14772, 17379, -11680, -37880, -68737, -51011, 11112, -3174, -33633, -28762, -1773, -21132, -25478, -25019, -20042, -20476, -22871, -18036, -23710, -25228, -51021, -38021, -15526, 1808, -1155, 3815, 15762, -6137, 12993, -7526, -32045, -44882, -58583, -57357, -49243, 8916, 40804, 9416, -18487, -9401, 1827, -589, -44672, -34426, -18273, 808, 31332, 42557, 30326, 28032, 25507, 12948, 3575, -14323, -42489, -37714, -63026, -8640, 20564, 8906, 6748, -13078, -17988, -6262, -19681, -62237, -32354, -9839, -3194, 5094, -15357, 3752, 22891, 46876]
1058D6876j0889l3265p191l352p660J5678L754k9590j3231R520J099k8984L4824
1045b2411K1868P804k1009M089r945j9354P228K9868K5133k3044n3078J0458P781
1032c4612L9402J4681l0913l6492L0919L294R128j1477j1824q306r289L926J1318
1019c0245N054J7702Q718l54j3379l7537K5248K1514J106k799k4391J0522M994
1006a3847m352j8984L590o487J383o644K3626K2779k1048J4488j7848J8460J0634
993E750j5157l4957J0255l1296n849L4103P773j5096l3948L0593L539J67q861
980e2984K2305m203K848M907K1320k9997k4400K2758n950L297J2989L8040k6840
967a5910K0348l032j05k7807J121j4325l484L2178n705k4735J4950M1027n416
$$ y = [46876, 35987, 2722, -4469, -7821, -15481, 197, 3951, -25639, -38870, -29350, -28251, -57235, -22411, -543, 7261, -13748, -9659, -19604, -38958, -31730, -1862, 23271, 227, -52851, -42393, -34612, 4790, 19471, -11442, -47934, -17015, -13721, -4593, -16070, -27894, -36200, -45489, -41563, -30245, -25191, -7489, 1229, 875, -12504, -50041, -24793, -3279, -2173, -4972, -29363, -18841, -13847, -18199, -37183, -33593, -40080, -38697, -45341, -21715, 1064, -19984, -5496, -23344, -4884, 5750, -9407, -44364, -34109, -65405, -71254, -37151, -29378, -44474, -78422, -47829, -44290, -44123, -52984, -30679, -34882, -32034, -27127, -5807, -35804, -60204, -37446, -43396, -40099, -27110, 10930, -15910, 4438, 1406, 1301, -26506, -25385, -39710, -43194, -11016, -16721, -41456, -26506, 14521, 9105]
954I105m8719J1582p073j7535K9261K1162o644J1450J4980j7275l3434K9365k6922
941c0697j508K6839N164j7867J2885L3560j4602K0672j7129J1305r514k9344p197
928a7433N852J0807L050k4285k1867L30J274n457j925K8419m125N516N183k6354
914d1015o562J7824n1799J6924O1436k415j8679L200Q231j4707l009j416j0671
901d2658Q91L7093k8095j7755K7347O183j975R538m98j2277Q539r650j7392M0115
887e94L0902m2209Q977l3867K1963P261M776p798j3085J8051m0316J0485L4394
874a060k3441j9110L2040j6874P092l1591L3273K8234l5894k5809K8993K0993
862c154L117k7281R065J9238J2256n325j9733K020K8213k366k5100j303k901j9407
$$ y = [9105, -39614, -28032, -35105, -52640, -23379, -2217, -8861, 2589, 17569, 294, -33140, -3775, -30697, -32205, -5366, -202, -18069, -5184, 28376, 13774, 34446, 17317, 28622, 19108, -10236, -17433, -11581, -774, 2276, -22009, -43876, -43546, -42272, -47729, -49654, -21235, -25360, -19844, -14661, -41015, -47577, -29753, -81552, -64628, -3192, -5607, -24286, -21086, -12855, -27562, -30571, -31987, -42658, -41767, -4674, -32769, -50524, -23177, -16994, -18969, -9431, -9929, -22206, -13667, -23317, -40709, -594, 30308, -11901, -2924, -36791, -14828, -7567, -2791, -10589, -23674, -5623, -45939, -35454, -1060, -24501, -43611, -11571, -28445, -21353, -52944, -19671, 8563, -27331, -53140, -24147, -3154, -37, -27318, -18253, 985, 13241, 7916, -11817, -9797, 18416, 16050, -9050, -10353, -13254, -32661]
848c2661l905J8427N922m819P619j349l2929r916L1692K5878N616j3080r814k1486
834c4805O430P740J5837N625k6144L0806o039J7287j5744l0234L5397L5177q566
821C2767l8091m6753k3529K9051K9593J5834p134R678l2443O948n300l0193L119
808e6453Q455q779k787O013J4589L2985M761k2140R677K3319Q427r168k4604q010
794b3715K7501o953n9383J5026M7003r473k2911L1973j1417L6571l8088p400p11
781b1977J942J4267l1261k880J3908J8882j6054k2267L8832J2575J9695K8123
769E3785k9234j9461q121k451k3293j0029j1342L8130L907k0695n63J5077J879
756a2411j0833r368N5867o252k970j6023k0961j3615o327J6120P245J7880l1121
$$ y = [-32661, -36566, -18139, -12217, -17036, -9417, -10766, -43695, -53611, -21919, 3959, 9575, -3505, -13319, -34805, -28375, -20635, -4798, 827, -25317, 5489, -550, 16737, 993, -29241, 6156, 41333, 32767, -5324, -52077, -75606, -46555, -16962, -1128, -8262, 1416, -31027, -24079, -29379, -59572, -56453, -47998, -56777, -59564, -53551, -38962, -5977, -1216, -23356, -13679, 9640, 18067, 8899, -15705, -23715, 3786, -3167, -62550, -47524, -521, -9994, -32905, -932, -12349, 24222, -13866, -21266, -21977, -20035, -5768, -37029, -39909, -26001, -7119, -23173, -45440, -6608, 5967, 25662, 53785, 24551, 5090, -3031, -5482, -28775, -38804, -50146, -12016, -8109, -28804, -29367, -14290, -12411, -23244, -32612, 23255, 17003, 14033, -1990, -22951, -36566, -42893, -26773, -19528, -1648, -32769]
743c2769l2697J9053K1532p239J4516m136J4735Q611P573O038J1458k9444j5534
730a8303p653K0303o941j3349N625j2031L3785N061k5341j859L927L0559k5986
717a2203k6447L070Q270K7141m7929q451L2012k908j5320M5941J2796k0083o610
704a0721q396J7944n114k6553J0090J9488j2692J1763j5196R506J8185K5132j7224
691A6212l387n310m1374j1701K7617K63p472J1050k7723J9206R206l7086j4156
678f4655K1226J7233K9432O310k8635J3238J3914l9523J6192k7308R241N165j0209
665c8379J6362l187p191N578J7800k784K346j613R959k8374J004M010j883R228
651a7124K2409j8863l0733K034j727p611K8485K4016K1107j3288j8273j7966j4980
$$ y = [-32769, -65466, -46413, -24881, -32120, -17604, -21740, -7005, 1606, 9179, 15217, 26675, -2769, -18303, -25956, -5653, -12594, -25943, -20318, -32349, 1436, 6497, -18844, -20703, -16776, 13783, -12203, -38650, -35580, -27310, -169, -48098, -56549, -24537, -27445, -42765, 3176, 15972, -4111, -10721, -19117, -1173, -6287, -32840, -22750, -3262, -15954, -4191, -19387, -9881, 8304, 33436, 16212, 12825, 7515, -33859, -45560, -17943, -17680, -25152, -14102, -41825, -22619, -13413, -50499, -64655, -43429, -26196, 3236, 9546, -19089, -5851, 8063, -31460, -15268, -42576, -33335, -28170, -38379, -22017, -25204, -32395, -26817, -9017, -11801, -9455, -11068, -1109, -29483, -28479, -24469, -26352, -17124, 5285, -13578, -44311, -42277, -44004, -51615, -23130, 886, 21993, 8705, -9568, -27534, -42514]
638d2514L6526M783l08K0245j9658j885n703j9755j3072K8961J2442l9156K2454
625a6640N455M451k7860j1205j0465J522J8838n806J7128L2123L1423l1884Q743
612A5823J2870k4684r698k6p741P413j1901k7875L404J8312L5556l5178N289m634
598b3070k2461M2497m171J7432O523j1906j9814j1736L450m042l51p450J4007
585b1092L4829j3600m7960J6020J3947K6311o416n812R992j1909M656J9693k1108
572b449k8833r894K8562L1129o728l6106j6434j1397q097J3481O505K9617L2648
559B2004r719p702J127J2935J6754j8034l3731p9M5016J693j7567Q697j1966K1548
545C0976k4442j3958r083J2976k0835r749r618K8474M2268J807R542j9314l3641
$$ y = [-42514, -5988, -1205, -1513, 18732, -926, -2811, -8514, -28269, -41341, -12380, 62, -39094, -16640, -11185, -6734, -34594, -45799, -56264, -54742, -35904, -41710, -24582, 7541, 38964, 7080, 15823, 28693, 4009, -5689, -5715, -13456, -6043, -17944, -45819, -42415, -24103, 11453, -23725, -18436, -23070, -45531, -3034, -7205, 10227, 16750, 4844, -14970, -26706, -23256, -27298, -27649, -35099, -21092, 13737, 137, -47823, -31803, -17856, 8455, 2039, -3773, 6219, -5690, -1034, 18659, -2449, -31282, -41176, -12614, 18515, 11787, -24319, -40753, -52150, -60247, -46766, -40261, -10644, 22004, 12285, 4583, 5710, 18645, 35399, 17365, -16366, -16445, 28571, 30264, 12697, 21394, 9428, 30976, 6534, -7424, -16507, -3531, -24366, -34115, -43733, -15259, 27009, 28816, 38358, 19044, -14597]
532a4597m7100K6667j890L608O2678K6148j1298k1292M31l1575k3217N1026J4427
519C4016q408r411L2453k1664O431k3457L576J1581q565q537l1635m166K800R220
505a5766K5174O22r601O037j805K1038o590j018q443p653K571k6860J0316L073
491h905J7593J0080l87J8M630K4180l2907J7151J716r713l2969R976J7134r604
477G993j1002j4692J7592J1761j4081j9890P937L267q944r093N758J2554K7829
464A6989m0296j1912L5264j008Q034J5456n455O561J6480m3149j2265L2486Q562
451B5747J5925m6104J4972j1108n658K455M568j1747J1433O790J8821j2675l4721
438b1302J8850j8249j0591j2281P3191K0151k1514L3243n9541q872N5146J4328
$$ y = [-14597, -61697, -35030, -36920, -33312, 29366, 55514, 44216, 22924, 23355, -8220, -31437, 19589, 34016, 25608, 16197, 48650, 26986, 33417, 9960, 13536, 25117, 16552, 8015, -23620, -27786, -24986, -15766, 9408, 10030, 429, 6466, 4661, 25699, 19109, 18091, 9648, 1995, 4566, -22294, -11978, -8905, 8688, 18768, 18381, 18399, 23029, 47209, 14302, 31453, 33169, 23456, -9513, 463, 17597, 7993, -3009, -17701, -109, 11652, -2429, -22319, -14382, -11115, -20059, -29152, -23394, -10840, 16989, -23307, -35219, 45, -963, 7071, 22527, 17072, 23633, 40113, -3036, -15301, 17185, 25747, 41672, -4432, 10540, -568, -6226, -3771, 797, -10950, 483, 7273, 26094, 13419, -21302, -2452, -20701, -31292, -43573, 29618, 49769, 28255, 61498, 1957, -6915, 48231, 62559]
426F2559R138m8493k2843J6916o445J1695l6696l1059L1902J4045k7834l149L6686
413F422R401q015K9661K432j8961K9177j7624M508j6953Q770O812L407J8253L692
399F0982k0384k7000P903q134K478P168k2667j6911N078p559J7550R392K9589
386C7485o34j9541j0564n762K1813M1382J6727l0319j3544N843R706k9349J6077
373C9320r881j931J509J495j8829K7943m65k6566k141j3268L87K2134m2378J2430
359a0241J8956p311Q337r43J5639j6071J9702R590L0686m4723j3764K1772j7943
346A3686J003j6143q185N113r980J6354M657K4021N692m2495M142M3378k2915
333A8328j2593Q59J7572l548N77K7690k4564l237j87L3089L310j8226J1309k1229
$$ y = [62559, 71697, 23204, 361, 17277, 10832, 22527, -14169, -45228, -13326, 719, -27115, -30264, 6422, 15823, 7808, 37469, 39901, 20940, 50117, 32493, 37001, 20048, 28818, 35630, 39037, 57290, 60982, 40598, 13598, 21501, 13367, 15845, 23013, 346, -16565, -11487, -19046, -1496, 7896, 37485, 36851, 17310, 6746, 984, 22797, 64179, 80906, 50587, 37043, 42886, 52592, 23243, 39320, 29439, 27508, 29017, 30512, 11683, 39626, 39161, 12595, 10454, -2814, -2427, 19707, -22671, -10241, 8715, 1404, 9741, 8798, 24437, 8366, 28068, 37658, 68344, 23621, 9857, 31629, 13686, 14689, -1454, -9639, -4526, -14506, 1848, 6505, 30526, 36218, -6277, -2135, 41243, 18328, 5735, 6594, 24166, 20618, 21195, 48885, 24321, 21084, 20897, 53986, 57296, 39070, 50379, 29150]
319B9150k1926L8096j3586l0379L4985J2543k5501J5487J5934p508k6116J6865
307C8044n067j0575K2614J1529J4306m547j8072r637J1054K7117k7206k3539k8818
294b797l3213Q318M2096J6713l17J3497J6838k9099m726n853j2259K1735j98r686
280B1049L061J6985K159K4621j6195k929l2950J4435R123N594k0016M5314N124
267G5375j4738M3713j502n898m1004j3550j9945K3188k502N21j130k2484n761
254A4283K0795L601m679M77j575L2581k3411j2284K7708k7860M099J4802j3349
241C5188j511j106K9059j677m3601j0189L6097K406k459J1616k7477n638L7198
228E7906J0219j6673j682J2114k1741j0288r206K5376k7706k1307J8524M3995
$$ y = [29150, 7224, 45320, 31734, 1355, 36340, 48883, 23382, 38869, 54803, 47295, 21179, 38044, 32977, 22402, 45016, 56545, 70851, 66304, 48232, 38595, 49649, 76766, 49560, 26021, -2797, -36010, -27692, 14404, 31117, 30800, 44297, 61135, 32036, 27310, 21457, 9198, 30933, 30735, 21049, 24110, 41095, 43254, 67875, 51680, 48751, 15801, 30236, 39359, 44953, 24937, 70251, 75375, 60637, 104350, 102848, 96950, 55946, 42396, 22451, 45639, 43137, 43658, 42528, 20044, 14283, 35078, 38679, 34000, 34477, 32902, 65483, 42072, 29788, 57496, 29636, 33735, 48537, 35188, 33677, 32571, 61630, 59953, 16352, 6163, 42260, 44666, 42207, 53823, 26346, 20708, 57906, 68125, 51452, 49770, 61884, 40143, 29855, 20649, 46025, 18319, -2988, 15536, 59531]
216E9531l3666J8613j0890k5304L4238K3002l1393l1256N277L2913j0393J3718
204D4390J487J1847m403m3654q028j1593K8567J5965K5107l004m83j0411o15k638
190D2534j4562j3295N745J8304Q316p290j3858j4594K657k3885K0009K0091R140
177C9312j6369j3642K1179R062J295N037j3700J6415k4842l0487K9678J4003j6924
164B0017L5635P717k5456N751J4761r735j3063k2579Q443J421l469j4829j9309
151a4695J6536Q025j3003K884K6446k2457K1581M3457j521j4334n464j2418j1341
138B3696M1126j2348n899L5748j5768j7660j7910l1089M61o569J0189l0159K1594
125d588Q514Q262m836J5081l69J5519J3801k2132P221P96J6182j4511m150j0715
$$ y = [59531, 25865, 44478, 33588, 8284, 42522, 65524, 34131, 2875, 8152, 41065, 30672, 44390, 45877, 57724, 53321, 9667, 1639, -9954, 18613, 34578, 59685, 56681, 56198, 45787, 45172, 42534, 27972, 14677, 20422, 38726, 47042, 39752, 25894, 11300, 13957, -9928, 10081, 30172, 39312, 22943, 9301, 30480, 39542, 40837, 45874, 32174, 48589, 23747, -6740, 22938, 36941, 20017, 55652, 63369, 37913, 43664, 58425, 48690, 35627, 13048, 21491, 22912, 19443, 4614, -14695, 1841, 9866, -3137, -253, 26193, 3736, 25317, 68774, 67253, 52919, 47455, 35037, 23696, 64822, 52474, 46575, 82323, 66555, 48895, 30985, -104, 357, -6212, 3977, -26182, -4588, 3926, 12188, 7352, 22433, 22064, 37583, 51384, 29252, 36473, 37269, 53451, 38940, 34790, 24075]
111B4075N066K898j1863N45J1218K880j752j4690k842l38M773J6164j8118J1165
97B9181n518j9633K540O193j49l3262p123J4242J9780k6426J1166K9525l6849
84a6333l133J9584J2259K533R080J8649l3952j3546R220O332j8637J8434K79j6698
70e929p723J942l190K193j2380M863L8287J3473L56r85J50m981k6336j4490M118
55a0632M496k4842K5477J465r126r574O522L3659j0427j4711j6257j1779n471
42d1200j4063J9814J350L116J6355j0982j4555Q206P116K701J2531k520j9701
29c1832Q79q846J5048K3599l665k257q879n878k8375n178P410M294j2703Q93J3388
14d2102J9359k303k1657J4361o58K959J1947J0577j8096j9765n322p217K5659
$$ y = [24075, 29141, 32039, 20176, 20721, 31939, 34819, 33067, 18377, 15535, 15197, 19970, 36134, 18016, 29181, 23663, 4030, 6570, 12763, 12614, -20648, -27771, -13529, 6251, -20175, -9009, 20516, -16333, -19466, 118, 12377, 14910, 23990, 42639, 8687, -4859, 4361, 10693, -7944, 10490, 10769, -5929, -13652, -11710, -14900, -12707, -25087, -20224, 18063, 31536, 31892, 30907, 31057, 26076, -260, -14750, -10632, -6136, -30978, -5501, -4036, -13162, -22736, -16214, 17445, 7018, -7693, -23950, -35729, -41200, -55263, -35449, -34099, -30983, -14628, -25610, -40165, -31959, -24843, -22142, -9611, -12131, -31832, -30953, -39799, -24751, -1152, -4817, -7074, -15953, -21831, -50206, -55384, -47974, -43680, -56383, -55490, -42102, -22743, -25046, -46703, -32342, -33000, -30041, -18094, -7517, -25613, -45378, -50700, -57917, -32258]
1c2258R185
0b3073
$$ y = [-32258, -23073]
$$ Imaginary data points
##PAGE= N=2
##DATA TABLE= (X++(I..I)), XYDATA
16383a538364J8975J6400R200L6445J7842m99M2015P702J055J7238L0440L5134
16371a306417J2872J3814J8230J1480K0277K5045K0029L2786K1701j0551J1582
16360a129152L6122J4434J8619K8838Q277J4735K8013J3726j3433J5957L9235
16349i24629K2150J7868N001o15J3033K7655L9814J0633K8471M548j3538K5385
16337g44224K4775L7908J4993K6212j5386N588K6038R020K4285L670L5462K3651
16325e28008J6543J6059J7423L3438J528L700P283J8988O780J8418J4771m33K1308
16312c52202M1451J6979J1772L589K8281P084J1684L0534L2995L916J4075L6222
16300a13620J1695J4644j6235o739L0543M435K7701K1286L51M0556J6236k1172
$$ y = [-1538364, -1519389, -1502989, -1493789, -1457344, -1439502, -1440001, -1397986, -1390284, -1389229, -1371991, -1341551, -1306417, -1293545, -1279731, -1261501, -1250021, -1229744, -1204699, -1184670, -1151884, -1130183, -1140734, -1129152, -1093030, -1078596, -1059977, -1031139, -1022862, -1008127, -980114, -966388, -979821, -963864, -924629, -902479, -884611, -879610, -880225, -867192, -839537, -799723, -789090, -760619, -756071, -769609, -744224, -719449, -681541, -666548, -640336, -655722, -650134, -624096, -615076, -590791, -587121, -551659, -528008, -511465, -495406, -477983, -444545, -443017, -439317, -432034, -413046, -406266, -387848, -373077, -373510, -352202, -310751, -293772, -282000, -278411, -250130, -243046, -231362, -200828, -167833, -163917, -149842, -113620, -101925, -87281, -103516, -110255, -79712, -75277, -47576, -26290, -25939, 14617, 30853, 9681]
16288I681J1316K2779l348P585J5612K7257K94N242K8891K890K4969K7345K531
16275A83044j2383K2304K2589K8248M373j0476K8906J800Q228J2270J8463K0146
16263C27512M0336r430k1160N744P351K2714n45K6173L3671J0528j6054J1542
16251D38382J2064J8035K0260K2205L0645l4508J6879K3118l294k349n896R106
16239E44647K2518j7235K5914J7761J4385L2669J3263O359R087j2410k800Q976
16227F63134J3191M1761K215k4523J4564L288J7158R938K6613L1860k3562j743
16215G73894j2916K2091q915m187J3903n482r77L7532K5893O899j2618K2556J3864
16202H71537k7310K5117J6561J6568M518l780k2058J0984J5414L88K3021l402
$$ y = [9681, 20997, 43776, 40428, 48013, 63625, 90882, 91176, 96418, 125309, 128199, 153168, 180513, 183044, 170661, 192965, 215554, 243802, 248175, 237699, 266605, 268405, 276633, 288903, 307366, 327512, 367848, 358418, 337258, 343002, 350353, 373067, 372522, 398695, 432366, 442894, 426840, 438382, 450446, 468481, 488741, 510946, 541591, 507083, 523962, 547080, 543786, 541437, 535541, 544647, 567165, 549930, 575844, 593605, 607990, 640659, 653922, 660281, 669368, 656958, 654158, 663134, 676325, 718086, 720301, 695778, 710342, 713630, 730788, 740726, 767339, 799199, 775637, 773894, 760978, 783069, 774154, 769967, 783870, 778388, 777411, 814943, 840836, 847735, 835117, 857673, 871537, 844227, 869344, 885905, 902473, 906991, 903211, 881153, 892137, 907551, 907939, 930960, 927558]
16190I27558L076J92J3733J9799M570K2799J8034j6299L923m522N186n619j1496
16177I80934j068o077L3702L0850j6319K5330M490N564n973q769O773K821L1993
16164A084251M1375k7892j8492k222K300Q313J0831j1059j5952J4704L9867J6544
16152A142568j0033J5311j2241Q079n021O610k8058j1739k336m65M5039K1114
16140A168828j6033K0452K4678j1936o274Q661j1758m1915k8956O2840K2053l048
16128A187592K8212k4642j7307j3128k9599L3540Q132j4391J6096O233K0629O787
16116A208154m4715l567J9908L4233j8641o009K8790K934J5297j8935j9852K3947
16104A221544O778L970j2738l4194m023K3306j1830j6631L5494p481K5274p415
$$ y = [927558, 930634, 930826, 944559, 964358, 968928, 991727, 1009761, 993462, 997385, 992863, 998049, 992430, 980934, 979866, 973789, 1007491, 1038341, 1022022, 1047352, 1051842, 1057406, 1051433, 1042664, 1049437, 1052258, 1084251, 1125626, 1097734, 1079242, 1077020, 1079320, 1087633, 1098464, 1087405, 1071453, 1086157, 1126024, 1142568, 1132535, 1147846, 1135605, 1143684, 1138663, 1145273, 1117215, 1105476, 1103140, 1102675, 1147714, 1168828, 1152795, 1173247, 1197925, 1185989, 1179715, 1188376, 1176618, 1134703, 1105747, 1168587, 1190640, 1187592, 1215804, 1191162, 1173855, 1160727, 1131128, 1164668, 1172800, 1158409, 1174505, 1180738, 1201367, 1208154, 1163439, 1159872, 1179780, 1214013, 1195372, 1189363, 1218153, 1221087, 1236384, 1217449, 1197597, 1221544, 1228322, 1232292, 1219554, 1185360, 1181337, 1204643, 1192813, 1176182, 1211676, 1204195, 1229469, 1222054]
16092A222054J3192L2150J6899R4l8978O358j2988j6561K2895J483k265N2823
16080A297156l6134n631j3526n6671o136M9569K5841j6790p08O71j6229L5374
16068A256786J2771j7044Q094p983j4684J1829J2375j989j6432o843J9243P885
16056A264008N076l1617K82K3716K1596M299J2979k6151m4098L6841K4086k0842
16044A270175L3751l715j495m117j451j4349j6088M658K703J5815q976K1095N1776
16031A349782m2370k5912L2776l240k0698J2216O11m158k4027J8184O873L0391
16019A330428j2417k3105J3086M626n785j4901k3772L0105j105m511j133j6723
16007A274793j0454K1936j4912j1107K2940o287L288K920R623K211j4346k6212
$$ y = [1222054, 1235246, 1267396, 1284295, 1284389, 1245411, 1251769, 1238781, 1222220, 1245115, 1246598, 1244333, 1297156, 1261022, 1255391, 1241865, 1185194, 1179058, 1228627, 1254468, 1237678, 1236970, 1237641, 1221412, 1256786, 1269557, 1252513, 1260607, 1252624, 1237940, 1249769, 1262144, 1260155, 1243723, 1236880, 1256123, 1264008, 1269084, 1237467, 1237749, 1261465, 1283061, 1287360, 1300339, 1274188, 1230090, 1266931, 1291017, 1270175, 1303926, 1300211, 1298716, 1294599, 1293148, 1278799, 1262711, 1267369, 1270072, 1285887, 1276911, 1298006, 1349782, 1307412, 1281500, 1314276, 1311036, 1290338, 1302554, 1303165, 1299007, 1274980, 1293164, 1300037, 1330428, 1318011, 1294906, 1307992, 1312618, 1306833, 1291932, 1268160, 1298265, 1297160, 1292649, 1291516, 1274793, 1264339, 1286275, 1271363, 1260256, 1283196, 1276909, 1280197, 1283117, 1292740, 1294951, 1280605, 1254393]
15995A254393Q822N009O329J3771K4376j540p582P05N838l3707J2995k3095k9910
15982A236404J4129J9636j3219J1076K2847K5105l6772j920r498l4345J2573J7237
15970A263253K4054o143j0397J866N477R671p443p964p417J3153K747M252L985
15957A289094J705J0199K3456k2827j7852m5151J5690L391j2721M9964O593P7
15945A301618j6667j2061n416j1211L878j3585L161m164J6602M2125m335J3764
15933A313709J0818o0110l434J6215j3022M5336r045l6023K1464K3373j502j1268
15921A296511K0740Q313n0239K7288p771r00l151m633j7517k453K6504j2561k0661
$$ y = [1254393, 1263215, 1268224, 1274553, 1288324, 1312700, 1311160, 1303578, 1304283, 1310121, 1276414, 1289409, 1266314, 1236404, 1250533, 1270169, 1256950, 1268026, 1290873, 1315978, 1279206, 1277286, 1267788, 1233443, 1246016, 1263253, 1287307, 1281164, 1270767, 1272633, 1278110, 1287781, 1280338, 1272374, 1264957, 1278110, 1280857, 1285109, 1289094, 1290799, 1300998, 1324454, 1301627, 1283775, 1238624, 1254314, 1257705, 1244984, 1294948, 1301541, 1301618, 1284951, 1272890, 1267474, 1256263, 1260141, 1246556, 1249717, 1245553, 1262155, 1304280, 1299945, 1313709, 1324527, 1264417, 1260983, 1277198, 1264176, 1309512, 1300467, 1264444, 1285908, 1309281, 1307779, 1296511, 1317251, 1325564, 1275325, 1302613, 1294842, 1293942, 1290791, 1286158, 1268641, 1266188, 1292692, 1280131, 1259470]
$$ [...]
##END NTUPLES=NMR SPECTRUM
##END=
