##TITLE=1H_DE-80H_X3
 200.13MHz, d2o
 8 sc
 
 19ns.26.2.2025
##JCAMPDX= 6.0         $$ Bruker NMR JCAMP-DX V2.0
##DATA TYPE= NMR SPECTRUM
##DATA CLASS= NTUPLES
##ORIGIN= UXNMR, Bruker Analytische Messtechnik GmbH
##OWNER= pz
$$ XWIN-NMR		Version 3.5
$$ Thu Jul 31 09:48:26 2025 Russian Standard Time (UT+4h)  Yarkov@DPX200
##.OBSERVE FREQUENCY= 200.1313
##.OBSERVE NUCLEUS= ^1H
##.ACQUISITION MODE= SIMULTANEOUS
##.ACQUISITION SCHEME= undefined
##.AVERAGES= 8
##.DIGITISER RES= 18
##SPECTROMETER/DATA SYSTEM= spect
##.PULSE SEQUENCE= zg30
##.SOLVENT NAME= CDCl3
##.SHIFT REFERENCE= (INTERNAL, CDCl3, 0, 15.5464)
##AUDIT TRAIL= $$ (NUMBER, WHEN, WHO, WHERE, WHAT)
$$ ##TITLE= Audit trail, XWIN-NMR		Version 3.5
$$ ##JCAMPDX= 5.01
$$ ##ORIGIN= Bruker BioSpin GmbH
$$ ##OWNER= Yarkov
$$ C:/Bruker/XWIN-NMR/data/yarkov2/nmr/H-C/1/pdata/1/auditp.txt
$$ ##AUDIT TRAIL=  $$ (NUMBER, WHEN, WHO, WHERE, WHAT)
(   1,<2025-07-31 09:47:19.62 +0400>,<Yarkov>,<DPX200>,
      <created by zg, POWCHK disabled, PULCHK disabled
       configuration hash MD5:
       00 E9 B6 7A A2 85 ED C7 34 08 36 98 17 FE 4E 26
       data hash MD5: 16K
       BC 9E F9 D7 6A 4C 02 21 CF DE A0 43 23 1B 61 5D>)
(   2,<2025-07-31 09:47:26.01 +0400>,<Yarkov>,<DPX200>,
      <Start of raw data processing
       efp BC_mod = 2 LB = 0.25 FT_mod = 6 PKNL = 1 PHC0 = -1346.296 PHC1 = -0.8090911 SI = 16K 
       data hash MD5: 16K
       38 1A EE C7 E2 23 28 42 96 F1 43 90 35 D3 74 79>)
(   3,<2025-07-31 09:47:44.40 +0400>,<Yarkov>,<DPX200>,
      <pk PHC0 = -16.30041 PHC1 = 18.6 
       data hash MD5: 16K
       EC AC DB FD B5 A4 2F 7E D1 84 EF A2 2C 7A 23 9E>)
(   4,<2025-07-31 09:47:48.82 +0400>,<Yarkov>,<DPX200>,
      <abs ABSG = 5 
       data hash MD5: 16K
       A0 CD 71 E3 4C 35 3A C5 8E E2 75 CF 48 FE 86 F7>)
$$ ##END=
$$ 
$$ hash MD5
$$ F2 06 2E 24 2B 3E CB CB A9 B6 62 DF E2 80 D8 3E
##$RELAX= 
##$RELAX= 
##$RELAX= 
##$RELAX= 
##$RELAX= 
##$RELAX= 
$$ Bruker specific parameters
$$ --------------------------
##$DU= <C:/Bruker/XWIN-NMR>
##$EXPNO= 1
##$NAME= <H-C>
##$PROCNO= 1
##$TYPE= <nmr>
##$USER= <yarkov2>
##$AMP= (0..31)
100 100 100 100 100 100 100 100 100 100 100 100 100 100 100 100 100 100 
100 100 100 100 100 100 100 100 100 100 100 100 100 100 
##$AQSEQ= 0
##$AQ_mod= 1
##$AUNM= <au_zg>
##$AUTOPOS= <>
##$BF1= 200.13
##$BF2= 200.13
##$BF3= 200.13
##$BF4= 200.13
##$BF5= 200.13
##$BF6= 200.13
##$BF7= 200.13
##$BF8= 200.13
##$BYTORDA= 1
##$CFDGTYP= 0
##$CFRGTYP= 5
##$CHEMSTR= <none>
##$CNST= (0..31)
1 1 145 1 1 1 1 1 1 1 1 1 1 1 1 1 1 1 1 1 1 1 1 1 1 1 1 1 1 1 1 1 
##$CPDPRG= <>
##$CPDPRG1= <>
##$CPDPRG2= <>
##$CPDPRG3= <>
##$CPDPRG4= <mlev>
##$CPDPRG5= <mlev>
##$CPDPRG6= <mlev>
##$CPDPRG7= <mlev>
##$CPDPRG8= <mlev>
##$CPDPRGB= <>
##$CPDPRGT= <>
##$D= (0..31)
0 0.7 0 0 0 0 0 0 0 0 0 0.03 0 0 0 0 0 0 0 0 0 0 0 0 0 0 0 0 0 0 0 0 
##$DATE= 1753940838
##$DBL= (0..7)
120 120 120 120 120 120 120 120 
##$DBP= (0..7)
150 150 150 150 150 150 150 150 
##$DBP07= 0
##$DBPNAM0= <>
##$DBPNAM1= <>
$$ [...]
##$SUBNAM3= <"">
##$SUBNAM4= <"">
##$SUBNAM5= <"">
##$SUBNAM6= <"">
##$SUBNAM7= <"">
##$SUBNAM8= <"">
##$SUBNAM9= <"">
##$SW= 18.0517328524113
##$SWIBOX= (0..15)
0 0 2 0 0 0 0 0 0 0 0 0 0 0 0 0 
##$SW_h= 3612.71676300578
##$TD= 16384
##$TD0= 1
##$TE= 0
##$TE2= 300
##$TE3= 300
##$TEG= 300
##$TL= (0..7)
0 120 120 120 120 120 120 120 
##$TP= (0..7)
150 150 150 150 150 150 150 150 
##$TP07= 0
##$TPNAME0= <>
##$TPNAME1= <>
##$TPNAME2= <>
##$TPNAME3= <>
##$TPNAME4= <>
##$TPNAME5= <>
##$TPNAME6= <>
##$TPNAME7= <>
##$TPOAL= (0..7)
0.5 0.5 0.5 0.5 0.5 0.5 0.5 0.5 
##$TPOFFS= (0..7)
0 0 0 0 0 0 0 0 
##$TUNHIN= 0
##$TUNHOUT= 0
##$TUNXOUT= 0
##$USERA1= <user>
##$USERA2= <user>
##$USERA3= <user>
##$USERA4= <user>
##$USERA5= <user>
##$V9= 5
##$VALIST= <valist>
##$VCLIST= <CCCCCCCCCCCCCCC>
##$VD= 0
##$VDLIST= <DDDDDDDDDDDDDDD>
##$VPLIST= <PPPPPPPPPPPPPPP>
##$VTLIST= <TTTTTTTTTTTTTTT>
##$WBST= 1024
##$WBSW= 4
##$XGAIN= (0..3)
0 0 0 0 
##$XL= 0
##$YL= 0
##$YMAX_a= 376590
##$YMIN_a= -344559
##$ZGOPTNS= <>
##$ZL1= 120
##$ZL2= 120
##$ZL3= 120
##$ZL4= 120
##$ABSF1= 15.53204
##$ABSF2= -2.51981
##$ABSG= 5
##$ABSL= 3
##$ALPHA= 0
##$AQORDER= 0
##$ASSFAC= 0
##$ASSFACI= 0
##$ASSFACX= 0
##$ASSWID= 0
##$AUNMP= <proc_1d>
##$AZFE= 0.1
##$AZFW= 0.1
##$BCFW= 0
##$BC_mod= 2
##$BYTORDP= 0
##$COROFFS= 0
##$CY= -3
##$DATMOD= 1
##$DC= 0
##$DFILT= <>
##$DTYPP= 0
##$F1P= 0
##$F2P= 0
##$FCOR= 1
##$FTSIZE= 16384
##$FT_mod= 6
##$GAMMA= 0
##$GB= 0
##$INTBC= 1
##$INTSCL= 3.241238e-09
##$ISEN= 128
##$LB= 0.25
##$LEV0= 0
##$LPBIN= 0
##$MAXI= 10000
##$MC2= 0
##$MEAN= 0
##$ME_mod= 0
##$MI= 1.114404
##$NCOEF= 0
##$NC_proc= -7
##$NLEV= 6
##$NOISF1= 3.799351
##$NOISF2= 2.8
##$NSP= 0
##$NTH_PI= 0
##$NZP= 0
##$OFFSET= 15.54636
##$PC= 1
##$PHC0= -1362.596
##$PHC1= 17.79091
##$PH_mod= 1
##$PKNL= yes
##$PPARMOD= 0
##$PSCAL= 0
##$PSIGN= 0
##$REVERSE= no
##$SF= 200.129995064981
##$SI= 16384
##$SIGF1= 3
##$SIGF2= 2
##$SINO= 0.751879
##$SIOLD= 32768
##$SREGLST= <19F.Aceton>
##$SSB= 0
##$STSI= 16384
##$STSR= 0
##$SW_p= 3612.71676300578
##$SYMM= 0
##$S_DEV= 0
##$TDeff= 16384
##$TDoff= 0
##$TI= <>
##$TILT= no
##$TM1= 0
##$TM2= 0
##$TOPLEV= 0
##$USERP1= <user>
##$USERP2= <user>
##$USERP3= <user>
##$USERP4= <user>
##$USERP5= <user>
##$WDW= 1
##$XDIM= 16384
##$YMAX_p= 462270556
##$YMIN_p= -865061
$$ End of Bruker specific parameters
$$ ---------------------------------
##NTUPLES= NMR SPECTRUM
##VAR_NAME=  FREQUENCY,     SPECTRUM/REAL,   SPECTRUM/IMAG
##SYMBOL=    X,             R,               I
##VAR_TYPE=  INDEPENDENT,   DEPENDENT,       DEPENDENT
##VAR_FORM=  AFFN,          ASDF,            ASDF
##VAR_DIM=   16384,         16384,           16384
##UNITS=     HZ,            ARBITRARY UNITS, ARBITRARY UNITS
##FACTOR=    0.220516191357247, 1,           1
##FIRST=     3111.29295325431, 0,            0
##LAST=      -501.423809751471, 0,           0
##MIN=       -501.423809751471, -865061,     0
##MAX=       3111.29295325431, 462270556,    0
$$ Real data points
##PAGE= N=1
##DATA TABLE= (X++(R..R)), XYDATA
$$ [...]
8654 26070 26876 28952 -14657 -56790 -46747 -44645 -62792 -73389 -40086 46162 55653 66445 78598
8641 78598 72263 86761 75952 -12952 -48694 -26322 452 -63699 -37137 -15726 24331 19097
8629 19097 -43889 -53475 23054 68792 3057 -78374 -86796 4400 -7989 -22848 -85947 -85810 -7847
8616 -7847 18160 -25971 -70061 -841 -707 -22236 -61153 -64459 16889 -26554 -102977 -48462 -71205
8603 -71205 -56100 29312 317 457 -35079 -17447 -29960 -12704 31982 46997 85770 82523
8591 82523 45997 6259 12267 -17373 34501 14696 33551 112546 97571 814 -136386 -69505
8579 -69505 28813 5468 -6332 68833 82964 -24603 -51733 -66850 -51664 -7737 3877 16056
8567 16056 -1454 20373 36577 -18761 -12644 -7842 -94148 -77265 -79314 -118198 -56012 -89167
8555 -89167 -81651 -23231 -39644 -61948 -77722 -50417 -22067 -61046 -5060 16749 21426 21904 -34656
8542 -34656 -59879 -59659 -55754 -24712 -3498 38275 -15726 -35782 -22593 -82534 -31237 -34698 -67354
8529 -67354 -27869 45800 7726 -26136 -25113 44633 -15817 -19799 38243 -7912 -36296 23458
8517 23458 7301 7746 11073 9900 67103 83009 13799 9440 57685 71197 102786 63244 784
8504 784 -8179 51297 70143 61215 25426 -20636 5657 -25550 12641 33399 15989 -7302 -37211
8491 -37211 -72973 -79441 -84175 -46101 57439 32875 -8531 -50136 -36152 -22142 28560 39560
8479 39560 7323 2952 -43734 -12103 18720 18030 55738 34491 29760 -7308 -449 47023 100139
8466 100139 21804 -7460 -32333 50635 26750 22098 56724 51735 73360 58980 30632 -1016
8454 -1016 16548 -22337 -8989 949 12552 70229 86231 40868 53927 87082 84529 5312
8442 5312 -12061 -37372 -27928 25100 38548 10225 14254 44857 45881 17030 -59964 -29030 -25714
8429 -25714 -29475 41718 8772 21685 36205 23820 61077 116718 82487 82073 79996 86271 95684
8416 95684 104098 73617 73102 -15233 49299 84968 21796 78307 41098 -754 -20528 -13428 -2340
8403 -2340 -25671 -54653 -40053 -34239 -5691 18747 -37246 -75437 -36794 -2592 14718 -18908
8391 -18908 -4594 8818 5011 -41373 21486 -75019 -64736 -40706 -39851 75517 62490 21563
8379 21563 -58967 -113559 -104994 -23450 49932 11667 26132 45115 56293 -9941 32281 49364
8367 49364 26556 80082 55391 -3625 -1653 17296 -46111 -83587 -51484 22452 58097 40985
8355 40985 -13168 -13215 -51711 -5615 -22948 -46461 -91907 -56519 -49787 -91538 -76293 -60807 -46454
8342 -46454 -83228 -86461 -71755 -81244 -40486 7252 35442 7817 -11141 -32156 -66585 -29024
8330 -29024 -7857 -31678 1592 -25975 -36449 -59744 3875 1588 -4959 66861 47909 34059
8318 34059 -52356 -29323 -10717 -36646 -17470 -4388 -35131 -8991 -8017 17952 -15980 -8524
8306 -8524 -4737 22949 -12013 42756 70438 84196 66116 5133 44531 26188 -51506 -36889
8294 -36889 52793 -56206 -198116 -158857 -118372 -123612 -111418 -97785 -123985 -94737 -3756 30825
8282 30825 39392 19606 30385 30081 25411 5725 12628 40100 68858 91589 103498 -1060 980
8269 980 -14782 4759 83171 32459 11457 10113 -30679 -17785 46890 59427 37285 90223
8257 90223 99926 105758 100442 19785 22275 28183 13043 1792 -23515 -28343 -21849 -50812 -24755
8244 -24755 21009 9982 -36982 -11094 2949 -32030 12722 -46883 -83063 -100479 7067 5456
8232 5456 -43531 -48113 -9397 25102 33727 30736 42453 103414 76655 61627 32555 -54597 -66398
8219 -66398 -49912 -28110 26106 37680 -50289 -36120 -717 1912 54921 60500 53223 20014
8207 20014 -40718 45601 70493 94599 54131 69795 115254 38504 79382 49311 79394 68087
8195 68087 182005 279365 360312 -599831 -865061 -351893 -207109 -27749 -97360 -131097 -78300
8184 -78300 -80464 -54833 -48683 -178488 -174421 -171090 -98423 20453 4870 -35539 -7757 -3754
8172 -3754 47426 53292 25511 10305 -53445 -132902 -107647 -103920 -109431 -75392 -43368 -105617 -46669
8159 -46669 51053 -30874 -17662 41628 10345 40678 51464 47237 953 -9188 48835 16048
8147 16048 1751 -49501 -69518 -28309 -21054 26108 -11715 10550 5532 47226 36903 22904
8135 22904 36244 33452 -9566 -66966 -41963 -19791 21338 36446 19281 44092 59250 40753
8123 40753 32474 43995 2128 14820 59893 38455 65821 47623 -4178 -14093 -991 -47681
8111 -47681 -38107 -43136 -3274 3784 51693 113995 3518 -21787 -25850 -59890 -31711 24496
8099 24496 40883 1664 -11124 -15703 -29397 -28129 -13460 -102877 -92066 -87611 -100617 -28229
8087 -28229 -32123 -74777 -10031 -46334 -45331 -8063 13311 -55451 -91386 -61862 -31333 -29605
8075 -29605 10402 -7949 77885 38983 -20848 43328 136469 144057 55598 34120 -706 -53945
8063 -53945 -54096 -23109 -56998 -7180 21713 5425 -38526 36019 84445 174281 143437 83384
8051 83384 15938 49831 61921 859 -60565 -7270 -66584 -6592 -11912 -52436 -80154 -87486
8039 -87486 -39910 -31048 -25044 28914 47391 54820 28476 71554 49677 43127 6683 -865 -7910
8026 -7910 -63391 -46528 -99481 -36136 -21527 -39109 -61051 -62249 -52631 -46052 -79890 -23681 34586
8013 34586 66960 -31307 -5877 25364 12662 -53091 -7753 33678 7516 92060 114737 44603
8001 44603 82735 95402 5981 -39217 -50127 -106898 -98587 -101511 -55654 -20817 -13503 5961
7989 5961 4669 28383 43874 28542 44068 36612 88702 62049 22711 18405 -27254 -4505 -103437
7976 -103437 -70418 -88663 -104154 -14915 -46970 -39367 -12281 -17257 -35377 -47926 64895 9248
7964 9248 6802 -31266 -34260 37170 37956 56497 25442 12073 7045 10475 38511 101667 88026
7951 88026 62448 -15350 -32452 -35433 -108259 -56176 6288 -71529 -45763 -31366 2064 -46296
7939 -46296 -88020 46466 65489 70613 -5397 -2432 30313 28704 51050 29754 40004 33554
7927 33554 -21618 -27445 -16356 -15494 43381 12687 -61784 4467 43283 27365 12643 7194 -26649
7914 -26649 16994 86066 18484 34544 95591 58748 48751 24437 38661 -19876 -91403 -83380
7902 -83380 -103778 -20213 4820 9908 3261 -24327 1107 -42474 -2889 33949 -783 -59085
7890 -59085 -18018 64362 65710 58158 34613 56742 62227 69685 57146 29742 35102 -23373 -72452
7877 -72452 -51070 -8750 -51825 -121099 -82659 -1128 15763 41692 35501 23082 -31321 2944
7865 2944 82209 66389 26227 43325 76406 19576 -36238 -52255 -14595 56147 39994 24065
7853 24065 60522 50128 50107 80463 100975 -10920 251 -683 -2080 8604 65127 21714 22817
7840 22817 -54835 -35485 60128 49382 56671 73428 89281 38442 2465 61429 62043 327
7828 327 -13044 3399 43253 58691 32755 -2998 -50531 -18348 187 -4999 54237 65243
7816 65243 -11410 4826 9840 15140 -33137 1699 -43782 -36345 -145970 -63748 -117809 -95794
7804 -95794 -454319 -564990 135924 31568 46309 39250 108091 82844 47236 17208 66798
7793 66798 51770 18382 -46500 -45181 -50042 22854 34394 19375 12447 67089 159666 113599
7781 113599 115339 147063 100017 69697 75041 80193 53508 49677 127460 131673 136516 84611 66525
7768 66525 100450 19016 -25876 -59180 -56466 23896 60841 11821 29345 -6462 -54479 -19337
7756 -19337 -1078 84037 113332 58887 49011 26174 33217 44470 79834 77042 66771 39231
7744 39231 -11773 -27722 7906 42168 -35733 -45186 -43009 64932 62117 53528 95259 99130 29266
7731 29266 -97 -37327 -18364 -7538 36135 52655 17475 3652 103948 63708 81349 118512
7719 118512 99710 128845 95026 21504 -2862 -11671 -14654 20234 -46612 -34495 54980 32570
7707 32570 10367 50326 -31587 -118066 -57715 46879 79842 86857 44380 68740 93773 -801
7695 -801 2258 68940 35488 70460 60060 55046 72632 116514 132140 125191 98386 25575 27614
7682 27614 -10439 23964 27426 52683 50609 18034 -30675 -40050 -299 23552 -10379 -14949 -45379
7669 -45379 -70628 -78381 -54053 -4128 17034 5454 -373 -36027 -17902 -2537 -33522 -45018
7657 -45018 -2182 22668 -1069 34340 53177 86347 38016 19290 24179 50508 50094 11775
7645 11775 65679 83030 82824 16103 3740 33855 37310 98720 67753 81796 83682 65517 28635
7632 28635 37076 72319 125728 81321 71135 20032 41948 105534 36591 29200 41672 53084
7620 53084 84124 82718 73688 58843 59469 -3976 39709 149118 99520 16630 -10078 8899
7608 8899 -46908 -17116 1595 48715 6486 -9209 22546 39208 57189 75917 -2508 -74066
7596 -74066 -12074 20363 -4438 17585 -8626 5701 83059 4059 -33072 40961 29550 17937
7584 17937 26852 17257 17574 -13707 -8063 2717 32311 28203 22697 20882 69434 50296 58404 31739
7570 31739 19843 24331 5908 -25006 -56313 -58524 -12611 -46885 -49252 10813 40182 -12545
7558 -12545 7933 102246 73935 79204 67453 23039 29708 12895 39852 23471 15868 -12249
7546 -12249 9531 3577 13289 -1856 -36577 13133 78963 113440 105324 69131 84875 165240
7534 165240 117171 59648 59773 60315 60764 108107 88697 3013 47518 91524 43286 -713 36884
7521 36884 86823 100961 32553 463 25731 29236 34358 56209 73866 30642 28704 -3867
7509 -3867 57991 103197 92487 51206 67804 68112 44044 61482 70246 84123 78442 52478 81459
7496 81459 28893 10846 36246 54117 63098 95950 104769 90019 75226 73183 71774 55863 -3098
7483 -3098 -14025 -21769 25255 23312 45226 65555 41193 140468 97310 64875 116099 56241
7471 56241 69337 35269 42840 -35126 -43801 39533 -27395 -79848 -35240 -7275 70027 74826
7459 74826 52761 93275 96490 72870 40190 -13801 38437 31316 40403 15799 35096 68647
7447 68647 16115 80366 21867 39044 62445 100645 109391 95883 63487 50039 67620 36795
7435 36795 -21962 58051 27874 8461 78115 95650 -10438 -80151 -48960 13802 106299 120397
7423 120397 97263 130577 152443 81733 75703 165185 28681 12488 22123 7575 6272 31690
7411 31690 3403 20850 -22868 -17191 39615 90420 41922 37502 87748 33383 21743 34963
7399 34963 19337 11902 80356 49025 60522 106039 71824 31035 76191 76257 71958 88161 67291
7386 67291 82386 98849 86951 163406 145050 112841 128047 130957 125621 89146 9533 -28646
7374 -28646 -12906 88256 125928 196550 151943 96550 57975 53499 47071 22109 -8817 126065
7362 126065 87842 44626 108173 87176 63688 -581 -48113 -1712 8438 46590 31470 -14461
7350 -14461 17227 71758 65780 -4064 -28733 1804 95594 96149 64099 107394 136480 55464
7338 55464 -11435 26579 28396 3177 80967 48079 59731 73500 84674 89953 146713 85157
7326 85157 79900 35566 101801 159701 136242 137858 103568 44359 54153 110538 68292 21500
7314 21500 61711 60906 39261 73623 53514 6378 70652 108389 81385 82828 73773 91463 63866
7301 63866 18287 1964 31926 64594 68348 142623 182482 111704 39019 80334 44288 113660
7289 113660 111356 92288 143217 60156 59546 63344 66654 94059 98832 71811 26755 -19166 64637
7276 64637 108179 124127 143853 107886 107752 69376 64143 93853 94736 32570 17773 56186 21727
7263 21727 12728 42506 137072 139218 124689 137559 132704 91126 134680 151804 142499 74896 73683
7250 73683 133568 93009 68616 125993 126536 95069 103599 153968 100481 126797 111760 73147
7238 73147 82290 98720 163841 129415 64969 55589 63734 85174 166671 209299 135498 139631 133705
7225 133705 93785 54137 55137 104450 202038 165140 148907 98973 28560 68274 88620 108854
7213 108854 135398 198046 143060 101132 108684 101006 105964 89415 29191 64126 69084 96369
7201 96369 58556 94484 113140 116746 48241 63639 133961 96670 27740 31768 125061 154259
7189 154259 87255 112723 151004 183920 153516 62967 82260 102961 86130 79837 48539 104432
7177 104432 77130 19102 92894 128540 121336 151876 115971 161670 132434 69200 154973 142468
7165 142468 133748 156693 195959 143686 157075 178122 131923 93641 83166 86101 103553 51087
7153 51087 76297 77438 65160 72173 164439 153064 132755 178520 179428 138621 125026 166119 220903
7140 220903 204450 180817 191891 131930 122508 119773 84772 65556 16506 73133 149610 136847
7128 136847 69571 94663 132191 179335 186832 118288 182235 170741 192446 179294 164007 109708
7116 109708 125955 130858 169018 222189 208602 189905 235696 196702 164966 208229 239842 243334
7104 243334 178768 117461 120834 186653 168640 118064 175769 164600 134046 253133 214739 209927
7092 209927 244901 241870 238828 172977 182986 209262 248476 218349 180460 189191 153844 130398
7080 130398 147498 221297 201437 178627 203508 239620 231992 233271 262268 246512 210173 234773
7068 234773 271237 258837 263786 256023 272363 310315 377945 385263 373319 335304 417380 438611
7056 438611 419350 369385 313968 229860 238369 287025 338631 342906 287353 309464 314712 261868
7044 261868 193830 238360 284155 292835 266466 279175 310391 363002 343623 353092 349321 333369
7032 333369 348052 409837 367069 391442 422266 346834 368503 421703 369008 275603 335648 272172
7020 272172 173013 248198 262069 284114 279358 212763 301513 343616 303300 346428 324169 339475
7008 339475 373322 367691 394518 373070 350964 401940 392418 358485 342820 371150 361859 311539
6996 311539 284390 253278 259817 326174 296352 268401 283651 307419 295815 316998 306839 246712
6984 246712 289653 348051 367115 395788 368231 346786 328627 312810 327589 360114 308151 314830
6972 314830 299262 215778 312085 321613 319321 259025 201603 240375 252327 261372 280187 240341
6960 240341 305200 319676 295150 312304 309823 223120 192667 238582 295971 295605 328731 380970
6948 380970 337591 284584 257768 273548 218292 249347 267061 296965 330560 370139 347838 337249
6936 337249 372239 352337 377305 375177 401175 346063 292618 316850 358782 381168 389949 378307
6924 378307 355114 305810 297959 329517 349714 369951 329181 318839 336746 348552 330710 300255
6912 300255 279299 292360 278862 279151 347244 359167 371586 358997 324196 368808 402959 394267
6900 394267 362853 400275 417342 366717 385287 380743 312056 316936 392380 429279 428836 439363
6888 439363 433560 453606 409579 430980 371116 330172 407715 461774 411302 422331 403188 386448
6876 386448 458715 453289 377931 365696 373740 393136 468541 437303 443194 408968 417725 470654
6864 470654 588036 555193 540653 566137 601966 535397 589603 664287 622099 559067 598820
6853 598820 621236 638657 558549 561851 601244 585582 618133 572045 616786 606039 600497 566023
6841 566023 666157 711079 743734 757699 690878 664175 739634 739381 718949 774704 743714 775892
6829 775892 790781 822567 820174 764247 798763 790165 766909 793982 776826 812931 871364 894494
6817 894494 860774 894344 964111 1021586 1112643 1061036 1054942 1090950 1103620 1090935 1131627 1185593
6805 1185593 1209702 1220133 1310017 1258879 1316943 1353425 1394683 1445180 1504807 1570825 1574674 1645517
6793 1645517 1697507 1748557 1756590 1900424 2006619 2236950 2393058 2540314 2743660 2828030
6783 2828030 2946141 3028311 3044085 3140862 3288376 3495067 3618231 3611775 3577246 3505543 3515684
6772 3515684 3558875 3551470 3643670 3720958 3815410 4050102 4241195 4452136 4784344 5182708 5672890
6761 5672890 6116922 6644282 7271163 8020587 8938520 9758699 10394281 10596958 10662672 10878915
6751 10878915 11272499 11902919 12420004 12516182 11863029 10908597 10064122 9507196 9150359 8947243
6741 8947243 8967915 9087934 9343387 9621058 10078555 10622617 11349021 12177655 13141049 14279482
6731 14279482 15723313 17289563 19146326 21244929 22983265 23926930 23963607 24007116 24656558
6722 24656558 25791906 26920539 27263575 25978552 23252835 20478552 18470424 17112995
6714 17112995 16039011 15362276 14964560 14858739 14984269 15192551 15608057 16218873 17076397
6705 17076397 18203111 19607148 21174132 23059988 25215281 27697104 30131923 31809274
6697 31809274 32022072 31705267 32036477 33086473 34547244 35380937 34461609 30993000 26787714
6688 26787714 23400385 20942468 19042855 17676597 16702057 15960747 15519340 15267320 15266897
6679 15266897 15429367 15777265 16327234 17061492 18007783 19142440 20475221 22106932 23897951
6670 23897951 25349620 25768100 25348823 25231385 25678840 26568750 27390053 27157765 25051321
6661 25051321 21635280 18623756 16309069 14599220 13243375 12231352 11374138 10834041
6653 10834041 10425205 10059920 9837912 9742673 9718055 9752310 9974359 10262489 10608048 11092027
6643 11092027 11697844 12213132 12427825 12279587 12057719 12116679 12259665 12527768 12504141 11829854
6633 11829854 10585013 9189343 8085124 7201429 6475159 5932080 5545536 5155563 4858101
6624 4858101 4703483 4472265 4262986 4141380 3998393 3873045 3819443 3850760 3892310 3949891
6614 3949891 3883725 3852153 3828578 3763973 3646078 3619878 3652195 3621166 3571189 3321885 3066829
6603 3066829 2789332 2580391 2436104 2271497 2179617 2067661 1990960 1853872 1805690 1744012
6593 1744012 1631424 1655179 1659606 1579133 1508654 1465775 1447975 1396737 1382613 1333663 1275210
6582 1275210 1288197 1310719 1296397 1272824 1251002 1235813 1151871 1095407 1106590 1069670 1084404
6571 1084404 1052220 970158 1030047 1046751 1012641 1080338 1066799 1030038 1022601 1046620 1018479 1036311
6559 1036311 1011931 980579 946239 958935 980104 990827 968557 1015653 1044451 990584 1001157
6548 1001157 968769 936886 957528 962003 934094 935141 873578 823356 880878 938189 931631 962576
6536 962576 971424 996448 998094 940631 953286 939679 976698 1028874 1025241 1056193 1058325 1054739 1064480
6523 1064480 1114402 1100528 1153216 1192742 1256380 1257901 1256003 1233654 1234188 1312442 1302630 1298026 1319890
6510 1319890 1283124 1313732 1327774 1275324 1267269 1303754 1251419 1217649 1183220 1134798 1124564 1205763
6498 1205763 1204294 1263137 1310057 1258272 1246342 1212958 1191676 1184934 1190937 1207798 1285890 1272639
6486 1272639 1240333 1181947 1118321 1155980 1177763 1188664 1136010 1082883 1116035 1106200 1105795 1099664
6474 1099664 1145000 1172435 1215403 1201804 1210759 1239374 1235938 1249140 1337682 1370129 1347217 1352570
6462 1352570 1412463 1471732 1454520 1481168 1533523 1592010 1623602 1696987 1735473 1762220 1793355
6451 1793355 1830254 1848522 1901004 1987638 2042155 2060257 2141545 2238664 2181971 2134005 2196341
6440 2196341 2254891 2257515 2221602 2215527 2187731 2099763 2081547 2041163 2057589 1987053 1918129 1834829
6428 1834829 1782213 1695901 1682824 1674608 1614563 1548241 1515309 1464694 1389226 1367441 1309192 1288902
6416 1288902 1301748 1287418 1266875 1218112 1168048 1101071 1088386 1179309 1173722 1155118 1118425 1060397
6404 1060397 1041409 1079637 1066687 1085917 1100273 1139950 1083483 1102979 1135779 1061995 1093097
6393 1093097 1199129 1204741 1133105 1180073 1190877 1143041 1140589 1144824 1119137 1096706 1102161 1117009
6381 1117009 1072249 1060924 1085779 1110120 1089516 1107820 1114621 1067177 1104014 1097647 1074098 1090980
6369 1090980 1115492 1140917 1222303 1278114 1279146 1293094 1262279 1178127 1118190 1022594 1015985 1150744
6357 1150744 1157050 1086764 1019432 1025293 1028003 1087268 1010917 976670 950367 958809 1050718 953805
6345 953805 960764 999541 946461 906138 902132 965926 969045 994327 1074283 1102674 1022779 1036260
6333 1036260 1062934 996454 1004087 1025685 1004528 957411 870648 897641 922503 950793 1038675 1007352
6321 1007352 994588 1030729 1073688 1026597 1034561 1010980 960640 959673 1004018 1041130 1001511 940656
6309 940656 945234 949747 951391 966654 980693 1026226 1069809 1061017 1024887 996719 1041833 1125993
6297 1125993 1070498 1093762 1112224 1125626 1170402 1122685 1054275 1077711 1101584 1026600 1037693
6286 1037693 1068690 1123579 1124143 1141725 1115992 1114261 1091527 1037384 1035235 1079280 1104837 1137707
6274 1137707 1265528 1256709 1256131 1238939 1170659 1177633 1218358 1272058 1347634 1350789 1436900 1486370
6262 1486370 1417846 1406294 1448390 1499449 1486548 1483052 1388090 1425146 1511339 1552076 1600849 1657102
6250 1657102 1696069 1679566 1746355 1841551 1815354 1876311 1879496 1966248 2010255 2068367 2075454 2149267
6238 2149267 2193638 2277795 2371837 2414948 2473351 2460631 2496074 2550203 2584966 2663322 2661122 2653804
6226 2653804 2706549 2799490 2871603 2985714 3047906 3152244 3258863 3317070 3410696 3575902 3708994
6215 3708994 3797412 4035997 4209274 4344807 4502274 4689869 4834298 5067926 5268546 5534093
6205 5534093 5777739 6174207 6461133 6645395 6931364 7297795 7579815 7914066 8382972 8865626
6195 8865626 9412717 9984654 10556356 11207899 11982897 12800883 13477210 14256022 15133293 16195637
6185 16195637 17451717 18942009 20562257 22355672 24171989 26092542 27799256 29229806
6177 29229806 29958496 29863288 29397198 28907725 28638738 28452443 28277712 28197652 28279347 28513515
6167 28513515 29004819 29750488 30758200 31935814 33103162 34076820 34862135 35758911 36969447
6158 36969447 38518988 40376127 42560859 45062797 47769469 50642443 53529126 55539079
6150 55539079 55179542 51398993 45696982 40733684 36981612 34153852 31842329 29883501
6142 29883501 28369749 27130290 26180939 25537067 25001466 24508671 24132668 23897638 23895460
6133 23895460 24094639 24568545 25293030 26172271 27226946 28204320 29167177 30060014 30922076
6124 30922076 31588880 31399937 29723290 26861543 23741821 21156122 19268773 17772737
6116 17772737 16623799 15732173 15053470 14570304 14137743 13755720 13399155 13096212 12820370
6107 12820370 12645398 12562435 12513671 12636037 12705608 12785082 13021799 13300590 13658870 14013503
6097 14013503 14541802 15130245 15774176 16526257 17484548 18532308 19754129 21214601 22888105
6088 22888105 24782525 26853066 28994815 30754543 31647962 31540486 30998823 30502528 30097418
6079 30097418 29775445 29652368 29733540 30019000 30653929 31574742 32760965 34336709 36343990
6070 36343990 38760166 41734383 45101532 48997856 53230894 57930197 63046672 68137304
6062 68137304 72087556 74229284 75307250 76171024 76608692 75604256 72305872 67802888
6054 67802888 63863934 60909413 58882118 57671018 57052223 56686406 56678275 56900660 57383714
6045 57383714 57953872 58930001 60488248 62738388 65930926 70011900 74810629 79902213
6037 79902213 84861951 89990709 95630535 100504149 102073160 97684664 88654556 78845781
6029 78845781 69931061 62067974 55511105 50371017 46406403 43312537 40844147 38960990
6021 38960990 37483349 36357843 35592614 35067716 34670444 34403752 34151258 33985799 34121360
6012 34121360 34722434 35696964 37022161 38723551 40705946 42926225 45194673 47219643
6004 47219643 48039912 46593393 42568117 37192567 32224264 28229787 25283644 23059838
5996 23059838 21186234 19673384 18392137 17300705 16421103 15612877 14859844 14278760 13744507
5987 13744507 13197152 12702322 12144842 11593476 11057174 10536101 10077031 9706357 9295553
5978 9295553 9006874 8643365 8340190 8132945 7953970 7754077 7542951 7420970 7223021 7046695
5968 7046695 6913361 6736984 6655692 6489034 6344384 6227313 6050344 5916313 5799003 5693732
5958 5693732 5588988 5507479 5465714 5326851 5200054 5195768 5172146 5086630 5070863 5119352 5142053
5947 5142053 5211256 5315064 5313421 5331005 5352663 5437249 5464089 5445030 5497751 5588256 5529229
5936 5529229 5507959 5510134 5454480 5395715 5303389 5233472 5231006 5222561 5187681 5140651 5088210 5072889
5924 5072889 4988507 4974887 5068689 5114577 5119637 5161264 5228095 5294714 5264518 5322011 5365113 5377086
5912 5377086 5444300 5397155 5363354 5370782 5303070 5232791 5141951 4956637 4707069 4578902 4412469
5901 4412469 4365277 4264561 4142878 4025581 3913557 3839133 3815111 3791774 3689211 3687100 3626710
5890 3626710 3667324 3569697 3443185 3404204 3346936 3382502 3300603 3233959 3185533 3151494 2995792
5879 2995792 2914453 2828791 2770493 2669357 2567272 2462366 2407785 2332237 2282053 2254503 2164896
5868 2164896 2079483 2036921 2035570 1976993 1941850 1891435 1834006 1783427 1782757 1790278 1696058 1619462
5856 1619462 1529093 1525325 1510253 1563553 1476348 1426743 1446417 1412332 1338754 1277824 1328943 1316868
5844 1316868 1271947 1218127 1255345 1248429 1235298 1256839 1282515 1256761 1322112 1339184 1298750 1217234
5832 1217234 1238656 1227259 1159860 1160005 1138392 1180326 1149166 1135417 1124763 1113631 1095467 1073294
5820 1073294 1120013 1103675 1075545 1029685 1032258 1037071 1076676 1127023 1190342 1211714 1212291 1225282
5808 1225282 1267866 1300999 1273632 1207365 1125668 993350 992235 997861 983875 939969 840599 819075
5796 819075 842766 896425 918184 878193 873868 851934 830459 871538 803825 754785 763258 742516
5784 742516 751292 880416 867887 826916 861074 860343 841018 845512 827593 801889 689833 714515
5772 714515 727674 660494 684295 702538 712856 664000 632403 654425 648076 649794 626764 605361
5760 605361 633608 630093 627633 645905 670422 718206 711072 677257 606862 610869 680018 626926
5748 626926 728666 725061 729030 737222 731677 635842 691738 709542 743467 735615 787509 788528 780144
5735 780144 787470 829715 901479 946084 947334 967933 1016845 1011304 1056358 1104450 1117251 1046757
5723 1046757 1048402 1056463 1062125 1011079 1023765 1034444 1074287 1076440 1042168 987597 1056801 1027310
5711 1027310 978711 978317 959575 1039673 1041719 1099212 1175035 1202770 1314746 1384415 1457552 1480601
5699 1480601 1500118 1370597 1374311 1414091 1408040 1327965 1232129 1177279 1145718 1169577 1179138 1142727
5687 1142727 1138607 1113030 1035120 1064696 981324 1039882 1093470 1064774 1113680 1128271 1146027 1150150
5675 1150150 1137321 1118985 1025383 995064 1041480 1064995 1070927 1054242 1066941 1053878 1051078 1051885
5663 1051885 977679 971646 981986 943103 952086 928839 931010 941460 939723 909123 948794 966947
5651 966947 955968 934622 881758 877017 872136 925628 924216 909777 985957 963158 972835 1032436
5639 1032436 990851 1019547 1055880 1066253 1059977 1084396 1042058 1028229 1095101 1090675 1064073 1073655
5627 1073655 1101445 1136144 1130275 1186601 1202880 1260867 1264526 1297391 1353943 1367492 1346860 1343325
5615 1343325 1397882 1374046 1412827 1484386 1543765 1495125 1569151 1638535 1678362 1719803 1733149
5604 1733149 1797156 1837917 1891848 1913955 1962599 2040700 2098785 2163510 2183065 2302244 2366181
5593 2366181 2400010 2512883 2625060 2716781 2853362 2961354 3128697 3223678 3319176 3356257
5583 3356257 3493183 3676965 3786179 4086449 4324875 4445733 4688101 5018487 5253507 5408878
5573 5408878 5466464 5589823 5741567 5944427 6149899 6220846 6262801 6403415 6517571 6652795
5563 6652795 6937777 7282974 7577900 7749250 8015471 8349410 8736730 9294395 9915305 10530845
5553 10530845 11328304 12226117 13138280 14042816 14976934 15983598 16733518 16870309 16205232
5544 16205232 15357154 14746501 14257980 13799538 13309027 12837413 12496490 12372465 12439734 12630323
5534 12630323 12890887 13226594 13646149 14119945 14633419 15356309 16387215 17499243 18797970
5525 18797970 20327937 22075621 23883014 25759879 27759533 29579202 30244664 28993016
5517 28993016 26147816 23198369 20803187 18889301 17338700 16197107 15386171 14864796
5509 14864796 14652599 14510430 14519221 14704874 14977739 15364862 15951440 16696577 17591211 18806104
5499 18806104 20302973 22115630 24252381 26515139 28655913 30909937 33430237 35254272
5491 35254272 35431857 32831954 28458338 24558820 21632299 19491448 17902992 16645439
5483 16645439 15772044 15157346 14639782 14303609 14119113 14084951 14145727 14345232 14592228 15092721
5473 15092721 15855187 16707144 17817975 19124408 20722940 22442280 23980753 25679944
5465 25679944 27465935 28565085 28086865 25425020 21943484 19122466 17023558 15479094
5457 15479094 14394119 13586649 13017326 12631956 12329712 12128431 12038405 11946192 11969829 12092731
5447 12092731 12295430 12619739 12972077 13406636 14024788 14891710 15779879 16747351 17775870
5438 17775870 18807433 19868883 20557212 20576651 19984585 19378135 19121644 19136730 19162764 19226561
5428 19226561 19229855 19459501 19910275 20669900 21709833 23115508 24716601 26582150 28851049
5419 28851049 31496441 34514835 37954814 41867084 45862745 48847749 49259762 47203411
5411 47203411 44002831 41000082 38727860 37159875 36155234 35534802 35301985 35584812 35974731
5402 35974731 36066047 35885509 35861104 36281277 37232456 38641203 40627041 43155552 46038822
5393 46038822 49290476 53096074 57602554 62785038 68445960 74745779 81388331 86723197
5385 86723197 87839733 83259617 75163117 67163681 60921502 56229053 52819857 50276217
5377 50276217 48010609 45903358 44106031 42533699 41270356 40510260 40059420 39980412 40223824
5368 40223824 40894482 41849422 42977294 44045067 44976173 45847100 46721905 47637203 48390863
5359 48390863 48636285 47877381 45480955 41489349 36882998 32716532 29421461 26867843
5351 26867843 24740668 23041222 21548839 20157257 18990060 17918370 17010414 16247743
5343 16247743 15664810 15220974 14814134 14527799 14288735 14068303 13776540 13379115 12844902
5334 12844902 12142988 11402087 10611833 9896422 9198577 8749875 8314471 7957287 7650478
5325 7650478 7344563 6988636 6772387 6583107 6312631 6084083 5878326 5644454 5475874 5387498
5315 5387498 5262121 5115851 4940770 4858078 4723262 4561798 4471452 4411503 4299670 4174534
5305 4174534 4199525 4138217 4022525 3962783 3875888 3850751 3799920 3703932 3648141 3538945 3497926
5294 3497926 3484429 3409515 3387614 3323335 3225168 3157947 3086951 3041119 2973826 2868599 2819088
5283 2819088 2836374 2825580 2725185 2639606 2556826 2558711 2509977 2492385 2599380 2602689 2586034
5272 2586034 2634645 2537370 2497793 2427010 2290188 2263459 2204926 2181676 2119680 2088138 2010918
5261 2010918 1977653 1843507 1877418 1869338 1859597 1797852 1797234 1747823 1734922 1713037 1684256 1719372
5249 1719372 1682397 1668971 1626712 1626847 1725811 1758948 1713357 1710436 1697167 1774682 1765333 1760241
5237 1760241 1767026 1791696 1646946 1548147 1480548 1481185 1501445 1511266 1494873 1393881 1405260 1460601
5225 1460601 1384477 1364530 1328819 1374651 1394449 1378150 1449350 1372678 1353614 1422347 1479830
5214 1479830 1474219 1428825 1356482 1365573 1420844 1384042 1401399 1346248 1428151 1465037 1502063 1517828
5202 1517828 1461560 1467887 1484954 1460167 1438895 1412644 1395974 1422247 1370499 1401021 1486611 1433908
5190 1433908 1391124 1467383 1472601 1460491 1462647 1452740 1564904 1608539 1669151 1633150 1617422 1613750
5178 1613750 1650435 1617407 1564443 1558079 1635411 1701942 1713325 1584001 1529549 1557053 1548653 1489727
5166 1489727 1509457 1442275 1487353 1501686 1480316 1522440 1597121 1551610 1512976 1483402 1552062
5155 1552062 1652928 1686871 1704618 1689167 1644521 1628095 1662223 1599511 1580680 1568017 1637671
5144 1637671 1601377 1634705 1685703 1790050 1707391 1650843 1634593 1607042 1631675 1657796 1623936
5133 1623936 1616128 1561609 1656257 1731470 1645190 1612994 1653400 1716403 1776433 1755935 1769940 1798823
5121 1798823 1927997 1873848 1823209 1919843 1951918 1917141 2016159 2003129 1928861 2003902 2035693
5110 2035693 2018489 2053988 2140536 2158063 2113042 2228890 2302018 2313233 2321656 2406195 2444545
5099 2444545 2462212 2501923 2559343 2598144 2628965 2616813 2656506 2754761 2823589 2799099 2842785
5088 2842785 2839598 2989326 3119956 3173652 3315891 3429166 3551466 3613974 3699032 3827311
5078 3827311 3934605 4107344 4282502 4507562 4662369 4831771 5036371 5274945 5439496 5696520
5068 5696520 5795540 6012379 6171518 6413624 6644813 6800721 7032583 7332678 7541428 7879805
5058 7879805 8237807 8692821 9237851 9701728 10146124 10703538 11189205 11794489 12356499 13018344
5048 13018344 13828473 14776626 15837361 16964938 18182008 19596874 21312444 23188502
5040 23188502 25289795 27613191 30358350 33464636 37103792 41233138 45971750 51618952
5032 51618952 57724842 63731944 69095367 75609790 84808331 95900436 107677502 117384455
5024 117384455 127157979 141037482 160883584 179807551 184480341 160355958 127711650
5017 127711650 105182477 90169457 80190347 73210138 69294929 66472668 63842584 58501889
5009 58501889 51057575 44740011 39959889 36128368 33045002 30348468 28131897 26107204
5001 26107204 24288741 22636868 21168869 19844748 18718470 17633394 16733769 15770003
4993 15770003 14898761 14098221 13402716 12725793 12208423 11613926 11097729 10568964 10064358
4984 10064358 9565256 9128414 8749540 8426482 8079267 7800329 7495476 7228295 6943411
4975 6943411 6803989 6596280 6408047 6206339 6000745 5849754 5787214 5656170 5583535 5551703
4965 5551703 5530768 5384859 5261249 5144196 5005065 4869161 4794867 4801864 4761642 4643941
4955 4643941 4629574 4575347 4572736 4478337 4346641 4212000 4189381 4072012 4033286 3999241 3923837
4944 3923837 3859882 3863233 3902615 3859622 3845432 3746913 3717878 3721418 3665106 3709846 3712339 3684555
4932 3684555 3697144 3703112 3666388 3729014 3713154 3734153 3825152 3876773 3909499 3968836 3994290 4036882
4920 4036882 4140460 4227197 4333717 4449343 4522866 4584138 4617371 4587163 4585659 4553263 4582024
4909 4582024 4624873 4573331 4501577 4374681 4222509 4075118 3929726 3783417 3744872 3619677
4899 3619677 3486602 3394146 3383878 3403843 3367210 3319611 3315570 3303432 3211997 3134941 3096330
4888 3096330 3070483 3055787 3022895 2967728 2937971 2911961 2935009 2943019 2925988 3006570 3017152 3017855
4876 3017855 3002887 2955137 2904866 2893547 2926557 2997275 2955398 2871336 2837919 2804153 2802942 2844249
4864 2844249 2890007 2805024 2769272 2801507 2905175 2893569 2885078 2922063 2960906 3010937 3115748
4853 3115748 3107958 3152044 3231367 3331578 3382012 3501492 3477004 3469974 3453533 3423180 3407771
4842 3407771 3339793 3240149 3256708 3261855 3233586 3143353 3217391 3250516 3210224 3187372 3178695 3252632
4830 3252632 3294167 3269301 3319769 3357994 3374678 3402568 3448363 3430041 3500671 3570846 3663713
4819 3663713 3679636 3792813 3864252 3903838 3882038 3946781 4082854 4176845 4262153 4255634 4213087
4808 4213087 4250597 4244933 4231426 4349006 4419869 4417895 4488447 4552260 4629680 4719419 4767147 4842016
4796 4842016 4875306 4969558 5009968 5036353 5100768 5229015 5309052 5372959 5530803 5658050 5719950
4785 5719950 5840941 5964367 6085088 6268619 6506815 6692738 6863243 7152968 7416237 7657551
4775 7657551 7968548 8278729 8613470 8874234 9261058 9667726 10062754 10518801 10987686 11485390
4765 11485390 12126331 12718986 13206878 13817658 14533273 15252699 16071471 16915838 17857937
4756 17857937 18816385 19903282 20993557 22166437 23509480 25126815 27025253 29262579
4748 29262579 31801265 34434427 36758091 38323324 39030231 39458741 39979463 40539307 41095800
4739 41095800 41562884 41878203 42347181 43141433 44218674 45400683 46524087 47748308 49142683
4730 49142683 50707467 52417059 54217508 56028966 57583107 59006364 60576978 62321332
4722 62321332 64298700 66660785 69325268 72096684 74937879 77812096 80408827 81891663
4714 81891663 81368485 78967056 75891587 73156767 70723904 68565142 66611050 64938992
4706 64938992 63540534 62386783 61045672 59213800 57047059 54818518 52904376 51265421
4698 51265421 49971526 48971254 48156192 47377910 46585498 45951283 45641659 45586946 45620730
4689 45620730 45375845 44819714 44064358 43241540 42483436 41083267 38593814 35399685 32302188
4680 32302188 29704627 27661142 26083267 24884134 23890161 22896130 21962911 21097772 20301932
4671 20301932 19466042 18756413 18104567 17469094 16948502 16451340 15996921 15512841 15156028
4662 15156028 14791469 14445071 14115167 13772835 13508163 13255926 13064441 12901076 12730780
4653 12730780 12693786 12660711 12587034 12491221 12299380 12039600 11765113 11432111 11080403 10822334
4643 10822334 10500285 10280098 10162207 10054634 9872013 9797419 9764406 9789993 9876994 9934928
4633 9934928 9978070 10128265 10345785 10609928 10805546 10978981 11088127 11175725 11283607 11438070
4623 11438070 11545295 11663735 11788961 11887139 11868477 11859296 11813186 11630277 11307330 10903597
4613 10903597 10484392 10119790 9726798 9375014 9061394 8777971 8514089 8272022 8068407
4604 8068407 7873771 7721956 7672569 7641087 7650283 7588694 7595548 7678786 7684475 7735346 7707010 7709450
4592 7709450 7625976 7568123 7540372 7475751 7391799 7351909 7255306 7091987 6829557 6440325 6026695
4581 6026695 5695066 5424250 5228485 4984356 4629091 4434658 4296288 4141828 4026904 3977488
4571 3977488 3925652 3770079 3668925 3526871 3453794 3426917 3378862 3273548 3188850 3149062 3092040
4560 3092040 3015271 2979021 2977942 2892482 2894338 2851089 2841817 2767847 2729317 2679196 2689596 2670587
4548 2670587 2640019 2671709 2677265 2712128 2636819 2538961 2518715 2478798 2484003 2458829 2494535 2511754
4536 2511754 2432187 2409686 2426878 2455016 2438518 2445364 2389718 2344030 2237844 2255217 2240614
4525 2240614 2286112 2330676 2253106 2224407 2221432 2213127 2243071 2181594 2153888 2179744 2197478 2203646
4513 2203646 2141483 2059852 2044817 2069399 2029981 2028544 2009357 2043658 1986596 1945509 1993027 1989804
4501 1989804 1970422 1882982 1866464 1895396 1817274 1777198 1797197 1773576 1809598 1831196 1773674
4490 1773674 1753033 1695875 1695726 1692236 1649304 1622808 1652777 1665925 1654428 1744539 1690424 1700378
4478 1700378 1646983 1568473 1613010 1596265 1563320 1561505 1575012 1513181 1512685 1523288 1478476 1465846
4466 1465846 1494705 1486107 1445555 1554094 1583690 1495296 1438963 1451192 1458082 1491996 1454291 1473032
4454 1473032 1455176 1462901 1493507 1465177 1409143 1408189 1412296 1411370 1407110 1364241 1349616 1389952 1377233
4441 1377233 1399203 1368232 1403903 1433418 1484654 1500997 1490416 1508592 1490719 1345734 1300095
4430 1300095 1333426 1336588 1322267 1318890 1350320 1328786 1353075 1395068 1396221 1386559 1417931 1450531
4418 1450531 1470331 1487309 1494917 1526299 1435150 1432928 1526939 1467791 1447618 1508830 1627750 1562127
4406 1562127 1563379 1596808 1646349 1592150 1558840 1588792 1541994 1469083 1469160 1475536 1497968 1425298
4394 1425298 1459630 1461035 1458342 1397780 1433954 1496473 1505848 1454676 1404595 1402613 1431528 1430900 1502903
4381 1502903 1544081 1528179 1497984 1506238 1447820 1460876 1445498 1433137 1477944 1454216 1433469 1420024
4369 1420024 1435464 1413011 1446941 1421801 1374055 1370799 1384902 1432074 1424219 1420166 1381420 1399905
4357 1399905 1370987 1405377 1400719 1387434 1457489 1417650 1361397 1359029 1292248 1265683 1294591 1339868
4345 1339868 1373260 1417864 1399946 1388089 1367402 1363493 1471071 1440886 1500919 1529592 1553398
4334 1553398 1541985 1516777 1527783 1550737 1573646 1649132 1597946 1597983 1536625 1520472 1553647 1482330
4322 1482330 1437747 1466631 1462224 1510197 1560411 1530018 1499025 1529726 1499260 1542938 1550715 1554763
4310 1554763 1491876 1508600 1515957 1545844 1594732 1630036 1631862 1597260 1634126 1670896 1651560 1589296
4298 1589296 1628549 1639945 1732153 1714554 1720001 1746018 1755146 1779658 1837911 1841946 1886515 1908976
4286 1908976 1920433 1939026 2000211 2036790 2061810 2137647 2286489 2386810 2400072 2425352 2469032
4275 2469032 2543435 2589556 2690662 2763946 2946463 2999218 3115560 3327397 3522913 3566704
4265 3566704 3698715 3880992 4083186 4319779 4595363 4795184 5013413 5293519 5514153 5757276
4255 5757276 6089274 6463341 6883412 7384994 7921202 8484317 9005602 9622399 10176797 10724527
4245 10724527 11164274 11524207 11767725 11987380 12373364 12903050 13530485 14285587 15088482
4236 15088482 15976437 16993342 18099282 19088452 19882851 20478830 20883262 20975665 20944332
4227 20944332 20858842 20824882 20993882 21387202 22009402 22783322 23658853 24570253 25538926 26301449
4217 26301449 26789370 26823480 26621184 26099517 25320127 24555359 23847900 23315623 23069916 23081747
4207 23081747 23175597 23428551 23742304 23978355 24035381 23739371 23169277 22344930 21294432 20218010
4197 20218010 19048964 18119556 17450497 16862283 16463968 16165388 15908970 15729894 15484783
4188 15484783 15144932 14729751 14105438 13359737 12606155 11766804 11036682 10431157 9944343
4179 9944343 9505063 9050542 8678344 8346037 8067614 7884814 7599663 7226999 6860731 6506498
4169 6506498 6227080 5947544 5670465 5338140 5166315 5058306 4900676 4757339 4650344 4559724
4159 4559724 4509224 4457139 4282840 4201398 4156052 4044055 4002367 3961677 3864203 3787238 3721522
4148 3721522 3690500 3694987 3647956 3566431 3477068 3353032 3324385 3314189 3259070 3131270 3100213
4137 3100213 3127121 3073709 3042916 2999336 3022143 3011269 2965191 2946903 2983125 2944175 2878666
4126 2878666 2856963 2892500 2912325 2930756 2964689 2962740 2957058 3037307 3041018 3022183 2989249 3015732
4114 3015732 3017577 2982754 2986203 2948320 2889255 2855847 2917364 2927262 2986161 2963919 2999187 2986314
4102 2986314 2975909 2968678 2926469 2977757 3021409 3029752 3015062 3121800 3136329 3148004 3125062 3150501
4090 3150501 3232642 3330627 3410348 3452779 3500135 3480766 3545016 3645721 3717986 3738897 3813680
4079 3813680 3835055 3965396 4033036 4098932 4118374 4220933 4331755 4430161 4490423 4628204 4800785
4068 4800785 4972080 5177090 5379510 5556820 5750987 6006465 6313320 6693873 7135238 7567291
4058 7567291 7970787 8336569 8580893 8727543 8858169 9130794 9489310 9905758 10321254 10736410
4048 10736410 11232812 11646600 12000734 12418183 12754411 12880181 13001740 13226979 13449538
4039 13449538 13830318 14280913 14650723 15038471 15484367 16013720 16621710 17334416 18076634
4030 18076634 18511269 18569119 18322166 17933231 17627434 17420035 17257307 17314843 17451271 17759356
4020 17759356 18154671 18542500 18969983 19402706 19735065 19879279 19911493 19820807 19636114 19482133
4010 19482133 19378781 19553168 19838385 20174023 20408359 20494977 20606407 20677511 20649557 20742983
4000 20742983 20842141 21051995 21362532 21809594 22337699 22639174 22781259 22795020 22917595 23239606
3990 23239606 23761953 24498077 25354969 26285253 27264880 28037032 28724944 29486920 30321810
3981 30321810 31180194 32084296 32869181 33524299 34309281 35284985 36258032 37234588 38198948
3972 38198948 39140975 40306268 41833368 43700615 45628661 47263079 48205630 48905131 49806125
3963 49806125 50787489 51703832 52410412 52802634 53315278 54026896 54883769 55503837 56018665
3954 56018665 56406238 56682496 56995071 57619289 58595681 59661295 60000408 59246366 58108419
3945 58108419 57208512 56674471 56434904 56545353 56753868 57101341 57273449 57367365 57359669 57106988
3935 57106988 56407436 55278831 54089235 53250177 52804197 52439297 51754476 50616665 49234080
3926 49234080 47970689 46948651 46210105 45662799 45136745 44802538 44602031 44587961 44744751
3917 44744751 44902772 45004411 45095824 45221875 45458206 45797488 46078041 46281311 46434421 46485596
3907 46485596 46635400 46952462 47596524 48617990 49568955 50274339 50884310 51518536 52319690
3898 52319690 53254677 54032534 54686842 55186404 55867553 56869034 58198124 59715893 61547073
3889 61547073 63879028 66818306 70160518 73627596 76861375 79509742 81370010 82121138
3881 82121138 82054340 81839554 81981034 82787481 84088152 85868562 88258677 91261842 94493386
3872 94493386 97470953 100083266 102645130 104921838 106550071 107208509 107009342 106435818 105894770
3863 105894770 105794522 106044103 106785828 108196345 110123804 112639385 115814477 119298855
3855 119298855 122213394 124190890 124905222 123580745 119502428 113546176 107712589 103229476
3847 103229476 100225290 98551824 97975906 98216777 99011167 100004807 101116244 102162467 102780035
3838 102780035 102603694 101776205 100466184 98432543 95813213 92436416 88717128 85175242
3830 85175242 82255709 80199926 78946685 78376778 78038201 77802176 77349216 76724752 75956990
3821 75956990 74850467 73209635 71350940 69854310 68707671 67946548 67279277 66737593 66357952
3812 66357952 65704160 64697229 63273434 61551322 59764123 58081419 56371114 54775886
3804 54775886 53462327 52566285 52080357 52056767 52583814 53431867 54234435 54902489 55449660
3795 55449660 56283608 57464336 58646817 59451573 59801548 59876247 59752466 59482574 58941149
3786 58941149 57970281 56468094 54490576 52494757 50649713 49001419 47547285 46241075
3778 46241075 45268119 44709328 44631985 44988366 45676858 46707956 48002847 49468120 50768443
3769 50768443 51378682 51139102 50652517 50416154 50496891 50696749 51047878 51670089 52422444 53125161
3759 53125161 53568044 53461000 52642453 51402240 50425834 49723899 49245487 48687625 47772246
3750 47772246 46478739 45195682 44257506 43712194 43501091 43588559 43824956 44038224 44183335
3741 44183335 44163391 43810174 43086051 42103106 41218539 40738088 40775893 41220279 42007718 42958498
3731 42958498 44153425 45448352 46625232 47675954 48417433 48976453 49809924 50876611 52109621
3722 52109621 53463889 54903823 56658099 58764214 61347594 64372389 67518611 70644965
3714 70644965 73587457 76314200 78729832 80832024 82372579 83342489 83852867 83998344 83853901
3705 83853901 83631104 83377134 83329685 83503992 83839572 84206956 84364883 84272789 83706512 82539351
3695 82539351 80761563 78374888 75546360 72314021 68815951 65158617 61303367 57347613
3687 57347613 53357478 49689990 46403302 43507077 40916838 38706932 36677877 34882281
3679 34882281 33181309 31625868 30279211 29052842 27936247 27015970 26201306 25504152 24777400
3670 24777400 24044604 23333069 22705183 22078854 21565272 21164466 20813609 20528490 20294053
3661 20294053 20058005 19877921 19656639 19411232 19164738 18963411 18675904 18448433 18199867
3652 18199867 18021651 17777685 17497521 17184990 16866110 16613804 16355460 16101562 16016169 15831980
3642 15831980 15708219 15688813 15604569 15512336 15505233 15446220 15387906 15417236 15514774 15477931 15553178
3631 15553178 15558181 15610402 15776573 15986422 16150301 16251826 16443180 16645320 16841558 17176140
3621 17176140 17562616 17900553 18243250 18673083 19156812 19786021 20379191 21069840 21779247
3612 21779247 22433755 22939792 23433017 23876847 24168839 24230433 24178816 24073482 23926067 23827096
3602 23827096 23704476 23692803 23761825 23778293 23731277 23555965 23396031 23260389 23052579 22908650
3592 22908650 22547675 22097070 21752472 21392497 20998019 20757905 20538261 20319173 20117128
3583 20117128 19922605 19686939 19483159 19315098 19072977 18888799 18834449 18850602 18976882 19167527
3573 19167527 19540892 19950457 20421804 20897211 21483419 22053305 22502773 22733497 22934649
3564 22934649 23024691 23016957 22872744 22766371 22647718 22514607 22284328 22162278 22025884 21917298
3554 21917298 21686099 21607553 21462873 21442162 21448141 21531648 21541108 21674256 21777467 21992050 22215922
3543 22215922 22570190 22980545 23427685 23873016 24509673 25169869 25920112 26758971 27710127
3534 27710127 28592217 29669131 30938163 32400771 33998183 35833542 37863279 40166823
3526 40166823 42719243 45635669 48861070 52426456 56344580 60835308 65773610 71197110
3518 71197110 76930592 82916288 88874547 94803319 100351874 105609748 110515521 115170920
3510 115170920 119698085 123888014 127533859 130661750 132980647 134652407 135757193 136666332
3502 136666332 137225385 137404564 137263334 136851599 136150853 135233230 134005688 132706697 131264742
3493 131264742 129673778 128154982 126894459 125823119 125196425 125006411 125500119 126697009
3485 126697009 128841221 131790151 135831790 141045697 147759424 156450558 166937971 179649304
3477 179649304 195020157 213554288 235049547 259704323 289468530 324827333 358776180
3470 358776180 379997377 382075155 384301173 397306856 420654701 442234860 447264798
3463 447264798 417600365 372551860 339736882 318497460 305020989 296351714 291718954
3456 291718954 289533035 289235544 289998833 292107434 295558123 300908083 308629457 318876314
3448 318876314 332352511 348432311 366724263 388078879 414781518 442469552 462270556
3441 462270556 461553422 450171459 445928828 451896023 461277658 460598269 431341233 373435925
3433 373435925 320280140 280311922 250046528 225638798 206406014 190686363 177989758
3426 177989758 167152188 157803850 149127689 141361351 134454293 128710565 123379638 118796206
3418 118796206 114460391 110455124 106618793 103231412 99903557 96786864 93826921 90929305
3410 90929305 88009924 85242747 82532109 79954981 77490317 75261947 73066563 70901046
3402 70901046 68597546 66355122 64191779 62076031 60073521 58173123 56268154 54418614
3394 54418614 52657222 50984032 49551325 48157806 46943284 45825638 44848593 43869723
3386 43869723 43133524 42507661 41983919 41512790 41191349 41061150 41085743 41105709 40895302 40026190
3376 40026190 38819814 37799506 37163582 36519681 36043234 35670626 35513182 35451003 35484205
3367 35484205 35345006 35493671 35652983 36023448 36463427 37133924 37766031 38566332 39403104
3358 39403104 40454808 41463033 42721343 44176983 45766018 47654131 50010078 52454695
3350 52454695 54994351 56969760 59114620 61354491 63719765 66133310 69265818 72887384
3342 72887384 77301054 82279632 88142204 94729253 102350232 111125673 121914596 134736489
3334 134736489 150252914 168449820 190697371 216750763 245242060 272760814 300183424
3327 300183424 327061928 342444605 333522622 290928366 242559005 208092773 184419199
3320 184419199 168165411 156512316 148423501 142651205 139248823 137346561 136839554 136982686
3312 136982686 138644607 141428732 145634537 151260785 159309550 169544309 182727492 198979754
3304 198979754 219882977 244150577 270493173 295406779 321525937 344647661 354018942
3297 354018942 335508091 288197180 244100416 213646755 192801577 178088317 167736254
3290 167736254 160481208 155337978 151568615 148562336 145649166 142588141 139444523 136146531
3282 136146531 132609558 128800169 124936706 120784005 116400898 111727786 106886268 101813476
3274 101813476 96600101 91400534 86335470 81247722 76414213 71771826 67356927 63195821
3266 63195821 59388516 55803719 52622929 49590256 46860466 44402286 42259337 40254149
3258 40254149 38457767 36708663 35053894 33550020 32181895 30849326 29739835 28680863
3250 28680863 27666402 26747508 25929658 25168439 24482005 23821483 23295745 22782885 22332240
3241 22332240 21814897 21379348 20970105 20531464 20202319 19932591 19704356 19477819 19290064
3232 19290064 19174639 19013139 18965970 18823826 18696658 18572172 18383727 18189447 18075496 17877582
3222 17877582 17786627 17605855 17322324 17047827 16756269 16404728 16025790 15754088 15530755 15218577
3212 15218577 14855022 14605000 14310040 13997680 13636402 13322452 13139401 12958631 12739728
3203 12739728 12542693 12298173 12076408 11820222 11603318 11430926 11247439 11072210 11001417 10852749
3193 10852749 10748349 10607604 10497898 10462549 10411145 10366533 10368020 10433997 10469903 10570763 10699248
3182 10699248 10723609 10728208 10726181 10596789 10593788 10631321 10603468 10551142 10415289 10193131 9943583
3171 9943583 9682966 9527038 9368842 9216179 9086867 9071779 9124896 9040105 9078182 9054179
3161 9054179 9043983 9055531 9047151 9205617 9285587 9345282 9380517 9390362 9441587 9392537 9335340 9381364
3149 9381364 9371471 9272527 9135838 9000314 8866256 8616929 8380526 8202437 8132987 8110769
3139 8110769 8077776 8089890 8166384 8093944 8093613 8102183 8164299 8125993 8067926 8053221 8093445 8129477
3127 8129477 8141766 8179664 8221590 8173285 8186980 8205527 8264948 8222225 8157777 8223520 8248447
3116 8248447 8266405 8304004 8378571 8436096 8489586 8629640 8803231 9018489 9249213 9479937
3106 9479937 9764508 9997902 10196423 10421091 10556374 10717454 10972521 11261075 11512583 11927385
3096 11927385 12307609 12678366 13035743 13330229 13677962 14055583 14374338 14694618 15109115
3087 15109115 15447636 15962477 16465965 16866204 17331391 17805684 18324059 19018886 19834911
3078 19834911 20664327 21647631 22728051 23796177 24867037 25993995 27139651 28411669
3070 28411669 29808661 31335250 33062109 35108500 37408118 39935906 42787689 45912423
3062 45912423 49468936 53465220 57947505 62938804 68493809 74833963 82111073 90255187
3054 90255187 99439019 109969396 121950953 135728995 151585801 170065479 191837158
3047 191837158 217081473 245874880 277454167 311473515 347132829 379131603 395629342
3040 395629342 384895753 348875107 304790236 267053866 239294817 219924923 206321309
3033 206321309 195227399 183287495 168951285 153074847 137502689 123566751 111668602
3026 111668602 101618070 93151063 85885777 79521383 73929045 68877566 64393633 60405289
3018 60405289 56848751 53521763 50545082 47905578 45395575 43056145 40855725 38791116
3010 38791116 36825352 34926600 33102415 31409149 29831268 28348792 27016592 25822368
3002 25822368 24769240 23786077 22782801 21857147 20932932 20132325 19415341 18700988 18057623
2993 18057623 17399938 16833812 16282424 15718638 15321495 15014562 14616094 14293054 14036023
2984 14036023 13825656 13472907 13109699 12771688 12415407 12073332 11759444 11577621 11376865
2975 11376865 11177271 11022903 10789471 10606961 10385134 10130738 9885548 9625009 9393101
2966 9393101 9219092 9039046 8865495 8711732 8521948 8302925 8085616 7932991 7767215 7627354
2956 7627354 7483821 7382644 7267900 7184674 7039104 6916072 6922649 6781147 6642003 6565873
2946 6565873 6401899 6187812 6079187 6013662 5885299 5829644 5795906 5713179 5636831 5482900
2936 5482900 5420810 5435289 5371611 5310341 5173967 5094402 5046901 4982380 4959666 4920557 4813905
2925 4813905 4732386 4572013 4484084 4466686 4418469 4300156 4207668 4042277 4004376 3992206 3939269
2914 3939269 3913470 3894874 3855631 3735806 3701612 3709001 3650779 3621115 3496303 3451142 3425501
2903 3425501 3367614 3276451 3343891 3354474 3372461 3362113 3333051 3262606 3045029 2956985 2997816
2892 2997816 2876848 2910299 2808748 2681344 2688793 2631904 2582895 2486458 2434621 2420068 2396572
2881 2396572 2412512 2434124 2309376 2309668 2325175 2277114 2360045 2416594 2419023 2326159 2270174 2255429
2869 2255429 2243184 2303914 2331482 2305964 2226249 2208611 2265359 2246948 2168788 2064381 2056331
2858 2056331 2089616 2126526 2161842 2166356 2096054 2041315 2143280 2126072 2124899 2084778 2081114 2090148
2846 2090148 2102593 2170712 2101036 2084548 2074837 2067294 2011329 1920118 1907932 2002602 2023380 1962476
2834 1962476 1947536 1933383 1953657 1898738 1909317 1820541 1826133 1795001 1764995 1659181 1703667
2823 1703667 1713474 1739552 1723573 1708652 1768147 1789089 1733324 1701577 1640007 1675954 1686167 1669955
2811 1669955 1746216 1773365 1775295 1747692 1730972 1720419 1705329 1715097 1641583 1641370 1654841 1627675
2799 1627675 1606822 1589963 1577692 1568246 1542555 1501988 1534392 1608541 1563729 1532778 1551476 1567331
2787 1567331 1581649 1488321 1508193 1546427 1518750 1506455 1513640 1589256 1620353 1671767 1635955 1633690
2775 1633690 1633654 1647817 1701145 1696551 1680721 1733818 1848713 1879633 1997709 2068379 2156421 2291701
2763 2291701 2426791 2562513 2739273 2942109 3130132 3164327 3102762 2949131 2667176 2430308
2753 2430308 2344156 2321688 2262654 2217042 2118211 2012273 1968674 1879145 1766348 1666947 1575091
2742 1575091 1469729 1418500 1434948 1432159 1332571 1308806 1290978 1259194 1242541 1267928 1204903
2731 1204903 1240693 1187386 1164349 1150663 1101739 1075229 1093379 1070197 1068972 1102011 1079161 1052777
2719 1052777 993739 986402 931153 918310 910123 935135 958371 929284 920132 936940 955321 973760
2707 973760 901919 873609 883165 873142 904470 867231 884860 856142 835053 790492 782709 817429
2695 817429 837707 807779 770862 774285 747117 689862 693233 740892 740189 729855 695761 639954
2683 639954 651173 619938 584029 613042 591051 585739 666871 721683 671239 709510 660661 562178
2671 562178 535280 545218 531006 523505 579115 602708 595359 624793 605276 572216 579222 582619 576544
2658 576544 570577 580835 623484 598234 519288 466364 477854 466910 511506 619917 600816 555675
2646 555675 522905 610469 571053 505125 513452 493933 470502 399843 399386 398121 478244 511018
2634 511018 536411 526096 543690 501368 470323 474693 450933 475415 485747 444759 363246 398917
2622 398917 422956 498341 428855 399534 415503 461387 433450 440564 479825 495416 439584 395112
2610 395112 410336 416571 380831 324508 360186 364696 389712 415346 434595 386894 408242 400213
2598 400213 396378 339907 299690 314432 323656 304562 344148 282028 312581 399038 375676 379052
2586 379052 413815 429183 415088 420576 365077 382161 416269 368218 352104 402596 401678 386863
2574 386863 372774 343406 335654 369454 392565 352106 329191 368899 332061 290676 280607 351694
2562 351694 359647 380264 379648 345445 359562 289616 261178 306419 324838 295158 308491 342652
2550 342652 379936 308529 392058 368775 370749 367434 380180 350063 376998 399623 390955 369293
2538 369293 348754 276198 214856 182345 247947 326050 268555 224882 241922 337759 289479 272998
2526 272998 350117 304084 228721 259127 356037 358144 266908 219713 311150 399517 317487 306247
2514 306247 266849 275331 270876 242703 178977 215239 252556 227667 209636 283415 254013 269742
2502 269742 299890 297802 337413 294558 274024 233161 235930 268291 261750 296383 282947 200931
2490 200931 177271 243490 271270 300986 319851 333527 288630 216621 181915 170618 258115 172775
2478 172775 129601 189303 199724 174382 244897 282546 252344 213483 207484 251297 261162 253255
2466 253255 176801 208784 275164 230384 197162 271718 252610 262588 301482 259094 285731 233096
2454 233096 250284 304265 261143 301529 265701 298721 240650 220154 203711 154744 190841 203389
2442 203389 263012 223967 186472 221881 248022 297440 250066 249710 205634 210838 221207 164331
2430 164331 213681 226890 228510 295842 291237 239078 229257 231183 234872 254281 175811 167077 227442
2417 227442 269815 302021 201628 202427 218930 204811 163069 191243 223389 230835 243330 213484
2405 213484 184217 222802 174751 207287 267050 300192 361084 307741 302552 284741 267091 165611
2393 165611 151436 237744 212028 286644 241606 177144 207772 213215 227559 287184 331278 293692
2381 293692 290119 300507 313657 319130 258437 252732 253639 288147 322478 269579 249808 176979 219734
2368 219734 198477 189334 184393 238051 255432 226401 232352 243643 301740 303366 306303 344330 342920
2355 342920 314559 308657 287406 277560 284476 237367 228351 248458 256978 284741 322725 369243 281432
2342 281432 307520 356483 327770 275689 319690 352117 268552 268154 311020 363348 339129 361977
2330 361977 401839 414257 446085 487216 528997 498595 493038 486215 523047 531491 496365 494998
2318 494998 562532 556922 582831 592680 626021 663328 672276 679982 742706 759006 884190 935964
2306 935964 997786 996478 1075738 1049729 1045427 1194036 1289117 1397805 1439606 1583789 1709987
2295 1709987 1897589 2138675 2314513 2544796 2749021 3062044 3375854 3645490 3807786 4121952
2285 4121952 4516982 4991717 5618535 6377637 7326495 8527653 9976668 11692179 13352871
2276 13352871 15662486 18573486 21109053 20629699 16135413 12354747 9992194 8377206
2268 8377206 7187765 6329279 5660788 5081446 4643355 4300500 4013824 3736005 3562483
2259 3562483 3463649 3283628 2971462 2734334 2489877 2269619 2069547 1976390 1853875 1766843
2249 1766843 1712018 1577099 1511300 1419986 1293218 1268092 1283607 1155144 1162230 1125234 1056008
2238 1056008 1051899 990210 989026 928737 830089 804126 823799 804918 752231 694888 681714 651007
2226 651007 610899 573479 484785 642835 647700 585673 559387 536384 550575 536958 548805 511962
2214 511962 518097 553940 468665 538562 540309 450790 477118 483303 441195 458554 454325 445198 446557
2201 446557 392068 406465 336763 407526 373244 364989 330278 412759 360911 409459 451195 361784
2189 361784 320116 316067 338717 382174 374979 357528 337955 340491 387688 329108 289155 273344
2177 273344 253101 303046 304797 250235 238931 286628 263856 202391 245454 212490 297722 250637
2165 250637 274587 270276 252602 225538 250728 272330 221705 194149 174686 232078 249166 290682
2153 290682 253550 251553 217030 211571 221952 212105 155242 145853 183950 163674 160892 150055 163967
2140 163967 129690 179945 205133 139386 133594 180584 229025 229747 237083 218442 205564 139588
2128 139588 179424 230267 214566 262926 245745 173012 173435 218806 195320 148585 70957 102634
2116 102634 98757 140207 123977 92358 153210 119996 141104 141207 131277 181099 165830 141405
2104 141405 138618 100594 147805 188866 212478 191657 181806 106605 139329 167108 83282 88099
2092 88099 96084 105275 159127 100605 63597 140227 181095 122082 123927 92520 61044 76508
2080 76508 123595 129199 117652 77427 120091 174264 134338 141622 118234 211319 168779 111253
2068 111253 101361 146038 173934 157442 150243 95420 87832 88861 137799 231117 223404 145200 153800
2055 153800 141565 130926 88160 96799 73027 53632 134486 181797 218573 145724 176576 187710
2043 187710 111356 97000 63442 47698 92119 115408 123157 117072 135336 135697 160901 187008
2031 187008 148868 115193 117957 120151 80982 94072 105629 94154 47271 49403 101635 78594
2019 78594 133361 135699 121481 178307 125333 106400 125032 96261 71321 78205 75605 53081
2007 53081 102358 132311 171911 167135 119381 165118 149650 105502 55725 59847 98414 177733
1995 177733 155659 55337 48392 63930 49456 61723 76761 28802 77859 83391 97839 4590
1983 4590 8925 40063 41175 48823 104305 109508 35543 75129 66108 111593 70433 64463 65886
1970 65886 58210 130773 84662 83313 151489 154157 174865 118617 69773 78235 55001 129807 79147
1957 79147 78578 93976 33903 41014 106744 136610 103991 98614 83605 143791 82926 98364 110194
1944 110194 128321 117754 81936 104630 91474 66936 111584 103508 27241 57427 57512 121696
1932 121696 121618 79702 52217 90131 89521 114004 121043 113258 126832 108616 56348 25414 9185
1919 9185 120940 81997 -47501 -73663 22774 83051 14296 -9656 41281 73373 49833 29968
1907 29968 51047 3598 -39629 42030 53750 5883 -17223 53978 69348 66772 49286 54939
1895 54939 89459 95078 98883 112761 66458 108206 63810 -13894 -31444 -27641 18466 40700
1883 40700 99428 113051 31606 55534 3950 48715 34829 57166 59607 27972 37650 12577
1871 12577 -2712 -31072 24657 28541 -9003 -16731 34666 81064 60320 25205 55668 27663
1859 27663 42469 88369 49763 2836 31356 79979 13287 -17641 32845 79524 92270 59837
1847 59837 38176 70341 5339 27783 39832 49386 120386 109502 79745 88010 126965 143892
1835 143892 64003 13714 92905 177367 229289 178962 116659 82453 20563 36224 29664 -2396
1823 -2396 46245 13654 27039 44487 12033 55526 99394 72380 16967 -26865 -69773 -61147
1811 -61147 -51168 19233 33045 46111 76009 85221 67320 -8098 25034 33881 12567 -16196
1799 -16196 74035 65310 42126 39929 16575 31883 43619 57441 44990 24294 13758 19862
1787 19862 8304 23621 -347 -27132 824 88152 121802 82221 69003 61034 23164 -12332
1775 -12332 61679 89787 68514 48041 56380 46542 4316 -19086 -55258 53586 79404 38681
1763 38681 74572 47303 94123 72112 78560 40308 23768 25836 44156 -13116 -42259 29582
1751 29582 42292 75001 107002 159692 139030 57635 80327 72126 1245 14021 3330 44815
1739 44815 57162 -24701 -29069 25703 3586 -84681 -40132 21141 75215 107485 121314 103370
1727 103370 111128 47651 -9363 18706 7343 46810 51640 86567 61847 48334 119977 85984
1715 85984 96100 76428 40693 53716 47141 3038 -26143 -55730 -41543 22853 51949 49335
1703 49335 -6132 36628 7697 7821 70316 38218 57056 94879 86519 11353 -37353 6700
1691 6700 62600 18230 36215 15025 37211 39588 -3326 64794 23147 21355 -5882 54085
1679 54085 86990 46955 -8826 -8093 -3238 -96963 -86791 -19353 -54684 -70229 -52399 60446
1667 60446 22910 -12598 -39381 -20126 24362 61998 63625 12995 -43952 -66385 -7639 1274
1655 1274 21997 65235 27355 60290 88342 49369 46091 -5876 -12179 -2432 12007 26752 -44537
1642 -44537 6791 80570 73394 19967 1155 -3281 -25376 -35510 -17858 37597 56094 65578
1630 65578 15582 -90534 -47898 29851 -18287 21054 46552 31577 -8342 -6825 1838 70764
1618 70764 90731 5263 2626 39095 26879 23990 -30903 27195 328 -29722 -12094 -13015 20768
1605 20768 -46675 -65485 29630 -9316 -26726 26714 102077 91505 18628 36596 -9936 -13989
1593 -13989 -37381 -63493 -69357 -11625 -22216 34162 72925 70991 4729 69301 106043 53550
1581 53550 -30286 -100260 8 8155 8443 11343 77684 41166 42691 46490 72014 10621 -32401
1568 -32401 -678 -926 12696 -25702 -38843 33301 17698 41906 84515 12567 -29257 -44795
1556 -44795 -33519 -28944 20109 24805 22648 -28581 -29414 -39050 -58174 21830 41685 47664 69284
1543 69284 123922 75995 27938 -4565 6933 31848 -33600 -71183 -38041 16216 -1613 -20599
1531 -20599 -56597 -7563 109508 91688 -13418 -7830 24583 78901 106260 31803 40790 52130
1519 52130 8506 -11282 -22671 -22761 -15730 -47195 -46632 1584 63318 75266 32694 -1436 37390
1506 37390 4518 -25678 41455 21270 4972 8834 -24361 3886 14361 -13124 -17052 34931
1494 34931 8124 24889 -2544 -101956 -70300 -25482 13116 5255 52273 37326 -28862 5457
1482 5457 -17983 -63242 -29374 31479 11081 -47558 15849 2090 -41424 -27068 -53528 -50665
1470 -50665 -60925 -18554 37916 65180 71756 36013 -3331 -27090 32306 67268 25526 51978
1458 51978 88713 -36006 -30946 -9347 36130 28948 6208 70171 75180 34763 33050 21828
1446 21828 33882 46137 79192 66802 18386 12284 21054 23088 13605 35870 -81525 -50370
1434 -50370 -3506 -33388 1046 11000 11537 -25428 -48637 24236 32012 65082 4690 -17872 13208
1421 13208 13608 -24720 22274 48139 84239 51448 -16253 39405 36482 44689 7211 15951 -9495
1408 -9495 24676 19187 27110 36463 99433 140376 76984 31431 96616 76464 96637 104077 80940
1395 80940 91671 80711 77733 33513 56576 -1693 -3301 -35728 12034 66643 -5145 -19000
1383 -19000 899 -49184 -30287 -32360 11360 56226 121554 111979 67025 42232 -53064 -65654
1371 -65654 -41989 47921 24988 19323 -26677 37629 40689 -8748 -61415 -45549 -45589 -90532 -27105
1358 -27105 -15831 -34043 47739 116849 50633 82850 109715 71518 72125 68686 101875 62814
1346 62814 23222 19668 -6044 14160 72106 4470 35343 60877 -51241 33970 50212 18854
1334 18854 55744 56117 -16643 -8514 45807 58048 80931 161239 79260 65373 106069 42706
1322 42706 -31898 3229 -10469 8735 -58972 -65760 50430 55181 42034 42552 20596 68058
1310 68058 115586 49344 57291 108492 135531 103467 45926 -811 -19941 -101052 -84991 11529
1298 11529 16579 -67423 -43942 -65451 -75093 -11905 23696 19229 44769 -10382 -30176 -23436 26825
1285 26825 57715 63174 18885 41371 -23722 -33881 29399 -36473 19755 41269 40070 1989
1273 1989 46025 -22363 -48880 45343 72829 128255 119831 31692 43838 8068 -52087 3904
1261 3904 -8885 -66606 2812 8057 29611 51517 -19363 -89550 -27777 23751 21130 -28703
1249 -28703 -7104 40051 36598 106054 79607 81620 87795 4305 47656 31556 -57224 -102196
1237 -102196 -42187 -29233 -20927 44836 35411 -42195 -53460 -11795 -40503 -27606 -43451 -56335
1225 -56335 -5189 8190 75195 99457 100981 72327 26828 58767 55524 52720 29100 12732
1213 12732 -2784 20261 -8929 -8196 -13905 19459 218 6968 6637 15639 198 -24625 34733
1200 34733 67159 14560 -40830 -10493 -15507 -31716 -19911 -24869 -54522 11036 23405 51074
1188 51074 -98 11948 14301 8142 62119 -14439 9081 -16334 -72989 -55328 10447 49699
1176 49699 -29914 -22534 -54776 -59385 -13079 51592 32619 -22028 22978 56534 11686 14204
1164 14204 23837 40277 48877 126053 105953 43945 48871 -4335 -26560 -67602 -44038 -79386
1152 -79386 -38022 -33470 49387 86910 77084 58822 83376 42394 54837 68322 51199 -6078
1140 -6078 10226 3933 14258 -2221 19358 59288 8684 -32512 -27282 -51646 -111 42552
1128 42552 92052 52644 -33677 2771 10336 24132 3658 -36185 -68988 -101615 -80658 -59743
1116 -59743 -16758 40097 57749 43817 23493 -11395 -7608 23006 -38793 -14518 -5065 -7982
1104 -7982 -4358 -23259 -7582 35070 29128 -3 -19714 45926 64729 33739 26158 31956 -17489
1091 -17489 -46500 -17928 74364 5336 -39929 -108067 -105743 -111155 -51667 -89718 -94025 -29222
1079 -29222 25179 -18740 -28269 5425 -5398 -30584 17795 62134 33639 2544 28390 14942
1067 14942 -2791 3357 5614 33492 14549 21337 -32307 -25910 25504 25796 -7649 -61997 -50386
1054 -50386 17089 8792 1201 -9090 -43554 -61353 -92930 14907 31325 19079 70590 -4856
1042 -4856 -25886 -24421 -54501 -61297 -48107 -27763 60507 75428 62294 -12143 -20473 -5780 11174
1029 11174 11079 -38336 -4644 10957 16473 20710 9136 50048 40118 79507 45608 44553 65268
1016 65268 28062 -48461 -27136 21418 33528 50709 20912 44352 33702 -5464 -17207 -48375
1004 -48375 -55086 -81658 -65846 -54624 -11486 -24283 -19539 -11373 31266 21279 -19673 -11032 16823
991 16823 22680 -19238 -29599 -21958 -22870 -39912 -60581 -50299 -30276 -58360 -23267 -13768 5658
978 5658 -9969 19936 16701 -15569 -58604 -70298 -8820 -20734 30219 25677 39560 15518 19951
965 19951 82390 15379 63833 38314 43260 54873 53435 42059 17711 -48588 47687 54506 25509
952 25509 101709 37688 -45200 -73963 -63894 -49220 -13813 21102 10595 48205 32959 4790
940 4790 12121 39930 109563 58306 50556 28440 -84423 -78656 -64427 -96097 -47753 -62929 -23900
927 -23900 -21353 7735 38857 14423 -21390 -3503 -359 -7930 -14902 -21948 -51497 -104954 -58382
914 -58382 -48085 -32278 -95211 -119915 -72107 -110954 -106222 -80982 -100951 -131811 -127286 -133226 -116950
901 -116950 -144600 -68899 -22913 24136 16309 53947 40818 -7511 -3261 -19948 -95752 -92803
889 -92803 -33578 24636 72523 78891 41527 -28426 -74444 -20792 28703 -34045 -72365 -32450
877 -32450 14008 -10590 68217 72447 90556 37166 -49174 -18102 30502 2155 2710 -46498 -14981
864 -14981 11154 -12377 -6592 -22130 -54377 14420 -919 10735 -10109 -5497 16511 -27856
852 -27856 -22827 -21520 -44271 -61423 -19665 16426 9212 64545 37688 -23716 -4676 -18164 -31021
839 -31021 -9771 14481 -3088 -28554 -73588 -22672 -20552 -8586 56087 55215 40050 -20023 -72097
826 -72097 -45108 -23354 -8883 -2432 -28729 11566 28667 91266 121777 131843 67986 106774
814 106774 14276 -72225 -86127 -52941 -21902 -34995 -29761 -48421 -28523 -93930 -58390 -30314
802 -30314 -46018 -45636 -19932 -51627 -4097 -8430 38831 -15121 -30113 -15273 -3186 -67675 -45487
789 -45487 -64890 -18150 6288 -8807 -20806 -76321 -19091 -33073 33833 2698 -33140 -53995
777 -53995 -45013 -32937 -8048 5739 -15250 37100 35415 -34799 -20447 20411 35286 31917 -34217
764 -34217 -1402 -85831 -36376 -8442 -33674 -17874 -27227 -17046 15774 28270 7754 62481
752 62481 45749 -1872 23132 3120 -101346 -41762 -55047 -19832 27648 -15884 26136 29480
740 29480 -50284 -51567 -46659 32772 103699 73289 40236 29779 24611 55841 25044 -20771 -8085
727 -8085 20074 23976 58945 -17930 -37360 -92134 -50521 -43971 -56910 -31787 -54385 -58845 -96717
714 -96717 -95187 -78130 -20074 -50933 -13270 -11816 -29783 -84630 -81705 -65963 -37026 -32290 -2159
701 -2159 22690 6740 -30381 -21255 -22434 -29048 -13316 10725 40225 30539 6769 -21068 22048
688 22048 16954 -15165 59813 74339 68925 73986 75077 86983 8923 27434 26011 7497 -23045
675 -23045 -6378 1365 -44568 -42822 -9990 -57885 -105463 -35413 1522 -3933 -80600 -81318 -59475
662 -59475 -67281 -93387 -83982 -59532 19983 -46700 -110640 -58332 13807 -70149 -158075 -107111
650 -107111 -5964 -4809 -6567 -56251 -90856 1199 -36093 9777 26713 5841 -35516 -2634
638 -2634 -7269 -34839 -58429 -9202 -28462 -83786 -12077 -7208 -63029 -39067 -67474 -70576 -89802
625 -89802 -118747 -68579 37200 21822 -26696 29242 23447 36007 66902 9443 46490 76392
613 76392 -8707 18846 16859 -11632 22083 -5632 -2014 18852 -2107 -45605 -69937 -134730
601 -134730 -157145 -77084 -3901 -25117 -64456 -11993 -39444 -49929 -33461 -41608 -44748 11936
589 11936 25914 50590 -6285 -5668 42967 -39336 -106683 -2382 4075 -2628 30654 -16477 4223
576 4223 9846 66537 102325 47440 23365 -19142 -11017 60517 16007 -40028 -13920 -1589 -37386
563 -37386 -49221 -107838 -97903 -64811 53517 86302 -7735 24104 14767 -15003 -57596 -29170
551 -29170 -16178 -5877 36712 55549 92273 62636 -5238 -19535 24006 -24057 -21755 -50375
539 -50375 -48524 -32502 14759 -4057 -25068 -44534 -57640 -19268 -74282 -24607 37760 36012
527 36012 -1071 -44413 -57901 -23118 -21460 42324 44101 1719 68996 100498 56993 -40179
515 -40179 -99011 -63842 -58590 -138944 -71151 -63854 -133127 -120905 -89712 -43031 -68254 -55281
503 -55281 -75628 -47431 -8378 31746 -15228 -55311 -32356 33512 29389 -7360 -40055 -47610
491 -47610 -14517 -13677 -39859 -56129 28058 -2058 -47149 -8871 7087 52087 94006 36797
479 36797 27899 -93376 -100323 -34466 -31917 -65796 -37827 -56022 -6074 30271 5381 7642 -45571
466 -45571 45946 720 -72778 -98631 -57056 -9827 71789 -14993 -23293 -17292 -54238 -910
454 -910 -34230 -46842 33010 -9247 -21687 -31031 -26431 61225 -10054 -21826 39116 2290 1667
441 1667 -6134 -20846 -18302 -93989 -80345 -8763 39875 -46006 -80656 -13471 8078 -61905 -36724
428 -36724 -37067 7867 8446 18463 6318 -102861 -79143 -92577 -98304 -60747 -53134 -8690 21647
415 21647 36074 16785 13075 -21876 -70521 -84918 -108045 -92208 -89842 -121377 -133158 -154203
403 -154203 -84470 -67241 -94302 -91063 -80334 -46131 -18496 26243 24232 40303 -53965 -134337
391 -134337 -50076 -89095 -85972 -27311 -70829 -20732 -37619 -11970 -17574 -15547 3245 -260 26960
378 26960 5716 -81142 -131877 -70202 -13780 -36789 -9477 -42794 -100618 -69747 -129854 -97715
366 -97715 -28760 -15807 -134429 -135808 -72931 -80066 -40414 -58177 -20754 -54407 -112298 -162041
354 -162041 -145843 -158741 -61429 11585 -65378 -101775 -55669 -67086 -127180 -72280 -14120 -37946
342 -37946 -65471 -91568 -89973 -66476 -26724 -88324 -101206 -32992 -57254 -83216 -88879 -76800
330 -76800 -73602 -108171 -147972 -55782 -95869 -133455 -108116 -28230 -3992 -82285 -90651 -98111 -35566
317 -35566 -12231 -50680 -37315 11214 -133 -91019 -134553 -166155 -159086 -120651 -58430 -58114 -82983
304 -82983 -80614 -58819 -92179 -42430 -20337 -114378 -135111 -104541 -87384 -68804 -61382 -24446
292 -24446 -35888 -67935 -26072 -10873 -42564 -9414 -27272 -22272 -22644 -16910 -3113 -55770 -79734
279 -79734 -106316 -98374 -128540 -146880 -94717 -102892 -193072 -145475 -71626 27816 -28054 -111386
267 -111386 -120189 -103237 -16715 -64177 -86585 -120953 -86403 -45871 -62359 -58138 -16820 -29367
255 -29367 25295 2694 -41263 29142 -31774 -67100 -57628 -85972 -123911 -93097 -31283 -57033
243 -57033 -10748 -8731 -64941 -11652 -62675 -115912 -58254 -49797 -84248 5899 21370 5489
231 5489 -20701 -48047 -85326 -77949 -57619 -100341 -124841 -142217 -122441 -109498 -97528 -57944
219 -57944 -77031 -72271 -139570 -108698 -82925 -67460 -61897 -84590 -122736 -155965 -117699 -73693
207 -73693 -132228 -155754 -129491 -103889 -9306 -37666 -62479 -47069 -53031 -106447 -82768 -80878
195 -80878 -30149 -34244 -28138 3165 -10272 -42169 -38647 -15942 -80034 -92493 -43834 -26384 -28171
182 -28171 -39486 -56283 -50315 -132032 -68839 -61847 -48743 -35748 -72975 -58132 -26291 -73401
170 -73401 -91214 -55375 -128381 -120227 -132185 -91688 -97762 -78767 -74600 -64658 -72042 -50103 -85294
157 -85294 -79817 -4591 -16859 -53181 -67835 -23868 -66374 -79562 -66156 -13745 -45278 -64374
145 -64374 -102672 -95734 -104318 -67394 -90116 -130967 -156664 -129682 -106539 -57465 -74106 -114186
133 -114186 -55646 -53069 -27674 -40051 -43083 -41374 -77813 -127574 -96476 -98515 -86069 -83264 -46026
120 -46026 -27016 -64182 -43696 -61259 -53649 -16747 -43949 -47957 -86025 -96797 -117464 -109273 -102063
107 -102063 -60377 -51173 -43083 -88725 -82928 -89498 -9082 -36346 -63015 -16601 -82349 -42660 -13546
94 -13546 -33766 -43876 -74455 -141979 -118828 -77212 -111453 -82285 -75922 -104538 -124051 -110956
82 -110956 -62847 -10129 -18985 -69718 -63591 -66483 -104448 -105573 -91801 -75343 -39066 -43513 -100559
69 -100559 -144089 -121260 -91499 -109941 -72059 -11238 -6495 -30080 -97930 -93994 -98924 -119578 -118619
56 -118619 -55721 -64272 -48521 -31720 -68262 -51429 -31367 -41318 -40857 -64821 -139342 -122787 -115068
43 -115068 -88275 -65788 -75894 -44334 -8079 -51328 -64816 -78090 -60149 -50549 -54284 -38362
31 -38362 -56550 -16404 -39853 -59169 -48132 -61496 -117503 -123337 -100928 -107645 -90367 -59594 -68499
18 -68499 -73208 -73494 -50489 -26105 -52697 -93361 -64936 -48127 -71372 -77613 -67515 -111208 -94852
5 -94852 -79784 -83987 -119131 -72653 -48995
0 -48995
$$ Imaginary data points
##PAGE= N=2
##DATA TABLE= (X++(I..I)), XYDATA
16383 -2753068 -2732753 -2734864 -2704115 -2640088 -2607859 -2539178 -2510890 -2524015 -2457396 -2394247 -2329040
16372 -2329040 -2270274 -2267612 -2259517 -2211169 -2187857 -2155419 -2085795 -2049152 -2020284 -1996563 -1949088 -1865030
16360 -1865030 -1842120 -1843114 -1863317 -1820383 -1742016 -1751457 -1679022 -1597714 -1555719 -1543330 -1505744 -1502616
16348 -1502616 -1440165 -1382754 -1367489 -1358264 -1380658 -1279369 -1257932 -1216142 -1204772 -1190634 -1082363
16337 -1082363 -1074575 -1096241 -1038975 -929106 -902263 -865850 -845085 -825095 -825301 -805742 -752609 -708396
16325 -708396 -669694 -615002 -592423 -517374 -542385 -566635 -501150 -454138 -500949 -465066 -430813
16314 -430813 -335658 -348166 -349380 -229982 -248974 -199318 -150537 -124845 -105990 -40269 -15244
16303 -15244 42678 102055 105398 107151 134940 143688 173915 224407 227999 284242 327948 362810
16291 362810 399953 369670 372389 358713 442421 464339 502259 526674 529562 541420 560422 624356
16279 624356 587520 642080 700812 710422 741883 854562 837856 815568 848434 862189 906463
16268 906463 931070 972292 982554 1037354 1060172 1081034 1105070 1107166 1162145 1180193 1209499 1157903
16256 1157903 1207289 1300610 1347143 1370567 1316648 1338758 1347294 1361918 1425399 1415963 1431535 1459556
16244 1459556 1462796 1447524 1461758 1534819 1543443 1596299 1644594 1656647 1713327 1700506 1727242 1724631
16232 1724631 1746058 1743387 1681861 1740100 1789744 1828943 1863807 1922339 1905866 1911819 1877622 1897190
16220 1897190 1931515 1961264 1884926 1840139 1998115 2070950 2074863 2016149 1998468 2078978 2113931
16209 2113931 2101869 2130418 2156715 2174281 2157035 2163142 2215799 2198330 2196604 2194735 2185404 2218882
16197 2218882 2329544 2290745 2264273 2231964 2206741 2276580 2375685 2385995 2361337 2314194 2352560
16186 2352560 2428517 2424367 2416633 2418099 2440863 2458990 2412823 2420336 2432798 2444545 2382484 2425712
16174 2425712 2490899 2481325 2546238 2574099 2570155 2583888 2618364 2591877 2576384 2538708 2503631 2539330
16162 2539330 2608113 2638840 2649507 2641365 2603703 2568834 2647214 2659274 2723208 2725846 2733975 2703357
16150 2703357 2692661 2720562 2723502 2676049 2689195 2777490 2747441 2713485 2783963 2732077 2785811
16139 2785811 2765369 2765534 2796739 2757609 2774382 2784307 2817832 2877308 2813237 2770275 2815584 2818907
16127 2818907 2850667 2871813 2891598 2869480 2882261 2829865 2798993 2796868 2905055 2849684 2865313
16116 2865313 2941175 2909174 2872460 2868261 2863219 2903394 2943943 2891527 2909731 2923068 2894136 2855016
16104 2855016 2905293 2886302 2888882 2855696 2879421 2948010 3022192 2988517 2884729 2877295 2884316 2890188
16092 2890188 2921378 2922816 2855772 2878207 2929406 2964360 2954813 2926484 2907109 2916537 2900695 2960852
16080 2960852 2985111 2993702 2981382 3011831 2989677 3016370 3014522 3007068 2961115 2964570 3028067 3039099
16068 3039099 3054787 3006065 3008629 2983995 3024701 2982691 2907086 2939308 2946227 2896910 2888962 2963870
16056 2963870 2976689 2972547 2974521 2976124 2984623 2975702 2996998 2954232 2970844 3004268 2984888 3000019
16044 3000019 2974218 2963206 3013968 2967591 2954627 2960425 2936195 2950788 2971966 2974706 3018039 3039105
16032 3039105 3012763 3026931 3053896 3023044 3060865 3071295 3089911 3006831 3015347 3072224 3008244
16021 3008244 3018027 3044769 3020140 3026602 3028675 3042325 2970169 2904364 2918120 3025522 3014571 3015150
16009 3015150 3046992 3005348 3022208 3006297 3018864 2970654 2996858 2996870 2969790 2964797 3027807 3050701
15997 3050701 3052193 3082643 3057436 3000924 3023722 3088001 3088899 2978540 2988913 2983296 2999299 3035913
15985 3035913 3021578 3045875 2972862 2925428 2882241 2871226 2928423 2947097 2989877 3042703 3040832
15974 3040832 3065158 3069955 3018776 2962663 3016901 3005514 3004956 3037607 3040273 3045074 3037907 3064469
15962 3064469 2944041 2958527 2995965 3056388 3063185 3026916 3021182 3044081 3069462 3053432 3076402
15951 3076402 3071480 3104109 3035901 3000054 3037431 3038627 3029090 3042469 3032213 3061965 3110555 3093879
15939 3093879 3039249 3046134 3063812 3061785 3018138 2959249 2981503 3044290 3064663 2973280 2979659 2992490
15927 2992490 3024148 3025682 3043080 3003195 3024105 3107180 3155783 3084584 3058197 3103264 3071682
15916 3071682 3041029 3104934 3083583 3053083 3025783 3078135 3097886 3068444 3047536 3006880 3014685
15905 3014685 2993977 3016938 3023687 3031434 3016351 3073838 3043128 3033105 3135817 3197008 3137220
15894 3137220 3153946 3119084 3063136 3086778 3076013 3037679 3033229 3067194 3069567 3027594 3031339 3042860
15882 3042860 3038581 3034480 3066179 3050429 3042498 3057807 3069031 3132917 3135347 3169023 3108732 3104563
15870 3104563 3156456 3124670 3014028 3032868 3079140 3045839 3079612 3114750 3124937 3126989 3108340
15859 3108340 3083277 3059386 3030627 3042148 3046220 3153298 3129461 3114190 3105571 3079482 3145836
15848 3145836 3070592 3044828 3135045 3087827 3105009 3069430 3125611 3116774 3095550 3078225 3117506
15837 3117506 3119342 3008905 3007663 3066839 3105161 3082186 3099676 3107676 3074387 3109533 3102153 3107537
15825 3107537 3109161 3141492 3054176 3052384 3051748 3051112 3126794 3150701 3110283 3070402 3062879 3012103 2990100
15812 2990100 3000572 3033902 3089393 3066724 3052852 3034168 3107426 3143414 3122301 3090254 3050889
15801 3050889 3071824 3102651 3109733 2980811 2957275 3027004 3102717 3059029 3064452 3073641 3138501 3097657
15789 3097657 3095768 3090869 3087871 3075338 3103830 3082049 3059084 3057729 3030033 3008552 3000627 3021458
15777 3021458 3075623 3046640 3093073 3123081 3142340 3092763 3036658 3005078 3027091 3075892 3066355
15766 3066355 3024366 3095537 3114224 3060274 3108158 3093774 3077412 3037988 3024933 3059060 3133752
15755 3133752 3089948 3043578 3064886 3072456 3086013 3054390 3024230 3017015 3043364 3066931 3055454 3032822
15743 3032822 3025390 2963236 3028127 3110377 3156052 3124196 3135081 3103060 3065163 3030388 3075544
15732 3075544 3149723 3140379 3211720 3157282 3162747 3133653 3094753 3031119 2998215 3059448 3080200 3086909
15720 3086909 3040440 3007277 3041743 3078921 3072298 3021061 3086063 3111224 3103532 3144123 3138863 3184990
15708 3184990 3228325 3180767 3143336 3100620 3137034 3127854 3070363 3078971 3118262 3110192 3100045 3060519
15696 3060519 3087389 3075924 3080850 3078763 3114038 3152693 3044222 3027221 3056545 3089037 3075564
15685 3075564 3096015 3138009 3136332 3125874 3060982 3095965 3088281 3109858 3143580 3096325 3111589 3102555
15673 3102555 3139240 3071367 3086248 3112189 3159906 3221468 3086906 3113179 3177131 3131922 3096018
15662 3096018 3081886 3054153 3034732 3061785 3131347 3111613 3097624 3135246 3045451 3005471 3007947
15651 3007947 3057647 3151477 3165663 3197129 3183720 3084288 3054358 3102771 3097845 3118982 3137779
15640 3137779 3057714 2974947 3057182 3060414 3140178 3123939 3093224 3166884 3180130 3190434 3127578
15629 3127578 3100629 3109283 3155276 3175727 3167925 3074970 3045612 3075389 3067762 3129574 3130083 3193449
15617 3193449 3226011 3215989 3243791 3173625 3168653 3207801 3219916 3187748 3135505 3086201 3099022
15606 3099022 3123191 3136023 3157000 3149356 3166956 3220486 3204425 3105014 3095155 3084585 3102484 3108721
15594 3108721 3094556 3088773 3073930 3126430 3168058 3196127 3238702 3235066 3181304 3189685 3154686 3160629
15582 3160629 3108308 3078062 3164881 3186054 3164906 3118746 3179080 3165763 3122195 3224388 3187172
15571 3187172 3163933 3219597 3190701 3146083 3121623 3163152 3202080 3173138 3117171 3041939 3110382
15560 3110382 3180046 3138045 3152817 3173228 3135274 3158152 3126418 3116989 3209608 3142583 3126949
15549 3126949 3159906 3164848 3179891 3118969 3131473 3108669 3129187 3116945 3090946 3173331 3139808
15538 3139808 3093425 3164488 3176013 3176580 3187964 3218242 3225452 3220756 3210403 3179144 3115578 3078687
15526 3078687 3118091 3151992 3179107 3176643 3229972 3250548 3202208 3140386 3106174 3123821 3119350 3068903
15514 3068903 3076427 3114385 3128027 3113881 3133612 3119575 3137853 3208052 3160324 3177317 3156300
15503 3156300 3117553 3156244 3133244 3069623 3086250 3145099 3124582 3036472 3040577 3110355 3138696
15492 3138696 3162242 3110444 3140504 3177723 3160900 3156888 3205671 3237024 3260516 3216403 3139561
15481 3139561 3132561 3131090 3122010 3121713 3177736 3136982 3145794 3167622 3191915 3156204 3144069 3132257
15469 3132257 3167484 3159953 3164988 3167390 3182042 3184215 3098118 3086783 3108194 3130604 3194027 3170745
15457 3170745 3219377 3179541 3153879 3189646 3202952 3181037 3221850 3209600 3082277 3143531 3101755
15446 3101755 3101511 3078582 3151764 3221443 3157766 3079340 3142469 3172515 3131007 3091483 3085146 3149234
15434 3149234 3159078 3172288 3181552 3189261 3163173 3110291 3121978 3096157 3098281 3079880 3164088 3222931
15422 3222931 3201864 3210507 3149776 3107875 3195191 3240486 3196318 3205303 3211225 3165422 3174745 3173024
15410 3173024 3237144 3180701 3204239 3213857 3189646 3158270 3214176 3218545 3164060 3112936 3160348 3212132
15398 3212132 3147760 3178698 3189070 3220092 3209141 3129047 3168498 3179111 3089051 3107344 3125244
15387 3125244 3126804 3193335 3313342 3251341 3201735 3214386 3227129 3278056 3267153 3309048 3256481
15376 3256481 3231122 3260593 3231070 3170534 3162298 3193653 3224155 3211659 3179516 3130626 3121336 3122253
15364 3122253 3211871 3242018 3195085 3194292 3138929 3205190 3235990 3241378 3207032 3197761 3213939 3227775
15352 3227775 3189752 3226311 3217934 3239197 3263053 3248781 3229699 3220768 3217348 3193415 3186920 3178598
15340 3178598 3167742 3220297 3167326 3193465 3207484 3210457 3204734 3214157 3219861 3196965 3198074 3185893
15328 3185893 3146116 3218576 3202440 3205033 3249158 3256802 3209029 3194013 3131480 3191946 3255388 3279398
15316 3279398 3287239 3269775 3254445 3222381 3172727 3142769 3186843 3173591 3177977 3225930 3271316 3284499
15304 3284499 3304936 3252376 3247565 3152667 3179457 3214935 3175115 3167825 3232691 3239596 3238099 3245913
15292 3245913 3233847 3237703 3194818 3154579 3211554 3183525 3208039 3242454 3254445 3202003 3218948
15281 3218948 3270182 3163411 3202763 3204877 3219911 3288638 3328857 3287055 3231713 3263530 3256908
15270 3256908 3226504 3194714 3253666 3183834 3153989 3174054 3225153 3281741 3222544 3214138 3199073
15259 3199073 3200531 3211812 3217636 3239799 3197362 3197374 3227463 3219670 3207029 3227637 3207708 3236910
15247 3236910 3336309 3268192 3260852 3266172 3239567 3224366 3189929 3227546 3230974 3206817 3205551 3238475
15235 3238475 3278817 3234180 3228175 3299311 3314720 3253701 3235173 3255666 3260994 3251830 3239816 3140302
15223 3140302 3158113 3187743 3210980 3280956 3212739 3230216 3277317 3232977 3179500 3190978 3214832
15212 3214832 3199776 3197289 3205633 3164595 3162142 3190841 3277712 3292866 3281650 3263223 3239503 3222432
15200 3222432 3167545 3192886 3237607 3228599 3257426 3222477 3254370 3298799 3317706 3281539 3306896
15189 3306896 3289569 3317210 3286795 3333896 3326620 3351797 3341465 3244694 3232210 3263997 3289399
15178 3289399 3312707 3276305 3238957 3264995 3263601 3233449 3253156 3272377 3218476 3248548 3235207
15167 3235207 3270742 3236359 3286769 3265772 3247063 3279162 3253076 3252756 3264538 3261400 3260632 3259713 3285027
15154 3285027 3264660 3332253 3324581 3322214 3260951 3200939 3259486 3337026 3355565 3316258 3279019 3312823
15142 3312823 3280995 3278073 3251464 3228093 3216829 3234482 3218652 3199478 3205080 3202959 3254400 3262511
15130 3262511 3247769 3273554 3293233 3261303 3294591 3322752 3225804 3264502 3330585 3335723 3341690 3326720
15118 3326720 3302310 3243126 3234195 3246051 3278041 3316110 3313521 3288989 3284872 3291892 3282544 3263150
15106 3263150 3245627 3229014 3283399 3318138 3293406 3290993 3279192 3307558 3290722 3255793 3233072
15095 3233072 3251943 3285410 3345075 3283184 3230222 3231966 3209081 3196998 3226174 3341618 3344036
15084 3344036 3269317 3271714 3265134 3311640 3320740 3308741 3306167 3294987 3349257 3360227 3279715 3241200
15072 3241200 3291355 3251564 3263277 3269031 3261849 3183981 3260944 3241418 3233055 3226535 3230627 3291482
15060 3291482 3291350 3258844 3188140 3228027 3252621 3239076 3255455 3264882 3286539 3253516 3243002 3205730
15048 3205730 3225945 3288774 3239799 3250825 3250448 3270537 3309210 3287752 3331694 3312395 3337469 3342323
15036 3342323 3297564 3261067 3221573 3210987 3247670 3243301 3224578 3194084 3248082 3245243 3217672 3227419
15024 3227419 3263099 3293692 3271189 3315257 3370476 3338439 3340876 3387034 3334089 3312101 3313315 3319951
15012 3319951 3311444 3279333 3312635 3366025 3297570 3314633 3378126 3371434 3338068 3269987 3281375 3260259
15000 3260259 3337152 3355418 3282247 3217725 3202685 3249706 3306193 3314440 3326462 3388684 3386901 3368567
14988 3368567 3305010 3279989 3349647 3410285 3330122 3258575 3289334 3311202 3334717 3359845 3355282
14977 3355282 3328415 3296117 3325771 3351875 3335344 3283888 3299127 3306231 3374397 3358090 3260197
14966 3260197 3273375 3321191 3279887 3266942 3283766 3259473 3287639 3361793 3337266 3343313 3312495
14955 3312495 3357297 3384769 3392612 3338240 3314428 3296742 3268873 3356711 3326849 3319503 3334764 3322624
14943 3322624 3342749 3299738 3299951 3332334 3361561 3422723 3390917 3367065 3411350 3361775 3403974 3366829
14931 3366829 3326373 3322855 3277109 3261456 3298845 3325144 3277362 3281380 3315652 3283529 3311997 3308513
14919 3308513 3250919 3287930 3316202 3325755 3366464 3379708 3320211 3295822 3328590 3332448 3334604 3388271
14907 3388271 3381472 3399842 3322304 3330963 3393987 3358981 3316734 3283694 3249076 3347514 3376739 3352678
14895 3352678 3369094 3329567 3322146 3361184 3382521 3294379 3292693 3305460 3344365 3373741 3379855 3349813
14883 3349813 3346106 3283885 3285996 3342369 3320787 3343020 3321393 3337750 3377094 3340160 3331474 3387706
14871 3387706 3393403 3349984 3265486 3290031 3335357 3313585 3331251 3382410 3348905 3424062 3373118
14860 3373118 3383708 3384679 3367594 3393697 3365316 3318786 3292498 3275126 3300890 3314766 3311373 3315350
14848 3315350 3303128 3351424 3347874 3289361 3315167 3308449 3297224 3320606 3397869 3418903 3381669 3428672
14836 3428672 3414092 3371755 3374843 3438018 3360088 3316547 3376184 3340086 3413784 3384416 3371660
14825 3371660 3386963 3379660 3364032 3339736 3386274 3378748 3399288 3397041 3376713 3369611 3265538 3331195
14813 3331195 3404001 3350078 3376823 3333522 3322200 3318348 3335699 3374898 3376944 3345142 3356112 3336409
14801 3336409 3343639 3347378 3309274 3333187 3394466 3364552 3398519 3357098 3365139 3400206 3337686 3378215
14789 3378215 3434901 3377721 3390710 3467511 3503087 3443607 3366871 3359541 3360113 3394477 3434959 3350529
14777 3350529 3360828 3393008 3399759 3461975 3444820 3338235 3326852 3327262 3301046 3368616 3388013 3387965
14765 3387965 3372460 3411313 3370340 3275903 3334872 3399490 3361356 3379766 3419882 3425205 3413182
14754 3413182 3437124 3432815 3388827 3311856 3321445 3383012 3401561 3426253 3461103 3407098 3350708 3319964
14742 3319964 3337364 3421260 3392620 3394150 3402045 3345031 3391911 3395128 3389366 3370572 3384571 3437031
14730 3437031 3455237 3383007 3297309 3358343 3434885 3384993 3385334 3428402 3405631 3402479 3349962 3414403
14718 3414403 3438168 3396490 3311016 3280062 3297710 3371667 3424309 3431673 3417713 3428683 3361000
14707 3361000 3413401 3430871 3444239 3493316 3434602 3450580 3470262 3383017 3396766 3388046 3409533
14696 3409533 3488721 3454755 3425977 3505390 3510576 3471615 3433711 3343334 3303807 3393006 3401849 3437624
14684 3437624 3508892 3498900 3456936 3417021 3431203 3452263 3470254 3478701 3445409 3417356 3420913 3394232
14672 3394232 3370951 3388736 3412161 3373373 3423892 3424829 3465751 3407999 3400315 3398360 3390329 3376559
14660 3376559 3457748 3391057 3418672 3407528 3389697 3443614 3476684 3479333 3440286 3431929 3396193 3404826
14648 3404826 3437860 3453733 3456689 3460224 3461711 3475708 3476825 3414583 3454632 3462537 3417396 3398947
14636 3398947 3427808 3470626 3467963 3414793 3485338 3480099 3454444 3437487 3406072 3384042 3470953 3468250
14624 3468250 3391999 3371655 3363833 3410782 3389831 3396530 3406014 3471095 3542094 3499888 3461850 3459658
14612 3459658 3465627 3407005 3386466 3470658 3400709 3429134 3471802 3469116 3454426 3512509 3498376 3477242
14600 3477242 3461818 3404348 3389361 3376132 3382163 3381171 3341500 3364278 3320534 3383024 3456540 3513661
14588 3513661 3484309 3447314 3477192 3536815 3534411 3484623 3496191 3473700 3475355 3485422 3483666 3460514
14576 3460514 3402325 3332984 3393686 3439343 3364681 3397518 3418708 3465286 3474678 3471556 3417125 3382641
14564 3382641 3374853 3410771 3409582 3458294 3501894 3537058 3519292 3486316 3472688 3493419 3473550 3409081
14552 3409081 3377533 3425594 3468273 3431136 3461502 3416983 3425477 3453815 3431763 3380308 3426504
14541 3426504 3454468 3519590 3514663 3424105 3353492 3378506 3354940 3358677 3410578 3401201 3423074 3448777
14529 3448777 3506948 3512420 3510721 3530672 3548352 3511565 3495850 3522802 3506374 3472304 3438918 3442495
14517 3442495 3484415 3509817 3547882 3505212 3486919 3523952 3503956 3468837 3478701 3474651 3427213 3460983
14505 3460983 3475340 3497912 3479825 3463845 3533233 3553896 3500439 3431320 3379154 3418469 3469791
14494 3469791 3461003 3396199 3445879 3465151 3475215 3456158 3373542 3388139 3433105 3507318 3489800
14483 3489800 3439309 3427317 3454600 3503571 3471849 3450986 3466904 3519141 3457810 3478685 3408405
14472 3408405 3394964 3513370 3484294 3389934 3418960 3450442 3447221 3443668 3448661 3452475 3452583 3489182
14460 3489182 3483703 3478471 3454300 3465082 3452666 3503781 3439487 3447491 3536661 3572546 3503905 3464399
14448 3464399 3461488 3465888 3483762 3539572 3548153 3468100 3490679 3457464 3466546 3484413 3452416 3436541
14436 3436541 3433999 3482847 3481524 3437603 3425787 3449021 3442039 3473005 3516760 3483366 3457373 3470840
14424 3470840 3526661 3510348 3499613 3462479 3453235 3480273 3447400 3465763 3519944 3425034 3483828
14413 3483828 3515275 3512313 3549360 3507245 3527522 3480979 3466692 3516024 3505522 3493079 3500623 3441463
14401 3441463 3452309 3479691 3478760 3423895 3421202 3456080 3494039 3431961 3443319 3505940 3495688 3489926
14389 3489926 3485775 3492551 3507325 3522625 3468405 3503612 3477282 3437862 3394941 3465816 3506471 3544958
14377 3544958 3496776 3506505 3484372 3440240 3512888 3469903 3509338 3540693 3537288 3511604 3448309 3408638
14365 3408638 3472122 3425905 3505684 3518080 3502401 3512644 3524822 3537228 3468278 3422210 3477889
14354 3477889 3524360 3518834 3547282 3549019 3498514 3430819 3464000 3435845 3486359 3520641 3461551 3482542
14342 3482542 3499648 3516828 3442894 3416593 3437710 3480694 3494003 3556992 3543727 3517980 3494606
14331 3494606 3492183 3523748 3499768 3539918 3530752 3531332 3528667 3527513 3541106 3585594 3606345 3554678
14319 3554678 3485650 3453639 3469580 3514837 3581305 3570060 3574664 3540796 3476581 3438371 3490164
14308 3490164 3517572 3505948 3468367 3488821 3573662 3565521 3515028 3463431 3473633 3504053 3484044
14297 3484044 3524463 3533689 3503341 3533696 3594901 3513137 3432343 3594497 3567937 3486769 3393550
14286 3393550 3495684 3554417 3576734 3523745 3472975 3476825 3541924 3610502 3524671 3481567 3565424
14275 3565424 3568567 3574784 3553179 3498485 3492444 3534819 3518681 3512396 3507923 3484498 3539829 3503606
$$ [...]
##END NTUPLES=NMR SPECTRUM
##END=
