##TITLE=1H_DE-80H_X3
 200.13MHz, d2o
 8 sc
 
 19ns.26.2.2025
##JCAMPDX= 6.0         $$ Bruker NMR JCAMP-DX V2.0
##DATA TYPE= NMR SPECTRUM
##DATA CLASS= NTUPLES
##ORIGIN= UXNMR, Bruker Analytische Messtechnik GmbH
##OWNER= pz
$$ XWIN-NMR		Version 3.5
$$ Thu Jul 31 09:37:28 2025 Russian Standard Time (UT+4h)  Yarkov@DPX200
##.OBSERVE FREQUENCY= 200.1313
##.OBSERVE NUCLEUS= ^1H
##.ACQUISITION MODE= SIMULTANEOUS
##.ACQUISITION SCHEME= undefined
##.AVERAGES= 8
##.DIGITISER RES= 18
##SPECTROMETER/DATA SYSTEM= spect
##.PULSE SEQUENCE= zg30
##.SOLVENT NAME= CDCl3
##.SHIFT REFERENCE= (INTERNAL, CDCl3, 0, 15.5838)
##AUDIT TRAIL= $$ (NUMBER, WHEN, WHO, WHERE, WHAT)
$$ ##TITLE= Audit trail, XWIN-NMR		Version 3.5
$$ ##JCAMPDX= 5.01
$$ ##ORIGIN= Bruker BioSpin GmbH
$$ ##OWNER= Yarkov
$$ C:/Bruker/XWIN-NMR/data/yarkov2/nmr/H-C/1/pdata/1/auditp.txt
$$ ##AUDIT TRAIL=  $$ (NUMBER, WHEN, WHO, WHERE, WHAT)
(   1,<2025-07-31 09:36:41.95 +0400>,<Yarkov>,<DPX200>,
      <created by zg, POWCHK disabled, PULCHK disabled
       configuration hash MD5:
       00 E9 B6 7A A2 85 ED C7 34 08 36 98 17 FE 4E 26
       data hash MD5: 16K
       A7 55 87 3C D2 A3 70 12 1C 62 9F 04 2F DB 91 F7>)
(   2,<2025-07-31 09:36:48.64 +0400>,<Yarkov>,<DPX200>,
      <Start of raw data processing
       efp BC_mod = 2 LB = 0.25 FT_mod = 6 PKNL = 1 PHC0 = -1346.296 PHC1 = -0.8090911 SI = 16K 
       data hash MD5: 16K
       8C 9D D9 A5 92 AE DE 89 0A A7 05 56 79 0B E1 6D>)
(   3,<2025-07-31 09:36:52.68 +0400>,<Yarkov>,<DPX200>,
      <abs ABSG = 5 
       data hash MD5: 16K
       0E CC CA 1F C2 8B C6 2C 36 1C FC 4E 23 57 74 91>)
$$ ##END=
$$ 
$$ hash MD5
$$ BF FC 64 C9 12 5D DB C4 C3 80 5D 49 BF 79 44 F6
##$RELAX= 
##$RELAX= 
##$RELAX= 
##$RELAX= 
##$RELAX= 
##$RELAX= 
$$ Bruker specific parameters
$$ --------------------------
##$DU= <C:/Bruker/XWIN-NMR>
##$EXPNO= 1
##$NAME= <H-C>
##$PROCNO= 1
##$TYPE= <nmr>
##$USER= <yarkov2>
##$AMP= (0..31)
100 100 100 100 100 100 100 100 100 100 100 100 100 100 100 100 100 100 
100 100 100 100 100 100 100 100 100 100 100 100 100 100 
##$AQSEQ= 0
##$AQ_mod= 1
##$AUNM= <au_zg>
##$AUTOPOS= <>
##$BF1= 200.13
##$BF2= 200.13
##$BF3= 200.13
##$BF4= 200.13
##$BF5= 200.13
##$BF6= 200.13
##$BF7= 200.13
##$BF8= 200.13
##$BYTORDA= 1
##$CFDGTYP= 0
##$CFRGTYP= 5
##$CHEMSTR= <none>
##$CNST= (0..31)
1 1 145 1 1 1 1 1 1 1 1 1 1 1 1 1 1 1 1 1 1 1 1 1 1 1 1 1 1 1 1 1 
##$CPDPRG= <>
##$CPDPRG1= <>
##$CPDPRG2= <>
##$CPDPRG3= <>
##$CPDPRG4= <mlev>
##$CPDPRG5= <mlev>
##$CPDPRG6= <mlev>
##$CPDPRG7= <mlev>
##$CPDPRG8= <mlev>
##$CPDPRGB= <>
##$CPDPRGT= <>
##$D= (0..31)
0 0.7 0 0 0 0 0 0 0 0 0 0.03 0 0 0 0 0 0 0 0 0 0 0 0 0 0 0 0 0 0 0 0 
##$DATE= 1753940201
##$DBL= (0..7)
120 120 120 120 120 120 120 120 
##$DBP= (0..7)
150 150 150 150 150 150 150 150 
##$DBP07= 0
##$DBPNAM0= <>
##$DBPNAM1= <>
##$DBPNAM2= <>
##$DBPNAM3= <>
##$DBPNAM4= <>
##$DBPNAM5= <>
##$DBPNAM6= <>
##$DBPNAM7= <>
##$DBPOAL= (0..7)
0.5 0.5 0.5 0.5 0.5 0.5 0.5 0.5 
##$DBPOFFS= (0..7)
0 0 0 0 0 0 0 0 
##$DE= 6
$$ [...]
##$SUBNAM3= <"">
##$SUBNAM4= <"">
##$SUBNAM5= <"">
##$SUBNAM6= <"">
##$SUBNAM7= <"">
##$SUBNAM8= <"">
##$SUBNAM9= <"">
##$SW= 18.0517328524113
##$SWIBOX= (0..15)
0 0 2 0 0 0 0 0 0 0 0 0 0 0 0 0 
##$SW_h= 3612.71676300578
##$TD= 16384
##$TD0= 1
##$TE= 0
##$TE2= 300
##$TE3= 300
##$TEG= 300
##$TL= (0..7)
0 120 120 120 120 120 120 120 
##$TP= (0..7)
150 150 150 150 150 150 150 150 
##$TP07= 0
##$TPNAME0= <>
##$TPNAME1= <>
##$TPNAME2= <>
##$TPNAME3= <>
##$TPNAME4= <>
##$TPNAME5= <>
##$TPNAME6= <>
##$TPNAME7= <>
##$TPOAL= (0..7)
0.5 0.5 0.5 0.5 0.5 0.5 0.5 0.5 
##$TPOFFS= (0..7)
0 0 0 0 0 0 0 0 
##$TUNHIN= 0
##$TUNHOUT= 0
##$TUNXOUT= 0
##$USERA1= <user>
##$USERA2= <user>
##$USERA3= <user>
##$USERA4= <user>
##$USERA5= <user>
##$V9= 5
##$VALIST= <valist>
##$VCLIST= <CCCCCCCCCCCCCCC>
##$VD= 0
##$VDLIST= <DDDDDDDDDDDDDDD>
##$VPLIST= <PPPPPPPPPPPPPPP>
##$VTLIST= <TTTTTTTTTTTTTTT>
##$WBST= 1024
##$WBSW= 4
##$XGAIN= (0..3)
0 0 0 0 
##$XL= 0
##$YL= 0
##$YMAX_a= 595560
##$YMIN_a= -596347
##$ZGOPTNS= <>
##$ZL1= 120
##$ZL2= 120
##$ZL3= 120
##$ZL4= 120
##$ABSF1= 15.48796
##$ABSF2= -2.56389
##$ABSG= 5
##$ABSL= 3
##$ALPHA= 0
##$AQORDER= 0
##$ASSFAC= 0
##$ASSFACI= 0
##$ASSFACX= 0
##$ASSWID= 0
##$AUNMP= <proc_1d>
##$AZFE= 0.1
##$AZFW= 0.1
##$BCFW= 0
##$BC_mod= 2
##$BYTORDP= 0
##$COROFFS= 0
##$CY= -3
##$DATMOD= 1
##$DC= 0
##$DFILT= <>
##$DTYPP= 0
##$F1P= 0
##$F2P= 0
##$FCOR= 1
##$FTSIZE= 16384
##$FT_mod= 6
##$GAMMA= 0
##$GB= 0
##$INTBC= 1
##$INTSCL= 3.241238e-09
##$ISEN= 128
##$LB= 0.25
##$LEV0= 0
##$LPBIN= 0
##$MAXI= 10000
##$MC2= 0
##$MEAN= 0
##$ME_mod= 0
##$MI= 1.114404
##$NCOEF= 0
##$NC_proc= -5
##$NLEV= 6
##$NOISF1= 3.799351
##$NOISF2= 2.8
##$NSP= 0
##$NTH_PI= 0
##$NZP= 0
##$OFFSET= 15.58383
##$PC= 1
##$PHC0= -1346.296
##$PHC1= -0.8090911
##$PH_mod= 1
##$PKNL= yes
##$PPARMOD= 0
##$PSCAL= 0
##$PSIGN= 0
##$REVERSE= no
##$SF= 200.129987566805
##$SI= 16384
##$SIGF1= 3
##$SIGF2= 2
##$SINO= 0.751879
##$SIOLD= 32768
##$SREGLST= <19F.Aceton>
##$SSB= 0
##$STSI= 16384
##$STSR= 0
##$SW_p= 3612.71676300578
##$SYMM= 0
##$S_DEV= 0
##$TDeff= 16384
##$TDoff= 0
##$TI= <>
##$TILT= no
##$TM1= 0
##$TM2= 0
##$TOPLEV= 0
##$USERP1= <user>
##$USERP2= <user>
##$USERP3= <user>
##$USERP4= <user>
##$USERP5= <user>
##$WDW= 1
##$XDIM= 16384
##$YMAX_p= 284940837
##$YMIN_p= -93444
$$ End of Bruker specific parameters
$$ ---------------------------------
##NTUPLES= NMR SPECTRUM
##VAR_NAME=  FREQUENCY,     SPECTRUM/REAL,   SPECTRUM/IMAG
##SYMBOL=    X,             R,               I
##VAR_TYPE=  INDEPENDENT,   DEPENDENT,       DEPENDENT
##VAR_FORM=  AFFN,          ASDF,            ASDF
##VAR_DIM=   16384,         16384,           16384
##UNITS=     HZ,            ARBITRARY UNITS, ARBITRARY UNITS
##FACTOR=    0.220516191357247, 1,           1
##FIRST=     3118.79168007972, 0,            0
##LAST=      -493.925082926059, 0,           0
##MIN=       -493.925082926059, -93444,      0
##MAX=       3118.79168007972, 284940837,    0
$$ Real data points
##PAGE= N=1
##DATA TABLE= (X++(R..R)), XYDATA
$$ [...]
6118F5412J0488K575J0618J2091o845p607J0152j3501r840k4516r100j736j5573
6105B2618J0612J0763l628m502j1955J643k002p226K2291j3635o477L671m172
6092A8001K537j330K612o92R017P287q568j1389k169j7276o828J6850q267J214
6078I99j4340r477R023K0036p338J920Q380J106N522Q34k704o311Q064p993l707
6063D014K658J247n420R681J2946R010O402J335J0588K136n380M1180K1341J6176
6049A27914M384J5704J5271P422J9407K8678J1959L8739L6972L2893L6283K0356
6037C95982L0802K6101Q733Q777J9601J3627J5052K5892M8272L6870K4323L1182
6025F85214L781k419K7595J9711K0937J8792J3747L8659L9509L7546N6407O0659
$$ y = [65412, 75900, 78475, 89093, 101184, 94339, 86732, 96884, 83383, 73543, 49027, 39927, 38191, 22618, 33230, 43993, 40365, 35863, 23908, 25551, 23549, 16323, 38614, 24979, 18502, 22173, 18001, 20538, 19208, 21820, 21128, 30145, 37432, 28864, 17475, 15306, -1970, -8798, 8052, -215, 999, -13341, -22818, -13795, 6241, -1097, 823, 9203, 10309, 15831, 16665, 13961, 7650, 15714, 7721, 4014, 6672, 7919, 2499, 12180, 25126, 34136, 40538, 41873, 52461, 54597, 49217, 90397, 111738, 127914, 132298, 148002, 163273, 170695, 190102, 218780, 230739, 269478, 306450, 339343, 375626, 395982, 426784, 452885, 461618, 470395, 489996, 503623, 518675, 544567, 592839, 629709, 654032, 685214, 688995, 686576, 714171, 733882, 754819, 773611, 787358, 826017, 865526, 903072, 959479, 1020138]
6013A020138O3254Q8596N9800M0535J6472j4685k9767j0907k3845L251K3185N876
6001A241903K8198K3927L1589K4522L47k1851m2753o0731o7998o6542l8227j0948
5989A041436k1155J9653K1556J6L5350M3914K8415M0451L8394Q558j5027l1273
5977A210288n6738o3023p2820n6849l9389l9253j8935j5914j6011j7382j3253
5966H00721k7634l6965m8090n6182m9697o796k1651j6014k6344j870J1263j6K4889
5953E45614O216Q734K4829R122j2961j6835j9273l1581m9807l9145l2401m2289
5941C50223j7821o203j6978m791p416k2321l2711o897r03p262K705j5621k6930
5928A87074k4544J4645N882O225k274o290l805j7852K1934J6235J7940P131M150
$$ y = [1020138, 1083392, 1171988, 1231788, 1272323, 1288795, 1274110, 1244343, 1233436, 1209591, 1212842, 1236027, 1241903, 1270101, 1294028, 1325617, 1350139, 1350486, 1328635, 1285882, 1225151, 1157153, 1090611, 1052384, 1041436, 1020281, 1039934, 1061490, 1061506, 1096856, 1140770, 1169185, 1209636, 1248030, 1256588, 1241561, 1210288, 1153550, 1090527, 1017707, 960858, 921469, 882216, 863281, 847367, 831356, 813974, 800721, 773087, 736122, 688032, 631850, 582153, 575357, 553706, 537692, 511348, 509478, 520741, 520725, 545614, 551830, 560564, 585393, 594515, 581554, 564719, 545446, 513865, 464058, 424913, 392512, 350223, 332402, 326199, 309221, 304430, 297014, 274693, 241982, 235085, 234182, 226920, 229625, 214004, 187074, 162530, 177175, 183057, 189282, 187008, 180718, 176913, 159061, 180995, 197230, 215170, 222301, 226451]
5915B26451J107J5724P280l94m320r796k4883N25j438K527p627m964J5824J8758
5901B34774j4133k5895o679p242J6072J9584J8138Q484K0982L2957L4256J6437
5889C47735L9410K2751O0129L0242L6596n363l4815k4210m4801l9756k2970j8495
5877C46453k5067j1230j2672J1642P582j2750Q027J651J8272J1098J1249R042
5865C63297K0232K7824J9742L8887N0907L3938M3220L8145K3514j1345n1458n2400
5853E44503l9793m4886n1706l6018k9229l4987j0550k296k8127r572p783J0783
5841B60339J516p254j3724K9286Q194R210K0050K5144L3917K4863K8699J7100
5829D37340J7320j5659k9911l4295n1179m0099l5602n0880j7605j0309k2469P923
$$ y = [226451, 227558, 243282, 250562, 250168, 245848, 236052, 211169, 211694, 210256, 212783, 205156, 200192, 216016, 234774, 220641, 194746, 188067, 180825, 196897, 216481, 234619, 243103, 264085, 297042, 331298, 347735, 387145, 409896, 470025, 500267, 536863, 531500, 496685, 472475, 427674, 387918, 364948, 346453, 321386, 310156, 297484, 309126, 316708, 303958, 311985, 313636, 331908, 343006, 354255, 363297, 383529, 411353, 431095, 469982, 520889, 554827, 598047, 636192, 659706, 648361, 596903, 544503, 504710, 459824, 408118, 372100, 342871, 307884, 297334, 295038, 266911, 257339, 249556, 260339, 261855, 254601, 240877, 270163, 278357, 287567, 307617, 332761, 366678, 391541, 420240, 437340, 454660, 439001, 409090, 374795, 323616, 283517, 247915, 197035, 179430, 169121, 146652, 154575]
5817A54575j2585l439j7347n699J457p00r70l496J0320j621j855M721K2063J3709
5803A59133J198k374m841l353j0928k5006j9904j8144j5911k661q820q744o707
5790C2938J3264j232r173M731j3473k1623R605o939j63J5246j3773q925p025J132
5776e410P935J3533m36q048J0366k6920l306j2642K474K1206N436j3632j5694
5763b5138p393Q505o784n760L676j1733n851N948L885L862J1293k624p737j2859
5749d8710k459J0191J940J4891q393p662J1232Q492n556j7700Q559k714P31j8856
5735e6014j096K997N894j5184k753R01P417K60L994R838P739j6533l431N665q282
5720e8588q483J6313J426k0814M888k203n176K1654J9144q434j6030J4717j7891
$$ y = [154575, 141990, 138551, 121204, 115505, 116962, 116262, 115292, 111796, 122116, 120495, 118640, 123361, 145424, 159133, 160331, 157957, 153116, 149763, 138835, 113829, 93925, 75781, 59870, 57209, 48389, 39645, 32938, 46202, 44970, 35797, 40528, 27055, 5432, 15037, 8098, 7935, 23181, 9408, 483, -6542, -5410, 2525, 16058, 15622, 7574, 17940, -8980, -12286, -24928, -22454, -1248, 4188, -9444, -25138, -32531, -24026, -30810, -36570, -32894, -44627, -50478, -44530, -40645, -36783, -25490, -28114, -35851, -48710, -51169, -40978, -39038, -24147, -32540, -40202, -28970, -20478, -26034, -43734, -35175, -37889, -37158, -56014, -57110, -54113, -48219, -63403, -66156, -65255, -57838, -57578, -53584, -43746, -36007, -52540, -55971, -50306, -58588, -67071, -50758, -49332, -70146, -65258, -67461, -72637, -50983, -31839, -40273, -56303, -41586, -59477]
5707e9477j6474J0833Qk244j136J9045q898j005K278K693K377K879m887j406R207
5692d6207o224q809j4698l705K4987N316j9270k580J6635J5257R888p992j1983
5679d9385k496J2772m236N380K0009j8248P42M17l919o718o638k191R402j4295
5665e9404k185K0481L566m408m199q158j351J9860o816o893l65k191P532J2817
5651c1714l747o555r927P252P547p048J1304J4375j8675j2988J1330J4584J0635
5638a3627p709m75J887P905m993o14R056j1844K44j086K4739J4626k202n15J3099
5623B8491K5680j7886k017J0508J0369k801J2700J9569J1071M9708O985K1460
5611A73837K8929K3429M7451M2564N4734N3399P9886Q9774J01037J00162N7075
$$ y = [-59477, -75951, -65118, -65110, -67354, -68490, -49445, -58343, -59348, -57070, -54377, -52000, -49121, -54008, -55414, -46207, -52431, -61240, -75938, -79643, -54656, -49340, -68610, -71190, -54555, -39298, -29410, -37402, -49385, -51881, -39109, -43345, -37965, -17956, -36204, -35462, -35045, -38964, -45682, -52320, -54511, -45109, -59404, -61589, -41108, -37542, -41950, -46149, -54307, -55658, -35798, -42614, -49507, -49872, -52063, -44531, -31714, -35461, -42016, -51943, -44691, -37144, -44192, -32888, -18513, -37188, -50176, -38846, -24262, -13627, -21336, -21811, -19924, -12019, -17012, -17626, -8570, -20414, -20170, -21256, 3483, 18109, 15907, 15392, 28491, 54171, 36285, 34268, 44776, 55145, 52344, 65044, 84613, 95684, 145392, 152377, 173837, 202766, 226195, 273646, 316210, 370944, 424343, 504229, 594003, 695040, 795202, 852277]
5600H52277J7409o6752p8883n9209r4132o5456m6536k1166k3269j3296O335J2412
5588D19734J5592j2199J6897K8071L3008J1652M0456N2991O3824O1891Q1101J20715
5576I33733J32876J45366J64251K30457K60072K87923K47433J41308j8523k00286
5566B324610k18036k52452k42617k04642j76569j36229r2491n3523n0798k8680
5556H68573l2808j5799r483J898P050L3654M3254L8647L9589L8615R0961J16936
5544A221087J19104J73453J62020K23863K81892K82145K36205J27084m9312k25193
5534B552348k48715k66887k86268k34638j67769j24363r5560p4413n5128l3880
5524I64727k8561m1795l5196J8134J6432r297J2916K643K2614O1202N2397N6105
$$ y = [852277, 869686, 802934, 724051, 664842, 570710, 505254, 458718, 437552, 414283, 400987, 407322, 419734, 435326, 423127, 440024, 468095, 501103, 512755, 553211, 606202, 670026, 731917, 813018, 933733, 1066609, 1211975, 1376226, 1606683, 1866755, 2154678, 2402111, 2543419, 2524896, 2324610, 2106574, 1854122, 1611505, 1406863, 1230294, 1094065, 1001574, 948051, 897253, 868573, 835765, 819966, 810483, 812381, 819431, 853085, 896339, 934986, 974575, 1013190, 1104151, 1221087, 1340191, 1513644, 1675664, 1899527, 2181419, 2463564, 2699769, 2826853, 2777541, 2552348, 2303633, 2036746, 1750478, 1515840, 1348071, 1223708, 1128148, 1053735, 998607, 964727, 936166, 894371, 859175, 877309, 893741, 884444, 897360, 900003, 922617, 983819, 1036216, 1092321]
5512A092321O6112P2591J01968J10759J06559R5652P0486M1577m9579j18275r4401
5501A495770j01110j16082r3092p1096m0514k4670j5179k3311J961L817J6351
5490A032845J7985J4132J5569J9554N0482N4391N2971O5149M4864L7981O328n2441
5478A359810o1998r5243p7499q5570p2473m3107m5107n0991k5552k8417l5285
5467G38568p551r6N016J5371K784M160K0889K6002M0713M4361K9076M8690N2222
5454A020205K9774K0033j2265o9159q1923p2209r3981m9794m7439p2124k0907
5443E50211k4953k9962l2645j0505O3j5355j1824k0269j0762R147J8024J2246
5431D33416J8110K5774L6770L3158K1380K7184J1097k6191l5671m9222n7239n0184
$$ y = [1092321, 1158433, 1231024, 1332992, 1443751, 1550310, 1645962, 1716448, 1758025, 1708446, 1590171, 1495770, 1394660, 1278578, 1185486, 1114390, 1073876, 1049206, 1034027, 1010716, 1012677, 1016494, 1032845, 1050830, 1064962, 1080531, 1100085, 1150567, 1204958, 1257929, 1323078, 1367942, 1405923, 1412251, 1359810, 1297812, 1202569, 1125070, 1039500, 967027, 923920, 878813, 827822, 802270, 773853, 738568, 731017, 730921, 735937, 751308, 754092, 758252, 779141, 805143, 845856, 890217, 919293, 967983, 1020205, 1049979, 1070012, 1057747, 988588, 906665, 834456, 740475, 690681, 643242, 571118, 550211, 525258, 495296, 462651, 452146, 452209, 436854, 425030, 404761, 393999, 403146, 421170, 433416, 451526, 477300, 514070, 547228, 568608, 595792, 606889, 580698, 545027, 495805, 438566, 388382]
5419C88382m0829k4063j0593j3415j8222j6286k5231j2545J954J1174j2971j2982
5407B14373M423M975Q516J3678J0442Q99K9898J0246J2882R522P616R515j4060
5394C22925k1799k9882k6707J7982j225n092J459Q34J1576J6554N885M2897L7625
5381C73032K5663L6002K2718L5955M9688L6549n54L109q694m625r379j506Q379
5368E66337k0537n552J4714R305r253L2911K6690L0011L1694M6958O1733L0994
5356H16005L8898L7923L7714M2105M6638J8668M0717M6996L3059J3765k5225m3644
5344A103619m0017m3644l6505k0978k182j7470j3054o274J4599L3973L4235M8876
5332A055178L7152N2553N0246K9182J0193n4304l6612m7559m9901n0248l9173
$$ y = [388382, 347553, 323490, 312897, 299482, 281260, 264974, 239743, 227198, 229152, 240326, 227355, 214373, 218796, 223771, 232287, 245965, 256407, 257306, 287204, 297450, 310332, 319854, 327470, 336985, 322925, 301126, 271244, 244537, 262519, 261294, 256202, 257661, 258495, 270071, 286625, 292510, 335407, 373032, 398695, 434697, 457415, 493370, 543058, 579607, 579053, 582162, 573468, 568843, 559464, 557958, 566337, 545800, 540248, 554962, 564267, 555014, 587925, 614615, 644626, 676320, 723278, 785011, 816005, 854903, 892826, 930540, 972645, 1019283, 1037951, 1078668, 1125664, 1158723, 1172488, 1147263, 1103619, 1063602, 1019958, 983453, 962475, 960293, 942823, 929769, 923495, 938094, 972067, 1006302, 1055178, 1092330, 1144883, 1195129, 1224311, 1234504, 1180200, 1143588, 1096029, 1046128, 995880, 956707]
5321I56707k1023l8710n6232n2040m7852l6457l1292n2055m0879k6151o394o886
5309E40736j9184j79J010k159J6292L2194m680Q470J2798p016p032l8913l6535
5296D95802k5850l3129n2306l2594l0966k2344k5586k0998l0659k3566l463j153
5284A93188j8318j0174J1430k235j0506j3860k691j2639j5230n950k671j483o746
5271A02115m790Q842o062Q300j453P211J1619r744p874j3995q704J2435k2902
5258G4998l843M573j417q786L628m544j4844J0136p761p102l923J1145J829M72
5244E4561q470K585j1745L750q042Q529j5650j3562P372J1875K083J4949j1387
5231C6848k1561M888j888K7944r620k5924O629J3216j622p373j0256O90P804O59
$$ y = [956707, 935684, 896974, 840742, 788702, 740850, 704393, 673101, 621046, 580167, 554016, 547622, 540736, 521552, 521373, 522383, 520224, 536516, 568710, 564030, 572500, 585298, 578282, 571250, 532337, 495802, 469952, 436823, 384517, 351923, 320957, 298613, 273027, 252029, 221370, 197804, 194341, 193188, 174870, 164696, 176126, 173891, 163385, 149525, 146834, 134195, 118965, 113015, 110344, 108861, 102115, 97325, 106167, 100105, 108405, 106952, 114163, 125782, 116038, 108164, 94169, 85465, 97900, 74998, 71155, 75728, 74311, 65525, 69153, 64609, 49765, 59901, 52140, 45038, 41115, 52260, 54089, 54561, 46091, 48676, 36931, 40681, 32639, 41168, 25518, 11956, 19328, 31203, 33286, 48235, 36848, 15287, 20175, 18287, 46231, 36611, 10687, 17316, 30532, 28910, 21537, 11281, 11971, 19775, 20434]
5217B0434p719M000p291J542J1552j9559j5887p347k667K556J9292R576j5722
5204g240n983J93j745J637j8372l944J7334l008j950P721L935m661J1390n335
5190a0028j0683K131N640Q828k369J2674p432P549R642L266K5717j0204p293N112
5176C2550K678j3567j0588J9206j3298j3233j8642j349N73J741O795O785j4631
5163a4980j4776j134n318k272J2772j0949m728K3870O368j1803L821J5126p01
5150d704p305J2287N545j507P781J193J0206j5694P034l744Q7O04L380o229J1921
5135B0855o290j2249j1763q326J572J1090j4951l431J2843o31o03r360N952j7943
5121c3235n535m686n882O156j3798J4246J345m559R993O123J0258N705r604K2653
$$ y = [20434, 12715, 16715, 9424, 10966, 22518, 2959, -12928, -20275, -22942, -20386, -1094, 8482, -7240, -13223, -13030, -14775, -13138, -31510, -35454, -18120, -21128, -23078, -15357, -11422, -16083, -4693, -10028, -20711, -18580, -12940, -4112, -6481, 6193, -1239, 6310, 15952, 19218, 44935, 34731, 27438, 32550, 35228, 21661, 11073, 30279, 16981, 3748, -14894, -16243, -15670, -13929, -7134, -349, -14980, -29756, -30890, -36208, -38480, -25708, -36657, -41385, -17515, -11147, -22950, -19129, -4003, -4704, -12009, 278, 5823, 4316, 12097, 13290, 23496, 7802, 14836, 11092, 11179, 11783, 15163, 8934, 20855, 14565, 2316, -9447, -17773, -16201, -5111, -20062, -23493, -10650, -11281, -11884, -21244, -15292, -33235, -38770, -43456, -49338, -43182, -56980, -42734, -41389, -45948, -35955, -29832, -19574, -13869, -23473, -820]
5107h20j655q853l798j4400M018j3551J9339N831r719L236Q432M431k792j0777
5093b1078O32P232P97L860j7841j3022J879J4272j717j5619r573o013p461Q461
5079e5191k771l553J780L172J5805R02j2187O597n812P674N319k64O760j254R766
5064b3257K562Q199O864j501m974n64l244k120J9454o162j202J6302j2242n154
5050g039j6698N095J3973J6344n684Q401R210M962P105r682k635j913R895K9456
5036F0790Q280J4121P315Q474j7361N673q725p27R263J0910J8103O46K493q871
5022A10384Q194M91L342J7385r276O422L1756R1K372P526Q574K0383J0381J2271
5008B30296Q397j1109L0986K9640K6428J3998O972J7551q647K935J4205K8585
$$ y = [-820, -2475, -11328, -15126, -29526, -25508, -39059, -19720, -13889, -23608, -20372, -11940, -7509, -10301, -21078, -20446, -13214, -12417, -8557, -26398, -39420, -37541, -23269, -24986, -40605, -50178, -56191, -63652, -55191, -57962, -61515, -59735, -56563, -40758, -39856, -52043, -45446, -51258, -43584, -38265, -38529, -31769, -33023, -23257, -20695, -12496, -5632, -7133, -12107, -12671, -15915, -18035, 1419, -4743, -5945, 10357, -1885, -7039, -23737, -18642, -4669, 11675, 5991, 14392, 23602, 28564, 35669, 25987, 23352, 21439, 31334, 60790, 69070, 83191, 90506, 98980, 81619, 87292, 78567, 77840, 87103, 98013, 116116, 116762, 119255, 110384, 118578, 119069, 122411, 139796, 130520, 136942, 168698, 168789, 171161, 178687, 187261, 207644, 218025, 230296, 238693, 227584, 258570, 288210, 314638, 328636, 335608, 353159, 344512, 347447, 361652, 390237]
4996C90237J2073J4707L7519K6604J4538J4357M5852M5999L8260J3639j9565K018
4984F36238q626p742k144k5021k6457n3304n3695n0196m0873l3706k6256m0479
4972B67739j7780l0320p891l991k2452j9032k9990n233k2535p924n182q073j9538
4959F7798K375j1805M514J7085j0301j2888p468n216O348j5589k7017p808J0763
4946A0791J0733k043q131O47n221n403J4785j912l946N750p446J4098L751m227
4932B2226M500l440J0215o295j2855o991K070Q758K104o462M909Q087L489N485
4918C5800O471k5607P728r685M804J8466O375j730m246o93J4548j5088K711J6661
4904E6515R721q893n093J155L378J3823K190k166Q545N208L128l13K4039j086
$$ y = [390237, 402310, 417017, 454536, 481140, 495678, 510035, 555887, 601886, 640146, 653785, 634220, 636238, 627612, 619870, 617726, 592705, 566248, 512944, 459249, 409053, 368180, 334474, 308218, 267739, 249959, 219639, 211748, 207757, 185305, 166273, 136283, 131050, 108515, 100591, 95409, 87336, 67798, 70173, 58368, 62882, 79967, 69666, 56778, 49310, 44094, 50442, 34853, 7836, 28, 10791, 21524, 19481, 11350, 11997, 6776, 1373, 16158, 14246, 10300, 16050, 8604, 22702, 26453, 22226, 26726, 23286, 33501, 27206, 14351, 7360, 9430, 18188, 20292, 13830, 18739, 26826, 30315, 35800, 42271, 16664, 24392, 14707, 19511, 37977, 44352, 42622, 38376, 37683, 52231, 37143, 39854, 56515, 66236, 57343, 52250, 53405, 56783, 70606, 72796, 70630, 79175, 84383, 87511, 87198, 111237, 110151]
4890A10151j397N461J5245J8448l836N072J5166J5302L4224N157K532K4435K570
4877B48530L2013J9010J2925j929J2818r17P83J452r854L64j5209l0685p268m237
4863B57796o37N332j6092j0878L609j8337L583J910n65j7305J0237N409m432o728
4849B12902p702m542K3811J1912j5843j269Q722J884O896J1780O762J2935J1758
4836B80006O330o330j9123o600K687P210l098q340O06L707M480K7244J5337O405
4822C10521p801J1850K3420Q784j92K7260J2017r348J4270J9408P93N4535K2501
4809D88018m95K1866j8074K9646J495M149K1135KJ5842K5268K0214K5879J6857
4796F51802M1305J3365J7496M1515L6619K2238M5069M9868M3056M8203K8610M1268
$$ y = [110151, 108754, 114215, 129460, 147908, 144072, 149144, 164310, 179612, 213836, 218993, 221525, 245960, 248530, 280543, 299553, 312478, 310549, 323367, 322450, 323233, 324685, 314831, 315195, 299986, 269301, 262033, 257796, 257159, 262491, 246399, 235521, 239130, 220793, 224376, 226286, 225721, 208416, 218653, 224062, 219630, 212902, 205200, 200658, 224469, 236381, 220538, 219269, 227991, 229875, 236771, 248551, 255313, 268248, 280006, 286336, 280006, 260883, 254283, 256970, 264180, 261082, 252742, 253348, 257055, 261535, 288779, 304116, 310521, 302720, 314570, 337990, 346774, 346582, 373842, 385859, 376511, 390781, 410189, 410982, 465517, 488018, 487523, 509389, 491315, 520961, 522456, 526605, 547740, 547742, 563584, 588852, 609066, 634945, 651802, 693107, 706472, 723968, 765483, 802102, 824340, 869409, 919277, 962333, 1010536, 1039146, 1080414]
4784A080414N4628L9559N7470M6977K7974J6901M0866K4337K1905M8989M2251
4773A502271L8209O5306L4608N7379O9868M3873O1510N2381P3876J06902J09016
4762B215199J05126J18564J26695J52345J57758J53250J78420J71870J73281J91384
4752C743892K03460K32917K48748K64634K92258L00283L53041L60023L80610M06309
4742F786175M07009M38964M85897N65706N99596O40883P11871P41879Q16533R24874
4732A3119387J036679J184415J380373J503800J479195J318772J025050P39675
4724B2787346N53493M63502M21315L65045K97105L33260L97898N09894O07200
4715B6736058P00922P24455Q16831R04542J003637J113410J111865J117216J092555
$$ y = [1080414, 1135042, 1174601, 1232071, 1279048, 1307022, 1323923, 1364789, 1389126, 1411031, 1460020, 1502271, 1540480, 1605786, 1640394, 1697773, 1767641, 1811514, 1873024, 1925405, 1999281, 2106183, 2215199, 2320325, 2438889, 2565584, 2717929, 2875687, 3028937, 3207357, 3379227, 3552508, 3743892, 3947352, 4180269, 4429017, 4693651, 4985909, 5286192, 5639233, 5999256, 6379866, 6786175, 7193184, 7632148, 8118045, 8683751, 9283347, 9924230, 10636101, 11377980, 12194513, 13119387, 14156066, 15340481, 16720854, 18224654, 19703849, 21022621, 22047671, 22787346, 23340839, 23804341, 24225656, 24590701, 24887806, 25221066, 25618964, 26128858, 26736058, 27436980, 28161435, 28978266, 29882808, 30886445, 31999855, 33111720, 34228936, 35321491]
4706C5321491J066900J128660J213752J384371J498131J616055J738999J803134
4698D6771493J757422J449911Q48773o269p59679j186363j408336j478324j415243
4689D4573385j274745j129316j004489r51140r91349j102700j200544j178993
4681C5740109j140242j011776q52102p22761o16697n68270m84280l71985k45389
4672B9726607j39768j59167k10543l03648l55655m29602o34845r69841j333511
4663B5190027j602114j677372j615921j428619j212642r87076q51201p85205p22296
4654A4307581o79378o29524o03164n75658n26709m61993m48386m33644m08778
4645I540347l99775l78378l48092l53622l26704k92426k98374k72911k33884k51366
$$ y = [35321491, 36388391, 37517051, 38730803, 40115174, 41613305, 43229360, 44968359, 46771493, 48528915, 49978826, 50827599, 50821330, 50061651, 48875288, 47466952, 45988628, 44573385, 43298640, 42169324, 41164835, 40213695, 39222346, 38119646, 36919102, 35740109, 34599867, 33588091, 32735989, 32013228, 31396531, 30828261, 30343981, 29971996, 29726607, 29586839, 29427672, 29217129, 28913481, 28557826, 28128224, 27493379, 26523538, 25190027, 23587913, 21910541, 20294620, 18866001, 17653359, 16666283, 15815082, 15029877, 14307581, 13628203, 12998679, 12395515, 11819857, 11293148, 10831155, 10382769, 9949125, 9540347, 9140572, 8762194, 8414102, 8060480, 7733776, 7441350, 7142976, 6870065, 6636181, 6384815]
4635F384815k27709j94535j83389j67514j35314j28468r6678j08686j00388o7502
4625D974632q7451p5393q2816o4092p1961p7464o9335p7681r2115p7804r3664
4614D104856q4359q3162p3465m7256n0619n1697m8430o6297q0570n5732l6383
4603C426886n9369n1017l5371j7117O394J3194J5646l140J2738M1267J031l2734
4591C318408m7696k5578m9185o6185l3622o2002m7070o3609q1266p1628p9103
4580B691464q3991q0533o2219o5568q0956n8513m1558l7978m3170l1276m2366
4569B063336k2591k813k5494mK7123J3021k960l163R288j6115l8531k9859k0955
4556A950283m7543n1349p9851p3662m5116o5292o7753n9431p4711n5620l8187
$$ y = [6384815, 6157106, 5962571, 5779182, 5611668, 5476354, 5347886, 5251208, 5142522, 5042134, 4974632, 4887181, 4811788, 4728972, 4664880, 4592919, 4515455, 4446120, 4368439, 4276324, 4198520, 4104856, 4020497, 3937335, 3863870, 3816614, 3765995, 3714298, 3665868, 3599571, 3519001, 3463269, 3426886, 3367517, 3316500, 3281129, 3264012, 3270406, 3283600, 3299246, 3296106, 3308844, 3350111, 3351142, 3318408, 3270712, 3245134, 3195949, 3129764, 3096142, 3034140, 2987070, 2923461, 2842195, 2770567, 2691464, 2607473, 2526940, 2464721, 2399153, 2318197, 2259684, 2218126, 2180148, 2136978, 2105702, 2063336, 2040745, 2037932, 2012438, 2012434, 2039557, 2052578, 2049618, 2046455, 2055743, 2039628, 2001097, 1971238, 1950283, 1902740, 1851391, 1771540, 1697878, 1652762, 1587470, 1519717, 1460286, 1385575, 1329955, 1291768]
4545A291768k5375j2287l3238m9874l5610k6791l6487j0188l0529j9659o652k9785
4533I75293j7450k4460k3776j8306j7450k5051j8108N858O39r055o728l1084o119
4520G84203P884j0203L805m368l9550j692r18J0564q058N884Q094j8758j5238
4507G21649L377j3052j6232K0938j2864j429M167k2692j5195j2572m662J8045
4495F69478Q620o191k7215k0053Q755j925j1207p79K228L515j5448Q764o515Q324
4481F20351O92l051r545r659k7391r665J2911J197R828L455J338j2787j4101j6886
4467E46687m653J993j1778L355L137L16K594m912m671K845j1778j5460j7482K788
4453D92981q584j1553j2912L043K0235j916q857l751j2488m571o949l855n03m89
$$ y = [1291768, 1266393, 1254106, 1220868, 1170994, 1135384, 1108593, 1072106, 1061918, 1031389, 1011730, 1005078, 975293, 957843, 933383, 909607, 891301, 873851, 848800, 830692, 836550, 837189, 828134, 821406, 790322, 784203, 792087, 781884, 785689, 781321, 741771, 740079, 739161, 749725, 741667, 747551, 755645, 736887, 721649, 725026, 711974, 695742, 716680, 703816, 702387, 706554, 683862, 668667, 656095, 651433, 669478, 678098, 671907, 644692, 624639, 633394, 631469, 620262, 619483, 621711, 625226, 609778, 618542, 612027, 620351, 621043, 617992, 608447, 598788, 571397, 561732, 574643, 575840, 585668, 589123, 590461, 577674, 563573, 546687, 542034, 544027, 532249, 535604, 538741, 539057, 541651, 536739, 532068, 534913, 523135, 507675, 490193, 492981, 484397, 472844, 459932, 462975, 483210, 481294, 472437, 468686, 456198, 451627, 444678, 440823, 440320, 439831]
4439D39831o716l801l906j0247j6830P226j47j1608j8289k250J2398J5134j968
4426C98827k25L996k239j2670O88k159o703j3515J3215O078Q691J1788j8956K0165
4412D06981p385L840J692R16j3162j064Q320j180L788N315j0924k368K288L4030
4398D31087k50J520O513P085l499M412P837j048O98J0321J8740K3790J3788L21
4384E21315k4741l502j2526n820J1859o618j203k4730j6841j7695r013l26j6480
4371C93679J383J3464K4534n062j9903j5256K471O811o941k495r454q820Q291
4358C82702K154J4871n200j2135L711p651k82O17j4518p533o171j7640J0261l124
4344C40062m901j1035j0984J7329O081m422m848L658j3403M923Q288j388Q098
$$ y = [439831, 433115, 429314, 425408, 415161, 398331, 405557, 405410, 393802, 375513, 373263, 385661, 400795, 398827, 398602, 402598, 400359, 387689, 388377, 386218, 379515, 366000, 379215, 385293, 393984, 405772, 386816, 406981, 399596, 403436, 405128, 406044, 392882, 391818, 400138, 398958, 402746, 408061, 397137, 394769, 397057, 431087, 430837, 432357, 438870, 445955, 442456, 446868, 454705, 453657, 454355, 464676, 483416, 507206, 520994, 521315, 496574, 493072, 480546, 474726, 486585, 479967, 478764, 454034, 437193, 419498, 410485, 410159, 393679, 395062, 408526, 433060, 427998, 408095, 392839, 395310, 402121, 395180, 392685, 383231, 374411, 382702, 384856, 399727, 394527, 382392, 386103, 378452, 378170, 378787, 364269, 356736, 350565, 332925, 343186, 340062, 335161, 324126, 313142, 330471, 336552, 332130, 327282, 330940, 317537, 322460, 330748, 329360, 337458]
4331C37458q384m025m288j149J4073J0149j0778N411K506J3142r822q293o052
4318C29948K179l672J1032J8301l403q734O509n721J4378P512q568j5937P560
4305C51384n22l217P646M601m146K377P82L829K1048K244j4026P134J8308R342
4291D06784P477j2704J8740M331m061r281P718Q382J5209P600q274J6185J1913
4278D70019J2426l657P554K0100P717j0343Q67J576J997O447J7067J3902K3333
4265E69005J8584l157J9248K8261J8626N358K7020K1751K2231K83J9443L7932
4253G84585J5513J6318M3035L7871L3199M2992K8743L6107L7773N5877M0011M7770
4241A219794P0935O1302P2914P4750R9716R8885Q4906J17944J22149J12808J28222
$$ y = [337458, 329074, 325049, 320761, 319612, 333685, 343834, 333056, 338467, 340973, 354115, 344293, 336000, 329948, 332127, 328455, 339487, 357788, 354385, 345651, 352160, 346439, 360817, 368329, 359761, 343824, 351384, 350862, 347645, 355291, 359892, 355746, 358123, 358905, 362734, 383782, 386026, 372000, 379134, 397442, 406784, 414261, 401557, 420297, 424628, 420567, 411286, 419004, 427386, 442595, 450195, 441921, 458106, 470019, 482445, 478788, 486342, 506442, 514159, 503816, 504683, 506259, 508256, 514703, 531770, 545672, 569005, 587589, 584432, 603680, 631941, 650567, 655925, 682945, 704696, 726927, 727210, 746653, 784585, 800098, 816416, 859451, 897322, 930521, 973513, 1002256, 1038363, 1076136, 1132013, 1172024, 1219794, 1290729, 1352031, 1424945, 1499695, 1599411, 1698296, 1783202, 1901146, 2023295, 2136103, 2264325]
4230B264325J25290J49257J50087J47550J65300J93563K09343K35639K68741K94351
4220D203446L19594L29016L62289L49151L25538L03296K79154K60423K69700K87231
4210G288838L42627L88791M52457N11531N64136O26941O30964O01830N59309M90192
4200A2457616M06350L20466K76835K93475K98470L69538M37399N15549N75608
4191A5951306O03556O30360N77734N23139M34228L17600K16062J03861J02314
4182A9460160R4004J43370K43633L06263L67627L27243K82898J80121N3938l8737
4172B1420520j51736k03602k09058k23717j91192j02393j0898Q0503J18000P6245
4162B0602672j6870j97961l94859n41242o59419o89656o49898n87820m83157l56923
$$ y = [2264325, 2389615, 2538872, 2688959, 2836509, 3001809, 3195372, 3404715, 3640354, 3909095, 4203446, 4523040, 4852056, 5214345, 5563496, 5889034, 6192330, 6471484, 6731907, 7001607, 7288838, 7631465, 8020256, 8472713, 8984244, 9548380, 10175321, 10806285, 11408115, 11967424, 12457616, 12863966, 13184432, 13461267, 13754742, 14053212, 14422750, 14860149, 15375698, 15951306, 16554862, 17185222, 17762956, 18286095, 18720323, 19037923, 19253985, 19357846, 19460160, 19554164, 19697534, 19941167, 20247430, 20615057, 20942300, 21225198, 21405319, 21459257, 21420520, 21268784, 21065182, 20856124, 20632407, 20441215, 20338822, 20327924, 20408427, 20526427, 20602672, 20585802, 20387841, 19992982, 19451740, 18792321, 18102665, 17452767, 16864947, 16381790, 16024867]
4152A6024867k39372j69888p9373q8096j70317l20177n15204o32869p44747p61889
4142A2302935p22457o48284n68197m56110l63477k58826j98707j67091j64867
4133H754919k29876l17830l73026m40332m60555m33405l92642l49144k93560k56466
4123E208083k21049j90620j57072j63721j78490j34434j61250j80640j74690j84331
4113C461786j43925j54805j39520r9565r0309r3950r8384p0522p0621p7106o9561
4102B353518n0626m4118m1170n4072k0084k9047l9395m1394k1608n4599m1002
4091A916403k1783j893k1993k5927k4089m1941j4789r472m0166j3577k6903k8605
4079A645265k3378l5441k3040r27n206k2611j8073j4443M924j5625j673q778r141
$$ y = [16024867, 15785495, 15615607, 15536234, 15448138, 15277821, 14957644, 14442440, 13809571, 13064824, 12302935, 11580478, 10932194, 10363997, 9907887, 9544410, 9285584, 9086877, 8919786, 8754919, 8525043, 8207213, 7834187, 7393855, 6933300, 6499895, 6107253, 5758109, 5464549, 5208083, 4987034, 4796414, 4639342, 4475621, 4297131, 4162697, 4001447, 3820807, 3646117, 3461786, 3317861, 3163056, 3023536, 2923971, 2833662, 2739712, 2641328, 2570806, 2500185, 2423079, 2353518, 2302892, 2258774, 2217604, 2163532, 2143448, 2114401, 2075006, 2033612, 2012004, 1957405, 1916403, 1894620, 1892727, 1870734, 1844807, 1820718, 1778777, 1763988, 1754516, 1714350, 1700773, 1673870, 1645265, 1621887, 1586446, 1563406, 1562479, 1557273, 1534662, 1516589, 1502146, 1507070, 1491445, 1489772, 1480994, 1471853]
4066A471853J0733m290N94k76j4913M406J2791P229l97r756J5870j4579k907k22
4052A476136J815k648K2690J9731j1133r396K845J8223o083N400O736K404l561
4039A523159p1L438O869l215k554O041J6536L999J7759O182J1779j194J0498R855
4025A609081k002M642Q921J1407P518J866r573n284J4990P355N484L4495K7769
4012A716669K1359K2554n133q221J4430M360Q887K2497P483K3405P0J6495J9691
3999A864546K0951J4449K6459M3745K0526J8404K3012p583Q519K9938K8571j619
3987B089918M721K1986J9950L8525L9268L1883J1503K0397J9159K6254K7956K9853
3975B381373N3490K2000M0679N3570J9347M206M3413M2400J2014K3690L3064L5600
$$ y = [1471853, 1482586, 1478296, 1478890, 1478614, 1463701, 1468107, 1480898, 1488127, 1487730, 1477974, 1493844, 1479265, 1476358, 1476136, 1477951, 1475303, 1497993, 1517724, 1506591, 1497195, 1500040, 1518263, 1512180, 1517580, 1524316, 1526720, 1523159, 1523088, 1526526, 1533395, 1530180, 1527626, 1533667, 1550203, 1554202, 1571961, 1578143, 1589922, 1588728, 1599226, 1609081, 1607079, 1611721, 1620642, 1632049, 1639567, 1641433, 1631860, 1626576, 1641566, 1648921, 1654405, 1688900, 1716669, 1738028, 1760582, 1755449, 1747228, 1761658, 1766018, 1774905, 1797402, 1804885, 1828290, 1828360, 1844855, 1864546, 1885497, 1899946, 1926405, 1970150, 1990676, 2009080, 2032092, 2024509, 2033028, 2062966, 2091537, 2089918, 2094639, 2116625, 2136575, 2175100, 2214368, 2246251, 2257754, 2278151, 2297310, 2323564, 2351520, 2381373, 2434863, 2456863, 2497542, 2551112, 2570459, 2574665, 2618078, 2660478, 2672492, 2696182, 2729246, 2764846]
3963B764846L9365N5399K4178M1701L1816M9851K9266L5178M9851L7957M4187
3952C203595N9985K8531M0181N0604O7642N9190O2872Q3661Q6540O4340M3357
3941C850498K8881L4540M2145L7632L4532N5631O6719R4543Q0056N7546P7270
3930D459993P2443Q7359O7127O0347N6816N4903P0527Q9945Q4310Q2110R6861
3919E282741J16766J25889J53008J26829R2428J02487R5512R4406Q4251P6961
3909F351278Q6052Q1133Q9075Q7689R8746J03205J09889J16958J25831J44416
3899G394272J75744J84524K00398K12319K29020K67962K73688K74185K56686K12592
3889I681390J86391J53689J27057J24611J26390J52300J83679J93685K27428K76709
$$ y = [2764846, 2804211, 2859610, 2883788, 2925489, 2957305, 3007156, 3036422, 3071600, 3121451, 3159408, 3203595, 3263580, 3292111, 3332292, 3382896, 3450538, 3509728, 3572600, 3656261, 3742801, 3807141, 3850498, 3879379, 3913919, 3956064, 3993696, 4028228, 4083859, 4150578, 4245121, 4325177, 4382723, 4459993, 4532436, 4619795, 4686922, 4747269, 4804085, 4858988, 4929515, 5019460, 5103770, 5185880, 5282741, 5399507, 5525396, 5678404, 5805233, 5897661, 6000148, 6095660, 6190066, 6274317, 6351278, 6437330, 6518463, 6607538, 6695227, 6793973, 6897178, 7007067, 7124025, 7249856, 7394272, 7570016, 7754540, 7954938, 8167257, 8396277, 8664239, 8937927, 9212112, 9468798, 9681390, 9867781, 10021470, 10148527, 10273138, 10399528, 10551828, 10735507, 10929192, 11156620, 11433329]
3879A1433329L04654L67172M14765M44390M95791N34004N97523O51710P11030
3870A5954368P80577Q27738Q60071Q97635R24346J008414J127737J276557J423789
3861B5081232J584520J712518J734415J579088J214672Q07850N24485L65893L24466
3852C4929139L87264M86006O21575Q73314J117136J312666J416650J395383J315543
3843D3854676J076834Q10541N76814M39099L62834M20694N21966P07855J002811
3834D9774124J326742J683772J952709K188537K334388K299237J902507J066172
3826F4528188k09462j516836k352653k686914k606003k281881j830857j376756
3818D9666826j051878p92075n63906l99205l27619l26274l87761n63172q08541
$$ y = [11433329, 11737983, 12105155, 12519920, 12964310, 13460101, 13994105, 14591628, 15243338, 15954368, 16734945, 17562683, 18422754, 19320389, 20244735, 21253149, 22380886, 23657443, 25081232, 26665752, 28378270, 30112685, 31691773, 32906445, 33714295, 34238780, 34604673, 34929139, 35316403, 35802409, 36423984, 37297298, 38414434, 39727100, 41143750, 42539133, 43854676, 44931510, 45742051, 46318865, 46757964, 47120798, 47541492, 48063458, 48771313, 49774124, 51100866, 52784638, 54737347, 56925884, 59260272, 61559509, 63462016, 64528188, 64318726, 62801890, 60449237, 57762323, 55156320, 52874439, 51043582, 49666826, 48614948, 47822873, 47258967, 46859762, 46532143, 46205869, 45818108, 45254936, 44446395]
3809D4446395j122880j382227j520112j443554j254805r73624p26626n38968m35523
3800C5048076l71886l50915m24363n91309q92898j200455j483389j605539j556710
3791B6570612j455634j258657j072991r46301q24088p69268p40997p34313o86760
3782A8081603o55469o05495n49477m97191m41626l95359l68955l10806k99242
3773A3957983k89372k42698k19504k02590j55608j60968j25997j23307j38926
3764A2299013j56535j98734j89766k30481k49401k55802k20257k05891j90759
3755A0401387j88363j60029j57493j67765j59959j39616j27258j14699r6510j27566
3745H962129q9376q6526j01577j15667r9312p4371p7196o2645p7455o1062n5094
$$ y = [44446395, 43323515, 41941288, 40421176, 38977622, 37722817, 36749193, 36022567, 35483599, 35048076, 34676190, 34325275, 33900912, 33309603, 32416705, 31216250, 29732861, 28127322, 26570612, 25114978, 23856321, 22783330, 21837029, 21012941, 20243673, 19502676, 18768363, 18081603, 17426134, 16820639, 16271162, 15773971, 15332345, 14936986, 14568031, 14257225, 13957983, 13668611, 13425913, 13206409, 13003819, 12848211, 12687243, 12561246, 12437939, 12299013, 12142478, 11943744, 11753978, 11523497, 11274096, 11018294, 10798037, 10592146, 10401387, 10213024, 10052995, 9895502, 9727737, 9567778, 9428162, 9300904, 9186205, 9089695, 8962129, 8872753, 8786227, 8684650, 8568983, 8469671, 8395300, 8318104, 8255459, 8178004, 8116942, 8061848]
3734H061848q1130o8436l9321n7065m9979k9773j6453J1403K1932J5882J4057
3723G782965J9914J6043L3713M1541M9471P1369P1716R1130R2197J10610J18811
3712H499480J39886J90409J96485K34082K69821K71846L31175L59287L96708M39225
3702A1328404N53625O11056O72690P62290Q67315R95308J123173J282216J465999
3693A9662076J639074J807954J992285K131650K194746K154753K031700J808081
3685C5422319J481574J084936P38037L40251M8950k03407l27204l29244k34293
3676C8021919j00667O7181K36147L28889L04319J52791o7468l85014p34181j113730
3666C6710186j439873j726765j936205k050812k047413j986678j867545j725162
$$ y = [8061848, 7980718, 7912282, 7872961, 7815896, 7765917, 7736144, 7719691, 7731094, 7753026, 7768908, 7782965, 7802879, 7818922, 7852635, 7894176, 7943647, 8015016, 8086732, 8177862, 8270059, 8380669, 8499480, 8639366, 8829775, 9026260, 9260342, 9530163, 9802009, 10133184, 10492471, 10889179, 11328404, 11882029, 12493085, 13165775, 13928065, 14795380, 15790688, 16913861, 18196077, 19662076, 21301150, 23109104, 25101389, 27233039, 29427785, 31582538, 33614238, 35422319, 36903893, 37988829, 38726866, 39067117, 39116067, 38912660, 38585456, 38256212, 38021919, 37921252, 37988433, 38224580, 38553469, 38857788, 39010579, 38943111, 38558097, 37823916, 36710186, 35270313, 33543548, 31607343, 29556531, 27509118, 25522440, 23654895, 21929733]
3658B1929733j568072j355809j224118j075826r41443q27769p57605o91262o14032
3649A2873797n61897m96615m49833m15882l73641l43469l17108k79012k75721
3640I360619k69137k24177k19438k04988j74844j63198j57993j22303j23259j13150
3630G588132j15511j07387q3883r4319j01733j08701p0586p8730o7129q8497o6321
3619F605335o6994o7074m2979p7530p8091n3588m8128o8311r1380o0699n9614
3608E890947l1251m3632n0511l9479l6311j4290k2612L600K0933K8206N175J3559
3596E724334L2173K8510K1882N7082M2250L8378N8720N9168P7648Q8797J06420
3585F335362J16489J05150J08369J17237J20368J22345J12763Q4688J19762J35943
$$ y = [21929733, 20361661, 19005852, 17781734, 16705908, 15764465, 14936696, 14179091, 13487829, 12873797, 12311900, 11815285, 11365452, 10949570, 10575929, 10232460, 9915352, 9636340, 9360619, 9091482, 8867305, 8647867, 8442879, 8268035, 8104837, 7946844, 7824541, 7701282, 7588132, 7472621, 7365234, 7281351, 7187032, 7085299, 6976598, 6906012, 6827282, 6760153, 6671656, 6605335, 6538341, 6471267, 6428288, 6350758, 6272667, 6219079, 6170951, 6102640, 6011260, 5950561, 5890947, 5859696, 5816064, 5765553, 5726074, 5689763, 5675473, 5652861, 5656461, 5677394, 5705600, 5710775, 5724334, 5756507, 5785017, 5806899, 5863981, 5906231, 5944609, 6003329, 6062497, 6140145, 6228942, 6335362, 6451851, 6557001, 6665370, 6782607, 6902975, 7025320, 7138083, 7222771, 7342533, 7478476]
3575G478476J08899J13345J07187J17227J37879J41288J32918J35137J48706J76498
3565H797560J52910J39940J73337K13696K16586K31475K64643L05057L29277L65105
3555A1189586M14405M89293N96700O54252P03050Q44325R39082J092413J274679
3546A8197785J446068J651834J877577K072770K255255K392969K436219K368044
3538C4698521K201381J910620J551213J127669P31811L64081L075k60290l75232
3529D1952849m26856l34823j52162q428J58581K46761K41189Q1442j12185m08750
3519D1237618p00760j016002j322020j564940j723847j780156j731916j620402
3511B9777575j444694j230489r74085p23319m77699k56657n8557J26210L15879
$$ y = [7478476, 7587375, 7700720, 7807907, 7925134, 8063013, 8204301, 8337219, 8472356, 8621062, 8797560, 8950470, 9090410, 9263747, 9477443, 9694029, 9925504, 10190147, 10495204, 10824481, 11189586, 11603991, 12093284, 12689984, 13344236, 14047286, 14891611, 15830693, 16923106, 18197785, 19643853, 21295687, 23173264, 25246034, 27501289, 29894258, 32330477, 34698521, 36899902, 38810522, 40361735, 41489404, 42221215, 42585296, 42588371, 42328081, 41952849, 41525993, 41191170, 41039008, 41030580, 41189161, 41435922, 41677111, 41758553, 41646368, 41237618, 40536858, 39520856, 38198836, 36633896, 34910049, 33129893, 31397977, 29777575, 28332881, 27102392, 26128307, 25404988, 24927289, 24670632, 24612075, 24738285, 25054164]
3502B5054164N20125P15679R43340J150484J408029J686062J952819K261008K562887
3493C8254597K857182L110446L290978L373244L373756L301800L157372K971613
3485F3690988K765055K547739K287869J941708J603076J190189P48231L61888
3477G7136743r920l68940o90720r64573j198124j447070j681273j886465k102278
3468F6787380k281288k411398k531723k600375k620541k604252k575950k491421
3460D6670432k371477k206786k049354j859658j624921j434700j205645r72385
3452C2945506p69362n66821l78816j90650M73J68262L38043M99961P05667Q97357
3442C3649620J130086J400511J656529J962250K336499K748196L146744L505136
$$ y = [25054164, 25574289, 26289968, 27233308, 28383792, 29791821, 31477883, 33430702, 35691710, 38254597, 41111779, 44222225, 47513203, 50886447, 54260203, 57562003, 60719375, 63690988, 66456043, 69003782, 71291651, 73233359, 74836435, 76026624, 76774855, 77136743, 77126823, 76757883, 76067163, 75102590, 73904466, 72457396, 70776123, 68889658, 66787380, 64506092, 62094694, 59562971, 56962596, 54342055, 51737803, 49161853, 46670432, 44298955, 42092169, 40042815, 38183157, 36558236, 35123536, 33917891, 32945506, 32176144, 31609323, 31230507, 31039857, 31040330, 31208592, 31546635, 32046596, 32752263, 33649620, 34779706, 36180217, 37836746, 39798996, 42135495, 44883691, 48030435, 51535571]
3434E1535571L759301L953921M259027M479901M562074M436191M065418L489162
3426H4540566L049158K707313K333577K039981J826918J670737J608912J691111
3418A01468273J841436K046302K234459K415343K539058K600073K610464K539691
3410A20295099K400909K138729J783913J241991O28181p4767o84130j140850j607277
3401A24981798k090181k600570l151208l401045l261696k950568k445476j966167
3393A03114887j567880j347340j280563j372937j571839j929261k404592k912488
3385H8727987l377772l757230l987482m111362m065288l897854l647248l310781
3377E8572970k953776k589981k212030j805180j424579j097342q75690o89707
$$ y = [51535571, 55294872, 59248793, 63507820, 67987721, 72549795, 76985986, 81051404, 84540566, 87589724, 90297037, 92630614, 94670595, 96497513, 98168250, 99777162, 101468273, 103309709, 105356011, 107590470, 110005813, 112544871, 115144944, 117755408, 120295099, 122696008, 124834737, 126618650, 127860641, 128488822, 128414055, 127729925, 126589075, 124981798, 122891617, 120291047, 117139839, 113738794, 110477098, 107526530, 105081054, 103114887, 101547007, 100199667, 98919104, 97546167, 95974328, 94045067, 91640475, 88727987, 85350215, 81592985, 77605503, 73494141, 69428853, 65530999, 61883751, 58572970, 55619194, 53029213, 50817183, 49012003, 47587424, 46490082, 45614392, 44924685]
3369D4924685o79186o23836m04609j65543J09600M52778Q41387J215835J583860
3360D7254971J936478K236992K451296K568836K546552K439707K287446K086216
3352F5808494J895857J679922J401617J061001O70706L13976L0016j99203k98216
3343G2364170l63966k91868j51518k1878o6014k28185o69970q93489q89104j019639
3333F7768539j100533j342279j695667k367403k723510k913894l116540l097181
3325D9411532k980512k773490k559220k329360k114291j892794j653562j461339
3317C1646964j276557j081410r09432p78429n72367m12531k73168j15652L8995
3308B6266413J61522K66975K65331M1701j34106l38267p37925p24679n74769m44533
$$ y = [44924685, 44245499, 43621663, 43217054, 43051511, 43161111, 43613889, 44455276, 45671111, 47254971, 49191449, 51428441, 53879737, 56448573, 58995125, 61434832, 63722278, 65808494, 67704351, 69384273, 70785890, 71846891, 72517597, 72831573, 72861589, 72662386, 72364170, 72000204, 71708336, 71556818, 71534940, 71468926, 71240741, 70570771, 69677282, 68788178, 67768539, 66668006, 65325727, 63630060, 61262657, 58539147, 55625253, 52508713, 49411532, 46431020, 43657530, 41098310, 38768950, 36654659, 34761865, 33108303, 31646964, 30370407, 29288997, 28379565, 27601136, 27028769, 26616238, 26343070, 26227418, 26266413, 26427935, 26694910, 26960241, 27001942, 26867836, 26529569, 25791644, 25066965, 24492196, 24047663]
3298B4047663k28726O083K21304L60248M48395M44034L17321N6854j24640l42572
3288B5205964m11133l85513k84866j67306l0345P8914J47665J80183J62545J01995
3278B4598103J0849j811K558P9734J80897L10303N14558P01187R11955J169943
3268B8478276J434745J674832J886695K003742J953937J824618J726139J606649
3260D2589633J606933J677570J784462J854658J892835J866969J667520J426562
3252E6367142J132357Q45755O31922M35571K83002J57940J8480m9569q4823q1980
3242E9655797m4102m2776m2387l5335M210J06602J68636K10069J14387j37103
3232E9957998m55300q14683j157785j477638j797409k101840k346718k603630
$$ y = [24047663, 23818937, 23825020, 24046324, 24406572, 24854967, 25299001, 25616322, 25673176, 25548536, 25205964, 24794831, 24409318, 24124452, 23957146, 23926801, 24005715, 24153380, 24333563, 24496108, 24598103, 24608952, 24607141, 24609699, 24689433, 24870330, 25180633, 25695191, 26396378, 27308333, 28478276, 29913021, 31587853, 33474548, 35478290, 37432227, 39256845, 40982984, 42589633, 44196566, 45874136, 47658598, 49513256, 51406091, 53273060, 54940580, 56367142, 57499499, 58345254, 58977176, 59412747, 59695749, 59853689, 59872169, 59822600, 59737777, 59655797, 59611695, 59568919, 59526532, 59491197, 59495407, 59602009, 59770645, 59980714, 60095101, 59957998, 59502698, 58688015, 57530230, 56052592, 54255183, 52153343, 49806625, 47202995]
3224D7202995k775615k841299k823144k739330k599275k464775k269880k056837
3216B6632840j851539j635894j463903j276379j135831j011561r12790q29106
3208A6515837p39019o50481n88953n22582m57665m22008l59301l28085k91388
3199A2156355k32440j93823j98308j85949j98378j75215j64683j79880j59387
3190A0468292j90152j74566j70364j97645k12280k02343j93430j77458j86685
3181H763369j78496j50171j21675j06563j11361r4961r9329q7613r0521r2385
3171G630294j04652j26856j37661j31799j61645j61361j55439j68334j60507j47933
3161F174107j47108j25503j25834j39959r7479q9450r2730q7776q1104p4892n8067
$$ y = [47202995, 44427380, 41586081, 38762937, 36023607, 33424332, 30959557, 28689677, 26632840, 24781301, 23145407, 21681504, 20405125, 19269294, 18257733, 17344943, 16515837, 15776818, 15126337, 14537384, 14014802, 13557137, 13135129, 12775828, 12447743, 12156355, 11923915, 11730092, 11531784, 11345835, 11147457, 10972242, 10807559, 10627679, 10468292, 10278140, 10103574, 9933210, 9735565, 9523285, 9320942, 9127512, 8950054, 8763369, 8584873, 8434702, 8313027, 8206464, 8095103, 8000142, 7900813, 7813200, 7722679, 7630294, 7525642, 7398786, 7261125, 7129326, 6967681, 6806320, 6650881, 6482547, 6322040, 6174107, 6026999, 5901496, 5775662, 5635703, 5538224, 5448774, 5356044, 5268268, 5187164, 5112272, 5054205]
3150E054205n5361k9199m5534k5724q567j4652k0789j8046L672j612j7508j3896
3138D806989k3715q911l657l045j2451L994J4910p274o556p450j3641J518K340
3125D743051n002J9743J7523N09j3092k3225k1786j7659k6020p865j8863P402
3113D654716p420k0352k9247j4002j7419j6151j177J8215P630J0131K0459M017
3101D609400K2123J4990J8962L1803J9080K8325N7366M9498L1573K9967M4402
3090D957489L2312L6228N9480J03512Q3779R5388J07139J19212R6125J20442J29004
3079E940110J18345J57217J70218J75433J98765J88151J58625R1035P2994O1624
3069G332517Q1655R9900J27526J50301J35054J60060J80107J97700J87303J92211
$$ y = [5054205, 4998844, 4969645, 4924111, 4898387, 4889820, 4875168, 4854379, 4836333, 4840005, 4838393, 4820885, 4806989, 4783274, 4774363, 4770706, 4767661, 4755210, 4759204, 4774114, 4766840, 4760284, 4752834, 4739193, 4740711, 4743051, 4738049, 4757792, 4775315, 4775824, 4762732, 4739507, 4717721, 4700062, 4674042, 4666177, 4647314, 4654716, 4647296, 4626944, 4597697, 4583695, 4566276, 4550125, 4548948, 4567163, 4574793, 4584924, 4605383, 4609400, 4631523, 4646513, 4665475, 4697278, 4716358, 4744683, 4802049, 4851547, 4883120, 4913087, 4957489, 4989801, 5026029, 5085509, 5189021, 5272800, 5368188, 5475327, 5594539, 5690664, 5811106, 5940110, 6058455, 6215672, 6385890, 6561323, 6760088, 6948239, 7106864, 7197899, 7270893, 7332517, 7414172, 7514072, 7641598, 7791899, 7926953, 8087013, 8267120, 8464820, 8652123, 8844334]
3059H844334K21424K42024K55572K75341L09048L48734L57160L89637M06898M73364
3049A2123536N13312N48119N85391O55252P15772P79432Q47538R02434R26156
3040A8596942J001597J064434J124056J213994J331238J515559J701286J902271
3032B9451377K145066K353833K599329K867925L169885L552637M016554M500208
3024E4656814N084546N752990O537304P376421Q370178R636673J1297781J3368611
3016A22081318J5559289J7721095J9880100K2165633K3797844K3022948J8427881
3009B62656108J0159131J032524m703859o197430m456775K9993N827391R845780
3001B74192863Q951995J795979r857770k0245240k5751085k7148148k5326146
$$ y = [8844334, 9065758, 9307782, 9563354, 9838695, 10147743, 10496477, 10853637, 11243274, 11650172, 12123536, 12636848, 13184967, 13770358, 14425610, 15141382, 15920814, 16768352, 17670786, 18596942, 19598539, 20662973, 21787029, 23001023, 24332261, 25847820, 27549106, 29451377, 31596443, 33950276, 36549605, 39417530, 42587415, 46140052, 50156606, 54656814, 59741360, 65494350, 72031654, 79408075, 87778253, 97414926, 108712707, 122081318, 137640607, 155361702, 175241802, 197407435, 221205279, 244228227, 262656108, 272815239, 273847763, 269143904, 262946474, 258489699, 258519692, 264347083, 274192863, 283144858, 284940837, 275083067, 254837827, 229086742, 201938594, 176612448]
2994A76612448k1415915j7121287j3603447j1103553r432234q311569p482140
2987H8142303o711979o013563n371896m765424m262190l861155l528963l248637
2979E0378496k966683k677875k402058k158805j986597j882411j772826j666422
2971C2864819j543036j426750j308726j158551j052730r62769r16570q83622q83162
2962B2728903q54162q22953p85346p23555o81422o31787o01955n76999n22541
2953A6528183n07821n08735m78591m48718m21806m10363l82869l77097l52250
2944A2639933l19738l25147l08911l18335l08080k81107k76681l02748k57635
2935I941551k20536j87150j81998j99010j88041j89931j70202j66971j80854j71709
$$ y = [176612448, 155196533, 138075246, 124471799, 113368246, 103936012, 95624443, 88142303, 81430324, 75416761, 70044865, 65279441, 61017251, 57156096, 53627133, 50378496, 47411813, 44733938, 42331880, 40173075, 38186478, 36304067, 34531241, 32864819, 31321783, 29895033, 28586307, 27427756, 26375026, 25412257, 24495687, 23612065, 22728903, 21874741, 21051788, 20266442, 19542887, 18861465, 18229678, 17627723, 17050724, 16528183, 16020362, 15511627, 15033036, 14584318, 14162512, 13752149, 13369280, 12992183, 12639933, 12320195, 11995048, 11686137, 11367802, 11059722, 10778615, 10501934, 10199186, 9941551, 9721015, 9533865, 9351867, 9152857, 8964816, 8774885, 8604683, 8437712, 8256858, 8085149]
2925H085149j47398j40630j27403j36843j32757j20870j18924j11808j32351j08811
2915F807354j18569j13753q1733q7198j00423p3681q5601q6960r4157j14941q1828
2904E768510o9197p6519j09068o8218o2618p1062o2918o2643q7338q6066p7836
2893D935027q2558p4251o6815o7035p3984j00501o5630n6105l7345n3251m6361
2882D211191n7090n0525k2321l7197o5518o8834m9309n1373m4001m6138n9756
2871C659129l7160m6633n6487o3966n4066m0166l2727j9318m2685m8085n0739
2860C167097n5119m8104m5045m7560n5063o5924k9097m8882n2890m4012m9107
2849B626294n1994n1672l1961l2308k9961l6986l1125j7600k5281j7082k2424
$$ y = [8085149, 7937751, 7797121, 7669718, 7532875, 7400118, 7279248, 7160324, 7048516, 6916165, 6807354, 6688785, 6575032, 6493299, 6406101, 6305678, 6231997, 6146396, 6059436, 5965279, 5850338, 5768510, 5699313, 5622794, 5513726, 5445508, 5382890, 5311828, 5248910, 5186267, 5098929, 5012863, 4935027, 4852469, 4778218, 4711403, 4644368, 4570384, 4469883, 4404253, 4348148, 4310803, 4257552, 4211191, 4154101, 4103576, 4081255, 4044058, 3978540, 3909706, 3860397, 3809024, 3765023, 3718885, 3659129, 3621969, 3575336, 3518849, 3454883, 3400817, 3360651, 3327924, 3308606, 3265921, 3217836, 3167097, 3111978, 3063874, 3018829, 2971269, 2916206, 2850282, 2821185, 2772303, 2719413, 2675401, 2626294, 2574300, 2522628, 2490667, 2458359, 2428398, 2391412, 2360287, 2342687, 2317406, 2300324, 2277900]
2838B277900k6921m3464j7442j840k4786l4381j1921K398j5636j0080j2792m0242
2826B040793m148j0641j4047k3218m53q540O319m146l43k769k7633j4605k5034
2813A911535l2368k1856p530q538r922j4312l8111k6850m1249l3142k0369j9812
2801A637476o952p889j4950l3726l5810j6886o945l0004j5355k8088o599M106
2789A438378k658r101k4134j3807N841M78j4992l620J4717m479j0105J9583k474
2776A393627j0910J3897q479l189q382m230j4509O380q510o705p378J092O941
2763A349645j3943j1467K895J1090q343L499K892p04r334M982J2437j6342p685
2750A319622L619l747q063j478J828R0j623J142L2521K8385L4995L4017K1428
$$ y = [2277900, 2250979, 2207515, 2190073, 2188233, 2163447, 2129066, 2117145, 2119543, 2103907, 2093827, 2081035, 2040793, 2036645, 2026004, 2011957, 1988739, 1988286, 1979746, 1986065, 1981919, 1981576, 1978807, 1951174, 1936569, 1911535, 1879167, 1857311, 1849781, 1841243, 1831321, 1817009, 1778898, 1752048, 1710799, 1677657, 1657288, 1637476, 1630524, 1622635, 1607685, 1573959, 1538149, 1521263, 1514318, 1484314, 1468959, 1440871, 1434272, 1438378, 1435720, 1426619, 1402485, 1388678, 1394519, 1394997, 1380005, 1376385, 1391102, 1386623, 1376518, 1396101, 1393627, 1382717, 1396614, 1388135, 1384946, 1376564, 1372334, 1357825, 1364205, 1355695, 1348990, 1341612, 1342704, 1349645, 1335702, 1324235, 1327130, 1338220, 1329877, 1333376, 1336268, 1335564, 1326230, 1331212, 1343649, 1327307, 1319622, 1323241, 1319494, 1311431, 1309953, 1311781, 1311871, 1310248, 1311390, 1343911, 1372296, 1407291, 1441308, 1462736]
2737A462736L4471M8662O3640N5223P3287R4711Q7820J19030J24393R8865R1489
2726B354327O7301N066r353l1747k2696o763P884L2405L5936J5943o7294j09691
2714B271318j53245j68650j59664j18085r5428r4658p0985o6995k7751m2295n8097
2703A215465k5748m1493n9211k3916l5049k1105k0133j7560n985j3634k1076j7944
2691I12611k1138j2989J825j8751j5050j0014k714j1178j038n435j8234j6430
2679G81465M14M283J0367j262j1772j789K389k4378r493j849o557k8825r754L465
2665G06704r016k0908O066p573k3108m670l819m703n53M120o46j2242j5740q463
2651F05449j8024M16k266j8223j0338r792m969j2839J4478n764j2868r866p485
$$ y = [1462736, 1497207, 1545869, 1609509, 1664732, 1738019, 1832730, 1920550, 2039580, 2163973, 2262838, 2354327, 2421628, 2426694, 2417341, 2385594, 2362898, 2356135, 2364019, 2396424, 2432360, 2448303, 2381009, 2271318, 2118073, 1949423, 1789759, 1671674, 1576246, 1481588, 1410603, 1343608, 1315857, 1273562, 1215465, 1189717, 1148224, 1089013, 1065097, 1030048, 1008943, 988810, 971250, 965265, 951631, 930555, 912611, 891473, 878484, 880309, 861558, 846508, 836494, 833780, 822602, 821564, 816129, 797895, 781465, 781879, 786162, 796529, 795267, 783495, 781706, 784095, 759717, 750224, 748375, 741818, 712993, 703239, 706704, 697688, 676780, 682846, 675273, 652165, 647495, 643676, 638973, 638420, 642540, 641894, 629652, 613912, 605449, 587425, 587841, 585575, 567352, 557014, 547222, 542253, 529414, 543892, 538128, 525260, 515394, 507909]
2638E07909R065m946j3676M361j1010n103P417j6337l51j4867k1497j458j0832
2625D28675o382N147P144j7977k717L410l607P512j8462L078n055N570n916O183
2611D06603k193P323J627q082p378J987N893q029K428j473j9757M044o78l79K290
2596C84226J9626M505j0178j5622o44N699m304k740n560J51J5920R327L245n640
2582C98011k665k576J2457k0381j4696r908N419m687n88j40J2740p580r28N850
2568C70328j6576q45k586m600j0434j837m362P52J0589J346q281K1526j8772R432
2554C45680N268q392J7429J1682R216J5672o750o980r439l92M585L403p054Q938
2540C82866p962j8059J6510J875n159J7029l329j478q67o116j2652R278j2703
$$ y = [507909, 516974, 512028, 498352, 502713, 491703, 486600, 494017, 477680, 477329, 462462, 440965, 439507, 428675, 422293, 427440, 434584, 416607, 413890, 417300, 413693, 421205, 402743, 405821, 400766, 406336, 400420, 406603, 404410, 411733, 413360, 405278, 397900, 399887, 405780, 397751, 400179, 398706, 378949, 382993, 382315, 381936, 384226, 403852, 408357, 398179, 382557, 381913, 387612, 383308, 380568, 375008, 375159, 391079, 400406, 403651, 398011, 395346, 392770, 405227, 384846, 370150, 360242, 365661, 360974, 360386, 360246, 372986, 365406, 364478, 370328, 353752, 352907, 350321, 345721, 335287, 333450, 329088, 329840, 340429, 341775, 333494, 355020, 336248, 345680, 350948, 342556, 359985, 371667, 380883, 396555, 389805, 382825, 373386, 372994, 377579, 380982, 373928, 382866, 374904, 356845, 373355, 375230, 370071, 387100, 383771, 382293, 381426, 375310, 362658, 371936, 359233]
2527C59233j1872n789J932j535j3833J6457l57j3570O462j929o621J2886j411
2514C40053j1065j3183k999J1504j582K5167M513j8174M301j2270q644M953p804
2501C14770M909q001j7442q219J6797J6275K902j6934k9099O41J1465k172l206
2488B82686k474l593P05J8291K5498j2231o135J020q898L12J0960k3654j5299
2475B67188J6623Q95l969J429N733l14P071j781j0340j482n845l389k917K046
2461B70948r942l328J7459M745j5346n109M824p521K854J2551n222j0746r949
2448B46218k304K466l117Q73j509o498j576O886Q310n766l282M03l528p07k212
2433B34657O474j8246J751R411k508k9865J0041j604j1123Q751k27J5159o534
$$ y = [359233, 347361, 341572, 343504, 341969, 328136, 344593, 344236, 330666, 337128, 335199, 328578, 341464, 340053, 328988, 315805, 312806, 324310, 322728, 347895, 352408, 334234, 338535, 326265, 317621, 322574, 314770, 319679, 311678, 294236, 286017, 302814, 319089, 321991, 305057, 275958, 276599, 288064, 285892, 282686, 280212, 276619, 277324, 295615, 321113, 308882, 302747, 303767, 294869, 295181, 306141, 282487, 267188, 283811, 284706, 280737, 282166, 287899, 287585, 294656, 292875, 282535, 281053, 275208, 271819, 268902, 270948, 261006, 257678, 275137, 279882, 264536, 259427, 264251, 256730, 259584, 272135, 266913, 256167, 246218, 243914, 246380, 243263, 244136, 242627, 236129, 234553, 241439, 249749, 243983, 240701, 241104, 237576, 236869, 234657, 241131, 222885, 224636, 234047, 231539, 201674, 211715, 210111, 198988, 207739, 207512, 222671, 216137]
2420B16137l28j5650J4761P052l073P841K378N789r777n437p899k5427r30J9800
2406B05237R079j3970L589o252r29J0479R518k2384p038L5713J2365j6420j3389
2393B05598k2904J6480N003k0512J5357J961q51N566j0728n437J2300j2568j15
2380A89150J2038q273K981J513p592J876n826N639j9851k7616J6819m01j4553
2367A45904K9794J1880j6794l007l032L153N82l330j7021J3677N653J3108n284
2354A75283J0679j009N443q720r50K252p307K802K732K068l580n278n271J1877
2340A81021j165K825n635o611L616P83K281M372J512m291p296M846q495j7573
2326A50190K2388J2941j3778O75P234J5441K1295L908j303M788o255k3843k0155
$$ y = [216137, 215809, 200159, 214920, 221972, 218899, 226740, 229118, 234907, 225130, 219693, 211794, 186367, 185437, 205237, 214316, 200346, 203935, 197683, 196754, 207233, 216751, 194367, 187329, 223042, 235407, 218987, 205598, 182694, 199174, 204177, 183665, 199022, 200983, 200132, 205698, 194970, 189533, 201833, 189265, 189150, 201188, 192915, 195896, 197409, 189817, 191693, 185867, 191506, 171655, 144039, 160858, 160457, 145904, 175698, 187578, 170784, 167777, 164745, 167898, 168480, 165150, 148129, 161806, 167459, 180567, 175283, 185962, 184953, 190396, 181676, 180726, 182978, 175671, 178473, 181205, 183273, 179693, 174415, 169144, 181021, 179856, 182681, 177046, 170435, 174051, 174834, 177115, 181487, 182999, 178708, 171412, 176258, 167763, 150190, 172578, 185519, 171741, 172416, 179650, 195091, 216386, 220294, 218991, 223779, 217524, 193681, 173526]
2313A73526J9851K2994J5491j7305j504R258n976j6419k32J9543Q512o187j2337
2300B09215l236L296R506R203j9518o577J0393j590j3823J7921J3286K4415m849
2287B47642N905r055j569M188m113O371J0153P231m617n1J0078k630Q219L5128
2273C12880O063P49K5196K2628L610o24J1360K8076K2581K7010L2462N341L7081
2260E34413L5326P2465N9779O9122N3514P3258O8275P4071Q4459J15074J09863
2249A349619J70528K20736K84006L03397L37728M08655N16181M94304L55823k1776
2239D419201m69140m67166n50511m89724l91081k58430k12050j44743j33733j04696
2229A197927p7289o2879o0738n4216n4974m8145n6677o3235l6091l7881n2043
$$ y = [173526, 193377, 216371, 231862, 214557, 213053, 222311, 216335, 199916, 199684, 219227, 227739, 221552, 209215, 205979, 209275, 218781, 227984, 208466, 201889, 212282, 210692, 196869, 214790, 228076, 252491, 247642, 253547, 244492, 242923, 247111, 242998, 249369, 259522, 266753, 262136, 262085, 272163, 269533, 277752, 312880, 318943, 319692, 344888, 367516, 371126, 370502, 381862, 409938, 432519, 459529, 491991, 497332, 534413, 569739, 642204, 701983, 771105, 824619, 897877, 966152, 1040223, 1124682, 1239756, 1349619, 1520147, 1740883, 2024889, 2328286, 2666014, 3074669, 3590850, 4085154, 4440977, 4419201, 3950061, 3482895, 2932384, 2442660, 2051579, 1793149, 1581099, 1436356, 1302623, 1197927, 1120638, 1057759, 997021, 942805, 887831, 839686, 783009, 719774, 683683, 645802, 593759]
2218E93759l5495k6484k6961l1645k0514k3716k3208k8153j165O714J772n463
2206C79441j3582k3755k2555k7076j1421k330o55k0377r73k431m534p236j129
2193B41387K337j5197m188o379r25J80K792j8760O132m705j741q368o211J0504
2179A96858p001k574J853o398k578q038j1023K155Q391J4791L016k0633k3238
2166A45581j0687J0649J3088K3479L170r782o859K19r606n366q74K027j0283k0097
2152A24659Q901J0390k455l757m318l245J0982p82j2157k009j2212J809P442L422
2138A26670k1958N386M999J4061j9131j3615J0316M783O673m127K540L275k287
2125A17585o772L10o954m901J062j8209K7773J6151j0190N18j3480k825k140J8223
$$ y = [593759, 558264, 531780, 504819, 473174, 452660, 428944, 405736, 377583, 376418, 383132, 384904, 379441, 365859, 342104, 319549, 292473, 281052, 278722, 278067, 257690, 256717, 254286, 249752, 242516, 241387, 243724, 228527, 224339, 217960, 217035, 217215, 220007, 201247, 207379, 202674, 200933, 192565, 186354, 196858, 189857, 187283, 189136, 182738, 180160, 172122, 161099, 163254, 171645, 186436, 189452, 168819, 145581, 134894, 145543, 158631, 182110, 185280, 175498, 168639, 168858, 159252, 153886, 153012, 155039, 144756, 124659, 133560, 143950, 141495, 137738, 133420, 130175, 141157, 140375, 128218, 126209, 113997, 115806, 123248, 126670, 104712, 110098, 115097, 129158, 110027, 96412, 106728, 111511, 118184, 114057, 116597, 119872, 117585, 110813, 111123, 104169, 99268, 100330, 82121, 109894, 126045, 115855, 116373, 102893, 100068, 97928, 116151]
2111A16151j1897n802Q014j7368j9552J1964Q32j075J1966N143P213p481o278
2098I1830K24J3326m840K944R750n645j6499p172P959Q793j421L868l564j7187
2084H2366P610J8194M445j5200k0749j3656J7441Q926j0317J3132J3066K157l70
2071A07045j6728q752O771p949j3501J9716j3664j462M672M068q210j6628K0707
2058G6085N690J0486k4152j3422K6700l485j4216J377J1229K0008j1040j8635
2046F6625O36J7235L110k0517j0733J155J8432O379k2598r551P35K2588q383J437
2032F6550J4867j5594j650j959O167l703R94j3054K661O601N32j792K269Q919
2018G1808o795j3725J055K7008k2107L091j453l124j1412n132J5490L428Q067
$$ y = [116151, 104254, 98452, 106466, 89098, 69546, 81510, 82342, 81267, 93233, 98376, 105589, 98108, 91830, 92054, 105380, 100540, 103484, 113234, 107589, 91090, 83918, 91877, 100670, 99249, 103117, 99553, 82366, 89976, 108170, 112615, 97415, 76666, 63010, 80451, 89377, 79060, 92192, 105258, 107415, 107045, 90317, 81565, 88336, 80387, 66886, 86602, 72938, 71476, 76148, 80216, 72006, 55378, 76085, 81775, 92261, 68109, 54687, 81387, 77902, 63686, 65063, 76292, 96300, 85260, 66625, 67261, 84496, 87606, 67089, 56356, 57511, 75943, 82322, 59724, 50173, 50908, 73496, 65113, 66550, 81417, 65823, 64173, 62214, 68381, 64678, 65672, 52618, 55279, 61880, 62412, 60620, 62889, 71808, 65013, 51288, 52343, 79351, 57244, 60335, 58882, 55758, 44346, 39214, 54704, 58132, 66199]
2005F6199M687J2790j7802j8640L809J5829j5270k2278J2917O900P607J100j4403
1992D3445k067l478m67J8411O203j4428J8901q959j6450L927N188M821q490n566
1978D0991J4382N816j0093M48m423n344J4071J7480J307k6432M909J2499q47j0470
1964E4294P325q423o184m346N275J837j7332q301J305O714O889J0385j082J150
1950D9506M032j1491m708o511O367q651j0770J8508J1514l399l841j3961r361
1937A7234J9701o894M812J038r581J4134R096k0669q783N185J9272k675k0500
1924B1370J369K844R946J756j5189n283j382Q698J5719j2443p147M21k533J4511
1910C2657K128n027o480O481k444o416K314j535j4838J5744K991K149L78O578
$$ y = [66199, 70886, 83676, 65874, 47234, 51043, 66872, 51602, 29324, 42241, 49141, 56748, 57848, 43445, 41378, 37900, 37433, 55844, 62047, 47619, 66520, 57561, 41111, 45038, 50226, 55047, 46557, 40991, 55373, 61189, 51096, 51544, 47121, 41777, 55848, 73328, 74635, 48203, 53112, 65611, 64764, 54294, 61619, 53196, 47012, 42666, 47941, 49778, 32446, 24145, 25450, 32164, 39053, 49438, 48356, 49506, 53538, 42047, 37339, 30828, 37195, 28544, 17774, 36282, 47796, 44397, 40556, 26595, 17234, 36935, 30041, 34853, 35891, 26310, 40444, 49540, 28871, 20088, 25273, 44545, 41870, 21370, 22739, 25583, 35529, 37285, 22096, 16813, 15431, 24129, 39848, 27405, 20258, 20679, 18146, 32657, 34785, 29758, 23278, 29759, 27315, 20899, 23213, 21678, 6840, 22584, 25575, 27724, 28102, 34680]
1896C4680j941j611p500K676J3987R230j1218j3888P072m634m147M627O464l66
1882C3431K958l348j155M457m949j3790L0O110R833p580J6005L935j0694j5211
1868B0032l73M736p9K271N032j3064k835n608J244K3291l689q024l988j525j7449
1853b8P045L693r325P81J1930P383J8376n22j4064O415R146k752j1526r306J5363
1838C2609j768j3413N882j2913K0355J4600j2182q340j58l331K709j1145j8740
1825e835K1889K273o334k208R310K28j1023P1o33l73K311J8320q189R403r039
1810B0171j1689J4697j0867o540O977M139M524n264q847P17R175j3160n411J3306
1796A1928J0359j5996r956J671k0476J4980K2464J0826k2251o904J1208P549K180
$$ y = [34680, 32739, 31128, 23628, 26304, 40291, 49521, 38303, 24415, 31487, 26853, 22706, 27333, 33797, 33431, 36389, 33041, 31886, 36343, 31394, 17604, 17634, 23744, 33577, 25997, 42002, 45937, 35243, 20032, 19659, 24395, 24316, 26587, 31619, 18555, 15720, 10112, 11356, 34647, 30958, 22934, 18946, 17421, -28, 7017, 10710, 1385, 2166, 14096, 21479, 39855, 39333, 25269, 31684, 40830, 38078, 26552, 17246, 32609, 30841, 17428, 23310, 10397, 30752, 45352, 33170, 24830, 24672, 21341, 24050, 12905, -5835, 16054, 18327, 11993, 9785, 19095, 19323, 8300, 8371, 7738, 7365, 9676, 27996, 19807, 29210, 20171, 8482, 23179, 12312, 5772, 12749, 16888, 21412, 16148, 7301, 8018, 17193, 4033, -1378, 11928, 22287, 6291, -3665, -1994, -22470, -7490, 14974, 25800, 3549, -3355, 7853, 15402, 17582]
1783A7582m179P953k633j2198R995O450R677J397M818J5207k0069j1418m425k992
1769A5165k118k960k800J5977q10k1614M587R696o510q141J246J3448l861l640
1755G665M578j1136P197O112j6656k439N489J807K675P665Q6l492J1903k891p337
1740A1226O24O69j0320L344J5301L858j5704M070l186j3729J2055k205k472n050
1726a519l019J0785q841j0093J3924N734l228J208K4509k560m085k443k306P852
1712B5918j1021O945j3354r869O764p026Q189K854k859o283Q487O566k2616M12
1698f893R549R633p954M052J3074j1897O292p509l986M983P023l826K135P88j0738
1683D726r326k677n90J4168Q950j080n416l500P454j2192J965p369o861l618O692
$$ y = [17582, 13403, 21356, 18723, 6525, 16520, 22970, 32647, 34044, 38862, 54069, 34000, 22582, 18157, 15165, 13047, 10087, 7287, 23264, 22454, 840, 5427, 15123, 8613, 472, 1718, 15166, 11305, 7665, 12243, 1107, 8304, 14416, -2240, -4679, 810, 2617, 5292, 12957, 13043, 9551, 21454, 18563, 11226, 11850, 12519, 2199, 5543, 20844, 24702, 8998, 13068, 9882, -3847, 8208, 6003, 3531, -1519, -4538, 6247, -2594, -12687, 1237, 6971, 3743, 4951, 29460, 26900, 22815, 20372, 18066, 25918, 14897, 21842, 8488, -1381, 5383, -1643, 6546, 9400, 6541, 258, 8745, 15311, -7305, -6893, 2656, 12289, 4335, 8387, 21461, 9564, 15856, 8347, 4361, 9344, 16367, 12541, 14676, 15464, 4726, -4600, -7277, -7867, 6301, 15251, 14171, 8755, 5255, 12709, 517, 2482, -4887, -11748, -15366, -8674]
1668h674J0259Q079J0040N786M67j5798m180Q622R702j2351p380r961o089q970
1654b0448Q541M659M070P312R050m176j0365n320j4750R082M166J4218j4370O724
1640a607J0271j0309R100L519k083m21J224L721j0862Q940j2255K029m462O028
1626B833k1817K0725n160j0011L709O332O904k0949L444p481M134p785n020R931
1612b0211J0578J695P958o918P361j0840J344j2005R200R591j818P510R61k330
1598B076j1683n5j642p049j527Q205J1906q460r845p702J8020M813m012j6726
1584b3681R013J2490j4280K556l741O527K2880O35j373J5j1614j1440P161k513
1570g365o902n801o531p847K7068J5936J1026m862J089M970j9372q979J236J7382
$$ y = [-8674, 1585, 9664, 19704, 25490, 25957, 10159, 5979, 14601, 24303, 11952, 4572, -5389, -11478, -20448, -11907, -7248, -3178, 4134, 13184, 9008, -1357, -6677, -21427, -12345, -8179, 6039, -8331, -1607, 8664, -1645, 7455, 10974, 8891, 8470, 9694, 13415, 2553, 11493, -762, 1267, -3195, 2833, -18984, 1741, -3419, -13430, -9721, -3389, 3515, -17434, -13990, -21471, -17337, -25122, -30142, -20211, -9633, -7938, 20, -6898, 463, -10377, -9033, -21038, -11838, -2247, -4065, 3445, 4406, 2076, -9607, -9662, -11304, -18353, -19880, -11675, 231, -8229, -18074, -25776, -7756, -2943, -6955, -23681, -14668, -2178, -16458, -13902, -17643, -11116, 11764, 12399, 11026, 11041, -573, -12013, -4852, -7365, -14267, -20068, -26599, -34446, -7378, 8558, 19584, 14722, 15811, 20781, 1409, -7570, -6334, 11048]
1556A1048j524N292M898p043q258m852k2835P883N366O249O71k00o471J5744L233
1541I201q222l460J3464R661j304j2068p230k9K963Q705k986j9236J483M413j0186
1526a4831O032K942K521l47j0691J2723N761j1169J097n174L091L46o294k935
1512a6928Q0l087k51o877K121O008O666p753N953o432k223Q610L831j95l459O301
1496g635l738J1432q316J0410l436r740P290j509o904j1422J1842K4337o936j0830
1482e155j1121o90J5526j357M507j0754k691n25J327P994o804J1921j2134p424
1468a7380l766R358n463l153L145m368N631q208J2522J0744n562M60l552q261
1454a7853P656r56j3885J4105q342k5961K0599k184J2035O392j7566M685J5876
$$ y = [11048, 9524, 14816, 19714, 12671, 4413, -439, -23274, -15391, -10025, -3776, -3105, -3305, -9776, 5968, 9201, 979, -2481, 10983, 20644, 19340, 7272, 42, 13, 2976, 11681, 8695, -10541, -9058, -4645, -14831, -8799, -5857, -3336, -3683, -14374, -1651, 4110, -7059, -5962, -11136, -8045, -7699, -13993, -16928, -16848, -19935, -20186, -27063, -24942, -18934, -12268, -20021, -14068, -20500, -22723, -14113, -10282, -10477, -13936, -7635, -11373, 59, -8257, 2153, -1283, -11023, -3733, -5242, -12146, -23568, -11726, 12611, 5675, -5155, -16276, -16966, -1440, -2797, 1710, -9044, -11735, -12260, -10933, -2939, -9743, 2178, -9956, -17380, -21146, -11788, -17251, -20404, -17259, -21627, -15996, -24204, -11682, -938, -6500, -6040, -9592, -17853, -10197, -11153, -25038, -10933, -19275, -45236, -24637, -26821, -14786, -8394, -25960, -21275, -5399]
1441e399J431O575K064j0471p396J1135j4119o016O772J6312j2400k894q556L554
1427a9408P931K711k236Q819J733j0448k342J783o760J6937K1436j1905j8184
1414i933r837j5333K640q982J933M909m07P231R134m293Q475P88M742J3208k199
1399B076j031j2140J2505P33j0944j1241P400j0229n527K3574k461n713R892j4274
1385a7380k132J0907K903l645k725l80p470K649J7579j9032j5432J1249L876j1773
1371c0806K0575M7mo132j2807j2762J8630N137j456j105l455j4503J4739j3488
1357c7390K889J7059P836N38K346m596p426K592l336n300J8482n642o772j017
1343a9737m812k173J0301J039j928M045l654Q115r336j8857M566J3238o47n311
$$ y = [-5399, -3968, 2607, 4671, -5800, -13196, -2061, -16180, -22196, -15424, 888, -11512, -14406, -22962, -19408, -11477, -8766, -11002, -2183, -450, -10898, -13240, -11457, -18217, -1280, 20156, 8251, -9933, -19770, -35103, -32463, -41445, -39512, -34603, -35010, -27779, -18645, -22938, -14463, -13675, -8933, 4275, 2076, 1045, -11095, 1410, 2143, -8801, -20042, -12642, -22871, -28398, -4824, -7285, -12998, -3106, -17380, -19512, -8605, -5702, -9347, -12072, -12452, -19922, -17273, 306, -18726, -34158, -22909, -19033, -30806, -10231, -10184, -10188, -16320, -29127, -41889, -23259, -18122, -19578, -20683, -24138, -38641, -23902, -37390, -34501, -17442, -9606, -9068, -6722, -11318, -18744, -16152, -19488, -24788, -6306, -11948, -18720, -19737, -24549, -26722, -16421, -15382, -17310, -13265, -16919, -8804, -18140, -36997, -32431, -19193, -19840, -25151]
1329b5151p50K9230k2273o645K0271j0474k725N437M092J1085Q842k2114q24K144
1315i855j1209J5432K479R120p195P645j416j4811o310n652L129J1273K182j8266
1301b3454J036j4727P382m46l900K1370n145M500J867L120R29j1133n329J7144
1287f786j1637j0729O549P324j913Q96j1459j434N699J3014l320R789k98K148
1273b157n548L283o46J443J0359l086k4670j6700K0415J5731q272n103o747L202
1259a8496k500p203Q014Q642q754m273K5097n048R03j9928j0304J6290j1370Q529
1245b0401J5798J1553j2270J787o662P831Q358q124Q36j7450Q06l748j5690P084
1231c0292K1938o566j704M229k5290J5384N350j4387j325R410K3090K296p421
$$ y = [-25151, -25901, 3329, -18944, -25589, -5318, -15792, -18517, -13080, -8988, 2097, 10939, -11175, -11999, -9855, -21064, -5632, -3153, 5967, -1228, 6417, 5001, -9810, -16120, -21772, -18643, -7370, -5188, -23454, -22418, -37145, -29763, -30209, -34109, -12739, -17884, -13384, -11517, -8397, -7468, -18601, -23930, -6786, -18423, -29152, -22603, -15279, -17192, -16296, -27755, -29189, -23490, -10476, -13796, -4007, -4305, -2157, -7705, -4422, -5068, -3625, 6734, 3648, -21022, -37722, -17307, -1576, -9848, -14951, -21698, -18496, -20996, -28199, -20185, -11543, -20297, -24570, 527, -4521, -3618, -23546, -33850, -17560, -28930, -20401, -4603, 6950, -5320, -3533, -10195, -2364, 5994, -2130, -1294, -18744, -17938, -21686, -37376, -30292, -8354, -14920, -16624, -12395, -37685, -22301, -16951, -31338, -32663, -23253, -163, 2133, -5288]
1218e288J848m306m358j2949M016j3457j4043K5490L019O026R862Q140j0234o779
1204a3013j0419p528k008N298Q223p478K1862O807j8534l236O267N942N246m179
1190f750m363j878K20J78j9317J0631O2l322k633K1403J383K598r072P365o639
1175a0134l098N167q248m150P95k061O000k217o889J594K0081k1370j1203J2175
1161b3558p39K781J1890m885n58M456j8005P937N788O316j529r739M458j8599
1147c3986r39J3848N741O280J430L980j2464J8022r774j766O230l916Q01J2069
1133E556j261m330R321M724k0246r877j1532R394K545q134N490J239O855j6999
1119b7255N358j423j824J3460k215k3427n637Q736R760N545r816n459P578J586
$$ y = [-5288, -3440, -7746, -12104, -25053, -21037, -34494, -48537, -23047, -20028, -14002, -4140, 4000, -6234, -13013, -23432, -30960, -32968, -27670, -19447, -26925, -5063, 1744, -16790, -20026, -13759, -7817, -2571, -6750, -11113, -12991, -12771, -12593, -31910, -21279, -21217, -24539, -27172, -5769, -4386, -1788, -10860, -3495, -10134, -13232, -8065, -16313, -20463, -19668, -21729, -15729, -17946, -24835, -23241, -3160, -24530, -35733, -23558, -24297, -21516, -9626, -14511, -15069, -10613, -28618, -20681, -14893, -8577, -10106, -19845, -15387, -33986, -34925, -21077, -15336, -9056, -7626, -3646, -16110, 1912, -7862, -9628, -3398, -7314, -6513, 5556, 4295, -35, 9286, 14010, -6236, -16113, -27645, -18251, -15706, -23840, -18350, -17111, -10256, -27255, -21897, -23320, -25144, -11684, -13899, -37326, -42963, -34227, -24467, -18922, -28738, -34197, -26619, -25033]
1105b5033O529K788n821j4078M512O062J927J0333L821j0928J2739m80k7803L778
1091c1654O896K0661K19j7851j2140P614j689p109L982J1392J0655j3859m881
1078b7764O307j6682o97J301N289k692m121P609N314k639J5685N448j4478Q215
1064a3905k124j169j1071r5K0491N510k524n620N171L779n993q11J1113j4540
1050a1788j1823P934q955l640K0256J6086J3201p145k0240m293j3445o309M856
1037b5305M959Q760j4590J0813N9L675J6110j6635j432M838j288p080j1434j4730
1023d3280N883J6710M585J1251j704o844n062o980n086R555L397j3324j7434K3122
1009b5211M352o924j6057K5387J0645r749O65J770M839l078r05k668K048L966
$$ y = [-25033, -18504, -15716, -21537, -35615, -31103, -25041, -23114, -12781, -8960, -19888, -7149, -7629, -35432, -31654, -24758, -4097, -3878, -21729, -33869, -26255, -27944, -35053, -31071, -19679, -9024, -22883, -27764, -21457, -38139, -38836, -37535, -32246, -34938, -39059, -31450, -26136, -28775, -13090, -7642, -22120, -13905, -16029, -17198, -28269, -28364, -7873, -2363, -4887, -10507, -5336, -1557, -7550, -8361, 2752, -11788, -23611, -15677, -24632, -28272, -8016, 8070, 21271, 14126, -6114, -10407, -23852, -30161, -25305, -20346, -11586, -26176, -15363, -15304, -11629, 4481, -12154, -13586, -8748, -10036, -17116, -28550, -43280, -37397, -20687, -16102, -4851, -6555, -13399, -18461, -25441, -30527, -20972, -17575, -30899, -48333, -25211, -20859, -27783, -43840, -18453, -7808, -17557, -16892, -15122, -10283, -13361, -14266, -16934, -14886, -10920]
995a0920j585k166Q814p116k0489O389K2466n209j2566q039J88J2765J6627j5437
981a6278R611O355k66j5572q074J7159N755m839r499j0306o927P527K2195j1461
967a4620o072R90J2561L446L467J0943l895m008r707l200k861J480l143N30J2346
952a743q487J212L449N164k3229j1067J9283J8510j3735k2798o216O214J0991
939b2452J1483K127P212j0212r182j67n09Q932J3485j3727Q326M453j7723n836
925b3790j005J298J1531K120j0145J3654l946j3577R405q135J2342p258J546P166
911h794j7540l639J0433Q236m138J979n978P356p454K157N469L721j5028M424
897a8796o008J0979Q020m045K517j1642K339l052j867O429p288J0780O792p181
$$ y = [-10920, -12505, -14671, -5857, -12973, -33462, -27073, -4607, -9816, -22382, -30421, -30233, -17468, -841, -16278, -6667, -312, -578, -16150, -24224, -7065, -1310, -6149, -15648, -25954, -32881, -25354, -3159, -14620, -20692, -19702, -7141, -3695, -228, 10715, 6820, 2812, -6895, -10095, -12956, -11476, -14619, -14089, -1743, -10230, -9018, -5569, -405, -23634, -34701, -15418, 3092, -10643, -33441, -39657, -33443, -22452, -10969, -8842, -1630, -11842, -21024, -21191, -21700, -12768, 717, -13010, -4684, -231, -17954, -23790, -24795, -23497, -11966, -9846, -19991, -6337, -10283, -23860, -14455, -22590, -10248, -17506, -15960, -8794, -26334, -29973, -19540, -11304, -15442, -13463, -19441, -12085, -19539, -17382, -11913, -8192, -23220, -18796, -24804, -13825, -5805, -9850, -7333, -18975, -16636, -19688, -21555, -15126, -22414, -11634, -4842, -12023]
883a2023o646J6789n424p868Q856R690J475l885O037L388n862j1796o156r881
869b3306R487K352Q093L694k0676k454R118J1187o803j953o497P221J2603J391
855C457r512r225Q05L511o900N123j1846l173L084K753J2182q441J2350J537m010
840h305j0135K8430k266j7340j4444J647J0610j0056M226K764m67J22J1195J923
826b096O232j5310J379k169L062L47m677L709j884k345j5292J1289l185o295J3616
811a3619N5o310J0363j620p8R597o951k217n252p484R165J0666j5348J3655K6756
796B1378l086k8640K763O327J461k017l670o800l768J7243K939q835n64J634L23
781c312j2870j2040K7448N76j8675O019m755n290P95K96J0461J547k456q377m12
$$ y = [-12023, -18669, -1880, -7304, -15172, -6316, 3374, 4849, 964, 7001, 10389, 4527, -7269, -13425, -23306, -13819, -11467, -3374, 320, -20356, -22810, -13692, -2505, -9308, -11261, -17758, -10537, 2066, 3457, -6055, -15280, -14475, -10964, -17864, -12741, -24587, -27760, -24676, -21923, -9741, -18182, -5832, -4295, -8305, -18440, 9990, 7724, -9616, -24060, -22413, -11803, -21859, -17633, -14869, -15336, -15214, -4019, -2096, 4136, -11174, -9795, -11964, -8902, -8555, -13232, -9523, -11407, -13752, -29044, -17755, -20940, -27235, -13619, -13564, -19874, -9511, -11131, -11209, -1612, -8563, -10780, -16032, -23516, -14351, -3685, -19033, -5378, 21378, 18292, -10348, -7585, -1258, 203, -1814, -5484, -12284, -16052, 1191, 4130, -4705, -5269, -3635, -3312, -16182, -28222, -774, -198, -18873, -12854, -17609, -22899, -22104, -21808, -11347, -9800, -12256, -20633, -21045]
766b1045J2531Q611j1891j478j1742J3814k681k926J6968k3233K873Q101M633
753g465J427p62j990l268m282M944O407p387o739K2278p206k4735N739M190J0397
738h452K569J41k515j95J7236j0947M529q3k997M629q426N302q981q118L90M161
722a1757r582M69j406J2468J08L518Q621j4485j0902J3245J4341r633o634J3510
708A881J5787r871j4371o870k632P282j058Q529j7460O852O50K0K426L579q687
693a3943l970J7802M533n362R515o766q476R547n742k064Q572j0035j6866J2999
679a0256J6171j9329p694O526J253M659P466N80M347m812j3573p435J148J7102
665c847K149p179o423J7872p213J0142R570j6456l183j3887M12J0823q007j072
$$ y = [-21045, -8514, 97, -11794, -13272, -25014, -11200, -13881, -16807, 161, -23072, -20199, -12098, -7465, -6038, -6800, -8790, -12058, -16340, -11396, -4989, -12376, -19115, 3163, -4043, -28778, -23039, -18849, -8452, -5883, -5742, -8257, -8452, 8784, -2163, 2366, 2283, -714, 3915, -4511, 791, -8190, -16308, -15918, -11757, -21339, -20870, -22276, -9808, -9700, -6182, 2439, -12046, -22948, -9703, 4638, -4995, -11629, 1881, 17668, 7797, -6574, -13444, -16076, -8794, -9852, -1323, -18783, -11931, -11281, -11261, -8835, -5256, -13943, -17913, -111, 4422, -940, 8575, 1809, -6667, 2880, -2862, -4926, 3646, -6389, -23255, -10256, 5915, -13414, -21108, -14582, -13329, -8670, -1204, -624, 3723, -1089, -14662, -22097, -20949, -3847, -1698, -8877, -15300, 2572, -4641, 5501, 15071, -1385, -4568, -18455, -18043, -7220, -15227, -16299]
651a6299J2904l957o166R400o782Q639m923o261M233J1198O546j8336j6649J1594
637a4859O197q799n171N854J0790N774o718q812R879J0283Q381o664K702j3536
623d699j0363J6436k2593k748O171K450J0757J3285j0269Q222M567j0397q618
610g799J1449k2192P320Q118j7733N583M632J1120M045r51J4071N567j8344j0582
596e696Q819J1514j5120o05J8117m980r534Q790j0232Q473m845K085q849j587
582c650qm219R31m834P206J6206P017m501K40j4840p157L168k449l812J1318J6533
566A7149n292j1647O790j3404J0090J362O528L566n958K282K0831J771j7644k4165
552g741J1600J4978j7544L580n162Q703K043j1148Q197N794l184j3689Q249N709
$$ y = [-16299, -3395, -7352, -13518, -4118, -10900, -2261, -7184, -13445, -9212, 1986, 8532, -9804, -26453, -14859, -8662, -17461, -22632, -16778, -5988, -214, -6932, -15744, -5865, 4418, 12799, 6135, 8837, -4699, -15062, 1374, -21219, -23967, -17796, -15346, -4589, 8696, -1573, 6649, 11216, 819, -7799, 3650, -18542, -11222, -3104, -20837, -15254, -10622, 498, 4543, 3592, 17663, 23230, 4886, -5696, 3123, 14637, -483, -1088, 17029, 12049, 2515, 11305, 1073, 9546, 4701, 6786, -2063, -3650, -3658, -7877, -6946, -11780, -4574, 11632, 18649, 14148, 14388, -452, -7609, -4441, -6890, -10702, 616, 17149, 11857, 210, 7000, -6404, 3686, 5048, 11576, 15142, 9184, 11466, 32297, 34068, 16424, -7741, 3859, 18837, 1293, 4873, -289, 8414, 10457, -691, 7506, 13300, 10116, -3573, 4676, 10385]
538A0385O94m75K740P517J122m17n078K742Q710p770m032j3669j5185P674m119
523i161N133q238J7376l817j358Q420o875m329K1160m910o818l200P178n994O971
508A1538l205L753Q48m786k1819l402l075J6971l829J220O162m226P870J629R601
493A5250m293M488R264j1686j2485P260O275j4176m575J0085r50m029M706P915
479A3049p776j1852l837J6827K930P207l095j0119J8072j770o300M606K885o22
465B0205k3793L967M734J0259J4121q351j4632m308J396J1538p674l411J0987
452A5038R741k2032Pp438l556J7744J924q799O23j366J7525k826j185j753J118
437A4765L053q254l511K179n696l311k632n070J0562J1360p249j4635J1353J0172
$$ y = [10385, 11079, 10604, 13344, 20861, 21983, 21566, 16488, 19230, 27940, 20170, 16138, 2469, -12716, -5042, -9161, -4028, -12266, 5110, 1293, -65, 8355, 1480, -2849, 18311, 13401, 6583, 3383, 10561, 4567, 11538, 8333, 12086, 12934, 8148, -13671, -17073, -20148, -3177, -7006, -5786, 376, -3850, 4020, 5649, 15250, 10957, 15445, 24709, 13023, 538, 7798, 14073, -103, -4678, 5407, 4457, 428, 5134, 13049, 5273, -6579, -10416, 6411, 9341, 16548, 13453, 3334, 21406, 19636, 13336, 17942, 20827, 20205, -3588, 379, 5113, 15372, 29493, 21142, 6510, 2202, 3598, 15136, 7462, 4051, 15038, 24779, 2747, 2754, -4684, -8240, 9504, 11428, 2629, 3252, 1886, 19411, 16585, 15400, 13647, 14765, 17818, 9564, 6053, 8232, 2536, -775, -3407, -8477, 2085, 13445, 6196, -8439, 2914, 13086]
423A3086Q086p04M867m975j7711q836m734k521J361J2578M0P166N497K140r911
408E429j3870R199j8043J4601K6140j652N912J200M088j0418j1055N77o779n750
394d21j1985L983J5197j820J79J461Q902J195O451J7050j7904j2643j1623J0501
380H523J0051o53p062o230J0423q527k439J0735n863j4272k41L143J2929n895
366D622j130K3013l937n775N8k593R440Q52r28q100r541q583J3512O418J9R559
350B6906P08j141j4546J426n434N149M196K146P145p515k3658k43J7319N756j8157
335E7q141R679P754j5677J0769K4546K153j2774j3932L664l899J3406J671J191
321B0467p686k187K273o042J7079o742l856K368r703r180R790Q615l185J174n151
$$ y = [13086, 21172, 20468, 25335, 20360, 2649, -6187, -10921, -13442, -12081, 497, 537, 7703, 13200, 15340, 5429, -8441, 758, -17285, -2684, 23456, 21804, 27716, 28916, 33004, 22586, 11531, 12108, 5329, -421, -12406, -8423, 6774, 4954, 5133, 6594, 15496, 16691, 23142, 40192, 22288, 9645, -1978, 8523, 18574, 17921, 10859, 4629, 15052, 6525, 4086, 14821, 8958, -5314, -5555, -2412, 10517, 4622, 3492, 26505, 22568, 16793, 16851, 14258, 23698, 24550, 23622, 15522, 5981, -2602, 10910, 17328, 17347, 26906, 27614, 26473, 11927, 13353, 7919, 13068, 17264, 19410, 26555, 19040, -4618, -4861, 12458, 18214, 57, -8084, 1595, 9349, -6328, 4441, 28987, 31140, 18366, 4434, 8098, 4199, 17605, 19276, 20467, 12781, 10594, 12867, 6825, 23904, 17162, 13306, 15674, 5971, -3209, 6581, 15196, 12011, 13185, 8034]
306H034k655Q795l498k3347J2140K5044k09j3307R24L80O39J1861O749o595l033
291B1922o230j215M097k771P418n124l792J2935Q159M966r652J0016m964l260
277C2505q598r353L955K508j0546j8649J4303K5242J4272q931l02j2993j0505
264A2908P770m823L99p82J8624r213j1473J0250o13R952L864m781j1614q613j4297
249b442J2515K3110N12j1599P291l579m338J9668m78q552J0882j0398o022K047
235B8617L556p58k0093O411P841Q20m013j2204J2609O388J075p179M762K259M331
220C4422j591j016n387L12J2576K008k079j0190k267k770O038j1004r536M134
206A3650N786j555k358R953M745k654N706O514r256p409J0243l676k953k0199
$$ y = [8034, 5379, 14174, 10676, -12671, -531, 24513, 24304, 10997, 11921, 12301, 12940, 24801, 31550, 24955, 21922, 15692, 14477, 18574, 15803, 23221, 18097, 14305, 27240, 35399, 40365, 30713, 40729, 35765, 32505, 23907, 14554, 18509, 21017, 10471, -8178, 6125, 31367, 45639, 36708, 36406, 23413, 12908, 20678, 15855, 16254, 15472, 34096, 24883, 13410, 23660, 23047, 32999, 36863, 32082, 20468, 11855, -2442, 10073, 33183, 33695, 22096, 29387, 25808, 21470, 41138, 40660, 32108, 42990, 32592, 26570, 28617, 32173, 31415, 11322, 17733, 25574, 26394, 22381, 10177, 22786, 29174, 30249, 23070, 27832, 30091, 34422, 32831, 31815, 26428, 26740, 39316, 41324, 39245, 29055, 26788, 24018, 30056, 19052, 9516, 13650, 19436, 17881, 15523, 25476, 30221, 27567, 33273, 39787, 30531, 23122, 33365, 29689, 26736, 6537]
192F537k0057M764M806Q183J5394k647j254O590k83N014p553q529J887J0468p828
177A5492J0196J7176q176R975k1552j020J7683j185K22j0073j842j018k965m219
163A8694R435j3981J854J8189k639j4907l340n154l89r460p93n452N020J4820
149A1897n170m805J0026P462n439k424K830l317k3501J3350Q660l329M686j424
135I502j2664M499N899N472m507Q836r35m828k486j2848K764J2196J589p347k674
120B468J574q328R746J1298k977j4543R189o897O761J070j767J7685k528j7928
106D823q677Q14J0465o75o123p10O378M059o124L719J2095K915l33O4j7201L501
90H990L632l73j3283R28O030q278L954Q930o631k584o230Q442o756q29J0371p890
$$ y = [6537, -13520, -8756, -3950, 4233, 19627, 16980, 15726, 22316, 22033, 27047, 19494, 10965, 12852, 23320, 15492, 25688, 42864, 34688, 44663, 23111, 22091, 39774, 38589, 38811, 28738, 26896, 25878, 22913, 18694, 28129, 14148, 16002, 34191, 31552, 16645, 13305, 8151, 7762, -1698, -2491, -7943, -2923, 11897, 6727, 1922, 11948, 19410, 13971, 11547, 14377, 11060, -12441, 909, 9569, 6240, 10926, 9502, -3162, 1337, 7236, 12708, 8201, 17037, 16102, 11274, 8788, -4060, -1296, 10900, 12489, 5142, 2468, 4042, -4286, 5460, 16758, 13781, -762, 8427, 1530, 8291, 9361, 7594, 25279, 22751, 4823, -3854, -3040, 7425, 6750, 627, -83, 6295, 10354, 4230, 7949, 20044, 22959, 22626, 22690, 5489, 8990, 12622, 12249, -1034, -106, 5924, -2354, 1600, 10530, 3899, 1315, -4915, 3527, -3229, -4058, 6313, -1577]
74a577j2322R071r32O166j930j093n318j084k925r58r27l144k030J3050M520m398
58e831Q049j900o764l111q454m874J0257p592Q749J435P91n350m253J811M859
43a2178o715j849J0174j906J807L078J1279j3598r537p178J066R700J1783p444
29a1518o693l607j0784J3535K742q885K690o597M612Q325j0853j1092k899M843
15c6181k61K370k541o285r121P866R323j1619r458J5540N300l702j1702O219k995
0d7247
$$ y = [-1577, -13899, -4828, -5760, 406, -1524, -2617, -7935, -9019, -11944, -12902, -13829, -16973, -19003, -5953, -1433, -5831, 2218, 318, -6446, -9557, -18011, -22885, -12628, -20220, -11471, -10036, -9245, -14595, -18848, -17037, -12178, -18893, -20742, -10568, -12474, -10667, -7589, 3690, -9908, -19445, -26623, -25557, -15857, -4074, -11518, -18211, -21818, -32602, -19067, -16325, -25210, -22520, -29117, -24505, -16180, -27033, -38125, -41024, -36181, -36442, -34072, -36613, -42898, -52019, -44153, -34830, -46449, -55907, -40367, -35067, -38769, -50471, -44252, -47247]
$$ Imaginary data points
##PAGE= N=2
##DATA TABLE= (X++(I..I)), XYDATA
16383a395869J6316J3920K1611K107J6461J3007J4516K6166J3897R941J7332J1168
16371a219427J7423J1121K1745K3393J8851J3866O066J9506J2278J8637J7835
16360a038706J8677J7489O300J6727K3524K2362J5545J0658K0007J0578L784K857
16348h70198K2896M912K3343J7110J3569K1341M870J6719L1169O861J4306K943
16336f90159J4471K7242M212K0278J6163J6211j229K0826K4988J7930J6050J4185
16324d98832J2802N224J4410J1820K0971J8493Q460J974J8548J5893J1343J8665
16312c40229J0347O378J3754J3898K5021K1100q634J4530K1590J4678N340K198
16300b00029J8914O033O708K3993K0912Q246Q295K4681Q796N123O463L1816J2178
$$ y = [-1395869, -1379553, -1365633, -1344022, -1341915, -1325454, -1312447, -1297931, -1271765, -1257868, -1247927, -1230595, -1219427, -1202004, -1190883, -1169138, -1145745, -1126894, -1113028, -1106962, -1087456, -1075178, -1056541, -1038706, -1020029, -1002540, -996240, -979513, -955989, -933627, -918082, -907424, -887417, -876839, -873055, -870198, -847302, -842390, -819047, -801937, -788368, -767027, -762157, -745438, -714269, -707408, -693102, -690159, -675688, -648446, -644234, -623956, -607793, -591582, -592811, -571985, -546997, -529067, -513017, -498832, -486030, -480806, -466396, -454576, -433605, -415112, -406652, -404678, -386130, -370237, -358894, -340229, -329882, -323504, -309750, -295852, -270831, -249731, -258365, -243835, -222245, -207567, -202227, -200029, -181115, -175082, -168374, -144381, -123469, -115223, -106928, -82247, -73451, -68328, -61865, -30049, -17871]
16287a7871L633K2945J3477l661J3941K1960n130J33M0885J2943J0697j2560J2275
16274A13667K5479j3056J5489R424M984K3545J7677r413N852R636J2088j477J9069
16261B32964J5554N420K3816J2774J133N872O945J1202j666J3299Q307R324K4108
16248C69052J4622R22P510O856J9311J0156L543J1352R582J0150n353M822n49
16235D61976J9834Q868P451J4991j1509n429J6337K2798o869K0567J1430R039
16223E69484J9263j6114O724N548P602J3711J0896k831K184J9620J3664j3347
16211F36404p568J5192J9783J4975K799l302Q569J3527J3007r401O731K8125o153
16198G32688o906M208R739o438J033K2956J1825K378k6806Q968N768M279J3692
$$ y = [-17871, -14238, 8707, 22184, 18523, 32464, 54424, 49294, 49427, 90312, 103255, 113952, 101392, 113667, 139146, 126090, 141579, 151003, 155987, 179532, 197209, 187796, 193648, 203284, 215372, 213895, 232964, 248518, 253938, 277754, 290528, 291661, 297533, 304478, 315680, 314014, 327313, 335620, 344944, 369052, 383674, 384596, 392106, 398962, 418273, 428429, 431972, 443324, 452906, 463056, 457703, 462525, 461976, 481810, 490678, 498129, 513120, 501611, 496182, 512519, 535317, 528448, 549015, 560445, 569484, 588747, 572633, 579357, 584905, 592507, 606218, 617114, 614283, 616467, 636087, 649751, 636404, 628836, 644028, 663811, 678786, 681585, 678283, 686852, 700379, 713386, 703985, 710716, 738841, 732688, 725782, 729990, 739729, 733291, 734324, 757280, 769105, 771483, 744677, 753645, 759413, 763692, 777384]
16185G77384J6036Q752Q923J6022k2472O622R506J2665n098j6260J5450J8178
16173H45708J0032J3698q107J410n195J0305P438K2369J0671j4039n946n021n429
16160H77894J4567J5878l839j0268N431K098J9255L602j7122J3443l878Q469J529
16147I27059m318J8525M101N430n030j5660O519R730n149p954L840O47J6616K1067
16133I75423k0979J3814J3885j8251J0361n91J51j1316K2009J1413k0428q354
16121I67137J3808J85o038O677r547K7037J3198j0048M860o085k2563L165O144
16108I87930J0899p043O832J8352J5371M922j8572l897j2403Q554Q194R589M271
16095A032999l943k2744N632J6888K206K509l923q421J5729R81L253R96m366o299
$$ y = [777384, 793420, 802172, 811095, 827117, 804645, 811267, 820773, 833438, 828340, 812080, 827530, 845708, 855740, 869438, 861331, 862741, 857546, 867851, 875289, 897658, 908329, 894290, 888344, 883323, 877894, 892461, 908339, 904500, 894232, 899663, 901761, 921016, 924618, 907496, 920939, 917061, 925530, 927059, 922741, 941266, 945367, 950797, 945767, 930107, 936626, 946356, 941207, 933253, 937093, 937740, 954356, 975423, 954444, 968258, 982143, 963892, 974253, 973662, 973813, 962497, 984506, 995919, 975491, 967137, 980945, 981130, 975092, 981769, 972222, 999259, 1012457, 1002409, 1007269, 1001184, 978621, 981786, 987930, 998829, 991786, 998618, 1016970, 1032341, 1037263, 1018691, 1014794, 1002391, 1010945, 1019139, 1028728, 1032999, 1029056, 1006312, 1011944, 1028832, 1031038, 1033547, 1029624, 1021203, 1036932, 1037913, 1041166, 1042162, 1037796, 1031497]
16081A031497P669M923q349Q91J5774J4182m734j0820n450j3693J2269J3694j4050
16068A043803n01P005j1853J070M783K156k0590q946J8756N809N181O406J9039
16055A072118k1109q667R89N846J3160j2538P300m139r060j900q743J5624M815
16042A053696M35Q053p589l09l248o479J2003o543N512J4380J0022p55p419j3001
16028A058758j7743M086L04Q277j3725K3119Q122r416R498m846n344L363J257
16015A065710j3995M597P836N447l31m579m24J132n57J8654j4104J760J829J217
16001A074192j9212m953K2150k0919j1636J541j4708j789J1093J4002K612J392
15989A053765N487Q327j0621j8438l175J4686N212K0493J1921p456K614m610p158
$$ y = [1031497, 1039166, 1044089, 1035740, 1036631, 1052405, 1066587, 1061853, 1051033, 1045583, 1031890, 1044159, 1057853, 1043803, 1043302, 1050307, 1038454, 1039524, 1044307, 1046463, 1025873, 1016927, 1035683, 1041492, 1046673, 1053079, 1072118, 1051009, 1042342, 1043331, 1049177, 1062337, 1049799, 1057099, 1052960, 1043900, 1042000, 1033257, 1048881, 1053696, 1054131, 1062184, 1054595, 1054286, 1051038, 1044559, 1056562, 1050019, 1055531, 1069911, 1079933, 1079178, 1071759, 1058758, 1041015, 1045101, 1045405, 1053682, 1039957, 1063076, 1071198, 1061782, 1071280, 1066434, 1061090, 1064453, 1065710, 1051715, 1056312, 1064148, 1069595, 1069264, 1064685, 1064261, 1065393, 1064836, 1083490, 1069386, 1071146, 1072975, 1074192, 1054980, 1050027, 1072177, 1051258, 1039622, 1041163, 1026455, 1024666, 1035759, 1049761, 1052373, 1053765, 1059252, 1067579, 1056958, 1038520, 1035345, 1050031, 1055243, 1075736, 1087657, 1080201, 1082815, 1078205, 1071047]
15976A071047j250q841m946K196R553r017K468Q756n880q910R26J4332j5688m73
15962A054273K6080J9629j7849j4731k287k1066J1125J1625M906L1360j2400j0417
15950A080248p51j8828R087P631j0729J0869J498j527n702K935M980j6341J5341
15937A078711L042k0312Q51J1222j2446N680q56J0201J3304k5252j2905L3236
15925A084476K205j1974L125j7651M00n732P055J3558n86j3922n88R278M518q294
15911A065868O00j4382J913J0956J491k209j8795K3849R830r845j1132P188K3529
15898A088861k219k338j566L409P563j0275M834k0941m50j0K125J2505K88J1846
15884A093632r642j046l147J2912J871j1769j1143J416k220R796l763p272l559
$$ y = [1071047, 1069797, 1060956, 1056010, 1058206, 1067759, 1058742, 1061210, 1069966, 1064086, 1055176, 1056102, 1070434, 1054746, 1054273, 1080353, 1099982, 1082133, 1067402, 1065115, 1044049, 1055174, 1066799, 1071705, 1103065, 1090665, 1080248, 1079497, 1060669, 1069756, 1077387, 1066658, 1077527, 1079025, 1077498, 1071796, 1074731, 1079711, 1063370, 1078711, 1081753, 1061441, 1062292, 1073514, 1061068, 1066748, 1065892, 1076093, 1089397, 1064145, 1051240, 1084476, 1086681, 1074707, 1077832, 1060181, 1060581, 1054849, 1061904, 1075462, 1074876, 1060954, 1060366, 1069644, 1074162, 1065868, 1066468, 1052086, 1053999, 1064955, 1066446, 1064237, 1045442, 1069291, 1079121, 1069276, 1058144, 1065332, 1088861, 1086642, 1084304, 1082738, 1086147, 1093710, 1083435, 1088269, 1067328, 1066878, 1066868, 1068993, 1081498, 1081786, 1093632, 1083990, 1082944, 1079797, 1092709, 1094580, 1082811, 1071668, 1073084, 1070864, 1080660, 1076897, 1069625, 1066066]
15871A066066m23M733j599j064R933Q95J597O74m630l433P730o065m456n355K4846
15856A089449o223o112r8j0060j422j653O035m96k462J0180j1496l433k304p229
15842A052676K0195J988p339k114j330O8L515Q810L504j5250R205K369r592J9825
15828A086530j2955K110J6184j1600k679j2264N100m794J4395m789J2137l464
15816A083911J7673J196j6020L061j2993o92R79J773J482j19R371M130J13o602
15802A087263j7633N160J1255l785M07J4267k8095j6379J9044K005J4809M369
15790A092687j6104m721l637j438L180J1380p30k581k280N877M625k194j0142
15777A073922J0844L308P523k364K597O023j0079j946o851J1502m839q419m26
$$ y = [1066066, 1065643, 1070376, 1068777, 1067713, 1077646, 1078541, 1080138, 1080812, 1076182, 1072749, 1080479, 1074414, 1069958, 1064603, 1089449, 1083226, 1077114, 1077016, 1066956, 1065534, 1063881, 1069916, 1069420, 1066958, 1077138, 1065642, 1062209, 1059905, 1052676, 1072871, 1074859, 1067520, 1065406, 1064076, 1064144, 1067659, 1076469, 1079973, 1064723, 1073928, 1076297, 1066705, 1086530, 1073575, 1075685, 1091869, 1080269, 1077590, 1065326, 1070426, 1065632, 1080027, 1075238, 1087375, 1083911, 1101584, 1102780, 1086760, 1089821, 1076828, 1076136, 1077115, 1078888, 1080370, 1080251, 1089622, 1093752, 1093865, 1087263, 1069630, 1074790, 1086045, 1082260, 1082667, 1096934, 1068839, 1052460, 1071504, 1073509, 1088318, 1092687, 1076583, 1071862, 1068225, 1066787, 1069967, 1081347, 1080617, 1078036, 1075756, 1081633, 1086258, 1084064, 1073922, 1084766, 1088074, 1095597, 1093233, 1095830, 1101853, 1091774, 1089828, 1082977, 1094479, 1089640, 1081221, 1080795]
15764A080795q282K0930J4514k3014R028l259j6490Q039j422j312J1379j0241
15752A080665O077j0953p824q642K8968o955q13Q274M741o682o239l195p643J1864
15738A081643m907o562J6466J0386n82n83k4411m13P338n08j210m443J793J5027
15724A089034K47L548J9112k1775j276J7448k1635j4323M652J5532P581L93n430
15711A093108P551j5247J005N281R994J1702N05p670q260j36j0694P109j157j930
15697A091161p969n221j058p941P99R713N707M115p835L729J3869p813M582J7543
$$ y = [1080795, 1072513, 1093443, 1107957, 1084943, 1093971, 1090712, 1074222, 1082261, 1080839, 1079527, 1090906, 1080665, 1086742, 1075789, 1067965, 1059323, 1088291, 1081336, 1080523, 1088797, 1093538, 1086856, 1080617, 1077422, 1069779, 1081643, 1076736, 1070174, 1086640, 1097026, 1096444, 1095861, 1071450, 1071037, 1078375, 1077867, 1076657, 1072214, 1074007, 1089034, 1089281, 1092829, 1111941, 1090166, 1088890, 1106338, 1084703, 1070380, 1075032, 1090564, 1098145, 1098538, 1093108, 1100659, 1085412, 1086417, 1091698, 1101692, 1113394, 1113899, 1106229, 1097969, 1097833, 1087139, 1094248, 1093091, 1091161, 1083192, 1077971, 1076913, 1068972, 1069771, 1079484, 1085191, 1089306, 1081471, 1085200, 1099069, 1091256, 1095838, 1113381]
$$ [...]
##END NTUPLES=NMR SPECTRUM
##END=
