##TITLE=1H_DE-80H_X3
 200.13MHz, d2o
 8 sc
 
 19ns.26.2.2025
##JCAMPDX= 6.0         $$ Bruker NMR JCAMP-DX V2.0
##DATA TYPE= NMR SPECTRUM
##DATA CLASS= NTUPLES
##ORIGIN= UXNMR, Bruker Analytische Messtechnik GmbH
##OWNER= pz
$$ XWIN-NMR		Version 3.5
$$ Fri Aug  1 10:53:30 2025 Russian Standard Time (UT+4h)  Yarkov@DPX200
##.OBSERVE FREQUENCY= 200.1313
##.OBSERVE NUCLEUS= ^1H
##.ACQUISITION MODE= SIMULTANEOUS
##.ACQUISITION SCHEME= undefined
##.AVERAGES= 8
##.DIGITISER RES= 18
##SPECTROMETER/DATA SYSTEM= spect
##.PULSE SEQUENCE= zg30
##.SOLVENT NAME= CDCl3
##.SHIFT REFERENCE= (INTERNAL, CDCl3, 0, 15.5684)
##AUDIT TRAIL= $$ (NUMBER, WHEN, WHO, WHERE, WHAT)
$$ ##TITLE= Audit trail, XWIN-NMR		Version 3.5
$$ ##JCAMPDX= 5.01
$$ ##ORIGIN= Bruker BioSpin GmbH
$$ ##OWNER= Yarkov
$$ C:/Bruker/XWIN-NMR/data/yarkov2/nmr/H-C/1/pdata/1/auditp.txt
$$ ##AUDIT TRAIL=  $$ (NUMBER, WHEN, WHO, WHERE, WHAT)
(   1,<2025-08-01 10:52:32.51 +0400>,<Yarkov>,<DPX200>,
      <created by zg, POWCHK disabled, PULCHK disabled
       configuration hash MD5:
       00 E9 B6 7A A2 85 ED C7 34 08 36 98 17 FE 4E 26
       data hash MD5: 16K
       A7 37 E1 91 3B 4F 2B 57 DF 2A 50 CD D7 C9 0D ED>)
(   2,<2025-08-01 10:52:38.57 +0400>,<Yarkov>,<DPX200>,
      <Start of raw data processing
       efp BC_mod = 2 LB = 0.25 FT_mod = 6 PKNL = 1 PHC0 = -1360.196 PHC1 = 17.79091 SI = 16K 
       data hash MD5: 16K
       9C 4E 5A B7 16 D7 E5 37 50 61 DB B4 5A 58 C7 C9>)
(   3,<2025-08-01 10:52:46.31 +0400>,<Yarkov>,<DPX200>,
      <abs ABSG = 5 
       data hash MD5: 16K
       2F 5D 18 60 E6 19 44 17 E8 BA 4C 3E 5D 52 5F 3F>)
$$ ##END=
$$ 
$$ hash MD5
$$ 18 39 9B 1B A8 58 A7 94 2B 26 B4 77 DC 01 D9 C3
##$RELAX= 
##$RELAX= 
##$RELAX= 
##$RELAX= 
##$RELAX= 
##$RELAX= 
$$ Bruker specific parameters
$$ --------------------------
##$DU= <C:/Bruker/XWIN-NMR>
##$EXPNO= 1
##$NAME= <H-C>
##$PROCNO= 1
##$TYPE= <nmr>
##$USER= <yarkov2>
##$AMP= (0..31)
100 100 100 100 100 100 100 100 100 100 100 100 100 100 100 100 100 100 
100 100 100 100 100 100 100 100 100 100 100 100 100 100 
##$AQSEQ= 0
##$AQ_mod= 1
##$AUNM= <au_zg>
##$AUTOPOS= <>
##$BF1= 200.13
##$BF2= 200.13
##$BF3= 200.13
##$BF4= 200.13
##$BF5= 200.13
##$BF6= 200.13
##$BF7= 200.13
##$BF8= 200.13
##$BYTORDA= 1
##$CFDGTYP= 0
##$CFRGTYP= 5
##$CHEMSTR= <none>
##$CNST= (0..31)
1 1 145 1 1 1 1 1 1 1 1 1 1 1 1 1 1 1 1 1 1 1 1 1 1 1 1 1 1 1 1 1 
##$CPDPRG= <>
##$CPDPRG1= <>
##$CPDPRG2= <>
##$CPDPRG3= <>
##$CPDPRG4= <mlev>
##$CPDPRG5= <mlev>
##$CPDPRG6= <mlev>
##$CPDPRG7= <mlev>
##$CPDPRG8= <mlev>
##$CPDPRGB= <>
##$CPDPRGT= <>
##$D= (0..31)
0 0.7 0 0 0 0 0 0 0 0 0 0.03 0 0 0 0 0 0 0 0 0 0 0 0 0 0 0 0 0 0 0 0 
##$DATE= 1754031151
##$DBL= (0..7)
120 120 120 120 120 120 120 120 
##$DBP= (0..7)
150 150 150 150 150 150 150 150 
##$DBP07= 0
##$DBPNAM0= <>
##$DBPNAM1= <>
##$DBPNAM2= <>
##$DBPNAM3= <>
##$DBPNAM4= <>
##$DBPNAM5= <>
##$DBPNAM6= <>
##$DBPNAM7= <>
##$DBPOAL= (0..7)
0.5 0.5 0.5 0.5 0.5 0.5 0.5 0.5 
##$DBPOFFS= (0..7)
0 0 0 0 0 0 0 0 
##$DE= 6
$$ [...]
##$SUBNAM3= <"">
##$SUBNAM4= <"">
##$SUBNAM5= <"">
##$SUBNAM6= <"">
##$SUBNAM7= <"">
##$SUBNAM8= <"">
##$SUBNAM9= <"">
##$SW= 18.0517328524113
##$SWIBOX= (0..15)
0 0 2 0 0 0 0 0 0 0 0 0 0 0 0 0 
##$SW_h= 3612.71676300578
##$TD= 16384
##$TD0= 1
##$TE= 0
##$TE2= 300
##$TE3= 300
##$TEG= 300
##$TL= (0..7)
0 120 120 120 120 120 120 120 
##$TP= (0..7)
150 150 150 150 150 150 150 150 
##$TP07= 0
##$TPNAME0= <>
##$TPNAME1= <>
##$TPNAME2= <>
##$TPNAME3= <>
##$TPNAME4= <>
##$TPNAME5= <>
##$TPNAME6= <>
##$TPNAME7= <>
##$TPOAL= (0..7)
0.5 0.5 0.5 0.5 0.5 0.5 0.5 0.5 
##$TPOFFS= (0..7)
0 0 0 0 0 0 0 0 
##$TUNHIN= 0
##$TUNHOUT= 0
##$TUNXOUT= 0
##$USERA1= <user>
##$USERA2= <user>
##$USERA3= <user>
##$USERA4= <user>
##$USERA5= <user>
##$V9= 5
##$VALIST= <valist>
##$VCLIST= <CCCCCCCCCCCCCCC>
##$VD= 0
##$VDLIST= <DDDDDDDDDDDDDDD>
##$VPLIST= <PPPPPPPPPPPPPPP>
##$VTLIST= <TTTTTTTTTTTTTTT>
##$WBST= 1024
##$WBSW= 4
##$XGAIN= (0..3)
0 0 0 0 
##$XL= 0
##$YL= 0
##$YMAX_a= 234867
##$YMIN_a= -242000
##$ZGOPTNS= <>
##$ZL1= 120
##$ZL2= 120
##$ZL3= 120
##$ZL4= 120
##$ABSF1= 15.5684
##$ABSF2= -2.483451
##$ABSG= 5
##$ABSL= 3
##$ALPHA= 0
##$AQORDER= 0
##$ASSFAC= 0
##$ASSFACI= 0
##$ASSFACX= 0
##$ASSWID= 0
##$AUNMP= <proc_1d>
##$AZFE= 0.1
##$AZFW= 0.1
##$BCFW= 0
##$BC_mod= 2
##$BYTORDP= 0
##$COROFFS= 0
##$CY= -3
##$DATMOD= 1
##$DC= 0
##$DFILT= <>
##$DTYPP= 0
##$F1P= 0
##$F2P= 0
##$FCOR= 1
##$FTSIZE= 16384
##$FT_mod= 6
##$GAMMA= 0
##$GB= 0
##$INTBC= 1
##$INTSCL= 3.241238e-09
##$ISEN= 128
##$LB= 0.25
##$LEV0= 0
##$LPBIN= 0
##$MAXI= 10000
##$MC2= 0
##$MEAN= 0
##$ME_mod= 0
##$MI= 1.114404
##$NCOEF= 0
##$NC_proc= -8
##$NLEV= 6
##$NOISF1= 3.799351
##$NOISF2= 2.8
##$NSP= 0
##$NTH_PI= 0
##$NZP= 0
##$OFFSET= 15.5684
##$PC= 1
##$PHC0= -1360.196
##$PHC1= 17.79091
##$PH_mod= 1
##$PKNL= yes
##$PPARMOD= 0
##$PSCAL= 0
##$PSIGN= 0
##$REVERSE= no
##$SF= 200.129990654158
##$SI= 16384
##$SIGF1= 3
##$SIGF2= 2
##$SINO= 0.751879
##$SIOLD= 32768
##$SREGLST= <19F.Aceton>
##$SSB= 0
##$STSI= 16384
##$STSR= 0
##$SW_p= 3612.71676300578
##$SYMM= 0
##$S_DEV= 0
##$TDeff= 16384
##$TDoff= 0
##$TI= <>
##$TILT= no
##$TM1= 0
##$TM2= 0
##$TOPLEV= 0
##$USERP1= <user>
##$USERP2= <user>
##$USERP3= <user>
##$USERP4= <user>
##$USERP5= <user>
##$WDW= 1
##$XDIM= 16384
##$YMAX_p= 377960986
##$YMIN_p= -1342090
$$ End of Bruker specific parameters
$$ ---------------------------------
##NTUPLES= NMR SPECTRUM
##VAR_NAME=  FREQUENCY,     SPECTRUM/REAL,   SPECTRUM/IMAG
##SYMBOL=    X,             R,               I
##VAR_TYPE=  INDEPENDENT,   DEPENDENT,       DEPENDENT
##VAR_FORM=  AFFN,          ASDF,            ASDF
##VAR_DIM=   16384,         16384,           16384
##UNITS=     HZ,            ARBITRARY UNITS, ARBITRARY UNITS
##FACTOR=    0.220516191357247, 1,           1
##FIRST=     3115.7038231491, 0,             0
##LAST=      -497.01293985668, 0,            0
##MIN=       -497.01293985668, -1342090,     0
##MAX=       3115.7038231491, 377960986,     0
$$ Real data points
##PAGE= N=1
##DATA TABLE= (X++(R..R)), XYDATA
$$ [...]
5825I25977p448q7675p0726j0528J19113O3642m2558K2455m218j84920J20581
5814H43695J8436O1813M7192M8487m8075j34390J34796J07009r5801P1418j68
5803A054412n7179J14116K656R4504j12033N8023p2557j12872M3482j91464R0428
5792I11516J12488O8019o6574l7736Q0265P9582Q3626p4082q114M5017O2748j68279
5780A088476p9225J47156k5412J05979J5466n4483j21975o9312J28476Q3430j268
5769A217308j8042J38255O4724j01493l5178R0756J7519j63849j8864J18752p1833
5758A238055J84305R8837j35522k5218J11606O5611q8067P2084m729P746l3379
5747A491329m9671J10211L2237J67409L9956K3987j23386N5540K15909K3446M7699
$$ y = [925977, 918529, 830854, 760128, 749600, 868713, 932355, 889797, 912252, 908034, 723114, 843695, 862131, 923944, 971136, 1019623, 971548, 837158, 971954, 1078963, 983162, 1054580, 1054412, 997233, 1111349, 1114005, 1208509, 1096476, 1154499, 1081942, 969070, 1012552, 821088, 911516, 1024004, 1092023, 1025449, 987713, 1067978, 1147560, 1231186, 1157104, 1148990, 1194007, 1256755, 1088476, 1009251, 1156407, 1130995, 1236974, 1252440, 1197957, 1075982, 1006670, 1135146, 1218576, 1217308, 1199266, 1337521, 1402245, 1300752, 1265574, 1356330, 1373849, 1210000, 1191136, 1309888, 1238055, 1422360, 1521197, 1385675, 1360457, 1472063, 1537674, 1449607, 1521691, 1516962, 1524708, 1491329, 1441658, 1551869, 1584106, 1751515, 1791471, 1815458, 1692072, 1747612, 1963521, 1986967, 2034666]
5736B034666K5430R8255R0371J63517O733J20312R6629k5135r6400o6598j453
5725B446327Q3465P9111K8479P7125n0046L6032r5765k2987J85360k5480J9018
5714B760639J11110p5299L0853M6173O4027j2397K39930K47194J57471R5399N9438
5703C724538J82254j1650R628J96046J26735P9306O1744J37096O8113r0621j81430
5692D301759p1729K3153j55046j34693l8700o7534j1616P9274R1388M115j42993
5681C877378O8786m4342L4871J60409Q5530j5827N4327J41080J40973M6124J40858
5670D690167j7187N7059L812J57535O4761n3649N3914J55697j7969o5171p2150
5659D956819o3282k20244j23420r0120r5224L1840j76204l2507K6796l5660l8503
$$ y = [2034666, 2060096, 2158351, 2248722, 2412239, 2418972, 2539284, 2635913, 2610778, 2514378, 2447780, 2446327, 2529792, 2608903, 2637382, 2714507, 2664461, 2700493, 2604728, 2581741, 2767101, 2741621, 2760639, 2871749, 2796450, 2827303, 2873476, 2937503, 2925106, 3165036, 3412230, 3569701, 3665100, 3724538, 3906792, 3895142, 3904770, 4100816, 4227551, 4306857, 4368601, 4505697, 4573810, 4483189, 4301759, 4230030, 4253183, 4098137, 3963444, 3924744, 3857210, 3845594, 3924868, 4016256, 4020371, 3877378, 3946164, 3901822, 3936693, 4097102, 4182632, 4166805, 4221132, 4362212, 4503185, 4549309, 4690167, 4672980, 4730039, 4733851, 4891386, 4956147, 4902498, 4956412, 5112109, 5094140, 5028969, 4956819, 4893537, 4673293, 4549873, 4459753, 4364529, 4396369, 4220165, 4187658, 4214454, 4178794, 4140291]
5648D140291R0571J9115Q658o4388N716k49j0268Q8479J23909j7225Q3834o2782
5636D405661j0505J29178L8506P561J0691O625m1451n6293O8409J6964j5372q7437
5624D472537Q375J4766j7153q5400J47954J6026j73576J25007K83444p0207j05173
5613D616600j01594P0773K66598j11317R2222R3231p2739P3921J21994Q0142m4325
5602E085506J41685J68452K2086N2856J02707Q8851j112M7737m8440K808P6462
5591E739598J25426j00556J22539J89761J15420L0022J02218J18857l7349O800
5581F412736J71751J67316m4164j9589J12799J67972K5295J60066J26338J58478
5571G438998J80521J37829Q575N7401Q9893K75677J48673J2784J25083K05461
$$ y = [4140291, 4230862, 4249977, 4258635, 4194247, 4199963, 4199714, 4189446, 4277925, 4401834, 4384609, 4468443, 4405661, 4395156, 4524334, 4562840, 4570401, 4581092, 4587717, 4546266, 4489973, 4558382, 4575346, 4559974, 4472537, 4480912, 4495678, 4478525, 4393125, 4541079, 4557105, 4383529, 4508536, 4791980, 4721773, 4616600, 4515006, 4585779, 4852377, 4741060, 4833282, 4926513, 4853774, 4927695, 5049689, 5129831, 5085506, 5227191, 5395643, 5417729, 5470585, 5573292, 5662143, 5661031, 5708768, 5660328, 5663136, 5739598, 5865024, 5764468, 5887007, 6076768, 6192188, 6222210, 6324428, 6443285, 6405936, 6412736, 6584487, 6751803, 6707639, 6688050, 6800849, 6968821, 6994116, 7154182, 7280520, 7438998, 7619519, 7757348, 7765923, 7823324, 7913217, 8188894, 8337567, 8350351, 8475434, 8680895]
5561H680895J06814J21673K14112J40520K11896L4822J63472J97413K92514J79815
5551A0343946K33788J84468J18806J10243K02107J52169K77892L48208J30271
5542A2101898K02971J46562J36092K73549K99918J94351L22300L65467K33246
5533A4276354J52364J97667L07544N13874K46371K15259J92347K82725M24352
5524A6808857K97484K86193L41278L28670L42999K83554L59453L92465K39425
5515A9680378M15416K81885M05653K89031M66176M09388L33147L61571L63512
5506B3006157L84485L46051M95758M72313M67255M41412M55729L89126M19111
5497B6877397L88186L40216M30345N35419L94064M79831N16495M30494L69385
$$ y = [8680895, 8787709, 8909382, 9123494, 9264014, 9475910, 9510732, 9674204, 9871617, 10164131, 10343946, 10577734, 10762202, 10881008, 10991251, 11193358, 11345527, 11623419, 11971627, 12101898, 12304869, 12451431, 12587523, 12861072, 13160990, 13355341, 13677641, 14043108, 14276354, 14428718, 14626385, 14933929, 15447803, 15694174, 15909433, 16101780, 16384505, 16808857, 17106341, 17392534, 17733812, 18062482, 18405481, 18689035, 19048488, 19440953, 19680378, 20095794, 20377679, 20783332, 21072363, 21538539, 21947927, 22281074, 22642645, 23006157, 23390642, 23736693, 24232451, 24704764, 25172019, 25613431, 26069160, 26458286, 26877397, 27265583, 27605799, 28036144, 28571563, 28965627, 29445458, 29961953, 30392447, 30761832]
5488C0761832N25880K90819M46504M36283M05232L64073N34110N59184L99145
5479C4723062M17447K84717L31586M02550M94825L46646L50666L00476L95941
5470C8047916L14093L67259K53199M43484K82417J76418K49912L36644K89392
5461D0760734K60533J13242J72264J90698O8635K47581J41290K79415J11081p3628
5451D2271845J2387J08148Q4119P1784J24351q9114j5666r837n4620J25021j89935
5440D2438483j00852L9489j89188j50332j28378j76434j81676j30750k07686l07293
5430D0905383k47068l19227j85584k88483k35434l59376j75913j62117l50029
5421C8582152l02954l80544m26387l11875k82062k86863l77828n30330l43813
$$ y = [30761832, 31287712, 31578531, 32025035, 32461318, 32866550, 33230623, 33764733, 34323917, 34723062, 35140509, 35425226, 35756812, 36159362, 36654187, 37000833, 37351499, 37651975, 38047916, 38362009, 38729268, 38982467, 39425951, 39708368, 39884786, 40134698, 40471342, 40760734, 41021267, 41134509, 41306773, 41497471, 41566106, 41813687, 41954977, 42234392, 42345473, 42271845, 42284232, 42392380, 42476499, 42548283, 42672634, 42583520, 42567854, 42558017, 42503397, 42628418, 42438483, 42337631, 42377120, 42187932, 42037600, 41909222, 41732788, 41551112, 41420362, 41212676, 40905383, 40658315, 40339088, 40153504, 39865021, 39629587, 39270211, 39094298, 38932181, 38582152, 38279198, 37898654, 37472267, 37160392, 36878330, 36591467, 36213639, 35683309, 35339496]
5412C5339496l61944l24441n94891l42484m65689m68810l27283n33826l53603
5403C1566525l73680m67586l00282l50697l55115n03806m19561k80090m53057
5394B8062651m51677m22450l18637m11981m28218m14172l48114k67046k91150
5385B4709206n85182m30663l49977m56772l21115l40279l54914l25877n88921
5376B0955506k56031k90284k14165k73227m16592k11235j92301k28347k34390
5367A8638934k60206k22603k65658l35361k65212k62782k91508j84978j63459
5358A6387167k97881j55499l32134k02986k07345k95390j45356j55093k74947
5349A4320536j32781j54008j85572j40950k79019j41075j00122k99846m0424j4525
$$ y = [35339496, 34977552, 34653111, 34058220, 33715736, 33250047, 32781237, 32453954, 31920128, 31566525, 31192845, 30725259, 30424977, 30074280, 29719165, 29215359, 28795798, 28515708, 28062651, 27610974, 27188524, 26869887, 26457906, 26029688, 25615516, 25267402, 25000356, 24709206, 24124024, 23693361, 23343384, 22886612, 22565497, 22225218, 21870304, 21544427, 20955506, 20699475, 20409191, 20195026, 19921799, 19505207, 19293972, 19101671, 18873324, 18638934, 18378728, 18156125, 17890467, 17555106, 17289894, 17027112, 16735604, 16550626, 16387167, 16089286, 15933787, 15601653, 15398667, 15191322, 14895932, 14750576, 14595483, 14320536, 14187755, 14033747, 13848175, 13707225, 13428206, 13287131, 13187009, 12887163, 12846739, 12832214]
5339A2832214k83898k88600j16665J8752p3541j93913r6437j02881j55103j18720
5329A1421208k45077j83561K8779l00560k22211J7316K0735j26243q3141m5831
5319A0281414j37999j97523j33709j41579j11219n7871j9501l6473J2117q5647
5309I372010r2702m1949j44587l7165m5607J9996j8289q8410j91308M9430N992
5298H787411j30246j04440q5355q3023k6307O1858K4831J1470r6754j28160r8084
5287H133201m1607q3853L4101k8413J5653q5560q3257P6616m8544J4875p1657
5276G831555N3873j17506L0077q3112j3465J01357m7291j67131j0450N7143p6838
5265G558212K1501o8493l4320J64425j8496m8374J42017Q6820j24432k4850J8201
$$ y = [12832214, 12548316, 12259716, 12143051, 12161803, 12088262, 11894349, 11797912, 11695031, 11539928, 11421208, 11176131, 10992570, 11021349, 10720789, 10498578, 10515894, 10536629, 10410386, 10327245, 10281414, 10143415, 9945892, 9812183, 9670604, 9559385, 9501514, 9482013, 9445540, 9457657, 9372010, 9279308, 9237359, 9092772, 9055607, 9010000, 9029996, 9011707, 8923297, 8731989, 8781419, 8787411, 8657165, 8552725, 8467370, 8384347, 8358040, 8419898, 8444729, 8456199, 8359445, 8231285, 8133201, 8091594, 8007741, 8041842, 8013429, 8029082, 7943522, 7860265, 7936881, 7888337, 7903212, 7831555, 7885428, 7767922, 7797999, 7714887, 7701422, 7802779, 7755488, 7588357, 7577907, 7635050, 7558212, 7579713, 7511220, 7476900, 7641325, 7622829, 7574455, 7716472, 7803292, 7678860, 7654010, 7672211]
5254G672211M7667J6720j82912j5285J29964N2370k2181q5987p033Q1472J13869
5243G800875q5648j30605J23891m0379L6525n6J29149o4111q043J7121m6337P7984
5231G810366k0554O3398J02052K8403k5759n2443P0196J23219m600P4200P5001
5220H243479j4017M2517N178J6328j18065O2794J37899J0404P7794Q5404M9913
5209H599628J27613N0680n3758l3995o1495N4061R9451R2144J14712M8414O0567
5198I098022J33176O5396R1105N5639J41712O9035P1573O7763m5955O7233P0199
5187I884898n072J56196J97499m0804m6208N0859J52519K48889M3494J74655J47772
5176A0964697M9832M0590J62687N2387J59626J83730J43362o9302P3709J55352
$$ y = [7672211, 7719878, 7736598, 7553686, 7538401, 7668365, 7720735, 7698554, 7612567, 7605534, 7687006, 7800875, 7715227, 7584622, 7708513, 7668134, 7704659, 7704603, 7833752, 7769641, 7761598, 7778719, 7732382, 7810366, 7789812, 7853210, 7955262, 7983665, 7957906, 7905463, 7975659, 8098878, 8094278, 8168478, 8243479, 8229462, 8271979, 8277157, 8293485, 8175420, 8238214, 8376113, 8386517, 8464311, 8549715, 8599628, 8727241, 8777921, 8724163, 8690168, 8628673, 8682734, 8782185, 8874329, 8989041, 9037455, 9098022, 9231198, 9296594, 9387699, 9443338, 9585050, 9654085, 9725658, 9793421, 9747466, 9814699, 9884898, 9879826, 10036022, 10233521, 10192717, 10146509, 10197368, 10349887, 10598776, 10642270, 10816925, 10964697, 11014529, 11055119, 11217806, 11270193, 11429819, 11613549, 11756911, 11687609, 11761318, 11916670]
5166A1916670n0351J24637K92202J57709k2703L01925P9593K07519M186k3224
5156A2988163K54045J31538J67836K68373P8480j3789Q9269J30753J51199K66443
5146A4512310J48104J83811J9110J17305L28794K72886L8755J1800J06154J00705
5136A5839734K53059J79063J96196K23987K44437J87628J80561J28325J23993
5127A7556983K11417J85925N8098J44599J28726L00422J94539J00161K80813N8142
5117A9219825J34044K40650L17667K53180J22357K26757K15215o247J22678K38389
5107B1084515K63691J42322J1881K76438K14517L02411Q0062R7786L33658K4405
5097B2831686R0236K45818K78234J43460R1582J26210J78703J90390K20689J67511
$$ y = [11916670, 11866319, 11990956, 12283158, 12440867, 12418164, 12720089, 12799682, 13007201, 13011387, 12988163, 13242208, 13373746, 13541582, 13809955, 13888435, 13874646, 13963915, 14094668, 14245867, 14512310, 14660414, 14844225, 14863335, 14980640, 15309434, 15582320, 15621075, 15632875, 15739029, 15839734, 16092793, 16271856, 16468052, 16692039, 16936476, 17124104, 17304665, 17432990, 17556983, 17768400, 17954325, 18012423, 18157022, 18285748, 18586170, 18780709, 18880870, 19161683, 19219825, 19353869, 19594519, 19912186, 20165366, 20287723, 20514480, 20729695, 20723448, 20846126, 21084515, 21348206, 21490528, 21502409, 21778847, 21993364, 22295775, 22375837, 22473623, 22807281, 22831686, 22921922, 23167740, 23445974, 23589434, 23681016, 23807226, 23985929, 24176319, 24397008, 24564519]
5087B4564519J63148O8254P4583J52574J18083J27202K81281J27867P3865J80472
5077B5931848K04598J26281q0079O322J73140J04078r1480J79538O9307K12831
5067B6836384Q2166P0228O6964P271J11543P585J58196N4629l5896P9685m7520
5056B7391235P3234J29488J1103L0647l6029p1912L6456m4948K5155j6066j21106
5045B7407257J65470q0870j55535J19931K5326k01462r6299K9819K6366O8889
5035B7308892k91218n5353m5833j28074l12954j37766K3781J11854K8964m8914
5025B6453379j23931j83545k49000j54743N3288j25628q2624l1788p2824l69713
5015B5112871k1904k9662l34178j53299l2745k72672j48713k41679k06580p7146
$$ y = [24564519, 24727667, 24795921, 24870504, 25023078, 25141161, 25268363, 25549644, 25677511, 25751376, 25931848, 26136446, 26262727, 26182648, 26188970, 26362110, 26466188, 26374708, 26554246, 26623553, 26836384, 26918550, 26988778, 27055742, 27063013, 27174556, 27182141, 27340337, 27394966, 27359070, 27438755, 27391235, 27464469, 27593957, 27605060, 27635707, 27599678, 27527766, 27564222, 27519274, 27544429, 27528363, 27407257, 27572727, 27491857, 27336322, 27456253, 27481579, 27280117, 27183818, 27213637, 27240003, 27308892, 27017674, 26962321, 26916488, 26788414, 26475460, 26337694, 26361475, 26473329, 26502293, 26453379, 26329448, 26145903, 25896903, 25742160, 25795448, 25669820, 25587196, 25555408, 25482584, 25112871, 25090967, 25061305, 24727127, 24573828, 24541083, 24268411, 24119698, 23878019, 23671439, 23594293]
5005B3594293k58427k07594j84420j33395l1403j34519k35207l41487j22178j60481
4995B1785182j48617k10708j21931j71860p9150k28944j43063q4737r4519k38334
4985B0263319k28794j96525j25460k09008j39327j19251j70263k63181k63977
4976A8547533j797j83706j15889j88974j79443j98399J4266j55478j60395m7833
4966A7329885j46076k97578k09233j41805j29480K6651j54554k34218r9510k56043
4956A5688039m2273l5261r2008k40403j17800j2014k27921N940j10964m5693j81213
4945A4588429k48452J30911r3703j88353k02110j83774m6613k3053j25599k22135
4935A3385548N6679j09151j27945l8379j6501k20221r0749j17299j5311k8041
$$ y = [23594293, 23335866, 23128272, 22943852, 22810457, 22779054, 22644535, 22409328, 22067841, 21945663, 21785182, 21636565, 21425857, 21303926, 21132066, 21052916, 20823972, 20680909, 20596172, 20501653, 20263319, 20034525, 19838000, 19712540, 19503532, 19364205, 19244954, 19074691, 18811510, 18547533, 18545736, 18362030, 18246141, 18057167, 17877724, 17679325, 17693591, 17538113, 17377718, 17329885, 17183809, 16886231, 16676998, 16535193, 16405713, 16432364, 16277810, 16043592, 15944082, 15688039, 15645766, 15610505, 15518497, 15278094, 15160294, 15148280, 14920359, 14926299, 14815335, 14769642, 14588429, 14339977, 14470888, 14377185, 14188832, 13986722, 13802948, 13756335, 13733282, 13607683, 13385548, 13442227, 13333076, 13205131, 13166752, 13150251, 12930030, 12839281, 12721982, 12706671, 12678630]
4925A2678630j63417j21533j02896l6837j36588L1368n6605l8961k8973j80787
4915A1843401n4675J40558k47877j9180o463o3397m8487O1767j37775o2815j06045
4904A1299012M5911K5909L3103m3932k44067k01736o6813n8743j20396p9366k38956
4893A0349926j79505k2760j36359j55644j62894k67478k41388n7995j13718m6969
4883H965216l2126j38286k23717k9507l4283l97362k89704k8583J2173j68134
4873G635687K2127n0908Q92r6837j9652r3315j03854j74865r8244q9057K3341
4862F955315j13934j4258l8060n9267k11456j30606J6939j14339p8467j65932
4852F045935p0549J5479J2887j88686l7412n3098j93409R2449j41088q4798q5117
$$ y = [12678630, 12515213, 12393680, 12290784, 12253947, 12117359, 12148727, 12092122, 12053161, 12024188, 11843401, 11788726, 11929284, 11681407, 11662227, 11655764, 11592367, 11543880, 11605647, 11467872, 11405057, 11299012, 11344923, 11370832, 11403935, 11360003, 11115936, 10914200, 10847387, 10788644, 10668248, 10588882, 10349926, 10170421, 10147661, 10011302, 9855658, 9692764, 9425286, 9183898, 9125903, 9012185, 8965216, 8933090, 8794804, 8571087, 8541580, 8507297, 8109935, 7820231, 7791648, 7803821, 7635687, 7657814, 7606906, 7607798, 7510961, 7491309, 7397994, 7294140, 7119275, 7021031, 6931974, 6955315, 6841381, 6827123, 6789063, 6729796, 6518340, 6387734, 6404673, 6290334, 6211867, 6045935, 5975386, 5990865, 6003752, 5815066, 5777654, 5724556, 5531147, 5623596, 5482508, 5397710, 5312593]
4841E312593J9688l0463j20677J00482M5694k69900L8581P7302j61545o6805k101
4830D942849l3575K7455j02336k873l0552j28961j94245J5202J10233o7428j02002
4819D433767o8823l7825j33679J0818q9862q890p3832K839o8822M5748j819k0030
4807C989590j07090Q2220k1487j08973p8315K5059j14119o7013P3163n8870k8407
4796C585758J13110r497K3920l1056j26359o4375Q8017l3345k1524j58450o2490
4785C303709Q151Q5029l5209j7590J6068j17841m7235m4397K6325k0658J20487
4774C276839n9827m7050o3952L6187R5247j6036j17536j91360k2508K15552P8013
4763C183569j12399j28419p2319j9233J49958k8106O7230J3991j39163j3398j05153
$$ y = [5312593, 5332281, 5301818, 5181141, 5281623, 5327317, 5057417, 5095998, 5173300, 5011755, 4944950, 4942849, 4909274, 4936729, 4834393, 4831520, 4800968, 4672007, 4477762, 4492964, 4603197, 4535769, 4433767, 4364944, 4327119, 4193440, 4204258, 4114396, 4105506, 4031674, 4034513, 3965691, 4011439, 4009620, 3989590, 3882500, 3964720, 3943233, 3834260, 3755945, 3781004, 3666885, 3599872, 3673035, 3614165, 3585758, 3698868, 3689371, 3713291, 3682235, 3555876, 3491501, 3579518, 3546173, 3524649, 3366199, 3303709, 3311860, 3396889, 3361680, 3344090, 3360158, 3242317, 3195082, 3150685, 3177010, 3156352, 3276839, 3217012, 3169962, 3106010, 3142197, 3237444, 3221408, 3103872, 2912512, 2890004, 3105556, 3183569, 3071170, 2942751, 2870432, 2851199, 3001157, 2973051, 3040281, 3054272, 2915109, 2901711, 2796558]
4752B796558J8984r0197R744m899K4417L2525J5828M9584m8586L0725J39077p8470
4740B895290r4112N2392l7764m1908k31843J23349Q79n4551j162n8203q1906P1256
4728B541717q2L0257L6652j40701j8807j29583L0515J10088P3058j43429M34J61883
4716B552002K9207n7947R2050P9491k40558J8109p5051N830n5944O6539M8938
4705B462666o9799J03132p264n8832k9658O6198q8141J0889l3613o0870R8054
4694B392762J53327j49300j81803J05094J10573o2931l8239L0512M5107r485l2941
4683B362676J01242j11666j0898j7570N9807L4083R68M8946N4615N1715p8217
4672B495701o8420n4888o3406P1362n1264N2741P1747j81629O1790J62457r606
$$ y = [2796558, 2815542, 2725345, 2735089, 2730190, 2754607, 2787132, 2802960, 2852544, 2803958, 2834683, 2973760, 2895290, 2801178, 2853570, 2815806, 2773898, 2542055, 2665404, 2666283, 2611732, 2610570, 2552367, 2470461, 2541717, 2541635, 2571892, 2608544, 2467843, 2449036, 2319453, 2349968, 2460056, 2533114, 2389685, 2390119, 2552002, 2581209, 2523262, 2615312, 2694803, 2454245, 2472354, 2397303, 2403133, 2347189, 2413728, 2462666, 2392867, 2495999, 2488735, 2429903, 2400245, 2466443, 2378302, 2389191, 2355578, 2294708, 2392762, 2546089, 2396789, 2214986, 2320080, 2430653, 2367722, 2329483, 2359995, 2405102, 2395617, 2362676, 2463918, 2352252, 2341354, 2323784, 2383591, 2417674, 2418642, 2467588, 2522203, 2573918, 2495701, 2427281, 2372393, 2308987, 2380349, 2329085, 2381826, 2453573, 2271944, 2333734, 2496191, 2486585]
4661B486585N2739j1577l7917p303k4593J7686n3189J38941n8606n9674R9032
4650B542124N0141j7922j75502N8393l7763j41729J79957n3339K8743J06507k5145
4639B514465P9776o1011j17693J01492K6808k9581m242M9004L9474q2277j9011
4628B497204K413J8825P6091m0284Q0718j08551K3899Q1693K2840r742m5705p2316
4616B527085L5669J59145r0694K0765n1933j7680Q14p9525J02076J9469Q191K7112
4604B660494j35511K9037N4635j8433o8319M8284M5047o2707k1169O4286J35914
4593B731558M4638j14625K3097m356J2872J89844o3150k138j14368M6161Q7261
4582B836794K88l530k928n5608Q7567N6348K132N107n9365j9559L560j1579K6210
$$ y = [2486585, 2539324, 2527747, 2489830, 2482527, 2457934, 2475620, 2422431, 2561372, 2502766, 2443092, 2542124, 2592265, 2574343, 2398841, 2457234, 2419471, 2277742, 2457699, 2404360, 2433103, 2539610, 2514465, 2594241, 2533230, 2415537, 2517029, 2543837, 2514256, 2510014, 2559018, 2598492, 2516215, 2497204, 2499617, 2518442, 2594533, 2554249, 2634967, 2526416, 2550315, 2632008, 2654848, 2645106, 2599401, 2527085, 2562754, 2721899, 2631205, 2651970, 2600037, 2582357, 2583171, 2503646, 2605722, 2625191, 2633382, 2660494, 2524983, 2554020, 2608655, 2590222, 2521903, 2570187, 2615234, 2552527, 2531358, 2595644, 2731558, 2776196, 2661571, 2684668, 2680312, 2693184, 2883028, 2819878, 2817740, 2703372, 2749533, 2836794, 2837082, 2833552, 2830624, 2775016, 2862583, 2918931, 2921063, 2926170, 2866805, 2847246, 2850806, 2839227, 2865437]
4569B865437P7838J06813J9455j42739J32591O9049j06295P6743j30246l8104
4559B930542R9537o4912l6735k7456O4601J09679j918M5371p9418j19947J91967
4548C111311J29230J5155j18864l269J2918K99769J06780k04291k0771k0213r167
4537C298588j01466P6526l3231O345K63771n7006j0587l2146M3267o1567J9410
4526C411904K9392M1874j44260o1569J54379J92952m8320m7197J11736l3874j7845
4515C589172m64P879N7253K4124R0531L0013r0055p2155O8140N3718K9991q0884
4503C707263O6352J14980N930n237J09961J19137K6822m9763n1584J21495J45520
4492D310876J06942j1823m9425N3387P3392o6244M3056P8345Q6384o7573j85670
$$ y = [2865437, 2943275, 3050088, 3069543, 2926804, 3059395, 3128444, 3022149, 3098892, 2968646, 2930542, 3030079, 2965167, 2928432, 2900976, 2965577, 3075256, 3073338, 3118709, 3039291, 2919344, 3111311, 3240541, 3255696, 3136832, 3133563, 3146481, 3446250, 3553030, 3348739, 3327968, 3307755, 3298588, 3197122, 3273648, 3240417, 3246762, 3510533, 3453527, 3442940, 3410794, 3454061, 3392494, 3411904, 3441296, 3483170, 3338910, 3277341, 3431720, 3624672, 3576352, 3529155, 3640891, 3607017, 3589172, 3588708, 3596587, 3653840, 3677964, 3768495, 3798508, 3708453, 3636298, 3704438, 3758156, 3788147, 3707263, 3773615, 3888595, 3894525, 3889288, 3999249, 4118386, 4145208, 4095445, 4043861, 4165356, 4310876, 4417818, 4405995, 4356570, 4409957, 4483349, 4417105, 4460161, 4538506, 4624890, 4557317, 4371647]
4481D371647K06132P8595o887J18263q7314K55712L1298j91993P9069J2371J68433
4470E035326Q4914j24181O3879N7782L9423M8258J79700J34666R6591m823J48142
4459E759677N0440R2171q774P2864J51490N874Q603K1042J64141K01587O1784
4448F580899N072O4858R6305R4348J06198O1834M8916Q5202R7863J02323J00659
4437G444477J02756J90700J21940L37720l4380N1323K17319J10707Q6773J596
4427H630931L9738K57697K28924L48662Q5662P5163L06930J32346K32869J49685
4417A0488607J59573K40320O2545L38883K61092J32041K58326K77046M17670J75436
4407A2811539M08922K56063K95393L04710M53165M00046L04587K65396L69868
$$ y = [4371647, 4577779, 4656374, 4649487, 4767750, 4680436, 4936148, 4967446, 4775453, 4854522, 4866893, 5035326, 5120240, 4996059, 5059938, 5117720, 5157143, 5205401, 5385101, 5519767, 5616358, 5611535, 5759677, 5810117, 5902288, 5893514, 5966378, 6117868, 6123742, 6132345, 6153387, 6317528, 6519115, 6580899, 6585971, 6650829, 6747134, 6841482, 6947680, 7009514, 7058430, 7143632, 7241495, 7343818, 7444477, 7547233, 7737933, 7859873, 8197593, 8163213, 8214536, 8431855, 8542562, 8629335, 8630931, 8670669, 8928366, 9157290, 9505952, 9591614, 9666777, 9973707, 10106053, 10338922, 10488607, 10648180, 10888500, 10951045, 11289928, 11551020, 11683061, 11941387, 12218433, 12636103, 12811539, 13220461, 13476524, 13771917, 14076627, 14529792, 14929838, 15234425, 15499821, 15869689]
4398A5869689M67197L92157M11149L12901M71644N15734N93925N17509O00760
4389B0152665P22641O33786N70667N78323P27760O84099N77735O62292P66785
4380B6076753P67027R10195R67289R28946P60984R03834R77941R42115R18705
4371C4153789J037288R50794R73765R83633J009117J028066J033778R33699R67910
4362D3071839R61538R50779R97990R99635Q14690Q27198R94031Q45965N81639
4353E1045304O29744N94328P06153O18411M48512L78586L67794K74504J89235
4344E5252571J05141L20739K87753o9973M5963o0285r6200j44522k25850j25881
4334E5289456j32128j97697j38487m56723k45191j17900k64874l20623j61079
$$ y = [15869689, 16336886, 16729043, 17140192, 17453093, 17924737, 18440471, 19034396, 19551905, 20152665, 20875306, 21509092, 22079759, 22658082, 23385842, 24069941, 24647676, 25309968, 26076753, 26843780, 27753975, 28721264, 29650210, 30411194, 31315028, 32292969, 33235084, 34153789, 35191077, 36141871, 37115636, 38099269, 39108386, 40136452, 41170230, 42103929, 43071839, 44033377, 44984156, 45982146, 46981781, 47796471, 48623669, 49617700, 50463665, 51045304, 51675048, 52269376, 52975529, 53593940, 54042452, 54421038, 54788832, 55063336, 55252571, 55357712, 55678451, 55966204, 55896231, 55942194, 55881909, 55785709, 55641187, 55415337, 55289456, 55157328, 54959631, 54821144, 54364421, 54119230, 54001330, 53736456, 53415833, 53254754]
4325E3254754r5949j94942j10027m09719k06006j58028p8000N2004k26397M886
4315E1832576R4368o589l368Q1717J49838Q2431J36921K15983J05746L35153K80305
4304E3305081K92103L22009K18640L80580N56058L67466L95730N95165O13045
4295E7045877M30127L24842N85244O39823N35732N85829O18974N63124O55047
4286F1984619N11712N64637P19668O89928P24324P70546N43198O83816Q08227
4277F8000675O82242P57355O63525N99397O41182N79917M48594N64122M87831
4268G3424840Q19085N95637K94748M38990M83406L07441L72562K70713J42094
4259G7149516J07342j6935O0782k582j6319n0961j77187k99892k53481k48858
$$ y = [53254754, 53158805, 52963863, 52853836, 52444117, 52238111, 52080083, 52002083, 52054087, 51827690, 51832576, 51926944, 51920355, 51916987, 51998704, 52148542, 52230973, 52367894, 52583877, 52689623, 53024776, 53305081, 53597184, 53919193, 54137833, 54518413, 55074471, 55441937, 55837667, 56432832, 57045877, 57476004, 57800846, 58386090, 59025913, 59561645, 60147474, 60766448, 61329572, 61984619, 62496331, 63060968, 63780636, 64470564, 65194888, 65965434, 66508632, 67192448, 68000675, 68682917, 69440272, 70103797, 70703194, 71344376, 71924293, 72372887, 72937009, 73424840, 74243925, 74839562, 75134310, 75573300, 76056706, 76364147, 76736709, 77007422, 77149516, 77256858, 77239923, 77300705, 77298123, 77281804, 77230843, 77053656, 76753764, 76500283, 76251425]
4249G6251425m39284m47658m43570o76744o91171o12232o04627o50647p61078
4240G0924414r63202p94588o75775r09635r18353q11100r54676r59018r57854
4231F2980213j064261j055577j107792j004761j035423q87604q73249r33494r07546
4222E4110506r20170q94589q69544r17595q66337p24587p25767p27345p59951
4213D6704621p76336q14114o49194o48232o30804m60228o63877o27312m90932
4204D0943592n99541m61676k93865m61026m44926m63686m35649l76856m66810
4195C6939557k58268k68202m25628l24541l18220l12397q1833k58925k35584j94394
4185C4261565l47652k67965k15435j50546o9807k36101j86370j77882l88953l5616
$$ y = [76251425, 75812141, 75364483, 74920913, 74244169, 73552998, 72940766, 72336139, 71685492, 70924414, 69961212, 69166624, 68490849, 67581214, 66662861, 65851761, 64897085, 63938067, 62980213, 61915952, 60860375, 59752583, 58747822, 57712399, 56824795, 55951546, 55018052, 54110506, 53190336, 52295747, 51426203, 50508608, 49642271, 48917684, 48191917, 47464572, 46704621, 45928285, 45114171, 44464977, 43816745, 43185941, 42725713, 42061836, 41434524, 40943592, 40344051, 39882375, 39588510, 39127484, 38682558, 38218872, 37783223, 37406367, 36939557, 36681289, 36413087, 35987459, 35662918, 35344698, 35032301, 34950468, 34691543, 34455959, 34261565, 33913913, 33645948, 33430513, 33279967, 33210160, 32974059, 32787689, 32609807, 32220854, 32185238]
4175C2185238r8736k84631k89306m5488N3777k41591j46873q0118m0655j43337
4165C0868280k0287j34104K0749n6773Q169L2522q4866l1030K1615m9790j17067
4154C0457418Q395M0081K0226N2302J21374O638l5644J19232K00220o065J6761
4143C1000938M4085N1471J92284M5006J03843J11578K5997p3848N6642K73094
4133C1831090R8769J38449K15479J15667L450J28246J48562K23896J79373R1924
4123C3174905K42548J93027J02614K80360J34706J15427K64083J36546J86651
4114C4830867K27490K80881J81437J82271J98356J81415L22919L30577J40933
4105C6877146K25594K28365K14454M33912J75213K79991L52280K07795L02946
$$ y = [32185238, 32086502, 31801871, 31512565, 31467077, 31520854, 31279263, 31132390, 31052272, 31011617, 30868280, 30847993, 30713889, 30734638, 30677865, 30686034, 30718556, 30633690, 30602660, 30624275, 30574485, 30457418, 30465813, 30505894, 30526120, 30578422, 30699796, 30706434, 30670790, 30790022, 30990242, 30984177, 31000938, 31045023, 31096494, 31288778, 31333784, 31437627, 31549205, 31575202, 31501354, 31557996, 31831090, 31929859, 32068308, 32283787, 32399454, 32402904, 32531150, 32679712, 32903608, 33082981, 33174905, 33417453, 33610480, 33713094, 33993454, 34128160, 34243587, 34507670, 34644216, 34830867, 35058357, 35339238, 35520675, 35702946, 35901302, 36082717, 36405636, 36736213, 36877146, 37102740, 37331105, 37545559, 37979471, 38154684, 38434675, 38786955, 38994750, 39297696]
4096C9297696K23377K88850J87101L12053L04311L02659L62293K49362L21583
4087D1849285M85347M08113K01569L23264M31131L67004L75616L62522L22705
4078D5126556M44899K82245L53634L80150L29735K90690L87046L97059M85614
4069D8477628M34418L51406M14101M11853M40225N69876M44509L82154N79586
4060E2505756N25559M24793L84358M48726M42779M70396M98896N17428M58505
4051E6677196N25553N24348M83464O67595N55401M63572N86755N05066N25208
4042F1514158N48941M33586O12710N67603N08743O40291N99272O60392O21598
4033F6707294N24470O18257N65996O85241O95385O39619N63161O27477P31593
$$ y = [39297696, 39521073, 39809923, 39997024, 40309077, 40613388, 40916047, 41278340, 41527702, 41849285, 42334632, 42742745, 42944314, 43267578, 43698709, 44065713, 44441329, 44803851, 45126556, 45571455, 45853700, 46207334, 46587484, 46917219, 47207909, 47594955, 47992014, 48477628, 48912046, 49263452, 49677553, 50089406, 50529631, 51099507, 51544016, 51926170, 52505756, 53031315, 53456108, 53840466, 54289192, 54731971, 55202367, 55701263, 56218691, 56677196, 57202749, 57727097, 58210561, 58878156, 59433557, 59897129, 60483884, 60988950, 61514158, 62063099, 62496685, 63109395, 63676998, 64185741, 64826032, 65425304, 66085696, 66707294, 67231764, 67850021, 68416017, 69101258, 69796643, 70436262, 70999423, 71626900, 72358493]
4024G2358493P34033O40233N09078N81355P78373Q49070P88120P97349P92783
4015G8828887P45410P75503R79570R82563R41248R62095J062696J377961J045615
4006H7701548J117324J328500J509908J352320J441890J471733J436768J661459
3998I9021450J716633J762541J804274J841617J673110J732476J735098J937524
3990A13224723J790578J741938J468518J436436J270403J356100J247579R72823
3982A24509098R02923O48268N84379M53798K02302k2748j47910k41935l60152
3973A26528023o42196r10896r14658j025254j246598j321012j337729j393256
3965A17736424j574333j646467j648496j742841j848750j669316j830165j818644
$$ y = [72358493, 73092526, 73732759, 74241837, 74823192, 75601565, 76450635, 77238755, 78036104, 78828887, 79574297, 80349800, 81329370, 82311933, 83253181, 84215276, 85277972, 86655933, 87701548, 88818872, 90147372, 91657280, 93009600, 94451490, 95923223, 97359991, 99021450, 100738083, 102500624, 104304898, 106146515, 107819625, 109552101, 111287199, 113224723, 115015301, 116757239, 118225757, 119662193, 120932596, 122288696, 123536275, 124509098, 125412021, 126060289, 126644668, 127098466, 127300768, 127278020, 127130110, 126888175, 126528023, 125885827, 124974931, 124060273, 123035019, 121788421, 120467409, 119129680, 117736424, 116162091, 114515624, 112867128, 111124287, 109275537, 107606221, 105776056, 103957412]
3957A03957412j748854j801016j708072j808225j710962j607288j644549j680210
3949I0248236j586200j578037j518597j543157j610239j345814j442712j448248
3941G8175232j380644j337351j179247j301329j396552j214245j115207j289902
3933F7960755r16222r09522j022517j087341r46737r63331r54690r17726j013130
3924E9229539p58272o87469p96499p94325q93731o01751o65941o36393o62640
3915E2732518n14684o22015n55135m06332n43997m59466m52941m42744l13541
3906D8421663k88210m34202m33547r8236k53440m12088j93877l11849k57430o3845
3896D5674939j47041j45308J49736p5171j37430p9366K3930q4077M1988N1354
$$ y = [103957412, 102208558, 100407542, 98699470, 96891245, 95180283, 93572995, 91928446, 90248236, 88662036, 87083999, 85565402, 84022245, 82412006, 81066192, 79623480, 78175232, 76794588, 75457237, 74277990, 72976661, 71580109, 70365864, 69250657, 67960755, 67044533, 66135011, 65112494, 64025153, 63078416, 62115085, 61160395, 60242669, 59229539, 58471267, 57783798, 56987299, 56192974, 55299243, 54697492, 54031551, 53395158, 52732518, 52217834, 51595819, 51040684, 50634352, 50090355, 49630889, 49177948, 48735204, 48421663, 48133453, 47699251, 47265704, 47167468, 46914028, 46501940, 46308063, 45996214, 45738784, 45674939, 45527898, 45382590, 45532326, 45457155, 45319725, 45240359, 45264289, 45180212, 45222200, 45273554]
3886D5273554J33003R3096L43989K47107J83557K46921K10985M00206L25958L32056
3876D7790432M40173M12147L99254M70389O37308M74122K63466N35077N59892
3867E1982260N40193L25210L54918O06075L77768L12469K42636M50837M94240
3858E5686606M97028K88990K26565M19370M19806N15069N16350N81893O72801
3849E9824478N88998O68334P63826J007119Q95111J052996J017232J007279J179931
3840F8005304J148681J225763J471002J528127J628545J666005J785491J974067
3832H0432985J839647K053984K228876K366651K272527K378048K539875K732951
3824I8845544K816159K998339L018739K965940L149129L138549L106146L029570
$$ y = [45273554, 45406557, 45499653, 45843642, 46090749, 46274306, 46521227, 46732212, 47132418, 47458376, 47790432, 48230605, 48642752, 49042006, 49512395, 50149703, 50623825, 50887291, 51422368, 51982260, 52522453, 52847663, 53202581, 53808656, 54186424, 54498893, 54741529, 55192366, 55686606, 56183634, 56472624, 56699189, 57118559, 57538365, 58053434, 58569784, 59151677, 59824478, 60413476, 61081810, 61845636, 62852755, 63747866, 64800862, 65818094, 66825373, 68005304, 69153985, 70379748, 71850750, 73378877, 75007422, 76673427, 78458918, 80432985, 82272632, 84326616, 86555492, 88922143, 91194670, 93572718, 96112593, 98845544, 101661703, 104660042, 107678781, 110644721, 113793850, 116932399, 120038545, 123068115]
3816A23068115L110672L069249L170695L051901K794742K682704K526034K409649
3808A45883761K162747K123245J919615J751078J484622J108364J199969Q02640
3800A58436041P69318N97910L68179L79765J3484r5582j03317k74937l48658l89814
3790A59352389o38319o11738o34018o75022o18525o37401n50627m61774o65826
3781A53859139m74784m51735m13353l93004j95038j85658l98507k06018l26135
3772A50814907k60216m966j0676j86108k77755l29286k97962l16573l91671l75117
3762A48364577n44330m97408q53574o24989p22542r87973q89263j132215j130399
3753A40981884j138248j452558j399419j436692j403541j659117j529303j560029
$$ y = [123068115, 126178787, 129248036, 132418731, 135470632, 138265374, 140948078, 143474112, 145883761, 148046508, 150169753, 152089368, 153840446, 155325068, 156433432, 157633401, 158436041, 159205359, 159803269, 160171448, 160551213, 160564697, 160469115, 160365798, 160090861, 159742203, 159352389, 158714070, 158102332, 157468314, 156793292, 156174767, 155537366, 154986739, 154524965, 153859139, 153384355, 152932620, 152519267, 152126263, 151931225, 151745567, 151347060, 151141042, 150814907, 150554691, 150549725, 150539049, 150352941, 150075186, 149745900, 149447938, 149131365, 148739694, 148364577, 147820247, 147322839, 146469265, 145844276, 145121734, 144133761, 143244498, 142112283, 140981884, 139843636, 138391078, 136991659, 135554967, 134151426, 132492309, 130963006, 129402977]
3745A29402977j624173j666067j786187j858394j793519j896486j970680j879068
3737A14928403j966350k013448k019413k069914k129370j955545j893805j945726
3729I8934832j973382k081105j868749j751021j685139j691045j793338j702687
3721H4388366j595756j471702j587891j464548j377760j425198j360486j253897
3713G2851128j310217j214847j243365j023767j094300j004301j052325j058155
3705F3849851j108044j036247r31639r76533r03144p37970q14544q84585p48149
3696E5708996r18748p77403p80215o91361p76639o70270n80803p34471o81969
3687D9097117p16721o93947p19822m69105n90948o35578n13764m34406q04964
$$ y = [129402977, 127778804, 126112737, 124326550, 122468156, 120674637, 118778151, 116807471, 114928403, 112962053, 110948605, 108929192, 106859278, 104729908, 102774363, 100880558, 98934832, 96961450, 94880345, 93011596, 91260575, 89575436, 87884391, 86091053, 84388366, 82792610, 81320908, 79733017, 78268469, 76890709, 75465511, 74105025, 72851128, 71540911, 70326064, 69082699, 68058932, 66964632, 65960331, 64908006, 63849851, 62741807, 61705560, 60773921, 59797388, 58894244, 58156274, 57341730, 56457145, 55708996, 54790248, 54012845, 53232630, 52541269, 51764630, 51094360, 50513557, 49779086, 49097117, 48380396, 47686449, 46966627, 46497522, 45906574, 45270996, 44757232, 44322826, 43517862]
3678D3517862n48018m29036n34265n68294n77041l58396n54725o43866m70452
3669C8833769m51463m89405m49408m05560l85908l51335n46314l68380m00860
3660C4985136m31169l04509k47006k17254j43903l47322l48128k40771j93282
3651C2511792k55512j13786k60907j72601n4553k61435j60065k52391k10441l0405
3641C0739696p5662j81759j46844j96634l5269j11575j17728N037j09842p8065
3631B9691355J3062o1049J9345J1599j93830m2469J55725J04250J34859J16683
3621B9949530N0710L4527J82036K13225K15890L5570J85226K28231K00420J02175
3611C1397540K56383L47110K82211J98870L97725J69938L80206L29517N06519
$$ y = [43517862, 42969844, 42540808, 42006543, 41438249, 40861208, 40502812, 39948087, 39304221, 38833769, 38382306, 37892901, 37443493, 37037933, 36652025, 36300690, 35754376, 35385996, 34985136, 34553967, 34249458, 34002452, 33785198, 33641295, 33293973, 32945845, 32705074, 32511792, 32256280, 32142494, 31881587, 31708986, 31654433, 31392998, 31232933, 30980542, 30770101, 30739696, 30664034, 30482275, 30335431, 30138797, 30103528, 29991953, 29874225, 29879262, 29769420, 29691355, 29704417, 29643368, 29662713, 29674312, 29480482, 29438013, 29593738, 29697988, 29832847, 29949530, 30000240, 30034767, 30216803, 30430028, 30645918, 30681488, 30866714, 31094945, 31295365, 31397540, 31653923, 32001033, 32283244, 32482114, 32879839, 33049777, 33429983, 33759500, 34266019]
3602C4266019N30971L39269N26894N07957M99088N98048N24051N73314O85504
3593C9051115P07924N89015N68720Q15086Q29410O94231O12327P31496O52532
3584D5251856Q55965Q21428O55889P77248P79208O85738Q20636R07615R66588
3575E2522171R22886Q61324Q25200R61645R04913J035916R60894R61682J223701
3566F1180332J105586R74838J038352R75086J118254J200107J076252J060002
3558F9728809J009023J303409J358735J381521J373889J408168J542446J505974
3550H0611974J662716J831013J863406J925789K095259K238006K307744K496580
3542I7032487K616138K762100L123314L242076L336362L684293L749812M138335
$$ y = [34266019, 34796990, 35136259, 35663153, 36171110, 36670198, 37268246, 37792297, 38365611, 39051115, 39759039, 40348054, 40916774, 41731860, 42561270, 43255501, 43867828, 44599324, 45251856, 46107821, 46929249, 47585138, 48362386, 49141594, 49827332, 50647968, 51555583, 52522171, 53445057, 54306381, 55131581, 56093226, 56998139, 58034055, 58994949, 59956631, 61180332, 62285918, 63260756, 64299108, 65274194, 66392448, 67592555, 68668807, 69728809, 70737832, 72041241, 73399976, 74781497, 76155386, 77563554, 79106000, 80611974, 82274690, 84105703, 85969109, 87894898, 89990157, 92228163, 94535907, 97032487, 99648625, 102410725, 105534039, 108776115, 112112477, 115796770, 119546582, 123684917]
3534A23684917M075410M261958M471083M667537M572217M933539N026674N148166
3526A60841501N017376M850476N203943N315498N033203M757806M764093M498036
3518B00281932M354974M073666L782702L323068L021002K339721J995836J551756
3510B24724657J185289N55395O7839o17556r53993j442182j757409k378300k729860
3501B16653880l047319l342259l433494l652266l923923m064945m132110m200353
3493A86857211m435886m192991m287628m294117l924912l810513l769274l635522
3485A54506368l573466l396365l126570k870136k490686k453804k282626j965391
3477A32347324j815523j576842j501633j351358j087694j108196q41886p26788
$$ y = [123684917, 127760327, 132022285, 136493368, 141160905, 145733122, 150666661, 155693335, 160841501, 165858877, 170709353, 175913296, 181228794, 186261997, 191019803, 195783896, 200281932, 204636906, 208710572, 212493274, 215816342, 218837344, 221177065, 223172901, 224724657, 225909946, 226465341, 226533180, 225915624, 224961631, 223519449, 221762040, 219383740, 216653880, 213606561, 210264302, 206830808, 203178542, 199254619, 195189674, 191057564, 186857211, 182421325, 178228334, 173940706, 169646589, 165721677, 161911164, 158141890, 154506368, 150932902, 147536537, 144409967, 141539831, 139049145, 136595341, 134312715, 132347324, 130531801, 128954959, 127453326, 126101968, 125014274, 123906078, 123064192, 122337404]
3469A22337404o17099n41993m43121m75038l06122l38113k63446m92134l76423
3460A18483915n80013n42105n33933p05578p70162p35900q66129r01396j005176
3451A11843523j173214j114248j141291j136734j311642j417354j432090j570381
3443A01546569j666185j729511k030391k231849k118421k246514k133240k209051
3435H5181407k128881j918997j814617j575904j444829j293138j119074r99535
3427G2886432o90536n89042l54346k36545l17308n494L2164J93936M89793N85206
3417G1994260M15965M31437N37000M90038N06333M17047L07822M8017L707J41812
3407G5293438n467o7606k69062j13517q3737L07868P8945J93036L87363L90398
$$ y = [122337404, 121720305, 121178312, 120735191, 120260153, 119954031, 119615918, 119352472, 118860338, 118483915, 117903902, 117361797, 116827864, 116122286, 115352124, 114616224, 113750095, 112848699, 111843523, 110670309, 109556061, 108414770, 107278036, 105966394, 104549040, 103116950, 101546569, 99880384, 98150873, 96120482, 93888633, 91770212, 89523698, 87390458, 85181407, 83052526, 81133529, 79318912, 77743008, 76298179, 75005041, 73885967, 72886432, 72195896, 71606854, 71252508, 71015963, 70698655, 70693161, 70725325, 70919261, 71409054, 71994260, 72410225, 72841662, 73378662, 73868700, 74375033, 74792080, 75099902, 75147919, 75151626, 75293438, 75287971, 75220365, 74951303, 74837786, 74754049, 75061917, 75140862, 75333898, 75721261, 76111659]
3397G6111659M41064N34907N40363O11365O73767O05123Q68303P37265P62042
3388H1885858J045575Q34167J072929J178035J039580J319229J477487J565282
3380I1418142J717386K038269K061753K168818K448451K692916K709797K878679
3372A10134211L094018L318617L302859L375003L445169L407174L379541L350395
3364A36806987L147171K745015K390173K055144J566581J025550M53041m4837
3356A50144825n41855j178107j676950j845813k134302k383179k524351k452565
3348A35407703k316159k316423k260470k063075k073032j909645j619835j454672
3340A19394392j261052j191687j106287q97898q44933p59978o90227o11598m87777
$$ y = [76111659, 76552723, 77087630, 77627993, 78239358, 78913125, 79518248, 80386551, 81123816, 81885858, 82931433, 83765600, 84838529, 86016564, 87056144, 88375373, 89852860, 91418142, 93135528, 95173797, 97235550, 99404368, 101852819, 104545735, 107255532, 110134211, 113228229, 116546846, 119849705, 123224708, 126669877, 130077051, 133456592, 136806987, 139954158, 142699173, 145089346, 147144490, 148711071, 149736621, 150189662, 150144825, 149602970, 148424863, 146747913, 144902100, 142767798, 140384619, 137860268, 135407703, 133091544, 130775121, 128514651, 126451576, 124378544, 122468899, 120849064, 119394392, 118133340, 116941653, 115835366, 114937468, 114092535, 113332557, 112642330, 112030732, 111542955]
3331A11542955o66933p35337n73167o08931q83610j065021j016292j001733j085397
3322A03906534j197840j302115j222892j308805j466573j748702j572147j658558
3314I2428902j898189j887147j934662k104160k183174k115123k055184j967671
3306G6283592k102192j999483j941180j925977k028251j903139j881834j849150
3298F0652386j864104j661028j704740j842450j450314j403553j485356j401168
3290D7839673j345585j385626j175773r81716r14557r74538r77148p68259p89043
3281C8527428r11344q59115n52695n56811p35496o29454n75895n97815n89754
3272C2519049l75122m14582l37958m22703l13579l17449j38869j29869k38103
$$ y = [111542955, 110876022, 110140685, 109567518, 108958587, 108074977, 107009956, 105993664, 104991931, 103906534, 102708694, 101406579, 100183687, 98874882, 97408309, 95659607, 94087460, 92428902, 90530713, 88643566, 86708904, 84604744, 82421570, 80306447, 78251263, 76283592, 74181400, 72181917, 70240737, 68314760, 66286509, 64383370, 62501536, 60652386, 58788282, 57127254, 55422514, 53580064, 52129750, 50726197, 49240841, 47839673, 46494088, 45108462, 43932689, 42950973, 42036416, 41061878, 40084730, 39316471, 38527428, 37616084, 36756969, 36204274, 35647463, 34911967, 34282513, 33706618, 33108803, 32519049, 32143927, 31729345, 31391387, 30968684, 30655105, 30337656, 30198787, 30068918, 29830815]
3263B9830815k28927j57589r4694j28253k47231j56036k45530j63826k78726l92801
3253B7737202k45757k12390k40657m16403m02144l51383k87133k82204j67965
3244B5131166k89023l59118k66507k16460k37899k29728l11851j03057o5534j84501
3234B2867488j04134j12814j49908j50400j63211o0524n2929j23884k00655n926
3224B1743103m7042M5573K08591j55136j34728l7694l3938J59778l7671M007r2085
3213B1622758Q5555L1302r6876O0815P6042J00981o0066P3451J56783J54281n1178
3202B2153848J03408K32920q655R9861R6072P8657K25149J59013K36739R0480
3192B3467492J68538J56991K79644L26274J07521L10488L59892K59067K13178
$$ y = [29830815, 29601888, 29444299, 29349605, 29221352, 28974121, 28818085, 28572555, 28408729, 28130003, 27737202, 27491445, 27279055, 27038398, 26621995, 26219851, 25868468, 25581335, 25299131, 25131166, 24842143, 24483025, 24216518, 24000058, 23762159, 23532431, 23220580, 23117523, 23051989, 22867488, 22763354, 22650540, 22500632, 22350232, 22187021, 22126497, 22073568, 21949684, 21749029, 21743103, 21696061, 21741634, 21950225, 21795089, 21660361, 21622667, 21588729, 21748507, 21710836, 21714843, 21622758, 21708313, 21739615, 21642739, 21703554, 21779596, 21880577, 21820511, 21893962, 22050745, 22205026, 22153848, 22257256, 22490176, 22481521, 22581382, 22677454, 22756111, 22981260, 23140273, 23377012, 23467492, 23636030, 23793021, 24072665, 24398939, 24506460, 24816948, 25176840, 25435907, 25649085]
3183B5649085L72248L62388M20105K70826M17967K31780L09306L84761M56428
3174B8874894M02392M82113N91377M34722M06050O64691O42760N15944P11981
3165C3726924M85356O16313O80224P90825Q07043P99720R21868Q06967O62609
3156D0297849J094661J050133J138039R91146J164484J232681J237589J292365
3148D9498947J142118J351941J409892J665653J615868J551448J744428J944188
3140F1924483J866709K098646K245943K262147K395145K557156K718544K893521
3132H0962294L067696L280948L330829L397021L902645L971178M164556M561078
3124A10638245M778467N192148N325256N773390O226072O652435P108198P442165
$$ y = [25649085, 26021333, 26383721, 26803826, 27074652, 27492619, 27724399, 28033705, 28418466, 28874894, 29277286, 29759399, 30350776, 30785498, 31191548, 31856239, 32498999, 33014943, 33726924, 34212280, 34828593, 35508817, 36299642, 37106685, 37906405, 38828273, 39635240, 40297849, 41392510, 42442643, 43580682, 44571828, 45736312, 46968993, 48206582, 49498947, 50641065, 51993006, 53402898, 55068551, 56684419, 58235867, 59980295, 61924483, 63791192, 65889838, 68135781, 70397928, 72793073, 75350229, 78068773, 80962294, 84029990, 87310938, 90641767, 94038788, 97941433, 101912611, 106077167, 110638245, 115416712, 120608860, 125934116, 131707506, 137933578, 144586013, 151694211, 159136376]
3116A59136376P960244Q306956R010372R532275R995589J0665153J1168345J1589188
3108B37364498J1983349J2301365J2738648J2996742J2926208J2763252J2455516
3101C25529578J1641377J0714375R633198Q014573O108303M203166K116416j47082
3093C77813904k478047m410795o227018p663120r013358r759481j0251359j0684399
3085C17326327j0681313j0645147j0417777r920127r457525r175944q498353p801742
3077B40728399p366398o908933o219081n513230n071443m664610m272593l836907
3069A96875204l338575l093198k892171k491334k360225k207509j734563j808185
3061A76949444j447015j275206q87774l68669R3325N77904J022970J795535K428335
$$ y = [159136376, 167096620, 175403576, 184413948, 193946223, 203941812, 214606965, 225775310, 237364498, 249347847, 261649212, 274387860, 287384602, 300310810, 313074062, 325529578, 337170955, 347885330, 357518528, 365533101, 371641404, 375844570, 377960986, 377813904, 375335857, 370925062, 364698044, 357034924, 348021566, 338262085, 328010726, 317326327, 306645014, 295999867, 285582090, 275661963, 266204438, 257028494, 248530141, 240728399, 233362001, 226453068, 220233987, 214720757, 209649314, 204984704, 200712111, 196875204, 193536629, 190443431, 187551260, 185059926, 182699701, 180492192, 178757629, 176949444, 175502429, 174227223, 173339449, 172970780, 173064105, 173642009, 174664979, 176460514, 178888849]
3052A78888849L109938L925824M482660N386499O087913P022668P744772Q564150
3044B25213273R129287R309574R707433R612579Q703920P550573N635474L073670
3036B87935783N3125l320767o255194q936475j0613390j1937279j2351856j2339420
3028B22234527j1992675j1272961j0671133j0192782r355951q657745p968990
3021A52122290p376927o914105o550037o093047n704593n471278n151123m731412
3013A04129768m389363m248146l816432l647594l318996l122357l020039k843721
3005G5723120k508899k334780k244959k244407j951090k028526j786759j750554
2997E8873146j695086j543175j474240j507229j418419j237094j156786j105348
$$ y = [178888849, 181998787, 185924611, 190407271, 195793770, 201881683, 208904351, 216649123, 225213273, 234342560, 243652134, 253359567, 262972146, 271676066, 279226639, 284862113, 287935783, 287988908, 284668141, 278412947, 269476472, 258863082, 246925803, 234573947, 222234527, 210241852, 198968891, 188297758, 178104976, 168749025, 160091280, 152122290, 144745363, 137831258, 131281221, 125188174, 119483581, 114012303, 108861180, 104129768, 99740405, 95492259, 91675827, 88028233, 84709237, 81586880, 78566841, 75723120, 73214221, 70879441, 68634482, 66390075, 64438985, 62410459, 60623700, 58873146, 57178060, 55634885, 54160645, 52653416, 51234997, 49997903, 48841117, 47735769]
2989D7735769j265772j089597r74713j005116j031100q81358q80646q68642q61137
2980C8877688q18696p65649o41014p60614o25594o70268n68508o26495n98266
2971C2802584n43122o01736n85194m15573l72780m50545o04039m45967m59591
2962B8324037m02606l20002m83758m54187l58353n72822l46418l49076m87118
2953B4549697k61240k91800k54085l69907m05090l71508m08531k38983k63756
2944B1684797j73419l53918k48549j62473j68843k57034l26156k30544l0515l23204
2934A9410142l68293p0182j51319k82965k94517j24375j97936j48624j66437k00573
2924A7404921l13128r0296l13898k77429j19310j55571j92171q859k30518l36827
$$ y = [47735769, 46469997, 45380400, 44405687, 43400571, 42369471, 41488113, 40607467, 39738825, 38877688, 38058992, 37293343, 36652329, 35891715, 35266121, 34595853, 34027345, 33400850, 32802584, 32259462, 31657726, 31072532, 30656959, 30284179, 29833634, 29229595, 28783628, 28324037, 27921431, 27601429, 27117671, 26663484, 26305131, 25732309, 25385891, 25036815, 24549697, 24288457, 23996657, 23742572, 23372665, 22967575, 22596067, 22187536, 21948553, 21684797, 21511378, 21157460, 20908911, 20746438, 20577595, 20320561, 19994405, 19763861, 19733346, 19410142, 19041849, 18971667, 18820348, 18537383, 18242866, 18118491, 17920555, 17771931, 17605494, 17404921, 17091793, 17001497, 16687599, 16410170, 16290860, 16135289, 15943118, 15934259, 15703741, 15366914]
2914A5366914m7989q8932j22998j38259l07210k01742o1871j65296m3419k48433
2904A3940765l38504l5100j04028j21162o164j75602k27376m6164j50230j11350
2894A2625085l8761q0991j68117l8860j47285j71550p6916K9015k13297j43203
2884A1575120o1376n8999r1967r1222j75021o1973j46089o6868L1287Q8977o657
2873A0935212k15179j70479o7819O7544o8228j18898j42376j38429j08763p8480
2863I894105m4315k0115j19388l0777j6609K689j53992j69280j33360J31740j99149
2852I141549j67444J26319J18390m7605K7315k10993k53563R8323k095l3171r3489
2841H703536M77o36q3437l1856Q4287o1308k513p4117m8769p0786l7699R7791
$$ y = [15366914, 15318925, 15229993, 15106995, 14968736, 14661526, 14459784, 14397913, 14232617, 14189198, 13940765, 13602261, 13567161, 13463133, 13341971, 13335807, 13160205, 12932829, 12886665, 12736435, 12625085, 12586324, 12505333, 12337216, 12298356, 12151071, 11979521, 11902605, 11931620, 11718323, 11575120, 11513744, 11454745, 11362778, 11271556, 11096535, 11034562, 10888473, 10821605, 10852892, 10941869, 10935212, 10720033, 10549554, 10481735, 10549279, 10481051, 10362153, 10219777, 10081348, 9972585, 9894105, 9849790, 9829675, 9710287, 9679510, 9662901, 9665590, 9511598, 9342318, 9208958, 9340698, 9141549, 8974105, 9100424, 9218814, 9171209, 9198524, 8987531, 8733968, 8832291, 8830196, 8797025, 8703536, 8704013, 8703377, 8619940, 8588084, 8672371, 8611063, 8608550, 8534433, 8485664, 8414878, 8377179, 8474970]
2829H474970Q4458N2997m4206q7307j21018j9183J64507q4970J45732M3740k41177
2818H368543L8899k1988K63493J34463q9484q5613p1126j00869k5757p2632j34155
2807H203774Q7775k8686j31260k8141j467k71999O767K336q4007o6957k03484
2796G484651p4354j22333M1124l7926m216j31016k69167M8093p5213o7078K6441
2785F819006j09591j16679N6834n4170j61213q5004j86709L1792K3779m2443N9108
2774F234710M0452j74979j33927K4147L2535j7306L0927m3061O7281j79200N7592
2763E939171L5310j244l8696j78730J06678J21446j40833Q8827J0106J21763J2257
2752F076055j38818j9375l0377j13516j1553j1013j9308j03789j13964r5851m0932
$$ y = [8474970, 8559428, 8612425, 8568219, 8480912, 8359894, 8340711, 8505218, 8420248, 8565980, 8609720, 8368543, 8407442, 8385454, 8648947, 8783410, 8693926, 8608313, 8537187, 8436318, 8410561, 8337929, 8203774, 8291549, 8262863, 8131603, 8103462, 8101995, 7829996, 7836763, 7839099, 7755092, 7688135, 7484651, 7410297, 7287964, 7329088, 7291162, 7286946, 7155930, 6886763, 6934856, 6859643, 6792565, 6819006, 6709415, 6592736, 6649570, 6595400, 6434187, 6349183, 6162474, 6194266, 6218045, 6175602, 6234710, 6275162, 6100183, 5966256, 5990403, 6022938, 6005632, 6036559, 5993498, 6060779, 5881579, 5939171, 5974481, 5973237, 5934541, 5755811, 5862489, 5983935, 5843102, 5931929, 5942035, 6063798, 6076055, 5937237, 5917862, 5887485, 5773969, 5762416, 5751403, 5732095, 5628306, 5514342, 5418491, 5377559]
2741E377559j18163L9156l2147l1077j34785j33136j59142j24017K09879j30137
2731D763990o4781P2596m1256j48553N8296j88489j9712o1399O0628j25766o2023
2720D243531r4252k2391N2554m0487p1332k4170M2675L0601o3067J16066q6681
2709D083047L0138j40944j93107R8694Q025K610j26427j0990J06293L3278m3115
2698C847502J2439o8245j03061N3292O612q0821k5126n6124N9581J38218k1373
2687C762894q8790j31806O1006l9002K4614j27198K37574J05680j20769r1635
2677C592568m5382J23535k9264k36821j30303j9339L2680r1460L0038J34962m1278
2666C319936k8823P7835j96102k0330J17991P2063l1161j40085k9275n2060N7798
$$ y = [5377559, 5259396, 5298552, 5266405, 5235328, 5100543, 4967407, 4808265, 4684248, 4894127, 4763990, 4699209, 4771805, 4730549, 4581996, 4640292, 4451803, 4432091, 4370692, 4431320, 4305554, 4243531, 4149279, 4126888, 4179442, 4138955, 4067623, 4043453, 4086128, 4116729, 4053662, 4169728, 4083047, 4113185, 3972241, 3779134, 3877828, 3885853, 3888463, 3762036, 3751046, 3857339, 3890617, 3847502, 3859941, 3791696, 3688635, 3741927, 3748539, 3667718, 3642592, 3586468, 3646049, 3784267, 3762894, 3674104, 3542298, 3603304, 3564302, 3588916, 3461718, 3699292, 3804972, 3684203, 3592568, 3547186, 3670721, 3641457, 3404636, 3274333, 3254994, 3287674, 3196214, 3226252, 3361214, 3319936, 3291113, 3368948, 3172846, 3152516, 3270507, 3342570, 3311409, 3171324, 3142049, 3089989, 3147787]
2655C147787O6083L1890k24719m8168O557r411J407J65592J02973r0638r8238
2644C051115m9240j87780K1045J30760N8115R8635O3393j86825K5472r6215o5489
2633B862986q0588J1320k0647o1436L5282o5915m8709Q6834L309l46N4360M184
2621B780634l4624M3876k9844O1802O9890j8774o2049j93223O101K2853n1923
2610B594719k3057J0148k6242n8477Q7225o2817K3517l9806m0279l436Q0372o3352
2598B478515q8485o6914j54623o2728J07482J17189N0556R0637n6970m9808O0013
2587B424864l4082k9025q6743p3335q3832J39968L9501j0148j20400M8090O0209
2576B275067n6833j9169j27530J33228j8302j251q3457m5435J10186O4031J49588
$$ y = [3147787, 3213870, 3245760, 3021041, 2972873, 2979430, 2970019, 2971426, 3137018, 3239991, 3149353, 3051115, 3001875, 2814095, 2835140, 2965900, 3024015, 3122650, 3186043, 2999218, 3024690, 2928475, 2862986, 2782398, 2793718, 2773071, 2711635, 2746917, 2681002, 2632293, 2719127, 2722436, 2722090, 2776450, 2780634, 2746010, 2789886, 2760042, 2821844, 2891734, 2872960, 2810911, 2617688, 2623789, 2646642, 2594719, 2571662, 2581810, 2555568, 2497091, 2584316, 2521499, 2545016, 2505210, 2464931, 2461495, 2541867, 2478515, 2390030, 2323116, 2168493, 2105765, 2213247, 2330436, 2380992, 2471629, 2414659, 2364851, 2424864, 2390782, 2361757, 2275014, 2201679, 2117847, 2257815, 2297316, 2287168, 2166768, 2214858, 2275067, 2218234, 2199065, 2071535, 2204763, 2186461, 2185210, 2101753, 2056318, 2166504, 2230535, 2380123]
2565B380123Q4891k54317j2366m4854r9329m8843k1093K9523O2606r3679J44077
2554B126739L0293j91027L3428J52067p2135n8518n1724L6496Q3306k1613m0518
2543B026794j74515L5315Q2292j0485l0212K4417p7578L4425M9105K1900J45956
2532B127414q1131q3671R6656n4842p3593q9011J31197r4o9024N4245m2704j10140
2520A805302J68789P3542N9555n0103J4327J2984q7770j9641j76709J06529o2640
2509A844165J36627l9739k3479j95012K4641n271K0720K222O5825j23311M6422
2498A753810M5929o4273p4023J05304l3674J30668Q2787n9922L5378j10710P1329
2487A882603O6537q9550N3407r1716k25838K703p0943O8860J4668j8597k3633
$$ y = [2380123, 2465014, 2210697, 2198331, 2153477, 2054148, 2005305, 1984212, 2013735, 2076341, 1982662, 2126739, 2157032, 1966005, 1999433, 2151500, 2079365, 2020847, 1969123, 2005619, 2088925, 2067312, 2026794, 1852279, 1887594, 1969886, 1959401, 1929189, 1953606, 1876028, 1910453, 1959558, 1981458, 2127414, 2046283, 1962612, 2059268, 2004426, 1930833, 1841822, 1973019, 1972925, 1903901, 1958146, 1915442, 1805302, 1974091, 2047633, 2107188, 2057085, 2071412, 2084396, 1996626, 1976985, 1800276, 1906805, 1844165, 1980792, 1941053, 1917574, 1722562, 1747203, 1741932, 1762652, 1764874, 1830699, 1707388, 1753810, 1799739, 1735466, 1661443, 1766747, 1733073, 1863741, 1946528, 1886606, 1921984, 1811274, 1882603, 1949140, 1859590, 1912997, 1821281, 1595443, 1598146, 1527203, 1596063, 1610731, 1592134, 1568501]
2476A568501j1004l6201P2705J05133K5651n7232J1954q8605P3537L1928k9911
2465A666456j6504m4988p2809K01670J5235r2986J6805m3006k2685m8157o9663
2454A489368n2405J03656K9183j8829K2641j19071R9051k0886j24718r5727J07546
2443A419809M4372R902M2404m3443k6741J34179K8405p714J4703j11840K2473
2432A526509L195r9649P0337r3714p7672J37064J08794q0245j09624K5561J06507
2421A517063Q5912j68248p5231o2130p2344O0337J39771J04970k509J30208j06427
2410A551372m5330k899j06129Q2020j7338J18834N5989k64551j27252J3251J08977
2399A366944Q7966k2108j31399J4862K03891k2988Q291l8663j09700P5108O3294
$$ y = [1568501, 1557497, 1521296, 1594001, 1699134, 1724785, 1667553, 1679507, 1590902, 1664439, 1696367, 1666456, 1649952, 1604964, 1532155, 1733825, 1749060, 1656074, 1672879, 1629873, 1607188, 1559031, 1489368, 1436963, 1540619, 1569802, 1550973, 1573614, 1454543, 1553594, 1532708, 1407990, 1312263, 1419809, 1464181, 1474083, 1516487, 1473044, 1446303, 1580482, 1608887, 1601173, 1615876, 1504036, 1526509, 1529704, 1430055, 1500392, 1406678, 1329006, 1466070, 1574864, 1494619, 1384995, 1410556, 1517063, 1602975, 1434727, 1359496, 1297366, 1225022, 1285359, 1425130, 1530100, 1527591, 1657799, 1551372, 1506042, 1503143, 1397014, 1479034, 1461696, 1580530, 1636519, 1371968, 1244716, 1257967, 1366944, 1454910, 1432802, 1301403, 1316265, 1520156, 1497168, 1505459, 1466796, 1357096, 1432204, 1495498]
2388A495498Q8173p9815j78625m3086Q5937N4524p847j1493L11L3008j32851k11486
2376A092248R0246J26888q5300o613P9972J06295q4093m2925q4273q2670J20676
2365A230451R9882p4732J08331K3836L4883Q7329p5299n4307r4285o2241J25853
2354A349701J8440j51452k1490J06937J9198p7122k3540J12963L9855p8387N3779
2343A348882r9633q2173J5301P9966Q6900j6139m5153m0757m6985p1894J18098
2332A246413J34354N3288R0978m3155p9934j25349K6785O5372r2188N897N1127
2321A333588N6502j29815q3566J3913l1683K16399J12959m3425l08p1527J9551
2310A392588K0095O8051M572M8802J02206p3344K8586p7329l2580o8063p1098
$$ y = [1495498, 1583671, 1503856, 1325231, 1282145, 1368082, 1422606, 1414759, 1403266, 1403577, 1436585, 1303734, 1092248, 1182494, 1309382, 1224082, 1217469, 1297441, 1403736, 1319643, 1276718, 1192445, 1109775, 1230451, 1330333, 1255601, 1363932, 1387768, 1422651, 1509980, 1434681, 1380374, 1286089, 1223848, 1349701, 1368141, 1216689, 1195199, 1302136, 1321334, 1244212, 1220672, 1333635, 1373490, 1295103, 1348882, 1249249, 1167076, 1182377, 1262343, 1349243, 1333104, 1287951, 1247194, 1200209, 1128315, 1246413, 1380767, 1434055, 1525033, 1481878, 1401944, 1276595, 1303380, 1368752, 1276564, 1282461, 1333588, 1390090, 1260275, 1176709, 1190622, 1158939, 1375338, 1488297, 1444872, 1444564, 1373037, 1392588, 1412683, 1480734, 1485306, 1534108, 1636314, 1562970, 1591556, 1514227, 1481647, 1413584, 1342486]
2299A342486L5534O7795J32494o0502L5766j8107J03595P7310L8361m8725O457
2288A712464O2281K14252j5587j05188J68047K07634O6004J22849J32546K3402
2278B588704k6611Q5154J81650K65516J40970J08269J81671K59647K00111J58830
2268D143911K75517L68076M84372M50168N17630N07747O11019N21485O18752P55568
2258I254245J103552J379372J533724J956411K094251K225542K545820L108019
2250B5200936L043292J554022j342533l866034m007858l085537k350222j849874
2242A3296192j409081j182675r17412r42158o12332m03946k89483k28022n23113
2233F787970n43674m37245l83156k47817k26727l49785k48583k48197j82342j33084
$$ y = [1342486, 1378020, 1445815, 1578309, 1517807, 1553573, 1535466, 1639061, 1716371, 1754732, 1706007, 1712464, 1774745, 1988997, 1973410, 1868222, 2036269, 2243903, 2309907, 2432756, 2565302, 2588704, 2562093, 2647247, 2828897, 3094413, 3235383, 3343652, 3525323, 3784970, 3985081, 4143911, 4419428, 4787504, 5271876, 5722044, 6239674, 6747421, 7358440, 7879925, 8498677, 9254245, 10357797, 11737169, 13270893, 15227304, 17321555, 19547097, 22092917, 25200936, 28244228, 29798250, 28455717, 24589683, 20581825, 17496288, 15146066, 13296192, 11887111, 10704436, 9787024, 8844866, 8232534, 7828588, 7539105, 7311083, 6787970, 6244296, 5807051, 5423895, 5176078, 4949351, 4599566, 4350983, 4102786, 3920444, 3787360]
2223C787360j77950p4645k11416k30057k4994p7073r5561M2293k08062j97796
2213B532099o0970l176j56826l8507k6849k9546r2639L7921j07699p6175J84872
2202B162505n4410j12543n4361j19908j02885r4920r2841O100L9973k7077q4032
2191A465601M0042K96020N400j63641o6573j62581l0803M1386K0160j2316O8150
2180A500845N9829J45699j81676p7661Q1241m8136n2237m4963P8430q1129j70406
2169A209836P9518Q2701m1938p6637R7638j12831j58067k6400J35219m8765p3818
2158A066456L4040R9074k1222r6476P3509P310P20r370n3442M1684k8496j73844
2146I39943p1917J61217M1259J6567j45768P4278M9124j11448J97127j0398j69808
$$ y = [3787360, 3609410, 3534765, 3323349, 3093292, 3068298, 2991225, 2895664, 2937957, 2729895, 2532099, 2471129, 2467953, 2311127, 2272620, 2245771, 2216225, 2123586, 2161507, 2053808, 1977633, 2162505, 2108095, 1995552, 1941191, 1821283, 1718398, 1623478, 1530637, 1536737, 1576710, 1549633, 1465601, 1505643, 1801663, 1807063, 1643422, 1576849, 1414268, 1383465, 1424851, 1445011, 1432695, 1500845, 1560674, 1706373, 1524697, 1447036, 1528277, 1480141, 1427904, 1382941, 1461371, 1380242, 1209836, 1289354, 1372055, 1330117, 1253480, 1351118, 1238287, 1080220, 1053820, 1189039, 1140274, 1066456, 1100496, 1199570, 1178348, 1081872, 1155381, 1162691, 1163411, 1154041, 1100599, 1142283, 1113787, 939943, 868026, 1029243, 1070502, 1087069, 941301, 1015579, 1064703, 953255, 1150382, 1139984, 970176]
2135I70176p0458O3238k8194N5184M1712j1436n5722J8637q2044L716O0171P3809
2123A038789o9987J31089j12100o5323N9222k5804r4426j7452J10124j29684m4175
2112G80273J27221K105j261K826l7993J28089R4431j84012M2300l8021r3176o4600
2100G58182m7408J78504J03610N977q9778n091N5515j38652j34737J88594n843
2089H68873J1096J634j27704o482K9963O7846K5278j7083J294j23722P9428j14277
2077F96144J17783P9315r4579o8331j5007M8778k7850r6460R7062j2023O4158
2066G88990N4026j47635J8976j933m2994J84535j6129N7819j1151n5182j33657
2055F95665m0546j6340L5756J64124j15364k2619M4670j56918j33977O3424J72611
$$ y = [970176, 899718, 962956, 934762, 989946, 1031658, 1020222, 964500, 983137, 901093, 904809, 964980, 1038789, 968802, 1099891, 987791, 922468, 981690, 955886, 861460, 844008, 954132, 824448, 780273, 907494, 909599, 908338, 911164, 873171, 1001260, 1095691, 911679, 953979, 915958, 822782, 758182, 710774, 889278, 992888, 998865, 909087, 903996, 959511, 820859, 686122, 874716, 868873, 879969, 881603, 753899, 747417, 777380, 845226, 870504, 853421, 854715, 730993, 810421, 696144, 813927, 893242, 798663, 730332, 715325, 764103, 736253, 639793, 736855, 724832, 788990, 843016, 695381, 714357, 712424, 669430, 853965, 837836, 895655, 884504, 829322, 695665, 655119, 638779, 674535, 838659, 723295, 700676, 745346, 588428, 454451, 517875, 690486]
2044F90486J12658r8303P6761K1931r1635q4998N768N8367j0181l7105J0758O2365
2032G16872n106J823n487O9202M3558j56203m4887j6620N0823j69155J926J93007
2020F79753R2422j04815j49288O6927J9980p915N209p8275L5367K4785K2657l1841
2008E74966R658r576J1587m9190J73836K2584m8535r9984o0643P6441J08R1082
1996F92334J1923j35472K7234m94j1827j826j17600k0023Q7605K3265Q896n410
1984E58605J8096L8374l9746k0495J93199K883l9582j2771j17612o5439Q3558
1973E99070M7491j65632r1274k6483J27655Q1366p7066j67731q539P3834J53244
1962E45935p0627L4190o4509j551M9553k1092J3438l4639Q8707R657O1427P9100
$$ y = [690486, 803144, 704841, 781602, 803533, 711898, 626900, 632668, 691035, 680854, 643749, 654507, 716872, 711766, 713589, 708102, 777304, 820862, 664659, 619772, 603152, 653975, 484820, 486746, 679753, 772175, 667360, 518072, 584999, 604979, 597064, 602273, 523998, 559365, 584150, 606807, 574966, 584624, 575048, 586635, 537445, 711281, 733865, 685330, 585346, 524703, 601144, 601252, 692334, 704257, 568785, 596019, 595525, 583698, 581872, 464272, 444249, 531854, 555119, 564015, 558605, 576701, 615075, 575329, 554834, 748033, 750916, 711334, 698563, 580951, 515512, 599070, 646561, 480929, 389655, 363172, 490827, 572193, 495127, 327396, 318857, 392691, 545935, 475308, 509498, 444989, 443438, 492991, 471899, 485337, 450698, 539405, 549062, 610489, 689589]
1950F89589o0816j78517R8794N8139j42286j09934J01109j8205o2601P3741m1123
1939D07890O1915N9930M7966p3705J4345k6793j13292J034L1129j9956n5465J00327
1927D35325J14891q5597o9460J88592N1169j47604r2046j03753m3920J34937M1244
1916D23778k2726R2027p1330k1527K24222K8273k03825l5984k0629Q3036j00382
1905C74933p8749L5957N9075j2362P082L9286N2132L7515K5881j17812j9418r5219
1893C08301k773J19241J94156l0547n5730j61069k9023M4847N9290n755j09873
1882C31065M0943j25665Q5257j2602L8393J4922J44184J910o1305q2909L8910
1871D13103J36202j4894j00133k29571m8578K81397l2670l9778p4180j14083P6591
$$ y = [689589, 628773, 450256, 549050, 607189, 464903, 354969, 456078, 437873, 375272, 449013, 407890, 469805, 529735, 577701, 503996, 518341, 491548, 378256, 379290, 410419, 390463, 334998, 435325, 550216, 464619, 395159, 583751, 634920, 487316, 395270, 291517, 247597, 382534, 423778, 401052, 493079, 421749, 400222, 624444, 652717, 448892, 412908, 392279, 475315, 374933, 296184, 332141, 391216, 378854, 385936, 425222, 477354, 514869, 540750, 422938, 403520, 308301, 305528, 424769, 618925, 588378, 532648, 371579, 342556, 387403, 446693, 440938, 331065, 372008, 246343, 331600, 318998, 357391, 372313, 516497, 518407, 457102, 374193, 413103, 549305, 534411, 434278, 204707, 156129, 437526, 404856, 365078, 290898, 176815, 253406]
1860B53406O2753J55772N404o7555j5148j5446j3812j1990L2970j8875N5789j40565
1848B82703N9468R2263q3921K9241K0852J31165m5666j89203J1720O6034q8469
1837B86187J7422K9501q1324r1267k7633J22326k8361J19699J5282j17537J919
1826B46214Q2653l3232K6198j25710J55320O9532J24783P5673j27227p0191o0863
1815C63150J6424p8896J42033M9140l751M3687j937j56054Q510M3420N6395L116
1803D85237m5486r7014l8023j03022J47119J2091K5017q167J8250M9424j30516
1792C14910k9466q893R0810p3840j01404P9939K8159r0434P6920r4549o9305J44657
1780B67504J26030L9238o1632q2908o8643N9666L9073l3400J16119Q3031j31976
$$ y = [253406, 316159, 471931, 477335, 409780, 394632, 379186, 365374, 353384, 386354, 367479, 423268, 282703, 342171, 434434, 350513, 379754, 400606, 531771, 486105, 296902, 308622, 374656, 286187, 303609, 333110, 251786, 160519, 132886, 255212, 226851, 346550, 361832, 244295, 246214, 328867, 295635, 321833, 196123, 351443, 420975, 545758, 621431, 494204, 424013, 363150, 379574, 300678, 442711, 491851, 488100, 531787, 529850, 373796, 382306, 425726, 482121, 485237, 439751, 342737, 304714, 201692, 348811, 360902, 385919, 377752, 396002, 445426, 314910, 285444, 276551, 367361, 293521, 192117, 272056, 300215, 209781, 286701, 192152, 122847, 267504, 393534, 432772, 371140, 288232, 219589, 279255, 318328, 284928, 401047, 484078, 352102]
1769C52102l763N3373j2316P6820J5997j96957o3285K8761O4706K6390N1945j01949
1757B91824j79911K9535R5572j58526J39925P8276p6018K7315M0619j2359J5766
1746B92018O3039O8590J7639n9110J16607q9477j59734J69413L6104q2220q4460
1735B88409r6789J9918n2499K90N977L1684Q9506N994M9947O5616q5064J0820
1723C33809q8988J96260m2702l5498K432Q687L4132L5363o8881j9311l3621j56681
1711A65001J9456r7748J27676q4418J4643N5878l2521P0980p7174j22985R032
1700D7820J64056R4583l6256K2940r4668r2088R6928O6965K9686j53363j3269
1689A33334K1674R0p5326R1554J47971L2340l9971n0252k4554K5548M0713j00961
$$ y = [352102, 348339, 401712, 389396, 466216, 482213, 285256, 221971, 250732, 315438, 341828, 393773, 291824, 111913, 141448, 237020, 78494, 218419, 296695, 220677, 247992, 288611, 276252, 292018, 355057, 423647, 441286, 382176, 498783, 409306, 249572, 418985, 455089, 372869, 288409, 191620, 211538, 159039, 159329, 165306, 196990, 286496, 292490, 342437, 408053, 322989, 333809, 244821, 441081, 398379, 362881, 365313, 374000, 408132, 443495, 374614, 355303, 321682, 165001, 184457, 86709, 214385, 129967, 144610, 200488, 167967, 238947, 161773, 38788, 47820, 211876, 306459, 270203, 293143, 198475, 106387, 203315, 270280, 299966, 146603, 133334, 155008, 155098, 79772, 171326, 319297, 351637, 311666, 261414, 236860, 262408, 303121, 202160]
1677B02160k0254K5508k6499n7690J85186j25099j79297N3493K266J03322J20915
1666B84011m8955q3545R6972Q3880m5429m8705J5207p387K105n797o3380p1913
1654A07064M9577J19052J2156J1414k7661n6280O2787J28687o0994n9672o3127
1643B23003r0307j1597p0665K5855R3829J8136L777k81j7055p6317Q0432N3266
1631B32076k01771P3399R7468j38982p2443K7543L3499R9999r192Q384P6433O6746
1619B93159j00013o7331n907o1265k4062R0271J8148m4077J0980K8841q9074R7332
1607A47002j53595J64493J14186N1888r7560j20877R6341j82912K6687Q9695m2916
1596I2432K4125J09000o691Q1103p5853j08254o5533J01061L749n1590O4449K4817
$$ y = [202160, 181906, 207414, 180915, 123225, 308411, 183312, 4015, 57508, 59774, 163096, 284011, 235056, 151511, 248483, 332363, 286934, 238229, 253436, 246049, 248154, 242357, 178977, 107064, 156641, 275693, 287849, 299263, 271602, 215322, 278109, 406796, 345802, 286130, 223003, 132696, 121099, 50434, 76289, 170118, 188254, 192031, 191750, 174695, 98378, 178810, 232076, 30305, 103704, 201172, 62190, -10253, 17290, 50789, 150788, 141596, 149980, 226413, 293159, 193146, 125815, 119908, 58643, 34581, 124852, 143000, 98923, 109903, 138744, 49670, 147002, -6593, 157900, 272086, 323974, 226414, 105537, 201878, 18966, 45653, 135348, 92432, 116557, 225557, 218866, 299969, 224116, 115862, 50329, 151390, 155139, 103549, 167998, 192815]
1584A92815l3162k6810k0680n043K1311k377m4916P3800R2447p1000m8534L9504
1572A67355N5869R930k43352P3318J724j521l4933P3842m220R431p3233N7797
1560I2007j0505Q2646J17343j05851n9655l5800l8507J61869J5946j30659K6284
1549A15118N1764j86790l0069N0409N3140J9555L9814J4744R132j3910j079n0392
1537G1436n235P9711o5942m7261n9424L7492j5540N4829j83581J05921J95546
1526A67952M197K3859j29688l2078n8633l9228l727o149N4579m62L9598K0075
1514D0295o1647p9135J10761P7040K0610j62613R1897o2652k3924L160o6230K8909
1502h3529P9674N8245k5047j43560o428M4732J44430p6998p1942O7021L4063j9371
$$ y = [192815, 159653, 132843, 112163, 107120, 128431, 126054, 81138, 154938, 247385, 176385, 127851, 167355, 223224, 233154, -10198, 63120, 64844, 63323, 28390, 102232, 98012, 107443, 34210, 92007, 81502, 164148, 281491, 175640, 115985, 80185, 41678, 203547, 219493, 88834, 115118, 166882, -19908, -49977, 432, 53572, 73127, 112941, 127685, 136817, 122907, 121828, 71436, 66201, 145912, 79970, 32709, -26715, 10777, -4763, 50066, -133515, -27594, 167952, 172149, 196008, 66320, 34242, -24391, -63619, -67346, -73495, -18916, -19378, 20220, 40295, -21352, -100487, 10274, 87314, 107924, -54689, 37208, -25444, -49368, -46208, -112438, -83529, -3855, 54390, 29343, -114217, -120645, -75913, 68517, -8481, -80423, -13402, 20661, 1290]
1490A290J90807m7069j41670m3184J42305Q4031n0190R8811l1903n6299j07303
1479C9626m7514Q9285o9417N8564Q8875j8951M4008L3629r8338q1742M6222L0154
1467A14401J54734j28926k4743K0710q9780k6127M2334l9389l0917L3654m0063
1456a4112P8112p0916K3155L861k0129J17409Q2815m1401j31920r7100N0869Q99
1444a8458K2660N6433p1799j21449L577N0705l2971J11129N3067J04142q6552
1433G0484o9454O4837k3551k1009K44358k5350j48472o6184j1006P7012J1486
1422A03151o8331J5206n4876n9463K6446j8801J51442N0642J08098n7994k00723
1411e203k8428J1438J4007J16723p6998k4493J08220M1876J27088j78930j57439
$$ y = [1290, 192097, 145028, 3358, -39826, 102479, 186510, 136320, 235131, 203228, 146929, 39626, -7888, 81397, 11980, 70544, 159419, 140468, 184476, 218105, 119767, 38025, 84247, 114401, 269135, 140209, 115466, 136176, 46396, 20269, 62603, 23214, -7703, 25951, -14112, 64000, -6916, 16239, 20100, -29, 117380, 200195, 158794, 26874, -70226, -19357, -18458, 4202, 60635, -11164, -132613, -129036, -78331, -111302, -173, 52894, 157036, 70484, 1030, 65867, 42316, 21307, 265665, 240315, 91843, 25659, 14653, 91665, 103151, 34820, 50026, -4850, -64313, -37867, -56668, 94774, 145416, 253514, 195520, -5203, -33631, -22193, -8186, 108537, 31539, 7046, 115266, 157142, 284230, 105300, -52139]
1400e2139L0188M4224j08474J29434O0990j90486J7711J10141K6307n8849j6218
1389g171M3232j7213m7539j1079M4849m7613j1710k1991O8215n2507J4448L8070
1377h009j5813r518M9383n1364k8633O0171m6280j15253N8539J7571R329J27802
1365D7925Q2761p7595o2224K4558k838n5102k9841Q8646j18133j9605M9168J4938
1353e7342n2796j46377O1790J17015N9370j60307L8152J23483l126J4301l168
1342i005J8614m2034J0453M7172p3702M3424O3542L5490J9566p378M1970o3084
1330H5028q2053O738k8399m8070M4443K5062o1499Q0697Q4903j72171P2882R830
1318A7391n8772k4289J45366j20757J54089l1792r0002j4268K601L8395P0088
$$ y = [-52139, -21951, 22273, -86201, 43233, 104223, -86263, -68552, 41589, 67896, 9047, -7171, 36061, 18848, -28691, -39770, 5079, -42534, -54244, -76235, -8020, -60527, -46079, -8009, -23822, -33340, 16043, -35321, -63954, -3783, -50063, -165316, -106777, -89206, -79877, 47925, 130686, 53091, -9133, 15425, 12587, -42515, -72356, 16290, -101843, -121448, -72280, -57342, -110138, -256515, -194725, -77710, -18340, -178647, -140495, -17012, -20138, -5837, -9005, 9609, -32425, -21972, 25200, -48502, -5078, 58464, 93954, 113520, 106142, 148112, 85028, 2975, 9713, -18686, -66756, -22313, 2749, -58750, 21947, 106850, -65321, 7561, 17391, -41381, -65670, 79696, -41061, 113028, 81236, -8766, -23034, -20433, 17962, 88050]
1307H8050m8956N615Q8398r943l3653j10748J04448m7921J4123L0096l610j7989
1295E7910J8893o1513q9267M6777R0811q7960M5329O8872n2102m8152j03923n4184
1283a68509L5624J40357j09745J21113j14362q8532J06896K5664k100p1167J16470
1272h291k6936K8713O8938L8860o5725L1435O7965k45280n4971J29445k8842K6783
1260c7906J4566r8184J444J2412J04012p7652n8912J71860M7968j71924p8133
1249a70449r4685L7805M8170M7794M8178o3627K260o3007J18646P4199L1595n9804
1237d2925j08250J2384N3164q553O0364j4647N1784m1528r3278j90j85672N5522
1225b61825R559K0129J70786R5278j45449j24093Q09M9154J26667q147J0618n0962
$$ y = [88050, 39094, 44709, 133107, 123164, 89511, -21237, 83211, 35290, 49413, 79509, 75899, 57910, 76803, 15290, -73977, -27200, 63611, -24349, 20980, 89852, 37750, -10402, -114325, -168509, -132885, 7472, -102273, 18840, -95522, -184054, -77158, -51494, -53594, -124761, -8291, -35227, -6514, 62424, 101284, 35559, 66994, 134959, -110321, -165292, -35847, -64689, -37906, -23340, -121524, -120080, -107668, -3656, -81308, -140220, 31640, 79608, -92316, -170449, -265134, -227329, -179159, -131365, -83187, -146814, -144554, -207561, -88915, -14716, 16879, -42925, -151175, -138791, -85627, -94180, -33816, -48463, 3321, -38207, -131485, -131675, -317347, -261825, -252266, -232137, -61351, 33927, -111522, -235615, -234806, -185652, -58985, -67132, -56514, -107476]
1213a07476O1030J61341q2838n0873J08885m3393q1643l3083o3929R0455k9844
1202g1368j28462K5486l5100J29763L0677m6341Q1933L0581j4834p3100m0213
1191a10978P2563J81974L7938n459o2697j73455k7337K3156J10524l5027r5301
1180h4099k2719Q5537l8066J53050N6263r6467j08787p9249M216J1900L8103Q6469
1168F151M4527M024n150J29590l8038k0428o222j64206p5062R2964j33741k5997
1156a91588M8769R3765K729k1351N8928j344o770m312r4042k0296P1742O2392
1144a378j15144m1793J25844j01017q3421K2206J78934j55890r9812R4937J4602
1133a61932L2602m1332j17525K14249J39603J88q927j40301l2145N3147M8607
$$ y = [-107476, -46446, 114895, 32057, -18816, 90069, 46676, -34967, -68050, -131979, -41524, -71368, -199830, -174344, -209444, -79681, -49004, -95345, -13412, 17169, 2335, -70765, -110978, -38415, 143559, 181497, 176038, 113341, -60114, -87451, -64295, 46229, 11202, -84099, -106818, -21281, -59347, 93703, 149966, 53499, -55288, -134537, -130321, -118421, -80318, 6151, 50678, 54702, 49552, 179142, 141104, 120676, 114454, -49752, -124814, -31850, -165591, -191588, -142819, -49054, -46325, -67676, -8748, -10092, -16862, -21174, -115216, -135512, -63770, -1378, -116522, -158315, -32471, -133488, -216909, -194703, -15769, -171659, -271471, -176534, -161932, -129330, -170662, -288187, -73938, 65665, 65853, 56926, -83375, -115520, -62373, -13766]
1122a3766K9834P9820r0514n8611P2442j38781R2503O9146j9910l9919o9822o1178
1110a48756J8495N1496j6483j6113Q3494p5212J12270R5229p3254j57403L9719
1099h6518m7401P174J10892o5809n3286O1736r7626J13355o301o2274m2362N425
1087a62995P4360n3846P991J06663O4247J06705n5419j69074M6030O5784l6597
1076f151q1774r162l7342P4108j1898O1512K1794k1297J1928o182j6622m0633
1064f1719p6204P1495N4730P3046Q199r1088r6505P1684Q557O1997o6899j20214
1052a62921M0686j4784J081J5184r6498J4963J8790M8992M8349m4728j34251p3490
1040c38627J26924J43405q0528J51691j01842K3156L5964j40879J4965k4916K9107
$$ y = [-13766, 16068, 95888, 5374, -53237, 19205, -119576, -27073, 42073, 22163, -17756, -87578, -148756, -130261, -78765, -95248, -111361, -27867, -103079, 9191, 104420, 31166, -126237, -86518, -133919, -126745, -15853, -81662, -134948, -73212, -170838, -57483, -63784, -126058, -168420, -162995, -88635, -142481, -134490, -27827, 36420, 143125, 87706, -81368, -35338, 30446, -6151, -87925, -97087, -134429, -60321, -72219, -10707, 11087, -10210, 1718, -4464, -21086, -61719, -137923, -66428, -11698, 61348, 69547, -21541, -118046, -46362, -37805, 24192, -42707, -162921, -122235, -137019, -135938, -120754, -217252, -202289, -183499, -134507, -86158, -130886, -265137, -338627, -211703, -68298, -148826, 2865, -98977, -75821, -39857, -180736, -165771, -190687, -161580]
1029a61580k544k0051m2918K09972j26865m4384L6251k14K1514M1268J75135p7451
1017H133m0714j05657q1783J50844n135k4626p1404m802l8987P7418j6788l46
1005a53847J30538m7863k242j5175j11903M0908k8327M274M2404j18318o7503
994c27054K9209P6090L2265l1124J48645P8739k19117j7851J68699R9606m9564
983a1457n7023j2261m6934m994p3934J15848N0031J1031m0812O615O984j12877
971a69783p6747k553J25594J10967q3876j5175j3617n7496P4897M3216M1574m5283
959f8282o3195j50161j5232J73583m430l9906M3044Q984p675P4856N3439N4916
947E9941o6097k00187q6414P9377m261r2888J74059L6667l8415j32131J01093
$$ y = [-161580, -164124, -184175, -227093, -17121, -143986, -188370, -152119, -152333, -130819, -89551, 85584, 8133, -32581, -138238, -220021, -69177, -74312, -98938, -170342, -175144, -214131, -136713, -153501, -153847, -23309, -71172, -73414, -88589, -200492, -159584, -187911, -183637, -141233, -259551, -327054, -297845, -221755, -189490, -220614, -71969, 6770, -212347, -230198, -61499, 38107, -11457, -68480, -80741, -127675, -132669, -206603, -90755, -40724, -29693, -70505, -63890, -56906, -169783, -246530, -249083, -123489, -12522, -96398, -111573, -125190, -182686, -107789, -64573, -22999, -68282, -131477, -281638, -296870, -123287, -127717, -167623, -124579, -115595, -123270, -48414, 5025, 59941, -6156, -206343, -292757, -213380, -217641, -310529, -136470, -99803, -138218, -270349, -169256]
936a69256P1444o4493o3745P7715Q7310M0457K7119j7656j012J6634k0981o9816
924h6280j55420J12137O6140j1202n7700j1772n3896k9803O4859J69434q0128
913g3631o3338N6168o2285L1779m4329l5415Q2890L3498l1340P2541r0032L8652
901h4842k908j34110N5538K2575l7796J0057J76752q103l2439J2800j36672Q0431
889g8717j21675J22773l5558j6425N9492N9283m3405j19934L1126J43446k8853
878b8447p6834O5319N5696n250p2069k6787j54073M3528O9446M7156r0q520m8167
865a39092q6443J00994N1125r6458j30785Q077k0660p1121J72352P5244L181M0134
853i3452k2667o9391M3430m5389r357Q5589j39106p039J35015L7836k805q5060
$$ y = [-169256, -97812, -162305, -226050, -148335, -61025, -20568, 6551, -11105, -12117, 4517, -16464, -86280, -241700, -129563, -63423, -74625, -132325, -144097, -197993, -227796, -162937, 6497, -73631, -136969, -80801, -143086, -111307, -155636, -191051, -108161, -74663, -106003, -33462, -123494, -84842, -87750, -221860, -166322, -143747, -181543, -171486, 5266, -2837, -35276, -22476, -159148, -78717, -200392, -77619, -113177, -129602, -70110, -10827, -54232, -174166, -143040, 406, -28447, -105281, -39962, 15734, 10484, -61585, -88372, -242445, -198917, -129471, -82315, -82405, -90925, -139092, -225535, -124541, -73416, -169874, -300659, -292582, -313242, -384363, -212011, -136767, -133586, -93452, -116119, -185510, -142080, -187469, -196826, -111237, -250343, -257382, -122367, -84531, -87336, -172396]
841a72396p4717L0214O4292M5477j01741Q322O2684q899l5359j50648K0552M1959
829b70260o5687j6138j04646J11302J73213Q1420K4126j22334k0636O3519P467
818a38654J19819L0816j1565o0894n3996l8623J54755K853r2129l9101j18539
807b45258j13587J41488N8502k02571K4635J44126J20056j9477N6550L1305L2214
796B7983J7467k43160N980K2994P9093l6672o0326Q2738p9773K9176j5833l7795
784b08128j92M3180K2568n8013P5410L4504J2142o1906M4936K3343Q016j51723
772b15863Q0035r594j24799J97635k5481r6814P0058R5691L8294o1267j34243
761a86348j8454M0972j2506N2194M5233j78146O1398K18896o7578j22198J24808
$$ y = [-172396, -247113, -216899, -152607, -107130, -208871, -200549, -137865, -146764, -182123, -332771, -312219, -270260, -335947, -352085, -456731, -345429, -172216, -90796, -66670, -189004, -209640, -146121, -138654, -18835, 11981, 416, -60478, -114474, -153097, 1658, 4511, -87618, -126719, -245258, -358845, -217357, -158855, -361426, -336791, -192665, -72609, -92086, -35536, -4231, 27983, 45450, -197710, -191730, -168736, -89643, -126315, -186641, -103903, -183676, -154500, -170333, -208128, -208320, -165140, -142572, -200585, -125175, -90671, -78529, -140435, -95499, -72156, -64140, -215863, -135828, -145422, -270221, -72586, -98067, -194881, -124823, -29132, 9162, -52105, -186348, -204802, -163830, -176336, -124142, -78909, -257055, -195657, 23239, -44339, -166537, -41729]
750d1729L1700n9164j17182o5662n4405J67977N7568j4514J16197k3918o1808
739f4940m0050j4186k5322O4550l8494k6332J81364j16347k7410l4492K2014N0124
727f9521P3994r8924j8597j23477L6134J65787k3418j05844j71382L5000J81780
716a18468m2838K7998P6745m8877j3956N2880O4308n4535m3371j22200N765J65036
704e1513j34905k8057L2743j26175O7369J93712K7890O3755j62845p4429K6837
693a65618o6301N1617R9909j3448n4924j3631M6624j3755P5364j75527K3639J28606
681g7445j32543J38331o3037j4828o5414M0315m4565M5980M6782L9927R397K4650
669e2450l7703j22507O431J08570j5834o1977P6682O717r6229p0586p8738K4354
$$ y = [-41729, -10029, -69193, -186375, -252037, -306442, -138465, -80897, -95411, 20786, -3132, -64940, -104990, -119176, -144498, -79948, -118442, -144774, 36590, -79757, -107167, -141659, -119645, -69521, 4473, -94451, -113048, -236525, -200391, -34604, -58022, -163866, -335248, -300248, -118468, -161306, -133308, -56563, -105440, -119396, -66516, -2208, -56743, -100114, -222314, -216549, -51513, -186418, -214475, -181732, -307907, -240538, -46826, -18936, 44819, -118026, -192455, -165618, -231919, -180302, -80393, -93841, -148765, -162396, -115772, -129527, -54163, -229690, -206051, -77445, -209988, -71657, -134694, -149522, -214936, -174621, -219186, -173206, -126424, -86497, -77100, -52450, -90153, -212660, -206229, -97659, -113493, -175470, -98788, -92071, -188300, -258886, -337624, -313270]
657c13270P479J24516J03375N028k16267O4709N3324j33414M4431K7100p866M8725
645a92130K8861Q093J25847p7131L9072l6971o425K8945j32644k282n4088p3610
633c44463J14255L4161K4228J5982o2743P0288Q3625L0469j22419O1949n6884
622a51552o5823K1102o85J02330M2660J5148P5678Q900l6790j04694K4336j67384
610b36774k8165J9194R2238J02663p1698q014K6834m6272k7996L3499j88594N6150
598b76935J23021j46144M3530m8113m887n257K2211J01204N6424J8268q366m4887
586a69931r7358O7077j2832J44020k5910r1379L4148p6339J10803o8747j28903
575c15351J19932l7930L0981O0269k4785Q9092q5883K9274J1166J6372O9130k6890
$$ y = [-313270, -305791, -181275, -77900, -72872, -289139, -224430, -171106, -304520, -260089, -232989, -240855, -192130, -163269, -155176, -29329, -106460, -67388, -104359, -110784, -81839, -214483, -216765, -270853, -344463, -230208, -196047, -171819, -155837, -218580, -148292, -64667, -34198, -156617, -94668, -151552, -217375, -196273, -196958, -94628, -51968, -36820, 38858, 47758, 10968, -93726, -69390, -236774, -264939, -245745, -153507, -50844, -122542, -130556, -103722, -149994, -177990, -144491, -333085, -276935, -153914, -300058, -256528, -304641, -309528, -314785, -292574, -191370, -134946, -116678, -125044, -169931, -267289, -200212, -213044, -69024, -94934, -186313, -152165, -228504, -117701, -186448, -315351, -195419, -233349, -202368, -142099, -166884, -77792, -163675, -134401, -123235, -106863, -37733, -64623]
563f4623o4899L4551m100o7051r7295m8826K04173J0186J13113l9471k3319J215
551d6346L6933p7786N374O847k4875j15830k8086O3052J85835p2396p0780K4795
539a13263q5942J14973L2518o7876l9059r454N4709j24446M7415N1429q3207N128
527b17075l3868J7395K975j00644M2996J25994q5394k9632J40161j14225M1624
516b09693J5624o4596J01847j9284R2077j01788q4560j03448l609J18018J23949
505a35463K7830R138J38953L4891j51823o8977l9389j4001M3529n155N0984r4859
493b04342j7236R9221L9678R5340k4939j48067R4813j20079l8522N3906q3928
482b54155J03097J80702K2733j08820r61o3016l1232K1373m4113j32622K0620
$$ y = [-64623, -129522, -94971, -99071, -166122, -263417, -312243, -108070, -97884, 15229, -24242, -47561, -46346, -9413, -87199, -81825, -74978, -99853, -215683, -243769, -180717, 5118, -67278, -138058, -113263, -199205, -84232, -51714, -119590, -158649, -168103, -113394, -237840, -190425, -138996, -222203, -217075, -250943, -233548, -230573, -331217, -288221, -162227, -247621, -277253, -137092, -251317, -209693, -194069, -258665, -156818, -176102, -84025, -185813, -270373, -373821, -377430, -259412, -135463, -107633, -98495, 40458, 75349, -76474, -145451, -184840, -198841, -155312, -160467, -109483, -204342, -221578, -122357, -82679, 12661, -12278, -160345, -65532, -185611, -224133, -170227, -254155, -151058, 29644, 52377, -56443, -57404, -120420, -151652, -130279, -174392, -307014, -286394]
471b86394J58633r4671K8489P3858P5926l8367j7710j27683q4084J45553P2268
460i4182P2003O2359n5430j18392J14928K4784r2526m6518P159K0470J3285m5294
448a37354q9154N3112K0323j30571J21345N7039R8846M4830j21943j95790j21037
437d00354K5865K27201p4576q1617K6531J38728O0749p6793o3121P4010n489j6840
425a65706L3097M0479q5341r1334J09382J57717R3342j96366Q3624M996j91480
414b07590Q3170M0624l3981p3960L2887j41547p1143O7008J47576J63046M8545
403E4635j29819j85475R2959R0030n9673p63L1041k3700P1636p4126r260L5657
391a06858j9780j28969L5916J50452R1306j89642l1008O6868l1550L3919L6179
$$ y = [-286394, -127761, -222432, -193943, -120085, -44159, -82526, -100236, -227919, -312003, -166450, -94182, -22179, 40180, -15250, -133642, -18714, 6070, -86456, -132974, -125815, -105345, -92060, -137354, -226508, -173396, -153073, -283644, -162299, -105260, -6414, 38416, -83527, -279317, -400354, -374489, -147288, -221864, -303481, -276950, -138222, -77473, -154266, -217387, -143377, -148866, -165706, -132609, -92130, -177471, -268805, -159423, -1706, 91636, -104730, -21106, -16110, -207590, -124420, -83796, -117777, -191737, -158850, -300397, -371540, -304532, -156956, 6090, 54635, -75184, -260659, -167700, -77670, -137343, -138106, -107065, -130765, -59129, -133255, -142515, -106858, -126638, -255607, -219691, -69239, 22067, -167575, -198583, -131715, -163265, -129346, -93167]
380i3167r4704j78921P3016J32195o7406o3978J25777p6144k4589k4747L9955
369b52713J16454J03638O839j67809J7594K557m5952K6280L584K3531o9023k1766
357b56786M9992m2634j7236R050R5799j22010O8005R3671K1678p8531J26555K0664
345c1783l5391j273N2209P384j33045j6945K02415j37389l9476J47289r8723j2119
333i6847p1860L0165P4451L4602m1182L4133j09654r7844O9100p8673p4446J81803
321a46252j8254k0579p365j46238L6757J994n5915J01879M3109Q1709o8086Q538
309a88703J26981Q6590j31882K672k5186p5668J20520p8344R333r1194j3693Q3237
297a75337j02333M0928J25285N756j38897O5820Q0325R1181m4485p6774K9612
$$ y = [-93167, -187871, -366792, -293776, -161581, -228987, -292965, -167188, -243332, -267921, -292668, -252713, -136259, -32621, -25782, -193591, -175997, -173440, -219392, -193112, -189528, -165997, -235020, -256786, -206794, -249428, -266664, -257614, -161815, -283825, -215820, -122149, -100471, -179002, -52447, -31783, -67174, -68447, -16238, -8854, -141899, -158844, 43571, -93818, -133294, 13995, -84728, -96847, -168707, -138542, -64091, -29489, -70671, -36538, -146192, -244036, -174936, -253609, -328055, -146252, -164506, -185085, -192450, -338688, -301931, -299937, -355852, -253973, -210864, -129155, -197241, -188703, -61722, 24868, -107014, -104342, -129528, -205196, -84676, -163020, -153687, -244881, -258574, -175337, -277670, -236742, -111457, -105701, -244598, -178778, -98453, -7272, -51757, -128531, -98919]
286i8919j05636J3273J49161q6418K9190l9669j07597J86637l1409j37385J58006
275g0766o4688m8422O7672r7901r4580J8509J00953N4322p3519j15563j01844
264d25827l5337J60200J26575k7322Q0325k508p3822o404J12773n3649q7567m9514
252b82077O5424R9947j01167J25124r0321J11113n7475k24767J15847K26220k45188
241b57320o9392L9442K6968N0522q223o161p8660M1749K3204l2423o1184J39494
229a91984J23093J1859L4817k25054J50566m4104j16453n7528K04388P020p4313
218a77693Q430K6141J6196J40175n8408j8297L4175k28188M1378O872R8822M8143
206f2254K1534k0996m665r502q003n681k4255k7589m6727R8734p4044j03206P7417
$$ y = [-98919, -204555, -191282, -42121, -128539, -99349, -139018, -246615, -59978, -91387, -228772, -70766, -135454, -183876, -116204, -214105, -308685, -290176, -189223, -134901, -208420, -323983, -425827, -461164, -300964, -174389, -201711, -121386, -123894, -197716, -204120, -91347, -144996, -232563, -282077, -216653, -116706, -217873, -92749, -183070, -71957, -129432, -354199, -238352, -12132, -257320, -326712, -287270, -260302, -209780, -218003, -224164, -302824, -261075, -237871, -270294, -331478, -191984, -68891, -57032, -22215, -247269, -96703, -140807, -257260, -314788, -110400, -103380, -177693, -169263, -143122, -126926, 13249, -45159, -63456, -29281, -257469, -216091, -209219, -110397, -62254, -40720, -61716, -66381, -75883, -83886, -89567, -113822, -141411, -188138, -89404, -163448, -266654, -189237]
193a89237N8378K1180j3590P2800k953J8631q0812k3408o5815J7943M3147j36079
181b79815P72J09254l7860M2323p4783J23271J8041j04902r8574J25188p3442
170b50527n1282M4980N9646j1646P5447n5939Q917l8921k2615N9231k4348K2719
158a84338Q935J13365L2157J3923o556j83559p1519j5207k7663L0174l8546Q8113
146b40721P5562o2466M5705N1333p8400J6012J55250l9037j24646j17647k5545
135c44600O6631R5182J9128l3590k6748j10195n223J32030q290M5552l884L689
123a70318P1585o5316J9025j1820m2893R8994j35884n0554J10865N5082o0998
112a82232Q2803M910p1718O0964k1043p791j07137P9595M409M0367j2684Q7855
$$ y = [-189237, -130859, -109679, -123269, -50469, -53422, -34791, -115603, -139011, -204826, -186883, -143736, -279815, -279043, -169789, -207649, -165326, -240109, -116838, -98797, -203699, -302273, -177085, -250527, -301809, -256829, -197183, -208829, -133382, -189321, -180404, -219325, -241940, -182709, -207057, -184338, -175403, -62038, -29881, -15958, -22514, -206073, -277592, -292799, -320462, -290288, -328834, -240721, -165159, -227625, -181920, -130587, -208987, -192975, -37725, -76762, -201408, -319055, -344600, -277969, -182787, -163659, -197249, -223997, -334192, -339415, -207385, -215675, -170123, -174007, -170318, -98733, -164049, -145024, -156844, -199737, -100743, -236627, -287181, -176316, -121234, -182232, -99429, -94519, -166237, -105273, -126316, -134107, -241244, -161649, -157240, -116873, -129557, -41702]
100d1702L5964l5774n7464n4455l3466L3857J1201o3326p7832J10529M9697n3664
88a76435j03039O9485J7773q7242O5860M4039m5330Q7002N6044k6874m3379M0145
76a01951k0379k7534j64091R188R4618M254J1249N2395L2025N471o8701k8078
64b01534m4261l332O7168J34481q535p1502m7276j3129l4598j3550J8271R6085
52a21712j10648j2131N5617J3235N9692K2016j42833j16307J22001M2864j03969
41b92175j8154J27473J176J4079M9540M8406j40496n4985O0491m2176Q9711L4676
29a22434m4684o105k4776O1405j22100O7122j156J5927r424l3705n1784R8187
17a73527J1602l6660k9012l3911L9662r887K4418m6710J01865Q102n5212K3032
$$ y = [-41702, -5738, -41512, -98976, -153431, -186897, -153040, -141839, -205165, -282997, -172468, -122771, -176435, -279474, -209989, -192216, -279458, -213598, -169559, -214889, -127887, -71843, -98717, -142096, -101951, -122330, -149864, -313955, -304767, -210149, -205895, -194646, -142251, -110226, -104755, -173456, -201534, -245795, -249127, -181959, -47478, -56013, -127515, -174791, -187920, -222518, -236068, -217797, -121712, -232360, -244491, -188874, -175639, -115947, -93931, -236764, -353071, -231070, -188206, -292175, -310329, -182856, -181680, -167601, -118061, -69655, -210151, -265136, -204645, -246821, -157110, -122434, -167118, -173223, -197999, -136594, -258694, -191572, -192728, -176801, -186225, -219930, -271714, -173527, -161925, -198585, -227597, -261508, -221846, -231733, -207315, -254025, -152160, -144058, -199270, -176238]
5a76238j3363R5855L0790j8320n3874
0a35150
$$ y = [-176238, -189601, -93746, -62956, -81276, -135150]
$$ Imaginary data points
##PAGE= N=2
##DATA TABLE= (X++(I..I)), XYDATA
16383c936192O9333Q7860K7096K0464J29546L8307J13172J08282K7044J1432R4512
16372c209144P7538m848O6066O9592M8746P8553J22421L9749P6543J44358M1296
$$ y = [-3936192, -3866859, -3778999, -3751903, -3731439, -3601893, -3563586, -3450414, -3342132, -3315088, -3303656, -3209144, -3131606, -3136454, -3070388, -3000796, -2952050, -2873497, -2751076, -2711327, -2634784, -2490426, -2449130]
$$ [...]
##END NTUPLES=NMR SPECTRUM
##END=
