##TITLE=1H_DE-80H_X3
 200.13MHz, d2o
 8 sc
 
 19ns.26.2.2025
##JCAMPDX= 6.0         $$ Bruker NMR JCAMP-DX V2.0
##DATA TYPE= NMR SPECTRUM
##DATA CLASS= NTUPLES
##ORIGIN= UXNMR, Bruker Analytische Messtechnik GmbH
##OWNER= pz
$$ XWIN-NMR		Version 3.5
$$ Tue Jul 29 10:04:15 2025 Russian Standard Time (UT+4h)  Yarkov@DPX200
##.OBSERVE FREQUENCY= 200.1313
##.OBSERVE NUCLEUS= ^1H
##.ACQUISITION MODE= SIMULTANEOUS
##.ACQUISITION SCHEME= undefined
##.AVERAGES= 8
##.DIGITISER RES= 18
##SPECTROMETER/DATA SYSTEM= spect
##.PULSE SEQUENCE= zg30
##.SOLVENT NAME= CDCl3
##.SHIFT REFERENCE= (INTERNAL, CDCl3, 0, 15.5221)
##AUDIT TRAIL= $$ (NUMBER, WHEN, WHO, WHERE, WHAT)
$$ ##TITLE= Audit trail, XWIN-NMR		Version 3.5
$$ ##JCAMPDX= 5.01
$$ ##ORIGIN= Bruker BioSpin GmbH
$$ ##OWNER= Yarkov
$$ C:/Bruker/XWIN-NMR/data/yarkov2/nmr/H-C/1/pdata/1/auditp.txt
$$ ##AUDIT TRAIL=  $$ (NUMBER, WHEN, WHO, WHERE, WHAT)
(   1,<2025-07-29 10:03:07.96 +0400>,<Yarkov>,<DPX200>,
      <created by zg, POWCHK disabled, PULCHK disabled
       configuration hash MD5:
       00 E9 B6 7A A2 85 ED C7 34 08 36 98 17 FE 4E 26
       data hash MD5: 16K
       F3 E0 18 B0 83 32 87 FF 63 B1 BC 9A 06 41 F8 64>)
(   2,<2025-07-29 10:03:12.03 +0400>,<Yarkov>,<DPX200>,
      <Start of raw data processing
       efp BC_mod = 2 LB = 0.25 FT_mod = 6 PKNL = 1 PHC0 = -1358.793 PHC1 = 13.39091 SI = 16K 
       data hash MD5: 16K
       75 A0 A3 C8 36 0E 84 11 9F 8C 95 A7 0D 56 47 E3>)
(   3,<2025-07-29 10:03:30.92 +0400>,<Yarkov>,<DPX200>,
      <pk PHC0 = -1.403515 PHC1 = 3.2 
       data hash MD5: 16K
       15 47 8E 81 0C 3E 76 D5 46 39 06 E3 E5 30 6A 13>)
(   4,<2025-07-29 10:03:33.39 +0400>,<Yarkov>,<DPX200>,
      <abs ABSG = 5 
       data hash MD5: 16K
       68 7F 45 02 49 A4 21 A1 32 C3 DC C9 18 03 4A D3>)
$$ ##END=
$$ 
$$ hash MD5
$$ 5F EF 6F 25 25 1E 5A 1D B3 05 08 0E 8E 53 BF 7C
##$RELAX= 
##$RELAX= 
##$RELAX= 
##$RELAX= 
##$RELAX= 
##$RELAX= 
$$ Bruker specific parameters
$$ --------------------------
##$DU= <C:/Bruker/XWIN-NMR>
##$EXPNO= 1
##$NAME= <H-C>
##$PROCNO= 1
##$TYPE= <nmr>
##$USER= <yarkov2>
##$AMP= (0..31)
100 100 100 100 100 100 100 100 100 100 100 100 100 100 100 100 100 100 
100 100 100 100 100 100 100 100 100 100 100 100 100 100 
##$AQSEQ= 0
##$AQ_mod= 1
##$AUNM= <au_zg>
##$AUTOPOS= <>
##$BF1= 200.13
##$BF2= 200.13
##$BF3= 200.13
##$BF4= 200.13
##$BF5= 200.13
##$BF6= 200.13
##$BF7= 200.13
##$BF8= 200.13
##$BYTORDA= 1
##$CFDGTYP= 0
##$CFRGTYP= 5
##$CHEMSTR= <none>
##$CNST= (0..31)
1 1 145 1 1 1 1 1 1 1 1 1 1 1 1 1 1 1 1 1 1 1 1 1 1 1 1 1 1 1 1 1 
##$CPDPRG= <>
##$CPDPRG1= <>
##$CPDPRG2= <>
##$CPDPRG3= <>
##$CPDPRG4= <mlev>
##$CPDPRG5= <mlev>
##$CPDPRG6= <mlev>
##$CPDPRG7= <mlev>
##$CPDPRG8= <mlev>
##$CPDPRGB= <>
##$CPDPRGT= <>
##$D= (0..31)
0 0.7 0 0 0 0 0 0 0 0 0 0.03 0 0 0 0 0 0 0 0 0 0 0 0 0 0 0 0 0 0 0 0 
##$DATE= 1753768987
##$DBL= (0..7)
120 120 120 120 120 120 120 120 
##$DBP= (0..7)
150 150 150 150 150 150 150 150 
##$DBP07= 0
##$DBPNAM0= <>
##$DBPNAM1= <>
$$ [...]
##$SUBNAM3= <"">
##$SUBNAM4= <"">
##$SUBNAM5= <"">
##$SUBNAM6= <"">
##$SUBNAM7= <"">
##$SUBNAM8= <"">
##$SUBNAM9= <"">
##$SW= 18.0517328524113
##$SWIBOX= (0..15)
0 0 2 0 0 0 0 0 0 0 0 0 0 0 0 0 
##$SW_h= 3612.71676300578
##$TD= 16384
##$TD0= 1
##$TE= 0
##$TE2= 300
##$TE3= 300
##$TEG= 300
##$TL= (0..7)
0 120 120 120 120 120 120 120 
##$TP= (0..7)
150 150 150 150 150 150 150 150 
##$TP07= 0
##$TPNAME0= <>
##$TPNAME1= <>
##$TPNAME2= <>
##$TPNAME3= <>
##$TPNAME4= <>
##$TPNAME5= <>
##$TPNAME6= <>
##$TPNAME7= <>
##$TPOAL= (0..7)
0.5 0.5 0.5 0.5 0.5 0.5 0.5 0.5 
##$TPOFFS= (0..7)
0 0 0 0 0 0 0 0 
##$TUNHIN= 0
##$TUNHOUT= 0
##$TUNXOUT= 0
##$USERA1= <user>
##$USERA2= <user>
##$USERA3= <user>
##$USERA4= <user>
##$USERA5= <user>
##$V9= 5
##$VALIST= <valist>
##$VCLIST= <CCCCCCCCCCCCCCC>
##$VD= 0
##$VDLIST= <DDDDDDDDDDDDDDD>
##$VPLIST= <PPPPPPPPPPPPPPP>
##$VTLIST= <TTTTTTTTTTTTTTT>
##$WBST= 1024
##$WBSW= 4
##$XGAIN= (0..3)
0 0 0 0 
##$XL= 0
##$YL= 0
##$YMAX_a= 696144
##$YMIN_a= -706093
##$ZGOPTNS= <>
##$ZL1= 120
##$ZL2= 120
##$ZL3= 120
##$ZL4= 120
##$ABSF1= 15.52212
##$ABSF2= -2.529729
##$ABSG= 5
##$ABSL= 3
##$ALPHA= 0
##$AQORDER= 0
##$ASSFAC= 0
##$ASSFACI= 0
##$ASSFACX= 0
##$ASSWID= 0
##$AUNMP= <proc_1d>
##$AZFE= 0.1
##$AZFW= 0.1
##$BCFW= 0
##$BC_mod= 2
##$BYTORDP= 0
##$COROFFS= 0
##$CY= -3
##$DATMOD= 1
##$DC= 0
##$DFILT= <>
##$DTYPP= 0
##$F1P= 0
##$F2P= 0
##$FCOR= 1
##$FTSIZE= 16384
##$FT_mod= 6
##$GAMMA= 0
##$GB= 0
##$INTBC= 1
##$INTSCL= 3.241238e-09
##$ISEN= 128
##$LB= 0.25
##$LEV0= 0
##$LPBIN= 0
##$MAXI= 10000
##$MC2= 0
##$MEAN= 0
##$ME_mod= 0
##$MI= 1.114404
##$NCOEF= 0
##$NC_proc= -5
##$NLEV= 6
##$NOISF1= 3.799351
##$NOISF2= 2.8
##$NSP= 0
##$NTH_PI= 0
##$NZP= 0
##$OFFSET= 15.52212
##$PC= 1
##$PHC0= -1360.197
##$PHC1= 16.59091
##$PH_mod= 1
##$PKNL= yes
##$PPARMOD= 0
##$PSCAL= 0
##$PSIGN= 0
##$REVERSE= no
##$SF= 200.129999915845
##$SI= 16384
##$SIGF1= 3
##$SIGF2= 2
##$SINO= 0.751879
##$SIOLD= 32768
##$SREGLST= <19F.Aceton>
##$SSB= 0
##$STSI= 16384
##$STSR= 0
##$SW_p= 3612.71676300578
##$SYMM= 0
##$S_DEV= 0
##$TDeff= 16384
##$TDoff= 0
##$TI= <>
##$TILT= no
##$TM1= 0
##$TM2= 0
##$TOPLEV= 0
##$USERP1= <user>
##$USERP2= <user>
##$USERP3= <user>
##$USERP4= <user>
##$USERP5= <user>
##$WDW= 1
##$XDIM= 16384
##$YMAX_p= 458497181
##$YMIN_p= -231376
$$ End of Bruker specific parameters
$$ ---------------------------------
##NTUPLES= NMR SPECTRUM
##VAR_NAME=  FREQUENCY,     SPECTRUM/REAL,   SPECTRUM/IMAG
##SYMBOL=    X,             R,               I
##VAR_TYPE=  INDEPENDENT,   DEPENDENT,       DEPENDENT
##VAR_FORM=  AFFN,          ASDF,            ASDF
##VAR_DIM=   16384,         16384,           16384
##UNITS=     HZ,            ARBITRARY UNITS, ARBITRARY UNITS
##FACTOR=    0.220516191357247, 1,           1
##FIRST=     3106.44196950939, 0,            0
##LAST=      -506.274793496386, 0,           0
##MIN=       -506.274793496386, -231376,     0
##MAX=       3106.44196950939, 458497181,    0
$$ Real data points
##PAGE= N=1
##DATA TABLE= (X++(R..R)), XYDATA
$$ [...]
8558 28427 -29507 -996 -4722 -13831 -6950 398 11853 24396 4370 -11214 1180 -21059 10011
8545 10011 -30717 -25605 5450 49174 31026 -1127 -34666 -49540 3431 8841 11459 3565 -23812
8532 -23812 11672 18564 24227 19573 -15933 -17987 8147 -4354 12268 23200 4890 -5897 9483
8519 9483 12355 15406 14015 27766 27377 32768 57057 49896 77345 63236 31802 1977 2502 -6587
8505 -6587 -18706 -33977 -39360 -40289 -1919 20685 -6969 10907 25230 83 10844 38554 23513
8492 23513 21468 11126 -6140 18583 -5831 -2128 28527 31736 15115 -4580 1525 35441 35181
8479 35181 -1173 21454 11163 -5504 -2790 -8241 -40560 -60329 -32299 -10093 25052 19206
8467 19206 2809 18620 12087 19989 28128 -7763 -734 16324 -1891 -17412 9930 5430 14626
8454 14626 23587 13351 4587 26405 48611 29797 34856 22013 13550 32070 26876 16556 -464
8441 -464 9554 28039 6885 -4633 14008 1221 -15479 13662 7348 15223 22613 35114 17547
8428 17547 -4032 16682 18368 30939 26059 -17785 -23318 -7475 25889 12675 -7672 25008
8416 25008 18381 -9062 40912 35473 13866 23630 19864 13446 12504 11559 6891 20037 33527 18967
8402 18967 28242 3487 19836 -1868 -8532 -4569 50050 42222 23262 27444 34798 62723 25364
8389 25364 32128 34622 11713 -5431 36414 33046 23298 22751 17812 4415 -9148 -4291 6928
8376 6928 1002 575 11863 24190 6606 5284 -6684 -25849 -33580 16117 45795 24160 27682
8363 27682 55581 19250 27547 40842 32877 33886 21745 22278 794 -13289 -13085 -7539 8209
8350 8209 -15106 -548 57453 52957 15180 16 -232 -28625 1304 7019 -10990 15569 -10990
8337 -10990 -19155 15393 16545 9280 -5975 -39320 -8086 4833 -12231 26339 38982 25158
8325 25158 -5618 14514 12599 16679 42165 35740 8814 -36470 -5627 -6453 -9809 -20198 -51363
8312 -51363 -10450 13991 21799 8146 -19456 -193 -10595 -31908 -25142 -3271 18429 7090
8300 7090 -24515 18062 8682 -20435 -53480 -60647 -37102 -12949 18650 2280 12641 23263
8288 23263 212 -24759 5242 22863 32957 26408 3747 30349 27150 -12042 -19385 -9223
8276 -9223 -6705 -29816 -13070 -17935 -7445 36333 16476 8035 16486 20453 13490 24052 11054
8263 11054 1748 12139 12926 -22762 -22577 16006 -12294 -25730 12369 18807 44163 36103 3248
8250 3248 -6504 -34882 7773 -21777 10388 -14666 1067 31300 2128 11709 -13169 -26266
8238 -26266 -6206 18653 -5380 -16496 5810 -11191 -30534 -17446 17684 11221 -30321 -6506
8226 -6506 -11743 -20968 -9938 -13455 -29121 -9237 -12639 -27120 14250 16662 39027 55004 38862
8213 38862 20308 13048 14245 9174 3373 -3109 2299 -10057 -16867 -26642 -1910 19268 10936 -4607
8199 -4607 31670 44977 64986 18343 95118 93537 262411 17719 -231376 -97393 -126572
8188 -126572 -70159 -54827 -27494 -89830 -63493 -44097 -22474 -21738 -9340 -30350 1135 -21214
8176 -21214 1195 -6388 -37784 -43602 -42026 -5516 -13075 -51487 -15259 -52247 -60261 -40688 -60273
8163 -60273 -54105 -63144 -54517 -19451 -4227 -33200 -41450 -73852 -51088 -20297 -11068 -5410 -31139
8150 -31139 -63651 -65455 -52791 -31096 -25808 -23445 -32889 -48697 -43622 -36798 -67466 -43677 -47502
8137 -47502 -31227 -7602 -32067 -43038 -26462 -17907 -2242 1565 -27715 -11487 14736 5094
8125 5094 -24391 -23275 -1726 -37816 -41591 -52221 -31783 14818 613 -31680 -20796 -18152 -25374
8112 -25374 -28148 -24318 -6001 -7187 -18087 -29649 -16071 -22209 -28662 -36740 -42052 -17650 -22385
8099 -22385 -17833 -16167 -13914 -11812 -48659 -32565 -21877 -15499 -19349 -14650 -9514 -15929 -16677 -17841
8085 -17841 2875 -17937 -5054 2859 -11485 -33654 -18915 4790 -407 -5155 -24367 -46537
8073 -46537 -52948 -33799 -32243 -50245 -44673 -50728 -39843 -42274 -36168 -5454 -18377 -23358 -40284
8060 -40284 -30909 -35336 -32089 -50273 -40191 -11909 -35955 -47450 -16871 5631 5245 -15736 -21507
8047 -21507 -7818 6213 -34924 -68630 -62637 -37614 -56588 -50704 -1786 878 -1727 -16874 -7764
8034 -7764 -8918 -4913 -15533 -33054 -40015 -29436 -46260 -38527 -55371 -51508 -38786 -22037 9694
8021 9694 -7171 -11724 -26919 -8070 973 -18380 -41058 -5439 -7703 -17076 -6798 -2195 12666
8008 12666 15790 6826 -4243 24107 5335 -13363 -14029 -19973 -20485 18192 41466 31919 -24510
7995 -24510 -10183 19037 7607 2255 4508 -16171 -14405 15370 -15204 -4985 -1524 -16746 -9754
7982 -9754 -15691 14374 19325 -21263 -21020 1246 -1992 -30639 -15142 -10043 -16876 -40720 -36708 -26628
7968 -26628 -25441 -32838 -30361 -44294 -56734 -52518 -25493 6773 -11238 -9112 -27566 15828 27488
7955 27488 -3617 -27199 -14059 -9188 -2814 27605 24182 -3847 -37977 -12412 -16300 -27732 -966
7942 -966 18742 -18327 -10387 -5527 14390 4899 -14239 -11645 -20877 -53547 -43169 -22428 -37350
7929 -37350 -8484 -1582 -15298 -23591 10667 20603 1543 -23777 -29079 -7504 -5299 -2283 -26742
7916 -26742 -21871 -13897 -20515 -18983 -23852 32016 30528 -14452 -543 -12794 -43885 -20245 -15867
7903 -15867 -18613 6530 -7340 13510 12794 -3012 -35117 -33753 -10760 -16379 11167 -305 -30970
7890 -30970 -66415 -55566 11592 25544 6541 26283 12111 -17284 -10275 4145 12630 -6568
7878 -6568 -25352 -24114 -28249 -48725 -46723 -18688 -15207 -14849 -7811 -19347 -3143 942 11172 19296
7864 19296 -59082 -37168 13949 38197 15782 9548 11465 10795 31093 11901 -2999 -22250 -20828
7851 -20828 -40037 -14994 -3486 -1017 10498 -30621 -9451 22653 10014 9080 -31737 -14805
7839 -14805 -2308 -49717 -83623 -75742 -25537 -11065 2089 -6513 -7388 4894 -4041 -21632 -23121
7826 -23121 -44374 -50541 -23320 -15274 -19626 -27435 -28423 3690 24820 -5593 6403 -18261 -42740
7813 -42740 -21733 -23517 -40959 -58799 10748 -6146 114556 1545 -87137 -13083 -55515 -49620
7801 -49620 -65632 -27653 -40464 -5870 22371 -6976 -20004 -17966 -11298 -6417 -32335 8348
7789 8348 -12340 21441 21043 -2964 -21974 -47808 -20626 -18759 -26238 -4612 -1348 -32773 -27049
7776 -27049 -21290 -41727 -18386 -19537 -48639 -20622 -27138 -16729 -31437 -26027 -6013 -8736 -29961
7763 -29961 -30557 -25611 3751 12665 -30043 -46389 -34099 -9595 -8264 -24015 2332 11523 12339
7750 12339 4938 175 1682 -33192 -41701 -19476 8437 6758 8143 8284 -4700 -39231 -42549 -40244
7736 -40244 -29001 -14348 -6041 -14393 -39373 -47914 -33864 -9601 -18293 -19215 -10876 -14809 17207
7723 17207 38161 2480 -9772 6063 -11683 -32970 -16692 9428 -9549 -39595 -44585 -34512
7711 -34512 -21251 397 -6401 -20817 -20735 -24287 -12486 -1702 8231 -17035 -25257 -6175 -12367
7698 -12367 -5751 -5224 19205 24347 17352 20014 -13142 -32968 -18428 -19973 25141 6674 -13045
7685 -13045 -13310 -1658 -17925 -27632 -8397 3609 -3581 43308 33641 -29752 -29328 -4606 -7771
7672 -7771 -2848 -2884 -21392 -23857 -33017 -39504 -10303 -43926 -48338 -15757 -52004 -35873 -37267 -1478
7658 -1478 -15995 10619 16859 10591 -1298 25923 30994 9710 -31815 -10057 -16435 3859 24082
7645 24082 -8949 -7767 -17961 -23649 -47632 -28642 -12936 8577 20480 1177 2074 -15733 68
7632 68 -5303 -12305 17217 21552 18316 -1965 -39733 -38083 -37206 -19965 -23768 8748 11374 12679
7618 12679 -21478 -40340 -26363 -14303 -4145 -32420 -19606 4333 3899 -30814 4172 16345
7606 16345 30464 51327 46750 -5626 -16035 -6446 -878 2597 -16261 -15822 -11970 -9748 16019
7593 16019 -29506 -10487 -6392 -18360 6853 -4883 -19846 -47061 -33086 -24527 -18606 -4731
7581 -4731 8666 25860 20995 -11715 17480 23826 38330 39143 17736 -1319 7528 -21540 13342
7568 13342 32777 8080 -1798 -47705 -30536 -14255 -25836 -47910 -19829 -16001 -5038 -32035
7556 -32035 -18617 -3357 334 -13760 7067 -3288 -18862 -10548 4741 26057 3165 -20767
7544 -20767 -27217 -52531 -33283 -44125 -24735 -20931 -29654 -14359 -23661 -22629 1600 3763 48219
7531 48219 28535 -5795 -20116 -3384 -11952 -20215 -22022 -43890 -25139 2972 2534 -7271 12453
7518 12453 -6436 -5522 -4219 21386 15928 18034 2790 15129 29757 34577 -2242 9670 6712
7505 6712 1115 -32874 -15242 -3600 3977 9891 6046 -3667 -26248 -45741 -21071 -19403 -34995
7492 -34995 -29006 -39762 -37886 -17647 -8031 16096 13211 8980 -17379 -23826 -31192 -28696 -20850 -35167
7478 -35167 -33365 -30983 12211 14239 17370 12534 13220 40256 16697 -5734 9668 -7733 16783
7465 16783 8950 16368 -20927 -34186 -15160 4823 -20369 -16273 43732 28321 16577 7627 148
7452 148 -8741 7310 -9360 17387 -4989 -5198 -5827 -14129 -26167 -22082 13871 9706 -3409 4858
7438 4858 -23537 -32762 -1099 -2608 24799 -5681 11516 32308 21263 8231 -1811 14227
7426 14227 4256 -32312 -22871 -15888 -18027 -27637 -14769 -8612 16575 33315 -10359 -24875 -9052
7413 -9052 -27769 -27459 -31539 -37931 -4344 -2823 -39371 -25411 -14506 -18416 2425 37077 34066
7400 34066 22293 13753 -22830 -11685 40611 25735 15887 12212 -4160 -7116 -8161 26060 31172
7387 31172 24034 -47 32944 45257 -16527 -14605 -26755 -32784 -44144 -62953 -57727 -20657 40653
7374 40653 16520 15334 397 -38399 -21936 -8768 8897 -9006 6358 -17622 -7318 -11850
7362 -11850 -19861 -7514 -18104 4162 -7447 8121 18254 33993 -10234 -29715 -2046 -25953
7350 -25953 -2926 23235 4277 -16078 3612 14851 -2433 7606 -2702 -36292 -30660 -26149
7338 -26149 -46207 -40475 -22521 -18825 -25078 -7321 -7265 16146 -3487 -7652 30033 -33604 -29663
7325 -29663 -8045 -63 16055 -13888 4690 16763 15710 12470 6182 10755 -16551 -38448 -31409
7312 -31409 -10027 -2084 -16974 -5100 -34183 -29474 -26988 -66281 -71358 -32890 -58828 -30516 -11121
7299 -11121 -35185 -4997 188 -20617 -8885 -16596 19348 20182 -4612 -29715 -11593 -1910 14737
7286 14737 3530 -27633 -30190 -36042 16971 24968 10146 8817 -3933 12161 3701 -26078 -18356
7273 -18356 17440 48647 19143 12742 -8026 -40728 -55007 -37654 -8956 12870 9337 -39139
7261 -39139 -38757 -45601 -65239 -53541 -22449 -32934 -30130 7524 41539 17559 -13683 -1077 -18887
7248 -18887 1373 -18634 -16110 -8503 -26687 -24767 -7125 -7110 618 3777 -3723 -20796 -2015 11107
7234 11107 2746 -17769 -28700 -30470 -61558 -44532 6727 -7811 16293 -3735 -11072 -25102
7222 -25102 -15852 9610 4803 2237 -2431 25536 55072 4924 12950 -7450 6609 4562 -17736
7209 -17736 -12971 -26732 1302 13193 -10868 -2346 29844 23939 23850 4860 -7230 -6112 12330
7196 12330 21222 33588 38668 25420 18148 -9792 1771 -12020 -33536 -22656 -38688 -9715
7184 -9715 3611 -11776 5109 14367 25854 44202 -10076 -24560 884 -3317 4878 188 -7815
7171 -7815 2245 9874 7483 11139 24215 8865 -13465 -7017 3062 -12088 -30324 -19201 2853
7158 2853 -16887 -22849 -13781 6519 443 12505 -8166 3976 35303 41355 15660 -6664 -513
7145 -513 -6022 7862 -12396 -54605 -22871 3640 21396 2971 -4174 20148 33246 15761 9977
7132 9977 -9192 6343 -17362 -51108 -35287 -21369 7589 24525 25290 5849 -34400 -2951
7120 -2951 2961 -24873 -24108 -5756 -4467 1643 24817 1981 -5352 14158 9691 1566 5500 -12994
7106 -12994 20804 51937 18323 951 21852 -2496 -14634 -30615 -30927 -41206 -29932 -52341
7094 -52341 -29596 -8249 -19103 17061 33317 32784 -1687 17133 10340 6115 -30375 -3526 38883
7081 38883 12146 -5048 -14322 -255 9426 -3197 4014 -5719 42102 31270 9818 20088 -13767
7068 -13767 -35496 -20240 12017 24715 58068 34326 23921 16995 38409 22445 32052 9874
7056 9874 8716 29354 5265 -24516 -29570 -9008 -13926 2525 -28895 -32186 -13987 6571 13405
7043 13405 12766 21306 -20821 -52193 -14401 -12332 26654 51304 33963 7270 -7025 -422 -9839
7030 -9839 25613 -14481 -19013 -3398 -17678 6397 28563 28461 25523 -7047 1026 1418 9968 -6408
7016 -6408 -23190 -5250 17800 9723 -4616 -44418 -6809 4744 39215 12806 -5978 23266
7004 23266 29991 23429 -3048 947 8893 20377 57792 18373 -10885 25422 30793 1557 -12032
6991 -12032 17765 42929 59663 10361 -1982 -7448 -2305 4250 28364 26684 4675 23569 -15652
6978 -15652 -1501 -4543 -23531 -17873 11046 40343 51928 25755 30613 14775 28876 24700 3966
6965 3966 15926 6013 1340 9159 35563 15795 54458 39080 26957 43308 28276 14273 21272
6952 21272 17111 16375 -17952 -18585 -17184 -7073 9168 1841 -6930 10025 -7825 10734 21109
6939 21109 -11792 -31555 -27980 -38237 2852 29154 22880 19848 41020 2609 19817 15782 27493
6926 27493 -2217 -20404 -15456 -8598 -12554 -18653 4214 9368 17848 1277 3700 22681 8529
6913 8529 26286 34433 5965 1256 6891 -12057 22173 45559 27676 -1585 -17332 -9849 21833
6900 21833 15054 13 25196 16791 39196 16579 -11054 -12562 -14865 -24170 -8709 -15683 -20426
6887 -20426 -14202 13684 13922 -3709 23218 31761 1294 28434 38925 -1989 -20848 -12985 -14789
6874 -14789 -39974 -49069 -28992 17700 47011 36587 7318 -5035 23572 31406 7778 -18564
6862 -18564 -30178 -25406 -22174 -40174 -26167 -11185 6362 41127 -965 -29621 -17476 -14251
6850 -14251 -10880 1965 23153 8420 41405 38329 16112 -23760 -27923 9052 36775 11929
6838 11929 33467 23001 14700 -20610 275 10332 -8953 16279 47658 20694 8540 -6217
6826 -6217 14783 32622 18973 13979 9427 17975 18257 19340 41831 31048 16572 3616 33740
6813 33740 63293 29036 8599 14984 24454 12518 37765 22670 34412 19071 9997 50283
6801 50283 38973 25300 24910 1061 -3732 15469 15536 9011 12262 -11572 -11234 40343 48751 23599
6787 23599 26365 24549 45274 72104 91597 75821 92661 73817 56255 74379 72425 45561
6775 45561 69689 72745 50032 38121 56626 69126 75752 99794 95518 93127 115837 136195 142419
6762 142419 124686 110413 101822 60930 60466 75450 53783 76170 68346 80453 92039 59519
6750 59519 72671 91894 98793 75217 80518 85111 111313 103053 94927 114855 152953 159076 149997
6737 149997 203524 220196 242103 241806 223303 187170 162876 132794 124770 100955 126387 122577
6725 122577 121832 131373 154078 91075 59568 101464 95923 115217 124678 142507 149472 147286 146507
6712 146507 161012 177804 225338 254503 274377 296530 296821 287574 269186 210736 190866 182369
6700 182369 183664 172592 149445 142978 139160 147632 112351 117923 98089 82720 112765 117115 128311
6687 128311 100342 118023 160201 147049 135768 159978 203944 250346 263705 266319 260544 230599
6675 230599 208773 204202 163015 111171 101867 107912 94208 96860 106574 89440 107955 95895 75372
6662 75372 48524 54670 104477 97197 78825 94627 101541 124436 120504 117330 131442 140951 120618
6649 120618 115609 109816 106932 119959 121782 99631 98447 116846 114096 102451 55234 62548 35431
6636 35431 42769 65744 77780 77544 38237 31844 61558 63406 50438 60390 36988 -78 22296
6623 22296 16997 26987 55740 50952 31944 73590 53108 12805 996 9610 59377 39717 32562
6610 32562 68565 49178 22541 42176 73108 74360 92001 54460 23745 -1876 -801 24380
6598 24380 20039 5319 -5713 -4759 17540 28819 -9832 -14558 2607 -876 13332 5236 3781
6585 3781 18791 22200 12455 29805 45393 38091 14280 -15224 28459 46869 72649 91470 40971
6572 40971 14487 39077 31001 39866 46646 28293 29235 16250 39181 37696 57295 23402 62177
6559 62177 55905 -8093 47505 42656 49127 92316 82111 41588 27288 28421 34949 54744 51694
6546 51694 61431 80775 62460 48661 33419 36959 52364 66881 13743 27024 13663 13336 17418
6533 17418 21757 -14460 -6431 10306 40343 27317 16274 35059 33743 16950 10012 37119 35126
6520 35126 15681 -11569 7304 8599 4906 15196 31668 24367 23537 20449 8646 38829 15696
6507 15696 5427 13887 -3617 -16826 12532 5098 7906 27731 453 7027 13744 27428 46819
6494 46819 33183 19132 23683 25740 13719 -408 65317 81351 41000 21809 -2571 50547
6482 50547 56990 22142 9316 28269 63748 51484 31031 23454 25314 -23843 -7370 23903
6470 23903 8916 462 9050 30771 29196 39488 13250 33044 49782 55317 65116 42932 10299
6457 10299 11020 6461 40377 54271 25583 12 17653 30905 25157 38481 43964 46089 52839
6444 52839 56233 61682 86396 50777 44980 454 17166 19516 43558 66596 56137 52150 53659
6431 53659 26004 14692 23013 41501 31674 55788 79739 60288 43029 58301 60309 48872
6419 48872 44525 79167 106328 92091 82910 55135 72783 88881 72166 95693 119814 136793
6407 136793 102467 111420 105666 91011 98235 112249 156785 140058 117618 112461 104699 110668 71462
6394 71462 97384 143443 103332 61885 64906 85966 84078 82822 79479 96352 95862 89527 83483
6381 83483 78120 92934 99322 73385 42874 73009 115751 92526 63810 39508 84450 81027
6369 81027 56229 73182 77067 43614 71823 46554 20901 49556 36544 22789 37626 70866
6357 70866 72147 55944 49600 37997 25284 19725 38336 14780 32536 28886 25756 34483 46574
6344 46574 66109 24919 29663 25150 1192 15300 45883 58538 60144 71905 57314 90326
6332 90326 114015 95606 78706 64358 45111 24674 35792 73239 52712 2278 24967 13557
6320 13557 57351 31271 36528 40114 55428 40430 43174 63455 43860 62301 83512 59498
6308 59498 38098 52564 48779 42677 29612 46789 60771 99759 90451 67817 38021 54849
6296 54849 108849 81655 52968 58133 36069 78228 61669 56522 76682 61734 20470 52753
6284 52753 76397 71468 67438 65652 52067 38748 33893 42396 79387 87929 62662 49873 53284
6271 53284 82754 70206 41058 10792 -3518 56766 70372 80491 47004 46199 68116 36623
6259 36623 24059 36840 19522 54642 96434 87907 60835 39029 32734 66208 75023 54507
6247 54507 53087 64967 62455 50021 76248 63405 24229 44649 42327 30245 12146 16239 39981
6234 39981 47929 61465 75207 88600 69573 49491 43442 60316 80307 80762 72789 37961 21690
6221 21690 40570 31039 56607 45549 46705 68929 68873 47043 14642 32565 57186 67637 53649
6208 53649 38138 47101 40394 17105 52945 92419 103929 107200 77848 60259 56571 56244 72308
6195 72308 66098 65146 67170 36484 43927 87528 66559 100748 111051 71434 75450 45246 54379
6182 54379 51017 36696 50040 87439 116822 52766 22241 27572 64491 50989 74939 74767 50036
6169 50036 19087 33265 48055 43474 32717 53322 43248 68596 76548 98943 118668 99153
6157 99153 84724 98714 98382 79011 69132 36604 37378 74814 81882 64831 47680 103022 125314
6144 125314 86831 65743 25213 46127 22997 44242 61548 64353 43335 55633 59546 77435
6132 77435 78957 45663 39888 59315 45984 72502 94861 80591 60654 40465 27026 70109
6120 70109 85669 70762 62097 64758 48675 53951 65705 80766 78369 67697 26613 92467 118604
6107 118604 125009 121001 74785 74772 76530 99985 105092 68797 49069 70225 76522 95556 93227
6094 93227 107273 129929 127891 100440 83454 106746 95990 111063 101778 105362 106888 82383 102641
6081 102641 141809 162775 155599 148067 159500 194869 205999 192786 189867 205606 234751 282034
6069 282034 274054 298462 312105 310200 320541 353124 430789 470717 507433 515380 509482 480799
6057 480799 461592 463508 435228 406552 365408 382288 362603 349156 351496 347607 375965 350033
6045 350033 343334 349948 349777 371941 409170 415195 446992 470578 513404 611299 656877 712625 781079
6032 781079 895856 916480 942459 876844 811105 704067 612468 568748 531727 499314 464886
6021 464886 428938 396956 416775 428123 423604 371302 353435 373617 358300 373677 390065 399546
6009 399546 421039 439561 426161 437834 510055 560949 572792 618820 642939 614713 564471 540028
5997 540028 474257 427126 406301 346015 377555 400921 380101 364968 320530 288787 308130 261174
5985 261174 261887 295136 314177 268744 261276 266472 249249 233692 208645 247306 256568 196725 186080
5972 186080 190993 169683 194335 214500 206923 213877 217218 214697 220962 230707 209202 203734 219826
5959 219826 246186 243471 222609 243514 282175 275304 269714 249916 254853 258678 229060 236228 242583
5946 242583 247392 238490 266902 269855 274080 264133 253136 237393 239126 271219 261793 278757 269267
5933 269267 260230 246571 246449 245799 229260 263258 305129 309859 342579 313014 301844 307414 279331
5920 279331 275515 250704 258229 278438 243547 241353 272024 312637 307869 312788 339334 327322 341298
5907 341298 300381 273725 278332 289069 279243 255448 264199 262595 276934 272299 325993 323988 323549
5894 323549 288868 234576 250272 213965 248408 249194 241280 249502 229441 249361 270034 269897 243153
5881 243153 240596 218857 229868 223369 181972 187504 195873 183909 189309 217970 238755 209669 209679
5868 209679 243991 230778 201391 224647 212242 184376 167374 174392 175918 140991 161435 144785
5856 144785 136917 176478 185291 146135 148768 158523 195155 172423 189747 173946 164508 160670 137833
5843 137833 136022 146427 123280 119984 141633 177608 175765 145199 143246 129252 138836 147189 132400
5830 132400 116844 138327 150750 141338 151451 158507 146014 140592 105960 116443 127493 105206
5818 105206 104556 79991 108469 139636 146771 123234 96580 118588 146362 152084 149957 115599 106115
5805 106115 90436 91538 83421 97573 129883 128934 121260 118182 103165 149159 141083 104244 132994
5792 132994 120268 109987 130772 140444 115061 116234 104816 138634 152216 185487 152506 151576
5780 151576 150343 134502 119078 123055 142265 149339 163071 139937 143123 148516 126275 171890 172642
5767 172642 158209 170879 167991 146807 138296 144828 125031 139646 174163 155064 129786 137140
5755 137140 159399 139137 131210 162509 173804 195670 175084 175441 158617 180990 180206 174989 181769
5742 181769 165799 194861 205589 193394 185411 183647 166186 150471 168336 180814 176630 157109
5730 157109 175552 177956 155516 171209 148010 150052 150169 180547 174486 149392 132034 169283 147273
5717 147273 111596 138331 148917 163004 184467 181881 194902 196143 191101 200133 185732 158963
5705 158963 158939 165989 153681 158814 169542 179070 180285 229260 214502 196830 208731 202617 227743
5692 227743 246432 268482 270547 268704 269081 263084 253012 249207 268143 268023 308316 301992 308480 375390
5678 375390 384443 404748 434859 464544 479582 449278 398735 387302 385946 340211 347937 337150
5666 337150 291285 317928 351928 322737 329033 322954 340654 369208 361451 363936 428707 428826 435599
5653 435599 436814 474219 536906 563914 574324 622114 697098 741157 845034 955397 1007888
5642 1007888 994141 890063 797564 725397 648779 602560 543358 499411 480108 468571 465548
5631 465548 435226 431610 461186 488570 473818 478183 472343 456326 493157 536068 531859 508830
5619 508830 577441 595137 648489 702428 740270 807852 904154 1006783 1076701 1045488 920807
5608 920807 860926 785494 694086 663321 621952 597024 565060 526912 478582 454424 449633 395261
5596 395261 373915 381793 390742 365713 352408 387292 369426 379389 364321 397828 441866 445070
5584 445070 423866 407847 447400 453875 511891 527462 548230 526937 469991 417175 373044 357925
5572 357925 340691 328243 348167 320531 299327 331539 284362 271317 235258 240032 280461 319726
5560 319726 310468 298646 313166 302984 311741 265973 251955 278684 287170 268682 266227 253555
5548 253555 261691 288207 269705 274188 279112 276825 273823 281046 284798 290324 299874 336315 318987
5535 318987 316401 325602 337688 374803 393501 386127 341733 332980 313805 283462 285097 294925 270676
5522 270676 278623 266085 275126 279768 327542 333324 306100 309387 287078 284656 274172 301267 295465
5509 295465 283090 302008 361536 412431 403948 395562 418589 397557 389579 364247 365582 335484
5497 335484 344986 303443 269835 279598 289198 273919 278520 274713 284500 295993 274672 296683 286854
5484 286854 301672 311544 304647 308423 334741 341214 343294 351843 365064 356908 360381 327134 315321
5471 315321 321043 328730 330734 317263 288600 280351 261228 246590 260084 242585 220347 248265
5459 248265 257886 263878 260578 257925 260064 306529 296141 273631 240496 265792 296267 290448 286658
5446 286658 274957 250658 257492 281207 269908 273177 256476 285249 273374 273562 268234 276562 278150
5433 278150 270880 276624 265330 259939 260448 273889 265977 286898 286513 249271 237057 263208 266448
5420 266448 307639 328753 314726 306593 317246 343083 379658 381474 411210 448279 410944 433941
5408 433941 489756 489062 497911 492048 495146 515980 505568 487192 469185 468474 477191 485912 502173
5395 502173 518254 475811 467107 454044 471628 492279 500631 567302 619840 604116 589880 620908
5383 620908 640376 662137 693403 726199 773387 776600 784956 776798 743619 685611 642072 614094
5371 614094 589774 541494 514355 515568 480797 508518 530528 530885 533649 568721 578507 588813 614608
5358 614608 596917 639866 673984 679872 673893 686291 688341 691858 725041 748002 713253 686405
5346 686405 673950 638344 621709 609689 581270 568359 579138 581078 536491 534754 550728 554016
5334 554016 554142 502815 487876 491384 510277 503891 518286 537051 512589 513722 473975 515694 558409
5321 558409 560152 586767 588696 554066 541964 562360 589641 587078 580986 542751 550853 529341 510262
5308 510262 513677 459855 461064 481231 469951 453781 447758 442063 455917 437420 395950 389780 412798
5295 412798 413220 423365 425041 444967 430374 404760 390393 407799 386193 379122 387782 378230 385392
5282 385392 354227 364395 377273 392003 411793 416547 405043 384793 384950 388490 399667 394456 377833
5269 377833 341620 376542 381050 366526 300553 269707 279861 280082 287909 311027 323021 298471
5257 298471 269159 266354 291533 284210 265307 277811 275886 291511 288983 282396 267474 260462 268851
5244 268851 252995 267256 277998 283186 283941 293524 268002 287633 298131 294398 317809 322134 319261
5231 319261 313022 335315 358616 348420 357781 395429 412973 410221 417194 424563 439281 432161 428103
5218 428103 482237 500990 483838 470442 491252 483761 469234 503441 476862 469260 477014 502152
5206 502152 473634 464717 489939 477576 472743 480712 493643 518356 521846 486652 482261 545878 535904
5193 535904 520961 583182 621885 591032 559549 568568 556283 549050 540297 581160 606854 598018
5181 598018 595029 611405 638802 629657 613806 560300 539389 557121 578498 566418 544305 535847
5169 535847 543952 546929 506487 459060 462663 483448 496646 498985 465568 457277 473348 443172 451081
5156 451081 480651 466271 450891 433328 446912 454365 450405 424857 406169 417111 454846 462364
5144 462364 449335 449781 446890 444067 410752 421047 448800 419074 427248 430308 455617 447731 467044
5131 467044 447025 425928 423408 400505 385475 387517 372015 338375 341123 309486 290826 308073
5119 308073 335124 352428 338560 286288 275541 309873 303548 272687 286484 262380 278207 307738
5107 307738 313029 314424 303171 310649 297653 289801 305417 329157 315068 328776 335856 317146 305066
5094 305066 319517 308143 294095 303831 330429 330207 326567 342223 336245 329578 340549 317582 291344
5081 291344 313352 310747 319960 344412 303566 277802 324278 320505 370670 378261 380035 357816 362203
5068 362203 367668 366844 360498 376775 417502 456660 454684 465857 459145 479035 478858 492193 524249
5055 524249 508985 512212 544848 540392 533091 565017 564596 568648 578267 594951 542926 555259 587555
5042 587555 614044 608565 620727 627078 617845 630833 653185 688430 687120 701763 686618 687883 735877
5029 735877 787329 839273 871812 888051 844282 857510 836241 814151 793834 779077 770847 732277
5017 732277 705996 750897 744017 693372 717083 726814 745633 698182 687959 704465 693807 671939
5005 671939 651899 653922 603368 604756 663924 650491 664793 693662 666938 664025 657345 643534
4993 643534 639083 607796 579008 595560 598133 580155 541384 542532 532731 521401 549819 550840 529614
4980 529614 515909 516089 518133 530047 549960 531580 505391 521987 542181 522572 524441 521909 552975
4967 552975 545143 529338 517572 509840 531915 559060 535686 519870 565285 586824 576832 590209
4955 590209 598347 586895 551034 553055 587774 575492 591083 596010 614840 609691 620657 648532
4943 648532 604298 625514 639323 672617 676573 656264 688244 683084 711453 710370 706307 747488
4931 747488 764586 756191 777455 802570 819087 834219 885928 946747 954930 913719 913893 959359
4919 959359 963109 937381 956616 938339 913102 882931 905134 875295 878682 871392 894960 889523
4907 889523 886370 884998 867624 886225 878804 874316 896289 900597 903070 912421 897405 908904 909253
4894 909253 919056 953351 951136 937780 940261 968116 973864 973015 961055 954352 989087 1002934 1027225
4881 1027225 1012470 1018106 1039306 1074136 1076869 1093940 1111511 1151674 1177949 1158769 1180472 1213033
4869 1213033 1217029 1240890 1267568 1278441 1273463 1268205 1297119 1295346 1310806 1312577 1303657 1334718 1338463
4856 1338463 1371841 1390224 1381254 1387386 1445252 1449130 1468675 1494683 1460043 1489546 1565854 1579501
4844 1579501 1604455 1582292 1579476 1606932 1639354 1683896 1708019 1719199 1728606 1761108 1779461 1835812
4832 1835812 1889854 1900086 1897742 1951794 1970985 2025905 2034312 2055562 2120953 2165860 2231997 2298731
4820 2298731 2349297 2409410 2434053 2460369 2508524 2580479 2680595 2781891 2844531 2928188 3041136
4809 3041136 3117515 3162176 3207728 3260227 3339031 3397410 3445353 3496434 3573926 3652574 3742329
4798 3742329 3870021 3967812 4065511 4167676 4266362 4373620 4504740 4643368 4762645 4885306
4788 4885306 5065882 5208196 5435700 5687272 5923912 6239199 6555064 6830025 7204015 7564714
4778 7564714 7900666 8237112 8618558 9019858 9508036 10038763 10613053 11224730 11905258 12567094
4768 12567094 13272234 13983822 14754356 15598117 16495042 17557341 18700941 19951349 21196902
4759 21196902 22475396 23833501 25390862 27206566 29440748 32124835 35183620 38604333
4751 38604333 41885393 44432569 45904490 46657840 47329210 48171685 49044999 49685408 50125763
4742 50125763 50586960 51367141 52494529 53856028 55254919 56696060 58309788 60223494
4734 60223494 62476583 64858422 67171079 69212616 71006424 72795883 74758305 77046734
4726 77046734 79727141 82862743 86335776 90065879 94040046 97914799 100753741 101418706
4718 101418706 99507154 96102823 92563195 89379994 86483179 83788351 81364281 79351730
4710 79351730 77689627 76106257 74164309 71732391 69084791 66581532 64360253 62590855
4702 62590855 61188799 60009873 58865476 57748796 56847942 56328233 56170546 56126129 55977597
4693 55977597 55438763 54679346 53998617 53278497 51966365 49375810 45567614 41503016 37906503
4684 37906503 34971564 32634099 30730118 29187072 27861298 26613956 25351399 24142008
4676 24142008 23021750 21972266 21022523 20114572 19275851 18463773 17639924 16836675 16080861
4667 16080861 15334326 14620082 13992421 13418250 12898095 12446415 11978981 11524507 11030727
4658 11030727 10560420 10202362 9848006 9542696 9246347 8999732 8824608 8617606 8412683
4649 8412683 8243538 8086865 7923179 7760469 7614236 7494324 7390853 7261697 7137820 7002055
4639 7002055 6847545 6729696 6561809 6414921 6320537 6193217 6099872 5983474 5830461 5711312
4629 5711312 5565001 5347402 5160701 4981606 4800110 4670119 4545586 4473569 4350379 4238728
4619 4238728 4175690 4104506 4004269 3955120 3839093 3774958 3731864 3670097 3635120 3579472 3508078
4608 3508078 3460733 3426453 3334845 3262935 3175608 3073561 2997341 2947776 2935564 2853203 2737279
4597 2737279 2651496 2584270 2573461 2522081 2452923 2367146 2273571 2262222 2251190 2204264 2147303
4586 2147303 2110873 2076438 1993043 1981148 1967404 1940334 1931649 1904257 1866929 1801823 1772180 1782117
4574 1782117 1775601 1755325 1707654 1695640 1700683 1684230 1694786 1696823 1682034 1685554 1659232 1642801
4562 1642801 1630560 1611167 1568017 1556374 1557694 1521786 1521568 1522901 1475468 1460269 1469163 1456996
4550 1456996 1445609 1443727 1459256 1432150 1430196 1424258 1410119 1429659 1416481 1426024 1423334 1395051
4538 1395051 1399342 1394800 1338067 1315186 1333905 1346445 1365032 1334374 1299291 1301025 1292569 1299154
4526 1299154 1302264 1284059 1279138 1266646 1252063 1229059 1217103 1229276 1214925 1176144 1160025 1134316
4514 1134316 1140864 1127953 1107097 1122604 1077672 1077339 1088153 1071858 1041105 1039022 1029417 1020155 1021319
4501 1021319 1001497 997063 977219 969090 971022 963758 936692 953577 929188 936044 909748 910056 932240
4488 932240 913399 885186 879568 893506 883751 865152 856444 835055 835699 852557 843613 833557 809214
4475 809214 792980 785032 778712 771868 765605 739042 767304 735485 742141 769877 761675 775132 783623
4462 783623 751219 774176 755645 734943 727927 741887 739533 721175 698238 734088 795871 770768
4450 770768 807593 813755 787552 771584 822562 848956 871615 897847 905996 921396 920249 919898 899574
4437 899574 898576 884118 895544 893252 910737 911666 905891 943337 995061 952450 944988 960695 948952
4424 948952 986638 990944 1035007 1064486 1078228 1097760 1103680 1105774 1136155 1137207 1162710 1207254
4412 1207254 1227151 1255270 1287820 1309274 1314274 1323226 1298577 1265646 1233152 1244649 1199931 1155751
4400 1155751 1152300 1134302 1176901 1166681 1164898 1140680 1110974 1106979 1119687 1115986 1157042 1193848
4388 1193848 1186601 1195304 1214405 1213985 1189518 1212801 1190902 1228909 1245545 1214724 1223864 1211051
4376 1211051 1203835 1196682 1161391 1144120 1125251 1187695 1219117 1161520 1162129 1167485 1164427 1133667 1122988
4363 1122988 1108722 1110244 1089560 1078297 1058107 1071877 1075045 1094778 1105010 1054229 1027607 1072447
4351 1072447 1051059 1041194 1014128 1034534 1057972 1036135 1053480 1041477 1054009 1044383 1049125 1021692
4339 1021692 1010092 1004520 1006593 996409 955668 944689 939952 948990 963174 941372 936328 950898
4327 950898 970385 976323 981622 1003125 1018577 994872 987809 1000162 1008208 1026012 1018560 1023847 1032408
4314 1032408 1087282 1109953 1144108 1122633 1110126 1101728 1113882 1161132 1190506 1221359 1213437 1224031
4302 1224031 1227785 1268359 1295479 1320373 1368624 1420058 1477114 1494636 1518592 1575904 1589620 1626685
4290 1626685 1654605 1734803 1821946 1879155 1942192 2042823 2120321 2205589 2348973 2483789 2603381
4279 2603381 2749559 2903467 3096513 3305480 3517582 3736224 3993538 4243438 4484182 4702708
4269 4702708 4949924 5209799 5519733 5848127 6230859 6708227 7240924 7846930 8482547 9197747
4259 9197747 9898612 10548321 11080776 11496103 11834541 12097672 12418284 12827925 13351482 14044673
4249 14044673 14877974 15848386 16992532 18213444 19452094 20561448 21444521 22027736 22280224
4240 22280224 22272357 22104562 21976693 21980241 22181017 22658800 23363185 24285167 25357441 26513107
4230 26513107 27572303 28344802 28770771 28789259 28325598 27594320 26720402 25853886 25134798
4221 25134798 24615458 24394112 24408889 24572582 24860321 25207913 25425631 25394909 25015787 24431842
4211 24431842 23528887 22427110 21250390 20141078 19148236 18320142 17660350 17122330 16721765
4202 16721765 16460402 16163129 15866259 15492559 14985940 14403761 13705194 12934528 12150283
4193 12150283 11425024 10758052 10073146 9493661 9030286 8602924 8238412 7926696 7601736
4184 7601736 7286254 6989919 6691590 6386604 6095518 5796408 5452827 5153724 4900264 4631018
4174 4631018 4402445 4231642 4054565 3927746 3769360 3687052 3579701 3500786 3417064 3306012
4164 3306012 3219890 3132961 3056825 2987779 2918861 2807185 2783592 2718148 2639510 2537717 2467313
4153 2467313 2409118 2334849 2322988 2287459 2226349 2182911 2122032 2075466 2045399 2030225 1981864
4142 1981864 1924274 1899287 1885996 1843535 1833254 1861185 1855127 1828875 1791720 1791299 1777597 1762136
4130 1762136 1748846 1770404 1769174 1771309 1764023 1771371 1760493 1726752 1685067 1675416 1665014 1651449
4118 1651449 1594763 1563704 1545834 1559464 1542577 1550191 1535742 1522733 1540559 1522944 1537588 1560358
4106 1560358 1610984 1665980 1665705 1698250 1712182 1745404 1791633 1829923 1861313 1888627 1910132 1913187
4094 1913187 1940874 1929073 1925386 1896146 1876354 1854464 1851247 1805802 1818758 1828349 1809944 1784826
4082 1784826 1794283 1815729 1797171 1772253 1721010 1662141 1622686 1574209 1538803 1527562 1505032 1466419
4070 1466419 1446545 1451890 1457113 1410534 1380663 1352226 1355019 1352285 1321480 1309094 1299066 1293112
4058 1293112 1296336 1293173 1285209 1324171 1331785 1297106 1264965 1256597 1288881 1324871 1316586 1334077 1346182
4045 1346182 1367414 1356937 1355741 1407685 1414484 1400921 1413187 1433873 1403109 1395442 1400088 1397502
4033 1397502 1432879 1435140 1457952 1491732 1515157 1503190 1489427 1512460 1531360 1569894 1592568 1614897
4021 1614897 1605012 1647836 1693380 1734795 1770326 1823049 1858676 1911630 1974700 2001851 2030368 2076647
4009 2076647 2125960 2126620 2163360 2209091 2242687 2256358 2234776 2249756 2307623 2285397 2281918 2286524
3997 2286524 2312457 2347579 2354978 2379547 2403626 2440736 2486263 2509726 2528572 2541873 2524816 2552908
3985 2552908 2594819 2625820 2635474 2676858 2674499 2665613 2679735 2682678 2688643 2685662 2687738 2693424 2747917
3972 2747917 2768841 2808830 2835746 2863639 2902053 2929359 2960315 2997151 3023749 3116533 3172959
3961 3172959 3230313 3302800 3421038 3503681 3626957 3740396 3892563 3996157 4100448 4222045
3951 4222045 4344561 4488311 4627574 4767386 4868947 5015430 5129703 5223424 5267486 5301457
3941 5301457 5362455 5437630 5526711 5613925 5745051 5926649 6147708 6404773 6663882 6964652
3931 6964652 7324375 7756123 8195824 8679048 9127675 9415558 9596141 9721462 9794471 9831384
3921 9831384 9897237 10047244 10201498 10462257 10759541 11180277 11712037 12255116 12864400 13613173
3911 13613173 14407153 15351476 16386463 17564557 18891379 20345702 21921920 23464690
3903 23464690 24934595 26426224 27911205 29584194 31571702 34017913 36888072 40095300
3895 40095300 43612200 46983318 49669123 51025999 51206353 51058403 51097535 51437700 52000798
3886 52000798 52780385 53975051 55767480 58217489 61114906 64067722 66818434 69038050
3878 69038050 70447746 71161366 71616626 71976330 72331583 72859107 73771463 75261176 77429511
3869 77429511 80367935 84148717 88730171 93789104 99049183 104107837 107782803 108367422
3861 108367422 104911825 98704176 91913893 85995289 81366063 77878273 75326111 73376603
3853 73376603 71976121 71082578 70732459 70644309 70616804 70400620 69814972 68653650 66582309
3844 66582309 63586166 60150753 56876232 54150955 52204204 50993557 50270021 49746651
3836 49746651 49283778 48906265 48625377 48196942 47119208 44874555 41587576 38047778 34799283
3827 34799283 32054100 29795451 27970098 26505550 25283710 24117456 23033725 21929999
3819 21929999 20765516 19671152 18710891 17857798 17153580 16488330 15877768 15319557 14824484
3810 14824484 14378165 14030402 13715652 13411094 13182155 13018606 12890114 12769335 12655374
3801 12655374 12502917 12342228 12136093 11836415 11437766 11014208 10651162 10303782 9996760
3792 9996760 9698920 9499961 9305569 9126518 8988922 8828674 8702219 8588079 8488424 8436376
3782 8436376 8336134 8208715 8167713 8095946 8008587 7905024 7775930 7699171 7636440 7551039 7471080
3771 7471080 7391857 7345581 7286255 7215744 7200974 7247039 7286453 7315842 7333099 7410447 7480157
3760 7480157 7580898 7657427 7797288 7946185 8098898 8268226 8449426 8641582 8848211 9051743
3750 9051743 9303548 9604564 9928959 10234522 10599991 11000461 11484165 11999306 12584811 13247557
3740 13247557 13963417 14799801 15742982 16787692 17916134 19233753 20737596 22412904 24281906
3731 24281906 26432670 28831614 31610891 34800362 38385045 42398114 46796689 51332950
3723 51332950 55853815 60103866 63853890 66912005 69097216 70448232 70927921 70713138
3715 70713138 69912117 68856257 67832922 67075647 66745595 66954691 67569740 68429665 69317910
3706 69317910 69892173 69933933 69253808 67789397 65545132 62522024 58887981 54825342 50563840
3697 50563840 46365198 42337854 38594291 35241689 32314785 29739916 27510794 25586307
3689 25586307 23867483 22300379 20947457 19767393 18648710 17629204 16702473 15853326
3681 15853326 15119019 14447275 13814272 13273797 12804135 12352938 11984245 11627865 11283118
3672 11283118 10951708 10715123 10510927 10266427 10068156 9868461 9705765 9559375 9380309
3663 9380309 9215812 9061277 8926521 8758602 8599778 8466083 8304873 8208750 8112808 8001680
3653 8001680 7945884 7875370 7791375 7682163 7589388 7520063 7450651 7340855 7244349 7213664 7146555
3642 7146555 7119400 7109719 7086432 7097030 7078006 7084488 7056586 7070904 7046524 7061661 7075506 7088343
3630 7088343 7136385 7165024 7177898 7227352 7276345 7334057 7426874 7498634 7588923 7682336 7773034
3619 7773034 7851535 7925089 8013536 8101481 8144992 8181513 8243216 8279028 8354821 8414376 8495540
3608 8495540 8579637 8645677 8780941 8892725 9050320 9189727 9306456 9462490 9633861 9799756
3598 9799756 9986290 10221094 10490154 10767564 11096119 11480810 11928431 12443172 13066035 13828624
3588 13828624 14674047 15576290 16557735 17528474 18508789 19429517 20317047 21149508 21904282
3579 21904282 22658310 23370091 23964823 24507916 25045454 25428599 25655523 25806773 25874679 25812810
3569 25812810 25649400 25377309 24918434 24366524 23729772 23036854 22267755 21472754 20741174
3560 20741174 20161918 19611103 19142305 18760521 18474246 18297141 18228848 18263901 18346866 18552432
3550 18552432 18860978 19252076 19741536 20343579 20996799 21818856 22694417 23713582 24914678
3541 24914678 26256406 27762472 29456903 31356542 33489875 35894361 38577294 41599067
3533 41599067 44994509 48828141 53119623 57889229 63239007 69153401 75682981 82641525
3525 82641525 89799092 96948786 103859686 110357933 116450083 122218055 127637922 132661459
3517 132661459 137090172 140660951 143214224 144745263 145319946 145101615 144173472 142555916
3509 142555916 140383713 137775503 134752646 131305793 127521157 123406305 118940041 114145521
3501 114145521 109134117 103941399 98681492 93477615 88441111 83666822 79193386 75169067
3493 75169067 71687281 68693577 66270533 64497296 63282701 62646908 62520594 62994914 64058220
3484 64058220 65703496 68010186 70959370 74671425 79184510 84365651 90077706 96245723
3476 96245723 103057319 110347473 117787416 125047548 131833391 137966360 143191127 147353464
3468 147353464 150462610 152489997 153618409 154229084 154674573 155305573 156485496 158107242
3460 158107242 160097847 162274703 164428112 166272653 167471718 167698075 166585208 163942752
3452 163942752 159644762 153715425 146306608 137835380 128961661 120253771 112058144 104554944
3444 104554944 97777191 91776168 86472942 81806246 77687509 74040289 70744758 67734838
3436 67734838 64906045 62179029 59538829 56931300 54390211 51881671 49418998 47036291
3428 47036291 44831777 42772208 40856529 39147476 37608571 36213329 34954195 33872884
3420 33872884 32932657 32123788 31410493 30760506 30265707 29834526 29438353 29135863 28868807
3411 28868807 28683336 28573490 28590939 28634630 28798538 29114281 29533651 30044155 30550200 31064066
3401 31064066 31616645 32069824 32325262 32402965 32356098 32279144 32160755 31907007 31692361 31333042
3391 31333042 30743168 29946671 29091333 28352671 27685143 27086292 26570589 26139835 25732963
3382 25732963 25364409 25010439 24584412 24110970 23598752 23032289 22403576 21785848 21171249
3373 21171249 20476980 19839429 19258429 18772244 18366496 18089784 17805906 17542759 17402803
3364 17402803 17318036 17160924 16879677 16634790 16494867 16384292 16237699 16082760 15942214 15839584
3354 15839584 15690771 15539939 15381643 15186771 14971128 14792426 14623396 14531287 14492417 14531083
3344 14531083 14661104 14768048 14774954 14587509 14360032 14260105 14289986 14457973 14697586 14918867
3334 14918867 15141027 15243553 15222940 15245483 15307164 15396485 15578783 15747648 16017989 16328543
3324 16328543 16671695 17136956 17667883 18301954 19070472 19985725 21034471 22228070 23614430
3315 23614430 25210477 26863634 28542436 30454077 32763616 35492025 38651074 42194057
3307 42194057 46038853 50131695 54290522 58416834 62513036 66575253 70609173 74592377
3299 74592377 78366137 81691443 84329817 86175795 87228514 87644897 87548411 86969034 85935152
3290 85935152 84373470 82214046 79490516 76325651 72823908 69103768 65264149 61433210
3282 61433210 57663519 54003904 50483888 47158833 44065293 41284278 38782140 36431613
3274 36431613 34252387 32228961 30261638 28419644 26706146 25104841 23617167 22171838
3266 22171838 20791589 19492069 18377662 17396315 16518460 15711062 14976004 14362746 13815977
3257 13815977 13261835 12800070 12416672 12057106 11711927 11417674 11182631 10957337 10779009
3248 10779009 10604610 10477862 10359933 10294958 10341876 10356283 10442332 10548272 10656725 10791433
3238 10791433 10891544 11005172 11087579 11121273 11090179 10982227 10794538 10539900 10324749 10046381
3228 10046381 9733338 9425491 9113780 8782228 8440718 8156854 7929500 7645036 7398795
3219 7398795 7198482 7014499 6846234 6671690 6524815 6396503 6291465 6188891 6064005 5994146
3209 5994146 5925498 5846581 5791312 5710511 5705413 5679290 5624962 5557400 5492716 5425109 5376037 5308684
3197 5308684 5251629 5211233 5198156 5180502 5099998 5068387 5075126 5104563 5119533 5090697 5105458 5159124
3185 5159124 5205359 5197492 5176313 5185586 5202164 5236250 5237675 5255959 5244817 5237079 5226699 5172900
3173 5172900 5122703 5095281 5090842 5103328 5122165 5115708 5118078 5068839 5076521 5057184 5025490 5014620
3161 5014620 5000835 4995834 5011267 5036078 5050497 5042149 5037534 5003887 5034238 5133685 5235367 5299387
3149 5299387 5428699 5473448 5477936 5514689 5535159 5534538 5577213 5584774 5657025 5716287 5794338 5863253
3137 5863253 5938584 6041600 6160322 6348020 6482432 6630436 6822259 7049632 7343625 7652495
3127 7652495 8011169 8502180 9036687 9627692 10243704 10782288 11095359 11090896 10778776 10412544
3117 10412544 10107815 9858172 9661712 9561283 9475893 9490248 9559027 9639412 9770790 9893486
3107 9893486 10047081 10254941 10489361 10736607 11003929 11337643 11719824 12189848 12720629 13295392
3097 13295392 13812469 14366181 15023804 15754563 16531871 17333911 18239265 19205076 20300668
3088 20300668 21483442 22696213 24014063 25442819 26960930 28570268 30286471 32150418
3080 32150418 34329666 36691668 39380816 42395553 45684351 49352373 53458186 58140893
3072 58140893 63524314 69707196 76706917 84583489 93493181 103495687 114864307 127629586
3064 127629586 141977226 158309072 177388235 200489230 228978862 263526091 303966016
3057 303966016 350025322 399136427 440835861 458497181 442216430 401546487 356798056
3050 356798056 319614027 289965689 262984709 235555978 208733496 185180201 165700166
3043 165700166 149408543 135373136 123195631 112724919 103774791 96044523 89152693
3036 89152693 82839950 76943157 71482475 66531397 62129342 58283668 54844331 51718518
3028 51718518 48806626 46107212 43606418 41372635 39372859 37548274 35893317 34358982
3020 34358982 32820159 31364672 30024495 28779305 27645240 26563241 25550285 24560665
3012 24560665 23661912 22844979 22074736 21351599 20699125 20083878 19487475 18858619 18267841
3003 18267841 17730732 17131050 16630535 16103664 15608125 15130245 14720268 14318074 13854059
2994 13854059 13388727 12926419 12487550 12139587 11828946 11559191 11364136 11133274 10890311
2985 10890311 10675046 10432110 10203968 9958558 9727409 9509999 9302977 9103782 8873345
2976 8873345 8671244 8454733 8288342 8125243 7944818 7694463 7478134 7295267 7124464 6967756
2966 6967756 6813287 6644166 6476549 6306819 6128062 6013591 5860200 5751789 5675988 5639867
2956 5639867 5652440 5605904 5516438 5406189 5315227 5261814 5202024 5172397 5123650 5071807 4991549
2945 4991549 4933563 4821130 4712397 4652694 4618598 4586517 4517907 4464600 4378282 4277484 4178831
2934 4178831 4106535 4016112 3918426 3817334 3728252 3643119 3578173 3567698 3498074 3450673 3402473
2923 3402473 3362651 3320906 3259128 3215624 3160520 3116830 3080410 2999421 2891124 2831351 2794646
2912 2794646 2726895 2640852 2578474 2549381 2488884 2399110 2332134 2268077 2299717 2307624 2329767 2345160
2900 2345160 2389411 2399734 2433789 2470562 2517979 2539015 2547881 2569575 2575573 2603146 2598454 2547832
2888 2547832 2518217 2488440 2459209 2425381 2353132 2292816 2210961 2165330 2177735 2135579 2073778
2877 2073778 2023285 1995153 2028731 1980097 1910129 1886364 1844137 1858227 1833386 1786055 1805888
2866 1805888 1811938 1803588 1801763 1782274 1728027 1677039 1631682 1602026 1592462 1588322 1545033 1519904
2854 1519904 1516278 1529807 1531636 1516804 1564621 1598555 1570947 1546074 1556078 1599630 1625605 1594526
2842 1594526 1581291 1613857 1621602 1628500 1617584 1576477 1545674 1541523 1547793 1531105 1501006 1517429
2830 1517429 1524712 1521599 1509816 1492715 1486158 1482976 1486159 1492499 1463613 1414766 1431371 1453128 1448112
2817 1448112 1430133 1403560 1369830 1360866 1377444 1342677 1306182 1309024 1302746 1291511 1283519 1256411
2805 1256411 1276894 1297157 1284743 1252560 1225749 1237444 1260515 1258240 1227849 1241949 1241439 1261940
2793 1261940 1279399 1316350 1325430 1332829 1355774 1371320 1395628 1476312 1504381 1583237 1664115 1718912
2781 1718912 1801640 1861198 1976087 2094247 2250766 2465556 2668863 2890190 3146472 3350552
2771 3350552 3430000 3361533 3154439 2935574 2737776 2581854 2464995 2323680 2136214 1986259
2761 1986259 1885363 1796295 1702694 1649785 1622424 1557647 1543450 1490293 1484428 1426323 1396324
2750 1396324 1354875 1325957 1282789 1255089 1216691 1193503 1191466 1152252 1151615 1101340 1060632 1025558
2738 1025558 971974 1001828 986766 978777 985155 977546 973264 981698 990660 937884 904406 929776 948767
2725 948767 954959 931652 937135 891622 865280 876143 863489 881906 905318 900630 869482 862344
2713 862344 837604 846743 815029 803204 824565 814909 804267 818705 824774 794295 788776 811729
2701 811729 815449 768680 736446 756874 739886 719750 734167 728725 729056 716167 666085 657708 673498
2688 673498 687912 697119 671463 656837 653380 644424 612815 606805 596667 589592 589908 613162 618529
2675 618529 594666 589952 555607 536828 564130 595514 531987 531638 564520 601670 624795 625107 624230
2662 624230 624159 629477 634201 608385 613822 589594 608242 614197 586217 553309 567611 576023 555071
2649 555071 547691 531103 548690 550960 544943 539623 553940 535183 536220 549041 552633 528593 495947
2636 495947 489098 482246 455958 455113 454107 435118 436535 448897 451135 436955 424912 416254 414183
2623 414183 426915 445519 442846 418217 418119 426146 430157 440781 447837 447227 452647 442025 479882 497505
2609 497505 484117 470594 480960 490185 470547 478108 471726 466577 441181 474811 479162 493609 510956
2596 510956 500399 490124 522598 506893 490953 492819 501935 486307 513576 516066 514824 502292
2584 502292 460576 455878 439553 430857 425161 420026 451522 433119 390350 422423 441356 405365
2572 405365 419344 462396 451028 476572 471723 444324 439600 463749 463025 472725 471196 454297 453261
2559 453261 451707 417023 482497 483121 470872 430553 426445 437631 430723 435292 430255 420359 420082 407601
2545 407601 417027 429595 380763 380818 389997 382185 416426 424667 401828 398963 418465 417837 417889 422752
2531 422752 413334 423694 460250 452820 436923 395872 393059 423375 412773 396632 418077 425775
2519 425775 427727 418429 414631 427552 398737 386515 377560 351768 367606 368373 391941 408836 368505
2506 368505 364554 352995 361336 351010 379505 363673 354832 340697 345176 398864 394032 401338 405045
2493 405045 381756 352441 363886 344060 337518 357102 355750 345887 364372 389455 350409 337781
2481 337781 375449 388712 380657 392762 394657 382292 370510 358734 360584 376585 366978 378503
2469 378503 359256 384311 377676 349376 357370 361247 322233 330685 334183 350826 345856 315741 325419
2456 325419 327029 345686 358282 348929 349694 351011 373102 355020 352993 364832 350094 363167 329930
2443 329930 307934 346849 373295 354969 305829 310703 323561 320634 320209 313120 325640 345744 321554
2430 321554 318557 334679 330540 326268 318496 327718 328533 328661 310890 305676 291832 285001 288205 313556
2416 313556 299010 296560 293360 314469 293879 322586 336700 325716 355016 352840 342542 334990
2404 334990 339839 312256 298246 309870 355328 342009 299669 265362 298799 323481 309052 293313
2392 293313 279289 275893 311534 324976 314178 338578 332358 349561 357982 344013 329146 325367
2380 325367 310612 327086 329416 338951 292582 294065 298822 309272 325354 320301 325713 344905 358957
2367 358957 348588 356341 334063 341387 349212 344304 336795 367764 332921 310405 328102 338235 327521
2354 327521 377880 368936 323434 334899 375194 391864 375405 341589 350664 414943 413225 400645
2342 400645 440327 443837 405225 411375 439345 422778 435078 438134 453876 444629 453602 480144 510159
2329 510159 529431 522256 533408 539507 558776 585514 616309 627457 653529 694321 704160 741238
2317 741238 751557 815078 854579 904752 988256 1023107 1122678 1171899 1255356 1350418 1468161
2306 1468161 1582123 1750812 1960608 2102758 2185809 2354040 2541751 2810842 3082815 3494520
2296 3494520 3978936 4664088 5511161 6462982 7521484 9123448 10783482 11679343 10587686
2287 10587686 8346368 6761664 5642563 4859528 4204677 3656121 3223371 2959760 2717216
2278 2717216 2571779 2446338 2332906 2214351 2122549 1989431 1826973 1668619 1555427 1494233
2268 1494233 1435303 1303562 1235867 1196629 1144151 1085571 1054646 998643 925599 891935 904770
2257 904770 862895 791717 762589 748219 704617 683839 705649 695662 706241 702874 695533 669859
2245 669859 649277 642649 610174 593268 566882 513056 507376 511523 449121 467691 482422 515951
2233 515951 474695 467043 443374 446263 449739 480312 484551 466422 477027 432294 417054 413045 395705
2220 395705 396269 396849 377471 384663 402266 402062 359989 378007 357328 375210 350322 354639 329444
2207 329444 336555 309115 287360 287713 293092 356568 352054 321863 288095 305330 301542 273422 288168
2194 288168 273292 285381 287499 280496 294742 267742 280310 278677 273045 301048 282560 249254
2182 249254 262700 300018 278131 257822 290976 271292 265530 257796 276714 263239 243615 254185
2170 254185 291024 292207 282025 271239 274823 279960 287315 280454 250627 255596 250799 262399 263621
2157 263621 232882 210090 231959 223161 191905 230939 253830 208974 223940 229166 215692 229543
2145 229543 229746 230009 251806 234702 266466 240116 204208 197780 222401 236405 216254 187512 223915
2132 223915 200184 177939 235855 255844 239458 242499 221866 182486 165051 193717 189644 187607
2120 187607 212037 235671 232533 198107 217897 229705 225121 237576 235739 217926 220546 211161 204991
2107 204991 220550 226565 197188 214281 186511 173435 175312 204854 208235 236234 236150 253508 216482
2094 216482 202140 200302 164548 166757 168341 171041 133938 175198 214357 195246 188272 189922 192357
2081 192357 198935 183984 141544 148903 181899 163929 211643 186381 177846 195523 225219 230842
2069 230842 223079 205880 173844 158236 170640 183437 200212 202275 210189 194887 161816 183475
2057 183475 194702 191686 177753 190968 172997 182903 178283 169007 168864 167445 149336 170963 131931
2044 131931 162883 161669 159544 184367 181440 159196 169331 205981 226977 198784 218372 216834
2032 216834 198597 229672 248904 233186 196421 187092 172628 178675 159897 193306 234252 240662
2020 240662 205592 203525 209723 221927 198777 197359 224664 193610 148545 129231 173281 205238
2008 205238 204023 178485 139073 169561 190438 191402 174925 203045 196574 176366 170112 151104 136837
1995 136837 154826 153327 175487 144572 119867 167731 204895 187976 158836 168636 178937 154715
1983 154715 136514 151708 156938 160307 173880 152081 140163 160812 167873 196871 204926 213946 175684
1970 175684 173141 175434 154980 162779 124536 164468 170199 149911 158328 147003 178065 182921 152267
1957 152267 158901 171358 162732 149235 137432 165265 153722 163817 157085 153407 151344 164707 133674
1944 133674 123025 95510 101758 89611 122910 153453 134080 143558 148517 151231 158632 160403 154389
1931 154389 182145 131276 122646 153411 169709 177533 186840 168005 158979 147741 174312 162981
1919 162981 156851 173164 165549 126810 142268 156475 126985 108509 115674 150073 171586 166648
1907 166648 164438 160672 168175 177100 141448 149817 150823 145115 162914 140272 136086 181009 190554
1894 190554 174441 167033 155556 140878 125366 101526 94958 125084 129184 142807 152008 147469 160657
1881 160657 153254 137258 131492 123974 128257 114465 138251 142105 133096 143852 147384 123515 78435
1868 78435 128816 109657 93498 121292 153524 163850 166206 161657 158244 116497 119488 129920 132728
1855 132728 132925 111998 101683 104240 100462 114907 125677 141246 139226 132683 128291 110175 129968
1842 129968 141314 139084 117600 105678 119424 136380 139803 163055 142736 132631 137873 134447
1830 134447 144726 137175 134537 150059 117389 118734 141851 115490 125030 135040 113444 132039
1818 132039 145026 115757 107622 110484 102372 124326 123159 118818 115022 117064 131180 112921 137942
1805 137942 164786 117396 75146 110387 105672 108023 124778 105978 132434 106528 127383 146124
1793 146124 117102 114118 133855 141834 126146 95706 106866 115312 148291 152132 147939 155030 137344
1780 137344 142120 120206 92341 119012 125112 101324 108778 110064 106397 91539 109507 107458 96086
1767 96086 114830 95792 78511 119645 152624 146034 140461 160610 152124 133143 133587 141043 103028
1754 103028 70475 94141 110668 71734 73060 106358 112192 120380 119191 134788 138946 143260 106901
1741 106901 122470 139151 97137 128552 115599 90856 117326 121778 124161 108817 87119 100465
1729 100465 124928 121929 108561 137850 142022 144586 129005 134036 113177 114821 114123 57162 78384
1716 78384 125978 108470 108103 109353 79808 77549 117242 89754 87946 100152 139347 115657 44266
1703 44266 64215 101577 123361 101915 118969 118805 136354 109496 67707 81913 108290 114455
1691 114455 153819 140563 146349 131911 118010 125294 127701 133491 164749 152469 112804 111461 106746
1678 106746 144023 145268 134016 114371 110068 78800 68745 72060 95626 125677 95353 108899
1666 108899 108536 125355 136672 110454 106861 121690 138662 128450 133973 114430 106948 142767 135813
1653 135813 116872 80232 63101 81171 100851 118703 121312 126594 134038 139564 160229 148488
1641 148488 131961 148937 147925 142353 100431 101810 97863 79887 70847 76802 98782 104002 106001
1628 106001 102254 119003 105858 102246 110935 108423 102875 105075 130806 103492 71791 67434 87514
1615 87514 68287 105268 102264 97349 114365 97870 79607 82197 94429 83103 78076 59494 81959
1602 81959 96672 80584 96604 94092 99798 92758 83076 98531 92271 81814 112904 116269 77477
1589 77477 97072 89568 49467 46508 80370 101520 105969 97677 103266 84446 79432 80535 100463
1576 100463 97031 63385 62982 93997 122084 128097 109515 118157 110713 97024 70382 94695 102798
1563 102798 89369 96504 95898 56591 57807 86835 89144 79506 89060 103407 109486 86779 83060
1550 83060 135777 146316 133668 120178 107220 77684 63614 57546 60624 86636 68491 50606
1538 50606 67868 84513 86995 60725 54983 61225 64788 95248 107199 102457 77530 49037 58018
1525 58018 61616 106181 114235 100793 108038 119052 98850 93431 86749 82268 83593 83970 88788 73490
1511 73490 94239 73402 69117 58919 76864 64252 63678 100581 111638 127594 98776 72534
1499 72534 40593 39065 67906 132329 130141 118153 82788 81242 62332 103450 113442 71478 73841
1486 73841 76748 83920 105758 63194 61022 96065 81338 92105 89853 100056 45699 41803 55644
1473 55644 81534 106787 99079 64039 92832 119172 84259 68442 55922 40777 70685 82792
1461 82792 74010 103203 103397 97184 106506 107520 81764 99175 102177 70012 59330 79732 67085
1448 67085 82499 93390 87789 79607 68524 84241 87759 69185 37226 50068 54614 49008 42639
1435 42639 44257 45733 64713 98225 89128 105015 61026 73766 67680 87505 84765 77551 95995
1422 95995 76328 87261 77075 120646 116466 104964 85878 86492 81013 96174 95752 94167 99243
1409 99243 84793 75700 66965 63212 72593 79498 72871 86814 78976 89924 89017 64282 68423 50025
1395 50025 68850 85543 79334 71720 81159 61992 53049 21524 89626 135824 121403 101466 97191
1382 97191 106099 75581 52871 67082 60089 92007 99197 75494 85198 94423 122190 73863 69202
1369 69202 118503 118411 97638 86397 73823 55961 43760 86542 74982 97823 112054 109043 96589
1356 96589 81940 80258 35842 21444 63063 67903 69116 74917 59970 80995 112035 85330 89568
1343 89568 93772 74283 51734 49801 46651 59986 64982 65424 79875 87128 58877 43664 53798
1330 53798 57905 46252 43307 43188 38596 48758 53962 37132 25722 48285 14256 18336 23272
1317 23272 36010 65628 75711 74825 61286 56175 74164 68158 49011 44750 33728 47236 55677
1304 55677 51898 63535 46554 40004 64968 81381 80707 48008 45351 59337 51739 83620 50127
1291 50127 44206 51565 70640 86834 96316 99759 80914 70803 35998 13945 33418 59664 62669
1278 62669 53483 48632 42270 38966 48768 54344 45347 70656 52504 45848 58257 49495 76095 90557
1264 90557 69399 27040 52528 47619 11615 14430 50637 75844 92666 96861 74851 68989 87849
1251 87849 71849 60090 49686 36687 22605 56679 65087 42384 54139 67169 67013 75164 79640
1238 79640 73613 71891 72278 61213 37112 70384 57512 48599 44111 31245 35940 32808 69959
1225 69959 59020 71867 65836 63431 50163 42113 61576 65367 59968 55990 45610 53188 19013
1212 19013 37306 69791 71687 34560 46363 58834 51726 44579 63681 67259 58678 59113 51373
1199 51373 75187 54847 39974 29729 50235 51794 76677 70649 42639 42869 64508 63406 52641
1186 52641 39689 50761 43520 51112 35595 36524 21706 23221 43353 71230 22302 47304 96167
1173 96167 103309 67305 28830 62607 88917 69712 44348 57952 51153 77090 46755 24600
1161 24600 17845 6672 16800 36874 45812 52889 61157 48101 21003 51166 87617 71054 66093
1148 66093 51879 36937 11158 37851 63953 58892 68334 45197 37120 42621 42754 37830 50901
1135 50901 66348 82901 60351 63364 55068 28654 47545 51909 39213 55926 48708 10100 29036
1122 29036 65002 79193 40576 19901 10048 11454 3666 11192 52496 70332 63879 53887 38537
1109 38537 35255 54734 45623 39937 50770 57412 74874 27987 14956 23286 15161 25581 39459
1096 39459 24140 17938 48215 38525 22656 15252 44078 66107 55150 54831 42256 23064 42271
1083 42271 11900 -16051 30594 53266 45990 10063 7836 -7257 11063 15234 6470 -2442 -9244
1070 -9244 48123 62681 53263 60217 70750 44634 30720 49314 57636 46543 35624 42074 53208
1057 53208 30995 24407 20086 29780 44539 90637 99697 80974 49908 73681 74910 45142 36725
1044 36725 45969 53112 28662 15686 35334 7440 28313 21070 35379 40484 26498 20050 29048
1031 29048 24715 40701 53113 33290 24391 28070 -8257 -15598 -39729 -28009 7770 12299 28929
1018 28929 32939 75750 59212 44905 26313 42923 20579 44205 31570 59776 19783 -30477
1006 -30477 22072 13725 13480 18509 -7137 -7596 -25068 -21520 22629 53143 36265 -4830 -35194
993 -35194 1781 24744 17779 2467 24594 22357 15331 40389 -1011 -6393 26514 25785 21085
980 21085 1299 12912 15095 -9712 -13047 -15950 2301 43783 50870 26383 23381 37280 52260
967 52260 44846 26786 28078 30034 28683 21746 33861 49657 31695 30629 14328 2440 18998
954 18998 36701 50550 46627 59793 71495 58784 20690 2171 -16838 -9440 -16184 -23326 -7564
941 -7564 -11757 -1047 18149 14833 22718 50778 53889 20339 9926 4283 2008 15286 928
928 928 -15322 -23019 -1625 9357 18124 5339 7118 -791 -6706 34046 46695 32274 24594 45077
914 45077 49525 36916 56466 60439 47842 58708 56128 25090 24218 32582 34023 -8800 16494
901 16494 8971 -8978 14457 24553 14923 14549 43260 32639 17264 14359 7283 -1845 36483
888 36483 24018 2723 6413 21535 51307 56028 20428 15920 2977 -4211 -5348 10513 16064
875 16064 -19569 -349 9587 17618 15417 36949 24881 35851 26565 21175 -12125 -23515 23667
862 23667 31236 41930 41459 53172 34604 10291 -2774 -8012 -19976 -36510 -23182 -2246 30656
849 30656 28132 37889 37783 24008 -12648 -360 22125 18959 -3132 17441 5805 -2663 -20939
836 -20939 -32489 18320 4679 -6335 -14714 7423 19769 -4722 -15306 11227 1327 6858 13440
823 13440 3396 41636 8714 -6406 31811 11292 -6270 -2010 19743 20632 12166 7933 1929
810 1929 -11549 -14077 -26133 9911 15193 12474 9082 34335 25746 50169 33221 32933 5755 -16930
796 -16930 8618 -4920 -21602 -14900 5984 11522 -8008 37492 28570 13211 30944 9312 21096
783 21096 267 5869 20125 42675 35874 31181 13185 51136 38126 11675 7174 -11480 -22500
770 -22500 -8932 -1013 1756 -68 -10165 -11456 12846 20883 -1906 34635 12969 -5475 5544
757 5544 6711 12010 -5778 -17759 -15265 34227 47610 33378 -3924 9674 44304 -6609 -4699
744 -4699 11945 3377 22686 21306 20574 27650 22384 -18414 -27155 -8702 -18874 -7764 6948 19731
730 19731 -428 -36923 -11384 13008 -15937 -13990 -27674 -27897 -7012 -33127 -16387 -2490 -19180
717 -19180 -30609 -15549 -24503 -30334 -5402 -10808 -51444 -11770 34612 10936 12010 17415 -9748
704 -9748 -18169 -44803 -28138 -26758 -41665 -35257 394 24698 21219 31230 29338 17005 -6199
691 -6199 20475 -10088 -20181 -17537 13829 18139 -2183 -19883 -26597 -14205 24017 6921 -14258
678 -14258 -4329 -26569 -33716 -28066 6678 20286 8292 -23483 21193 -8997 -22117 2962 -17037
665 -17037 -41659 -55040 -25824 -5126 15490 13710 -5817 -3170 12107 9280 13635 8255 3723
652 3723 -24749 412 13531 -22852 -28471 -33213 -20023 -32568 -45698 -38779 -43033 -33941 -20727
639 -20727 -26558 -9652 7612 -20101 -18844 -20348 -6651 25191 14251 5600 18095 23530 -2553
626 -2553 -5797 -854 20278 15076 -3501 -4282 20787 28807 -23307 -28351 -30816 -28063 -48840 -28250
612 -28250 -21556 -17357 -38219 -33698 -27246 -21967 -8945 -9942 -2511 -11873 967 -25823 -17479 -24582
598 -24582 -50889 -18688 3422 10882 -21346 -6606 26132 4521 -38383 -36829 -24697 -32947 -12911
585 -12911 -36905 -37815 -41227 -21892 -23192 -3729 -11339 -16249 -9209 5235 -17116 -8652 -21964 -6698
571 -6698 7273 -29488 -42888 -7696 36255 32916 -16443 -37141 -38041 -53346 -34416 -46520 -20827
558 -20827 -21151 -40472 -46198 -22147 7073 10310 9403 -9302 -28124 -30430 -20736 -7417 -22717 -23899
544 -23899 -29813 -32942 -50970 -29591 3879 12255 -19353 -26216 -26885 -25981 -11679 379 -7871 8721
530 8721 -591 -13762 -20309 -25984 -24790 -23572 -33133 -35595 -215 21401 8988 -6011 -38312 -21054
516 -21054 -54951 -68723 -23523 -20176 -42403 -33692 -23316 -45715 -27350 -63086 -52409 -52860 -28641
503 -28641 -23039 -19497 -17684 -8503 6409 1861 -31120 -33066 -58742 -56699 -40043 -42849 -30471 -28534
489 -28534 -25042 -37288 -29919 -9733 -22114 -36203 -24788 -8377 -46631 -52495 -37412 -35893 -9932
476 -9932 -7217 -41737 -61378 -50921 -26849 -13340 -27505 -17333 -34934 -40446 -36188 -19199 -10934
463 -10934 5045 -17409 -9035 -9620 -10228 -251 -28609 -25220 -12501 -13194 -40047 -32502 4131 -2825
449 -2825 -7892 -9341 -33531 -31134 -39426 -14836 -42903 -56017 -39794 -10101 -32056 -45178 -4667
436 -4667 -136 -28046 -47841 -48417 -74734 -49585 -38476 -77163 -89329 -70125 -41197 -28628 -30407
423 -30407 -50889 -68391 -32463 -69656 -88816 -82612 -55694 -47678 -31160 -67172 -60576 -38505 -41268
410 -41268 -29260 -31008 -2710 -21941 -58754 -47593 -29212 -61372 -54918 -18448 -26146 -19204 289
397 289 6154 -27637 -10535 11943 -25376 -35838 -41670 -6002 -19768 -10919 9976 -33321 -52881
384 -52881 -10473 -10736 -44724 -34898 -37579 -37036 -29790 -32237 -39128 -34625 -17754 -34219 -28813 -35294
370 -35294 -69464 -91774 -55607 -46125 -72064 -69913 -34144 -24485 -37123 -25260 -42771 -22485 -46650
357 -46650 -48604 -22321 -30963 -12655 6918 8153 -22809 -39731 -48504 -74621 -55536 -27249 -25296
344 -25296 -24945 -32878 -32538 -49160 -33434 -58867 -66617 -35178 -17477 -23759 -27301 -10918 -9729 -8196
330 -8196 -33072 -26503 -19920 5815 257 -13059 -11536 -15293 -34908 -39122 -48489 -27379 -43832 -66177
316 -66177 -50123 -39364 -27668 -42764 -61691 -61713 -64697 -68100 -50968 -44956 -38801 -56212 -62067 -93464
302 -93464 -79435 -67450 -12818 -33049 -67589 -40645 -27986 -18017 -26883 -42238 -50464 -17902 5620
289 5620 -14905 -36127 -38381 -52708 -28304 -22437 -30076 -39568 -47191 -26298 135 -4624 -23495
276 -23495 -39995 -42394 -33020 -43113 -51078 -18457 -24052 -58810 -42762 -49881 -69747 -49445 -33327
263 -33327 -2408 -34445 -35121 -10624 -44949 -69617 -48977 -33405 -52104 -49834 -52503 -37787 -36557
250 -36557 -43404 -59657 -88700 -92527 -41749 -46695 -32321 -40343 -41570 -48562 -83047 -60588 -50333
237 -50333 -78604 -88032 -88528 -59482 -56956 -58015 -44904 -39778 -56448 -74334 -39143 -9841 -3406
224 -3406 -40304 -42242 -55218 -71785 -71904 -40159 -41056 -60587 -52871 -53406 -61758 -63575 -62858 -46178 -62920
209 -62920 -66436 -51144 -38342 -40042 -48690 -59948 -62052 -49933 -48343 -54881 -66046 -45333 -37072
196 -37072 -35196 -43998 -53279 -38815 -44569 -49196 -73717 -70218 -44861 -43717 -80913 -72894 -65682 -71751
182 -71751 -43614 -38920 -75478 -74685 -52995 -41745 -46338 -52289 -41993 -68148 -58146 -77279 -42415
169 -42415 -34641 -44758 -20841 -26788 -23058 -25125 -25640 -43844 -31076 -66438 -75810 -33222 -41036 -68352
155 -68352 -58775 -66899 -71054 -56464 -47551 -25751 -40076 -53824 -67436 -46371 -42142 -56462 -52979
142 -52979 -37384 -55849 -50243 -49384 -60425 -56983 -47816 -47339 -46696 -45329 -64420 -81623 -99471 -63835
128 -63835 -49476 -70644 -57433 -65404 -82162 -71956 -86045 -68541 -75946 -70558 -96463 -63836 -39134
115 -39134 -45381 -75045 -92376 -80491 -98170 -81108 -47809 -52458 -79154 -86768 -79468 -90055 -50484
102 -50484 -28168 -43462 -51854 -62284 -38152 -70098 -65803 -74380 -74980 -86925 -58698 -42052 -57612
89 -57612 -47348 -29641 -44730 -60485 -85098 -87640 -72047 -60300 -64413 -61823 -63588 -53839 -40052
76 -40052 -38082 -50823 -51739 -78416 -78406 -54590 -29732 -78410 -88277 -73013 -74982 -74237 -80780 -80163 -55295
61 -55295 -58864 -90734 -90489 -76172 -80351 -78191 -72330 -88233 -75276 -85730 -73228 -63913 -66578 -74557
47 -74557 -58220 -74865 -55484 -59100 -54883 -46279 -82696 -76912 -56713 -64144 -73288 -85997 -97941
34 -97941 -99895 -87394 -82068 -67497 -43755 -48994 -57159 -51722 -52236 -57096 -56134 -57850 -66605 -51215 -72782
19 -72782 -89963 -96491 -103460 -110711 -80993 -64005 -66053 -89689 -69904 -80596 -73639 -68017 -81571
6 -81571 -78243 -76337 -70681 -72350 -61647 -66328
0 -66328
$$ Imaginary data points
##PAGE= N=2
##DATA TABLE= (X++(I..I)), XYDATA
16383 -1409667 -1370251 -1357395 -1342382 -1328636 -1315644 -1299748 -1284384 -1276394 -1272907 -1258630 -1250243 -1209881
16371 -1209881 -1193038 -1152925 -1136361 -1109381 -1108281 -1100441 -1047751 -1047477 -1059810 -1021884 -1007673 -1002667
16359 -1002667 -978740 -980386 -954122 -932778 -894253 -895464 -887054 -851143 -852686 -850860 -816741 -780097
16347 -780097 -785129 -773127 -756743 -751588 -730570 -714126 -680155 -659931 -645756 -669963 -644200 -606568
16335 -606568 -571746 -560055 -540387 -521906 -499124 -496121 -514351 -498976 -478764 -432891 -409136 -397059
16323 -397059 -393711 -384167 -358638 -357949 -330659 -318076 -293755 -290602 -295543 -286952 -261158 -203623 -208818
16310 -208818 -213034 -190219 -174085 -159444 -150805 -117025 -113679 -113955 -99104 -109348 -97342 -61328
16298 -61328 -50830 -41665 -21047 20644 36887 34826 40094 53771 67477 54192 82527 109719
16286 109719 114839 122968 170029 177093 176952 191148 203743 189838 186654 236757 241717 245418 230316
16273 230316 219285 272303 318880 310056 278689 303764 328803 353391 381586 401549 391586 389161
16261 389161 387218 413378 423230 449620 431889 466543 493769 453646 468852 466498 504336 550654
16249 550654 516529 532986 576144 580599 593992 579396 554040 571041 553512 589276 607712 624954
16237 624954 661320 663787 654604 678126 705488 705953 710576 720458 731414 756625 739980 728847 745570
16224 745570 731373 733867 730612 761702 779993 789167 788792 777011 786431 798517 810813 825331 842750
16211 842750 882282 869256 855249 840736 867101 897863 918975 903392 911936 912656 921476 921921 924363
16198 924363 943011 944199 953003 931538 946240 962095 951290 963987 984229 1006751 991226 977670
16186 977670 983677 989530 1007537 1047005 1064733 1014832 1009755 1039436 1052490 1039833 1078380 1076840
16174 1076840 1043243 1053400 1055760 1061703 1059460 1084542 1090795 1107340 1103806 1108054 1084926 1085545 1105401
16161 1105401 1090542 1080177 1080527 1092233 1104669 1110840 1111864 1122397 1134591 1116005 1104377 1118884
16149 1118884 1177280 1181054 1145392 1156524 1123394 1151683 1188477 1152827 1123464 1159696 1175235
16138 1175235 1198205 1236058 1184337 1175000 1179734 1195422 1202872 1199053 1205538 1246226 1250650 1196215
16126 1196215 1209351 1221111 1168009 1176621 1178822 1178598 1215500 1219629 1212506 1187662 1208260 1258062
16114 1258062 1246995 1223434 1230961 1216941 1205132 1196236 1235875 1236141 1235872 1235247 1253189 1249647 1267839
16101 1267839 1271281 1274649 1275915 1258625 1230551 1206347 1217906 1225997 1234185 1235230 1216891 1230472
16089 1230472 1295451 1295157 1245587 1240464 1264786 1247931 1238775 1264771 1262267 1262279 1252886 1264465 1245152
16076 1245152 1255443 1261479 1244083 1249507 1278765 1270770 1256363 1268500 1273173 1268952 1269702 1280677 1280981
16063 1280981 1290363 1284099 1300931 1291139 1275317 1279624 1298722 1328228 1309926 1270170 1263594 1293807
16051 1293807 1281314 1316592 1325936 1304839 1323162 1281335 1266498 1281769 1287633 1291088 1290897 1294330
16039 1294330 1306524 1296779 1311641 1304374 1287934 1303764 1311096 1340483 1345791 1314599 1302190 1282703
16027 1282703 1289135 1295819 1298979 1308081 1318316 1281889 1285334 1286271 1291271 1264526 1289984 1305983 1296978
16014 1296978 1279353 1288424 1271780 1249788 1253920 1249493 1268237 1280951 1307975 1348963 1368088 1355913
16002 1355913 1347883 1329548 1308329 1284508 1261403 1288150 1266562 1303050 1337674 1321045 1311809 1328383
15990 1328383 1334359 1287241 1290546 1237837 1286378 1325328 1309962 1309441 1312143 1296629 1311116 1297404
15978 1297404 1301818 1302186 1325849 1317029 1309937 1302301 1296660 1271837 1231811 1279209 1307496 1271829 1266189
15965 1266189 1300003 1284210 1289919 1293395 1295586 1298490 1286915 1285263 1310373 1313120 1286098 1274533
15953 1274533 1293557 1281270 1275827 1278440 1301025 1306313 1294442 1304597 1293002 1281438 1310617 1323176
15941 1323176 1353330 1331221 1308190 1288377 1272673 1276656 1262647 1281714 1278164 1287417 1279981 1290629
15929 1290629 1275753 1285912 1302727 1324797 1308420 1277248 1290107 1304251 1324753 1291937 1294231
15918 1294231 1284824 1327240 1336740 1309015 1301825 1284464 1308476 1301388 1280148 1277988 1266195 1284910
15906 1284910 1303088 1282074 1293663 1327791 1311450 1310979 1323347 1302221 1322007 1287268 1248595 1276425
15894 1276425 1307120 1304793 1302128 1285981 1299216 1287660 1290381 1319028 1343375 1320303 1316098 1326223
15882 1326223 1314456 1319082 1269180 1309690 1328040 1328855 1322686 1327856 1333220 1301699 1296656 1285679 1294382
15869 1294382 1300160 1292391 1296440 1328373 1343427 1352157 1353940 1332657 1305199 1326747 1345460 1322681
15857 1322681 1314508 1318284 1310443 1297829 1292677 1322573 1322069 1297372 1270200 1280614 1295196 1285236 1300161
15844 1300161 1331151 1327755 1306254 1307422 1281553 1291484 1319778 1279250 1270743 1300718 1333767 1338866
15832 1338866 1329642 1336567 1327143 1285248 1296243 1300891 1295830 1330335 1350535 1319569 1347788 1349501
15820 1349501 1324978 1308092 1305380 1316852 1330491 1333378 1336641 1331270 1312365 1324946 1295006 1300865
15808 1300865 1323843 1321832 1314661 1297509 1288119 1298008 1278689 1280478 1280341 1283764 1315989 1336016 1353052
15795 1353052 1370839 1322681 1317991 1345012 1330512 1332746 1326010 1308514 1333125 1303408 1318828 1319480
15783 1319480 1289372 1287285 1315054 1342031 1336252 1316530 1312583 1333752 1342335 1298538 1315562 1313988
15771 1313988 1310342 1313342 1329850 1339745 1356639 1331907 1324370 1344092 1349218 1361786 1344900 1343750
15759 1343750 1331323 1322827 1335033 1345580 1351433 1323402 1331316 1334083 1341849 1315843 1318697 1323003 1325228
15746 1325228 1330268 1331351 1337422 1303917 1310414 1303575 1317213 1337939 1351779 1328482 1315733 1347880
15734 1347880 1375317 1387055 1340120 1327167 1337799 1353848 1356895 1318763 1314810 1305018 1277098 1279331
15722 1279331 1332949 1312395 1316570 1324140 1299948 1348042 1367891 1350839 1355496 1343903 1337479 1334413
15710 1334413 1345756 1303842 1343102 1313091 1301386 1310215 1281243 1325651 1325174 1302072 1356572 1359057
15698 1359057 1354886 1345038 1324317 1321769 1337997 1365187 1369071 1342131 1301725 1298061 1329645 1308120
15686 1308120 1302949 1332440 1311777 1311474 1352936 1358269 1361179 1366113 1372594 1350577 1364474 1350665 1340514
15673 1340514 1311314 1345182 1344878 1337060 1361444 1372945 1348593 1319498 1310515 1335680 1347123 1337644
15661 1337644 1344462 1336702 1335134 1362607 1367380 1386375 1418723 1384978 1370253 1330824 1331790 1320964
15649 1320964 1320027 1328343 1333985 1324634 1333694 1339226 1340150 1357064 1351160 1348154 1356358 1335939 1328495 1320637
15635 1320637 1348471 1346675 1361497 1367096 1385440 1348459 1358358 1369403 1390812 1416046 1397256 1366407
15623 1366407 1344943 1331507 1323307 1370305 1367001 1350649 1363775 1376188 1351300 1332084 1340137 1358211
15611 1358211 1391487 1362214 1318275 1374781 1382392 1379297 1404217 1348548 1335264 1341042 1356868 1358926
15599 1358926 1351886 1335204 1337634 1352244 1363670 1340058 1332794 1309813 1353809 1331714 1357311 1339073
15587 1339073 1371212 1368068 1330533 1315926 1313897 1324185 1305305 1302181 1284784 1309569 1324342 1339974
15575 1339974 1343479 1363386 1353867 1320667 1325331 1366601 1333124 1348295 1400347 1391270 1346895 1365164
15563 1365164 1339375 1327154 1330206 1341579 1366002 1384889 1395956 1390347 1342400 1339057 1348449 1372080
15551 1372080 1379929 1355810 1338414 1341428 1331133 1359241 1385153 1379780 1365865 1373726 1397298 1416697
15539 1416697 1412904 1403670 1360981 1358498 1349419 1357114 1380819 1348543 1349770 1332772 1365237 1388566
15527 1388566 1352416 1363773 1369713 1338716 1329272 1353452 1348837 1345997 1335685 1312208 1337875 1355422
15515 1355422 1368000 1362206 1388957 1395690 1390756 1373098 1368155 1370678 1356521 1349985 1338197 1320070
15503 1320070 1317430 1358817 1352117 1343121 1376055 1371529 1362214 1355598 1345263 1392107 1392015 1387342 1379308
15490 1379308 1320101 1338006 1345762 1321469 1335860 1307059 1330119 1332200 1325091 1346459 1395663 1403504
15478 1403504 1353087 1317566 1341890 1356847 1359135 1342597 1334923 1319414 1326086 1334847 1347352 1355835
15466 1355835 1364412 1383159 1381269 1367435 1365378 1397218 1385712 1377544 1367213 1367147 1366938 1346051 1343193
15453 1343193 1350827 1376411 1406829 1349962 1352179 1365688 1369773 1313224 1324266 1335041 1350433 1353746
15441 1353746 1343127 1335763 1340394 1331583 1346315 1364954 1353395 1343345 1338105 1368895 1342135 1348671
15429 1348671 1352553 1376282 1396558 1407055 1402561 1386208 1378515 1383284 1366394 1370156 1386941 1377142
15417 1377142 1381175 1381861 1382605 1369128 1354964 1346444 1320818 1323719 1328710 1321870 1317277 1323990 1350260
15404 1350260 1359737 1350810 1363855 1375082 1383848 1362539 1344102 1362827 1366104 1373233 1371460 1353375
15392 1353375 1330996 1371624 1350923 1341736 1351324 1343819 1346151 1368524 1379577 1367899 1398517 1399198
15380 1399198 1389405 1374458 1371969 1400132 1385617 1379798 1392468 1384392 1348700 1371828 1384338 1362671
15368 1362671 1354055 1356455 1377941 1325686 1331273 1373323 1377855 1379241 1380649 1376296 1381262 1366725 1382390
15355 1382390 1385006 1395506 1379167 1373777 1395188 1393970 1385406 1388072 1380531 1360738 1410762 1403156 1413289
15342 1413289 1381676 1359070 1377921 1367772 1382481 1381808 1347381 1350174 1368770 1388543 1404309 1405290
15330 1405290 1391018 1385214 1389116 1377966 1373834 1381499 1394520 1380548 1368169 1363735 1349729 1348566
15318 1348566 1373799 1413821 1393029 1384758 1387989 1366097 1369934 1384713 1371392 1371795 1395537 1399770
15306 1399770 1375551 1375933 1420701 1412755 1382288 1374520 1379768 1375195 1372749 1369150 1393194 1394448 1380579
15293 1380579 1374367 1379525 1381761 1362352 1347725 1361659 1388802 1396021 1372220 1364588 1372330 1341914
15281 1341914 1352337 1371640 1369329 1387777 1369650 1360974 1377100 1385772 1366374 1346349 1361211 1388979
15269 1388979 1363925 1331853 1332965 1334192 1363976 1368538 1375065 1379925 1378309 1361287 1387778 1398687
15257 1398687 1406441 1400543 1400564 1407856 1411326 1392397 1353318 1384273 1388741 1416677 1392272 1415848 1450907
15244 1450907 1453464 1412043 1394581 1403447 1394976 1381524 1394640 1383934 1411962 1383340 1392367 1406017
15232 1406017 1402425 1381490 1367734 1359599 1388283 1411826 1395234 1398250 1418853 1427058 1421749 1408571
15220 1408571 1410772 1400988 1358582 1360749 1373514 1360164 1337853 1344474 1329965 1355356 1374584 1381853
15208 1381853 1395675 1400196 1378906 1362534 1393357 1402924 1366237 1390235 1378279 1358750 1325441 1355851
15196 1355851 1365760 1359289 1382347 1396993 1418975 1428951 1393513 1394615 1406560 1390760 1374920 1398200
15184 1398200 1402532 1414850 1400602 1457297 1446903 1401853 1365248 1376587 1410326 1403595 1395935 1355460
15172 1355460 1338075 1365964 1412195 1427561 1407483 1397905 1404790 1405386 1420441 1422758 1392678 1382180
15160 1382180 1367829 1400333 1419414 1359114 1374244 1395891 1410638 1402555 1375743 1362057 1366138 1395220
15148 1395220 1399062 1379283 1375526 1405438 1430709 1434764 1426778 1433160 1420162 1383101 1415270 1420752
15136 1420752 1410753 1425988 1430807 1428374 1388055 1351034 1371956 1395303 1380911 1380688 1386355 1374160
15124 1374160 1384239 1372336 1382843 1389022 1382468 1376667 1392131 1384204 1387240 1404383 1387745 1385519
15112 1385519 1385115 1365383 1376728 1402889 1390546 1420063 1399241 1382407 1416413 1431653 1417610 1406453
15100 1406453 1404233 1407776 1466799 1467953 1420669 1416916 1450049 1445082 1437671 1400317 1402601 1406000 1396475
15087 1396475 1405638 1445509 1436084 1433906 1408603 1436490 1438367 1416012 1425717 1411654 1424429 1424004 1450337
15074 1450337 1405725 1371468 1355427 1384418 1374344 1374502 1391372 1404119 1411347 1393820 1385485 1408890
15062 1408890 1416853 1379714 1348872 1349262 1359766 1382668 1381204 1364821 1382808 1379495 1367695 1382471
15050 1382471 1403351 1427102 1428859 1422767 1425007 1415427 1415533 1427750 1429231 1421733 1415828 1429810 1402540
15037 1402540 1396427 1397606 1381667 1386973 1395761 1419751 1405858 1422887 1403743 1410000 1417612 1400638
15025 1400638 1372525 1413082 1428385 1419145 1410805 1414320 1414707 1422316 1420844 1389658 1410805 1434084 1421384
15012 1421384 1410484 1416125 1442262 1431510 1419148 1413184 1410513 1418517 1432683 1490779 1455011 1427072
15000 1427072 1399954 1390712 1427249 1425712 1428943 1420412 1413165 1413065 1409575 1423744 1416803 1388972 1401541
14987 1401541 1414748 1403922 1394901 1417757 1405885 1387797 1425169 1408724 1410075 1437164 1424434 1436607
14975 1436607 1446829 1431509 1433198 1450781 1460707 1459491 1440930 1426103 1440807 1431529 1469326 1422840
14963 1422840 1405500 1444342 1448714 1440546 1431627 1442495 1433498 1410755 1399564 1381361 1415864 1437508
14951 1437508 1393529 1414083 1427181 1403173 1384478 1391568 1419611 1433390 1438347 1427342 1425605 1417143
14939 1417143 1406208 1423251 1433601 1424702 1416172 1412517 1402203 1414486 1467742 1455036 1422313 1430951
14927 1430951 1438020 1433847 1445706 1437151 1432038 1455089 1435107 1396551 1397496 1397944 1437510 1435083 1443325
14914 1443325 1435821 1392938 1384912 1404659 1399897 1383731 1400382 1433775 1461692 1412811 1401417 1421335
14902 1421335 1419934 1420220 1415450 1431624 1450973 1422052 1462438 1469228 1425626 1431799 1410813 1417377 1415742
14889 1415742 1399240 1446808 1427393 1401585 1445549 1437397 1430052 1444096 1429609 1411437 1435267 1442677
14877 1442677 1449298 1439696 1428429 1420232 1425027 1434371 1413085 1433121 1452361 1457340 1457897 1460278 1465225
14864 1465225 1455757 1395467 1402293 1425537 1413746 1399179 1397289 1416321 1390044 1386269 1384656 1424118
14852 1424118 1443609 1405729 1410085 1411013 1415757 1428522 1405982 1405191 1424894 1430003 1470636 1440876 1441378
14839 1441378 1444895 1448782 1450098 1447991 1440248 1423857 1434417 1445507 1425332 1436109 1414048 1421136
14827 1421136 1436302 1432418 1430353 1456678 1445294 1411752 1401765 1413611 1378818 1371496 1420658 1459880
14815 1459880 1443541 1416780 1421136 1442689 1456571 1425941 1445132 1443758 1427713 1451532 1484770 1461450
14803 1461450 1458396 1466729 1451747 1451180 1444411 1435876 1429071 1458189 1494975 1481924 1471685 1448327 1432591
14790 1432591 1441199 1421493 1402634 1417552 1442906 1420516 1424373 1440740 1419958 1418544 1440142 1483146
14778 1483146 1453152 1421179 1393222 1424655 1461003 1487316 1456455 1431981 1451726 1452091 1441442 1464504
14766 1464504 1444557 1468315 1473821 1426383 1398456 1418784 1432072 1457538 1458633 1423002 1424529 1432795
14754 1432795 1449595 1452543 1434150 1443184 1453869 1438975 1447323 1437866 1433839 1436286 1422189 1414935 1447560
14741 1447560 1428553 1445978 1468300 1467021 1471708 1440708 1441857 1442037 1411154 1413082 1448778 1470107
14729 1470107 1460551 1460181 1451553 1446393 1448386 1413847 1411779 1413521 1418898 1430373 1470896 1469022 1456485
14716 1456485 1475936 1492708 1477723 1493971 1467474 1477747 1467109 1446496 1508838 1497442 1448401
14705 1448401 1439472 1446488 1413242 1420735 1425937 1439610 1437076 1412583 1401045 1423781 1415075 1402387
14693 1402387 1409675 1449603 1471127 1494430 1428943 1415156 1454334 1482922 1477762 1456089 1454212 1445564
14681 1445564 1467821 1501308 1518299 1493914 1467617 1489210 1468634 1456254 1457137 1434938 1448845 1456824
14669 1456824 1456347 1449095 1441037 1412932 1411163 1434668 1468776 1463638 1447847 1437914 1459398 1483696 1448936
14656 1448936 1439423 1433695 1444886 1473130 1500472 1508286 1430372 1447417 1461948 1459277 1454088 1474982
14644 1474982 1490452 1468169 1482225 1512013 1471979 1444018 1455346 1471366 1472055 1478520 1443827 1459247
14632 1459247 1494623 1468837 1491511 1491445 1488652 1493312 1493113 1489353 1471494 1473415 1461875 1440024 1451090
14619 1451090 1449087 1443465 1481620 1467676 1443366 1458593 1485780 1472634 1453623 1484156 1508615 1494462
14607 1494462 1497874 1504850 1478850 1501880 1489034 1470956 1448397 1455305 1441567 1478625 1448283 1443626
14595 1443626 1441659 1432876 1439350 1449547 1453388 1470567 1493750 1509547 1467044 1449711 1428833 1429601
14583 1429601 1434600 1456311 1515130 1473592 1472412 1467915 1475699 1489037 1471731 1493347 1481801 1458542
14571 1458542 1473196 1464492 1442063 1473604 1487124 1469301 1481447 1483583 1504118 1505683 1480542 1491109
14559 1491109 1496085 1470943 1429377 1437037 1450735 1450208 1459710 1476381 1478424 1448008 1428790 1447627
14547 1447627 1473448 1478797 1476341 1453954 1458536 1481596 1494740 1463699 1435903 1438712 1478093 1457709
14535 1457709 1452472 1448929 1445252 1428732 1434198 1437353 1433901 1436475 1478493 1461003 1458256 1458436 1484493
14522 1484493 1474047 1484556 1505999 1494040 1501611 1493404 1464618 1468847 1512740 1531291 1518915 1495131
14510 1495131 1508962 1486884 1479740 1489480 1442297 1454075 1460950 1477461 1491455 1469893 1463273 1460528
14498 1460528 1465063 1456698 1456808 1462512 1492036 1482391 1500166 1503901 1482556 1476790 1503026 1520079 1507586
14485 1507586 1499208 1486221 1479133 1485455 1489105 1484456 1470944 1496064 1498141 1523485 1551833 1530881
14473 1530881 1517536 1501395 1469879 1459842 1464916 1464887 1460007 1462690 1429860 1429253 1448194 1484160 1484669
14460 1484669 1486366 1494529 1503889 1530060 1521202 1491393 1483775 1492493 1451041 1460028 1474066 1490089 1498623
14447 1498623 1480448 1511919 1511825 1511055 1521794 1495160 1458044 1449077 1481392 1499620 1492184 1494928 1479629
14434 1479629 1500339 1513138 1500975 1516158 1486921 1473791 1473193 1474403 1512703 1513567 1476660 1458836
14422 1458836 1469968 1489768 1470916 1494724 1445803 1463357 1502943 1508668 1490876 1495142 1505494 1534626
14410 1534626 1546121 1516604 1484433 1468550 1474498 1460363 1516727 1502932 1489834 1489998 1469583 1445111
14398 1445111 1451048 1464919 1481719 1457926 1415397 1421320 1461775 1490119 1485323 1482676 1502834 1503529
14386 1503529 1521812 1512782 1488457 1485697 1467372 1478640 1493050 1508235 1495306 1484323 1529628 1521505
14374 1521505 1492173 1512983 1513499 1491928 1488105 1484715 1474294 1496499 1516741 1500469 1491891 1493992
14362 1493992 1488188 1498181 1514463 1518128 1540070 1495023 1469319 1460522 1472381 1490182 1510754 1509629
14350 1509629 1523321 1466783 1459701 1487185 1484288 1485613 1485330 1496259 1474353 1490797 1489759 1471839
14338 1471839 1498034 1467271 1453611 1463880 1463425 1499901 1485101 1468374 1492526 1503181 1481872 1489184
14326 1489184 1508952 1521003 1524973 1527020 1487622 1430340 1478734 1517200 1499934 1484917 1478058 1474113
14314 1474113 1478936 1528325 1503470 1514001 1504414 1530526 1518800 1507501 1493038 1461970 1468432 1508424
14302 1508424 1496777 1525670 1557057 1545091 1523845 1527215 1505113 1510893 1525229 1540729 1558343 1551223
14290 1551223 1547194 1562498 1578370 1554026 1553638 1538242 1500278 1482206 1483141 1486118 1512211 1490012
14278 1490012 1487538 1529034 1497394 1503049 1530718 1505665 1499787 1520199 1513516 1509701 1509627 1545133 1557095
14265 1557095 1509651 1492037 1509565 1526377 1501214 1509288 1533559 1534969 1521903 1532053 1521313 1534071
14253 1534071 1541145 1524000 1512298 1515343 1507891 1519337 1510552 1476498 1463378 1492275 1496036 1512052
14241 1512052 1515076 1510007 1503415 1542264 1536378 1523470 1548462 1545227 1531462 1567652 1544163 1497342
14229 1497342 1514940 1530703 1512665 1506792 1526378 1524413 1516010 1505328 1539078 1534978 1529274 1542561
14217 1542561 1539368 1514446 1513348 1503773 1481822 1486438 1520461 1522718 1534468 1573219 1552524 1541991
14205 1541991 1525452 1541613 1514425 1474489 1478676 1505913 1504696 1496110 1529949 1495770 1506073 1512301
14193 1512301 1500539 1528706 1555762 1542792 1531275 1538324 1533052 1529121 1551222 1517434 1494513 1521283
14181 1521283 1547546 1551971 1532410 1530325 1518829 1542828 1559465 1559591 1532945 1515399 1512139 1518674
14169 1518674 1527700 1525532 1529965 1516516 1512330 1509544 1517611 1501916 1514219 1536535 1549633 1519177
14157 1519177 1499602 1512684 1499384 1514675 1537761 1513710 1526883 1544127 1526136 1500283 1537788
14146 1537788 1530989 1531629 1550681 1567150 1529488 1511510 1536246 1534911 1484978 1480274 1524215 1533867
14134 1533867 1521733 1527693 1547015 1529282 1539692 1485350 1499301 1535906 1520668 1502571 1511060 1525274
14122 1525274 1548459 1558722 1522245 1490498 1494770 1520190 1569622 1536391 1499586 1499701 1512869 1491307
14110 1491307 1516328 1511551 1529037 1541175 1526342 1539184 1566845 1561481 1548437 1521153 1490320 1473144
14098 1473144 1540630 1558728 1530731 1531388 1522107 1546457 1496033 1495305 1558234 1525863 1553635 1571398
14086 1571398 1552015 1556964 1566382 1570697 1568883 1556754 1564156 1569393 1579367 1554570 1532406 1540163 1527526
14073 1527526 1553869 1549012 1562287 1530512 1517564 1510396 1533517 1529412 1545469 1532330 1530092 1573435
14061 1573435 1568887 1559415 1559619 1561702 1535332 1538861 1591061 1559233 1564041 1544204 1528047 1519742 1514286
14048 1514286 1531520 1555055 1558837 1552541 1535731 1513818 1514819 1525817 1516749 1526381 1529008 1524537 1536344
14035 1536344 1548741 1556874 1564063 1548199 1518648 1539481 1562050 1553597 1548857 1552746 1555329 1544846
14023 1544846 1515575 1516032 1533877 1542192 1537005 1518240 1512186 1513205 1538140 1534142 1521251 1512706 1522054
14010 1522054 1525124 1575697 1566153 1537105 1536513 1529591 1543884 1556908 1546667 1538343 1524738 1554951
13998 1554951 1594231 1576321 1578783 1591413 1592678 1554678 1579492 1551867 1548511 1566084 1601239 1606141
13986 1606141 1546103 1556989 1578573 1547119 1555692 1567180 1551296 1535086 1558631 1552943 1527201 1542543
13974 1542543 1578882 1538938 1509831 1521731 1508499 1544384 1565538 1532469 1558549 1565799 1569980 1588074
13962 1588074 1555573 1546592 1553461 1547474 1547574 1548736 1533620 1571214 1586231 1582857 1566986 1557694 1552970
13949 1552970 1557876 1537425 1516854 1535245 1539891 1550840 1548545 1549832 1548627 1570880 1553446 1557681
13937 1557681 1547036 1530663 1544835 1572541 1550125 1564645 1566308 1576488 1577453 1535517 1527175 1537932
13925 1537932 1573940 1602761 1575831 1555477 1539887 1535399 1529517 1544243 1561008 1551913 1551841 1566203
13913 1566203 1532170 1551140 1561046 1558572 1558965 1542981 1571067 1582549 1569686 1580706 1576943 1516871
13901 1516871 1515945 1522859 1551829 1559028 1547853 1573393 1554543 1575931 1560813 1527270 1542122 1550187
13889 1550187 1537907 1541133 1566498 1559129 1575592 1564627 1568057 1566323 1574137 1545854 1535675 1582194
13877 1582194 1570580 1548523 1592447 1605210 1581821 1549048 1575687 1557621 1555981 1568628 1542751
13866 1542751 1519930 1533751 1558299 1572001 1549093 1549016 1575507 1576255 1556264 1553391 1558834 1560376 1547012
13853 1547012 1590728 1591962 1594367 1563875 1557718 1567408 1563905 1543356 1575696 1609497 1591377 1560416
13841 1560416 1547332 1595586 1590022 1572081 1577216 1568230 1572002 1571081 1553873 1563162 1575436 1576660 1568897
13828 1568897 1569504 1559771 1583846 1585635 1590796 1583309 1589631 1596762 1594752 1564485 1578284 1607900 1601861
13815 1601861 1611340 1626232 1606843 1580495 1606814 1604757 1631933 1618477 1564347 1592962 1591064 1581469
13803 1581469 1574611 1575614 1568031 1570205 1564807 1542634 1559278 1573034 1565804 1590390 1591109 1584403 1593758
13790 1593758 1607735 1600891 1606925 1592962 1589148 1601364 1597398 1572410 1558161 1544638 1546925 1545886
13778 1545886 1556616 1534419 1572636 1577477 1597067 1627959 1618843 1613336 1594161 1573603 1583368 1600971
13766 1600971 1598469 1605366 1566545 1561219 1586382 1620571 1569149 1572305 1571540 1602112 1568142 1571434 1517685
13753 1517685 1524369 1557565 1551049 1579671 1601016 1617210 1604850 1621688 1616870 1594065 1574412 1614761
13741 1614761 1655887 1613001 1597559 1580510 1591205 1591074 1583242 1599414 1599535 1641596 1619381 1592244
13729 1592244 1594371 1588973 1571880 1571051 1577732 1592193 1589563 1599538 1595180 1605479 1585019 1577331 1561393
13716 1561393 1559881 1564174 1588499 1593904 1595066 1578499 1597385 1578494 1569491 1601685 1603996 1599751 1618204
13703 1618204 1622126 1627148 1607067 1605703 1608066 1593156 1577425 1591558 1584204 1584540 1569098 1574766 1598867
13690 1598867 1574499 1580405 1597979 1621924 1623295 1609599 1608106 1597722 1613439 1585215 1589130 1615095
13678 1615095 1562557 1579064 1590214 1588374 1600841 1585865 1618401 1616718 1601479 1581428 1583496 1582828
13666 1582828 1547269 1605039 1622321 1620335 1578111 1585613 1605064 1618443 1599042 1591289 1593889 1581430
13654 1581430 1587662 1574414 1592775 1603459 1587435 1570559 1560821 1556875 1543217 1553823 1563592 1608674
13642 1608674 1613475 1623276 1612770 1630995 1607272 1596939 1575019 1607953 1615335 1590902 1604844 1661932
13630 1661932 1663059 1664994 1637582 1617098 1622083 1636411 1633395 1636531 1612143 1596278 1592812 1600890 1605735
13617 1605735 1590214 1626685 1612118 1593545 1593443 1636777 1621289 1565004 1597251 1639178 1634512 1625358
13605 1625358 1620336 1630246 1593631 1618516 1590814 1606811 1631579 1646445 1600230 1611030 1625303 1626618
$$ [...]
##END NTUPLES=NMR SPECTRUM
##END=
