##TITLE=1H_DE-80H_X3
 200.13MHz, d2o
 8 sc
 
 19ns.26.2.2025
##JCAMPDX= 6.0         $$ Bruker NMR JCAMP-DX V2.0
##DATA TYPE= NMR SPECTRUM
##DATA CLASS= NTUPLES
##ORIGIN= UXNMR, Bruker Analytische Messtechnik GmbH
##OWNER= pz
$$ XWIN-NMR		Version 3.5
$$ Wed Jul 30 10:23:18 2025 Russian Standard Time (UT+4h)  Yarkov@DPX200
##.OBSERVE FREQUENCY= 200.1313
##.OBSERVE NUCLEUS= ^1H
##.ACQUISITION MODE= SIMULTANEOUS
##.ACQUISITION SCHEME= undefined
##.AVERAGES= 8
##.DIGITISER RES= 18
##SPECTROMETER/DATA SYSTEM= spect
##.PULSE SEQUENCE= zg30
##.SOLVENT NAME= MeOD
##.SHIFT REFERENCE= (INTERNAL, MeOD, 0, 15.5199)
##AUDIT TRAIL= $$ (NUMBER, WHEN, WHO, WHERE, WHAT)
$$ ##TITLE= Audit trail, XWIN-NMR		Version 3.5
$$ ##JCAMPDX= 5.01
$$ ##ORIGIN= Bruker BioSpin GmbH
$$ ##OWNER= Yarkov
$$ C:/Bruker/XWIN-NMR/data/yarkov2/nmr/H-C/1/pdata/1/auditp.txt
$$ ##AUDIT TRAIL=  $$ (NUMBER, WHEN, WHO, WHERE, WHAT)
(   1,<2025-07-30 10:21:51.84 +0400>,<Yarkov>,<DPX200>,
      <created by zg, POWCHK disabled, PULCHK disabled
       configuration hash MD5:
       00 E9 B6 7A A2 85 ED C7 34 08 36 98 17 FE 4E 26
       data hash MD5: 16K
       31 D1 03 DB 2D 74 C0 DE 71 8B 5B E5 79 40 D4 C0>)
(   2,<2025-07-30 10:21:56.23 +0400>,<Yarkov>,<DPX200>,
      <Start of raw data processing
       efp BC_mod = 2 LB = 0.25 FT_mod = 6 PKNL = 1 PHC0 = -1352.079 PHC1 = -1.809091 SI = 16K 
       data hash MD5: 16K
       D3 93 42 37 82 5F 0D 25 33 96 D3 58 13 76 9E 82>)
(   3,<2025-07-30 10:22:00.98 +0400>,<Yarkov>,<DPX200>,
      <abs ABSG = 5 
       data hash MD5: 16K
       53 10 A2 56 DD 30 7D A4 BD 63 CD 8C FE D9 F8 4C>)
$$ ##END=
$$ 
$$ hash MD5
$$ 92 21 CB F8 3B BE DF B1 58 A5 C0 9A 94 FF 76 E5
##$RELAX= 
##$RELAX= 
##$RELAX= 
##$RELAX= 
##$RELAX= 
##$RELAX= 
$$ Bruker specific parameters
$$ --------------------------
##$DU= <C:/Bruker/XWIN-NMR>
##$EXPNO= 1
##$NAME= <H-C>
##$PROCNO= 1
##$TYPE= <nmr>
##$USER= <yarkov2>
##$AMP= (0..31)
100 100 100 100 100 100 100 100 100 100 100 100 100 100 100 100 100 100 
100 100 100 100 100 100 100 100 100 100 100 100 100 100 
##$AQSEQ= 0
##$AQ_mod= 1
##$AUNM= <au_zg>
##$AUTOPOS= <>
##$BF1= 200.13
##$BF2= 200.13
##$BF3= 200.13
##$BF4= 200.13
##$BF5= 200.13
##$BF6= 200.13
##$BF7= 200.13
##$BF8= 200.13
##$BYTORDA= 1
##$CFDGTYP= 0
##$CFRGTYP= 5
##$CHEMSTR= <none>
##$CNST= (0..31)
1 1 145 1 1 1 1 1 1 1 1 1 1 1 1 1 1 1 1 1 1 1 1 1 1 1 1 1 1 1 1 1 
##$CPDPRG= <>
##$CPDPRG1= <>
##$CPDPRG2= <>
##$CPDPRG3= <>
##$CPDPRG4= <mlev>
##$CPDPRG5= <mlev>
##$CPDPRG6= <mlev>
##$CPDPRG7= <mlev>
##$CPDPRG8= <mlev>
##$CPDPRGB= <>
##$CPDPRGT= <>
##$D= (0..31)
0 0.7 0 0 0 0 0 0 0 0 0 0.03 0 0 0 0 0 0 0 0 0 0 0 0 0 0 0 0 0 0 0 0 
##$DATE= 1753856511
##$DBL= (0..7)
120 120 120 120 120 120 120 120 
##$DBP= (0..7)
150 150 150 150 150 150 150 150 
##$DBP07= 0
##$DBPNAM0= <>
##$DBPNAM1= <>
##$DBPNAM2= <>
##$DBPNAM3= <>
##$DBPNAM4= <>
##$DBPNAM5= <>
##$DBPNAM6= <>
##$DBPNAM7= <>
##$DBPOAL= (0..7)
0.5 0.5 0.5 0.5 0.5 0.5 0.5 0.5 
##$DBPOFFS= (0..7)
0 0 0 0 0 0 0 0 
##$DE= 6
$$ [...]
##$SUBNAM3= <"">
##$SUBNAM4= <"">
##$SUBNAM5= <"">
##$SUBNAM6= <"">
##$SUBNAM7= <"">
##$SUBNAM8= <"">
##$SUBNAM9= <"">
##$SW= 18.0517328524113
##$SWIBOX= (0..15)
0 0 2 0 0 0 0 0 0 0 0 0 0 0 0 0 
##$SW_h= 3612.71676300578
##$TD= 16384
##$TD0= 1
##$TE= 0
##$TE2= 300
##$TE3= 300
##$TEG= 300
##$TL= (0..7)
0 120 120 120 120 120 120 120 
##$TP= (0..7)
150 150 150 150 150 150 150 150 
##$TP07= 0
##$TPNAME0= <>
##$TPNAME1= <>
##$TPNAME2= <>
##$TPNAME3= <>
##$TPNAME4= <>
##$TPNAME5= <>
##$TPNAME6= <>
##$TPNAME7= <>
##$TPOAL= (0..7)
0.5 0.5 0.5 0.5 0.5 0.5 0.5 0.5 
##$TPOFFS= (0..7)
0 0 0 0 0 0 0 0 
##$TUNHIN= 0
##$TUNHOUT= 0
##$TUNXOUT= 0
##$USERA1= <user>
##$USERA2= <user>
##$USERA3= <user>
##$USERA4= <user>
##$USERA5= <user>
##$V9= 5
##$VALIST= <valist>
##$VCLIST= <CCCCCCCCCCCCCCC>
##$VD= 0
##$VDLIST= <DDDDDDDDDDDDDDD>
##$VPLIST= <PPPPPPPPPPPPPPP>
##$VTLIST= <TTTTTTTTTTTTTTT>
##$WBST= 1024
##$WBSW= 4
##$XGAIN= (0..3)
0 0 0 0 
##$XL= 0
##$YL= 0
##$YMAX_a= 198732
##$YMIN_a= -206099
##$ZGOPTNS= <>
##$ZL1= 120
##$ZL2= 120
##$ZL3= 120
##$ZL4= 120
##$ABSF1= 15.47806
##$ABSF2= -2.57379
##$ABSG= 5
##$ABSL= 3
##$ALPHA= 0
##$AQORDER= 0
##$ASSFAC= 0
##$ASSFACI= 0
##$ASSFACX= 0
##$ASSWID= 0
##$AUNMP= <proc_1d>
##$AZFE= 0.1
##$AZFW= 0.1
##$BCFW= 0
##$BC_mod= 2
##$BYTORDP= 0
##$COROFFS= 0
##$CY= -3
##$DATMOD= 1
##$DC= 0
##$DFILT= <>
##$DTYPP= 0
##$F1P= 0
##$F2P= 0
##$FCOR= 1
##$FTSIZE= 16384
##$FT_mod= 6
##$GAMMA= 0
##$GB= 0
##$INTBC= 1
##$INTSCL= 3.241238e-09
##$ISEN= 128
##$LB= 0.25
##$LEV0= 0
##$LPBIN= 0
##$MAXI= 10000
##$MC2= 0
##$MEAN= 0
##$ME_mod= 0
##$MI= 1.114404
##$NCOEF= 0
##$NC_proc= -8
##$NLEV= 6
##$NOISF1= 3.799351
##$NOISF2= 2.8
##$NSP= 0
##$NTH_PI= 0
##$NZP= 0
##$OFFSET= 15.51992
##$PC= 1
##$PHC0= -1352.079
##$PHC1= -1.809091
##$PH_mod= 1
##$PKNL= yes
##$PPARMOD= 0
##$PSCAL= 0
##$PSIGN= 0
##$REVERSE= no
##$SF= 200.130000357937
##$SI= 16384
##$SIGF1= 3
##$SIGF2= 2
##$SINO= 0.751879
##$SIOLD= 32768
##$SREGLST= <19F.Aceton>
##$SSB= 0
##$STSI= 16384
##$STSR= 0
##$SW_p= 3612.71676300578
##$SYMM= 0
##$S_DEV= 0
##$TDeff= 16384
##$TDoff= 0
##$TI= <>
##$TILT= no
##$TM1= 0
##$TM2= 0
##$TOPLEV= 0
##$USERP1= <user>
##$USERP2= <user>
##$USERP3= <user>
##$USERP4= <user>
##$USERP5= <user>
##$WDW= 1
##$XDIM= 16384
##$YMAX_p= 391227994
##$YMIN_p= -2327711
$$ End of Bruker specific parameters
$$ ---------------------------------
##NTUPLES= NMR SPECTRUM
##VAR_NAME=  FREQUENCY,     SPECTRUM/REAL,   SPECTRUM/IMAG
##SYMBOL=    X,             R,               I
##VAR_TYPE=  INDEPENDENT,   DEPENDENT,       DEPENDENT
##VAR_FORM=  AFFN,          ASDF,            ASDF
##VAR_DIM=   16384,         16384,           16384
##UNITS=     HZ,            ARBITRARY UNITS, ARBITRARY UNITS
##FACTOR=    0.220516191357247, 1,           1
##FIRST=     3106.00166502476, 0,            0
##LAST=      -506.715097981022, 0,           0
##MIN=       -506.715097981022, -2327711,    0
##MAX=       3106.00166502476, 391227994,    0
$$ Real data points
##PAGE= N=1
##DATA TABLE= (X++(R..R)), XYDATA
$$ [...]
$$ plain form
5869 2593106 2626039 2685634 2725255 2697501 2668510 2418835 2526775 2789722 2525406 2572923 2481253
5858 2481253 2308949 2484479 2443489 2449354 2699526 2906777 2859596 2967307 2851211 2844550 2889720
5847 2889720 3065448 2680728 2776425 2917785 2851047 2865089 2801034 2811203 2818434 2788344 2658970
5836 2658970 2733134 2916941 2807270 2890124 2728776 2979470 2691859 2716473 2922968 2789990
5826 2789990 2825463 2916698 2644281 2564644 2488748 2662343 3030452 3113938 3286563 3024087
5816 3024087 2849895 2646122 2762538 2847955 2924076 3074732 2893458 2684437 2909786 3318261
5806 3318261 3266804 3001483 2876533 2924627 3104859 2973974 2928221 3056708 2866725 3024347
5796 3024347 3198628 2964038 3070369 3030731 3058119 3260831 3062928 3170843 3136451 3052176
$$ packed form
5869B593106L2933N9595L9621k7754k8991k49675J07940K62947k64316M7517r1670
5858B481253j72304J75530m0990N865K50172K07251m7181J07711j16096o661M5170
5847B889720J75728l84720R5697J41360o6738J4042o4055J0169P231l0090j29374
5836B658970P4164J83807j09671Q2854j61348K50694k87611K4614K06495j32978
5826B789990L5473R1235k72417p9637p5896J73595L68109Q3486J72625k62476
5816C024087j74192k03773J16416Q5417P6121J50656j81274k09021K25349M08475
5806C318261n1457k65321j24950M8094J80232j30885m5753J28487j89983J57622
5796C024347J74281k34590J06331l9638K7388K02712j97903J07915l4392q4275
$$ plain form
5786 3052176 2927787 3020750 3062479 3117040 3131816 3119472 3033821 2994667 3252635 3172078 3190065
5775 3190065 3574145 3490518 3342153 3207761 3440520 3443173 3359626 3543784 3616983 3710248 3524262
5764 3524262 3537921 3437179 3678401 3601456 3557489 3762422 3746296 3678804 3856879 3859353 3889986
5753 3889986 3966096 4038102 4084328 4059645 3870034 4030610 4116596 4374021 4221467 4205117 4404713
5742 4404713 4492066 4579671 4576530 4602957 4487717 4481823 4506335 4664859 4873065 4735490 4743934
5731 4743934 4626384 4660241 4657175 4443858 4177244 4108674 4251512 4323975 4377428 4303403 4160357
5720 4160357 4291120 4433276 4404368 4239359 4280659 4492012 4583178 4816194 4597103 4846292
5710 4846292 4862692 5081908 5298806 5223785 5228746 5178261 4930202 4920317 5134892 5168525 5298538
$$ packed form
5786C052176j24389R2963M1729N4561J4776j2344q5651l9154K57968q0557J7987
5775C190065L84080q3627j48365j34392K32759K653q3547J84158P3199R3265j85986
5764C524262J3659j00742K41222p6945m3967K04933j6126o7492J78075K474L0633
5753C889986P6110P2006M6226k4683j89611J60576Q5986K57425j52554j6350J99596
5742D404713Q7353Q7605l141K6427j15240n894K4512J58524K08206j37575Q444
5731D743934j17550L3857l066k13317k66614o8570J42838P2463N3453p4025j43046
5720D160357J30763J42156k8908j65009M1300K11353R1166K33016k19091K49189
5710D846292J6400K19216K16898p5021M961n0485k48059r885K14575L3633J30013
$$ plain form
5699 5298538 5475750 5180789 5152277 5180092 5021715 5153599 5128518 4929570 4828115 4669430
5689 4669430 4976174 5040309 4992836 4981904 5040114 5058541 5168015 5285202 5226967 5227390 5166145
5678 5166145 5237981 5321602 5114353 5272686 5539030 5673393 5739412 5727863 5641244 5483273
5668 5483273 5774165 5763779 5692986 5615919 5577070 5701294 5618482 5581546 5873352 5808646 5544527
5657 5544527 5528814 5687827 5838187 5982036 5858147 5958948 6017439 6367867 6537287 6442793
5647 6442793 6365272 6287443 6292826 6376851 6456465 6450503 6505779 6429118 6238464 6142295 6262977
5636 6262977 6208299 6509297 6856646 6893110 7144641 7187371 7089981 7452903 7793380 7823381
5626 7823381 7832058 7884227 7943679 7645104 7926189 8187870 8224956 8244462 8382514 8690128 8887059
$$ packed form
5699E298538J77212k94961k8512K7815j58377J31884k5081j98948j01455j58685
5689D669430L06744O4135m7473j0932N8210J8427J09474J17187n8235M23o1245
5678E166145P1836Q3621k07249J58333K66344J34363O6019j1549q6619j57971
5668E483273K90892j0386p0793p7067l8849J24224q2812l6936K91806o4706k64119
5657E544527j5713J59013J50360J43849j23889J00801N8491L50428J69420r4494
5647F442793p7521p7829N383Q4025P9614n962N5276p6661j90654r6169J20682
5636F262977n4678L00998L47349L6464K51531M2730r7390L62922L40477L0001
5626G823381Q677N2169N9452k98575K81085K61681L7086J9506J38052L07614J96931
$$ plain form
5615 8887059 8983810 8892827 8968075 9297931 9673777 9633902 9703563 9996205 10004316 10030720 9980100
5604 9980100 10473600 10604209 10703471 11171525 11409246 11718106 11902197 12057481 12323170 12539106
5594 12539106 12601368 12493144 12636010 13331844 13507136 13729536 13815659 14185354 14486654 14693135
5584 14693135 15089772 15340191 15787273 16166512 16395647 16734949 17206736 17439382 17823470
5575 17823470 18111108 18372331 18587594 19041360 19505893 19683253 19772110 20252123 20779370 20890193
5565 20890193 21269730 21741672 22115676 22249691 22702949 23287265 23652588 24008631 24364758
5556 24364758 24472496 24862880 25307355 25758409 26193824 27015815 27341960 27460797 27579410
5547 27579410 27947127 28323256 28571097 28829759 29322918 29717606 29938411 30201666 30350358
$$ packed form
5615H887059R6751r0983P5248L29856L75846l9875O9661K92642Q111K6404n0620
5604I980100M93500J30609R9262M68054K37721L08860J84091J55284K65689K15936
5594A2539106O2262j08224J42866O95834J75292K22400Q6123L69695L01300K06481
5584A4693135L96637K50419M47082L79239K29135L39302M71787K32646L84088
5575A7823470K87638K61223K15263M53766M64533J77360Q8857M80013N27247J10823
5565B0890193L79537M71942L74004J34015M53258N84316L65323L56043L56127
5556B4364758J07738L90384M44475M51054M35415Q21991L26145J18837J18613
5547B7579410L67717L76129K47841K58662M93159L94688K20805K63255J48692
$$ plain form
5538 30350358 30875224 31084136 31191506 31714246 32355709 32437975 32452397 32512177 32982369 33298940
5528 33298940 33662149 34015419 34375438 34731030 34759998 35147636 35578677 35687915 35573077 35590451
5518 35590451 35917525 36069084 36418001 36739467 36865363 36889599 37038084 37180537 37156208 37389705
5508 37389705 37295064 37549806 37701792 37556658 37322476 37186370 37132791 37309488 37547256 37473896
5498 37473896 37326340 37236997 36935384 36885096 36649848 36613558 36653992 36612513 36371354 35497097
5488 35497097 35322473 35080070 34922417 35314616 34971168 34485217 34374972 34106818 33941153
5479 33941153 33564972 33196352 32887528 32757121 32460166 32085704 31943772 31842378 31150566
5470 31150566 30582467 30439056 29972858 29487990 29085533 28732170 28467997 28060974 27726576
$$ packed form
5538C0350358N24866K08912J07370N22740O41463Q2266J4422N9780M70192L16571
5528C3298940L63209L53270L60019L55592K8968L87638M31041J09238j14838J7374
5518C5590451L27074J51559L48917L21466J25896K4236J48485J42453k4329K33497
5508C7389705r4641K54742J51986j45134k34182j36106n3579J76697K37768p3360
5498C7473896j47556q9343l01613n0288k35248l6290M0434m1479k41159q74257
5488C5497097j74624k42403j57653L92199l43448m85951j10245k68154j65665
5479C3941153l76181l68620l08824j30407k96955l74462j41932j01394o91812
5470C1150566n68099j43411m66198m84868m02457l53363k64173m07023l34398
$$ plain form
5461 27726576 27201826 26986994 26534447 25979043 25394405 24967431 24816275 24084851 23795991
5452 23795991 23678458 23171219 22768066 22615690 22324038 21733351 21208451 20894881 20580367
5443 20580367 20180737 19773359 19525054 19113953 18737777 18505465 18076796 17796066 17300774
5434 17300774 16830968 16733696 16340951 16124133 15907285 15544358 15447149 15089058 14664843 14368145
5424 14368145 14157081 13827464 13503626 13244354 12905584 12590845 12640722 12452642 12493688 12354933
5414 12354933 11870734 11792107 11689486 11311795 11109910 11020553 10930751 10555249 10595548 10568607
5404 10568607 10052878 10108659 9867820 9470850 9468875 9450241 9304851 9264011 9114368 8819789
5394 8819789 8724411 8796805 8652814 8547738 8435462 8328122 8101751 8314943 8196044 7938443
$$ packed form
5461B7726576n24750k14832m52547n55404n84638m26974j51156p31424k88860
5452B3795991j17533n07239m03153j52376k91652n90687n24900l13570l14514
5443B0580367l99630m07378k48305m11101l76176k32312m28669k80730m95292
5434A7300774m69806r7272l92745k16818k16848l62927r7209l58091m24215k96698
5424A4368145k11064l29617l23838k59272l38770l14739M9877j88080M1046j38755
5414A2354933m84199p8627j02621l77691k01885q9357q9802l75502M0299k6941
5404A0568607n15729N5781k40839l96970j975j8634j45390m0840j49643k94579
5394H819789r5378P2394j43991j05076j12276j07340k26371K13192j18899k57601
$$ plain form
5384 7938443 7992039 7896375 7799442 7788523 7504688 7676149 7630055 7162705 7417287 7412216 7326687
5373 7326687 7167948 7009065 6831822 6819376 6877586 6742001 6710502 6629750 6891191 6750805
5363 6750805 6548690 6415198 6212096 6369424 6237588 6334190 6460293 6532264 6247318 6184611
5353 6184611 5841464 5848138 6087727 5636976 5670259 5791900 5829671 5934950 5827901 5579328
5343 5579328 5605910 5685118 5728404 5611968 5700750 5793985 5713295 5757046 5721653 5636001 5500163
5332 5500163 5275710 5373237 5536628 5402558 5355041 5371609 5313810 5304844 5118373 5057913 4996169
5321 4996169 5084937 4966400 5372418 5658730 5451682 5102145 4963287 4965371 5227775 5152331
5311 5152331 4724205 4840679 4952067 4698180 4908154 5263766 5274824 5250167 5247943 5326213
$$ packed form
5384G938443N3596r5664r6933j0919k83835J71461m6094m67350K54582n071q5529
5373G326687j58739j58883j77243j2446N8210j35585l1499q0752K61441j40386
5363F750805k02115j33492k03102J57328j31836R6602J26103P1971k84946o2707
5353F184611l43147O674K39589m50751L3283J21641L7771J05279j07049k48573
5343E579328K6582P9208M3286j16436Q8782R3235q0690M3751l5393q5652j35838
5332E500163k24453R7527J63391j34070m7517J6568n7799q966j86471o0460o1744
5321D996169Q8768j18537M06018K86312k07048l49537j38858K084K62404p5444
5311E152331m28126J16474J11388k53887K09974L55612J1058k4657k224P8270
$$ plain form
5301 5326213 5236144 5250453 5458515 5163574 5162009 5305271 5317390 5349776 5019731 4999447 4901498
5290 4901498 5168064 5178103 5194308 5135718 5258529 5331391 5516957 5594017 5309619 5238228 5287160
5279 5287160 5420546 5522350 5654305 5541189 5384650 5282658 5549079 5788469 5673424 5484884
5269 5484884 5313120 5245412 5395043 5395964 5610736 5374389 5297416 5390608 5551668 5745162 5724267
5258 5724267 5598680 5368325 5497647 5485763 5551743 5664200 5912543 5830551 5790226 5794182 5982566
5247 5982566 5997654 6040605 6091371 6151863 6165882 6256068 6277248 6329116 6236060 6379380 6408278
5236 6408278 6186708 6121239 6308725 6599499 6437797 6430098 6497044 6576945 6425023 6418681 6522132
5225 6522132 6292778 6476658 6696182 6595838 6697953 6816847 6843651 7091374 7155232 7259416
$$ packed form
5301E326213r0069J4309K08062k94941j565J43262J2119L2386l30045k0284r7949
5290D901498K66566J0039J6205n8590J22811P2862J85566P7060k84398p1391M8932
5279E287160J33386J01804J31955j13116j56539j01992K66421K39390j15045j88540
5269E484884j71764o7708J49631R21K14772k36347p6973R3192J61060J93494k0895
5258E724267j25587k30355J29322j1884O5980J12457K48343q1992m0325L956J88384
5247E982566J5088M2951N0766O0492J4019R0186K1180N1868r3056J43320K8898
5236F408278k21570o5469J87486K90774j61702p699O6946P9901j51922o342J03451
5225F522132k29354J83880K19524j00344J02115J18894K6804K47723O3858J04184
$$ plain form
5215 7259416 7203221 7172197 7265108 7372159 7321184 7376715 7446544 7359777 7717716 7868866 7685903
5204 7685903 7544567 7794108 7861636 7992839 8045993 8069085 8176412 8497728 8501836 8164739
5194 8164739 8332227 8718080 8948686 8828587 8872378 9131651 9212590 9197621 9040350 9351073
5184 9351073 9494478 9428547 9651058 9798279 9519453 9422559 9657885 9724950 9844528 10508163
5174 10508163 10964336 10619114 10667467 10908279 11098586 11206454 11385372 11407872 11590167 12144578
5164 12144578 12633328 12486335 12557035 12739204 12767013 12702807 13069409 13505695 13630139 13445405
5154 13445405 13480523 14010548 14145359 14458168 14735313 14915740 15052153 14976062 15213196 15711091
5144 15711091 16120164 16551521 16662858 16607950 16815919 16707455 16877365 17431268 17699925 18196903
$$ packed form
5215G259416n6195l1024R2911J07051n0975N5531O9829q6767L57939J51150j82963
5204G685903j41336K49541O7528J31203N3154K3092J07327L21316M108l37097
5194H164739J67488L85853K30606j20099M3791K59273Q0939j4969j57271L10723
5184I351073J43405o5931K22511J47221k78826r6894K35326O7065J19578O63635
5174A0508163M56173l45222M8353K40812J90307J07868J78918K2500J82295N54411
5164A2144578M88750j46993P0700J82169K7809o4206L66602M36286J24444j84734
5154A3445405L5118N30025J34811L12809K77145J80427J36413p6091K37134M97895
5144A5711091M09073M31357J11337n4908K07969j08464J69910N53903K68657M96978
$$ plain form
5134 18196903 18262143 18367085 18768522 19043515 19233205 19342387 19624507 19956234 20243970 20513058
5124 20513058 20643864 21323034 21425001 21671140 22094809 22267913 22391650 22729657 22965280
5115 22965280 23297528 23695519 23933827 24045403 24231444 24635929 25233123 25264474 25460333 25584118
5105 25584118 25759010 26298158 26607328 26887463 27096425 27110794 27140425 27399484 27876449 28306222
5095 28306222 28282612 28608002 28913121 28893408 29335574 29901888 29949545 30021936 30082561 30347256
5085 30347256 30404512 30688469 30737073 31031286 31238069 31247303 31489100 31677843 31839570 32238760
5075 32238760 32409753 32532934 32715211 32849574 33153425 33223175 33179886 33344515 33529370 33616213
5065 33616213 33850811 34043540 34153142 34332199 34570597 34788828 34964041 34765687 34860384 34733272
$$ packed form
5134A8196903O5240J04942M01437K74993J89690J09182K82120L31727K87736K69088
5124B0513058J30806O79170J01967K46139M23669J73104J23737L38007K35623
5115B2965280L32248L97991K38308J11576J86041M04485N97194L1351J95859J23785
5105B5584118J74892N39148L09170K80135K08962J4369K9631K59059M76965M29773
5095B8306222k3610L25390L05119j9713M42166N66314M7657P2391O0625K64695
5085C0347256N7256K83957M8604K94213K06783R234K41797J88743J61727L99190
5075C2238760J70993J23181J82277J34363L03851O9750m3289J64629J84855Q6843
5065C3616213K34598J92729J09602J79057K38398K18231J75213j98354R4697j27112
$$ plain form
5055 34733272 34589549 34588391 34612550 34522122 33891959 33738311 33504874 33060297 33017801 32620547
5045 32620547 32096050 31708603 31161192 30949378 30635277 30010067 29759795 29444882 29227128
5036 29227128 28997693 28713444 28366696 28125498 27885373 27717196 27600067 27217563 27068130
5027 27068130 26790940 26285509 25965383 25739766 25442240 25396551 25168723 25146894 24705182 24455282
5017 24455282 24295617 24113579 23868273 23678466 23313844 23059692 22805209 22460069 22590359
5008 22590359 22662431 22199796 21953532 22028007 22166581 21855202 21756965 21676580 21499145 21652648
4998 21652648 21598755 21369431 21194694 21339297 21261090 21229885 21262353 21108046 21253528 21324308
4988 21324308 20944029 20784616 20822581 20741557 20513490 20044151 19626461 19215426 18350394 17885820
$$ packed form
5055C4733272j43723j158K4159r0428o30163j53648k33437m44577m2496l97254
5045C2620547n24497l87447n47411k11814l14101o25210k50272l14913k17754
5036B9227128k29435k84249l46748k41198k40125j68177j17129l82504j49433
5027B7068130k77190n05431l20126k25617k97526m5689k27828k1829m41712k49900
5017B4455282j59665j82038k45306j89807l64622k54152k54483l45140J30290
5008B2590359P2072m62635k46264P4475J38574l11379r8237q0385j77435J53503
4998B1652648n3893k29324j74737J44603p8207l1205L2468j54307J45482P0780
4988B1324308l80279j59413L7965q1024k28067m69339m17690m11035q65032m64574
$$ plain form
4978 17885820 17614562 17193316 16836300 16529275 16256805 15838729 15528446 15315445 14971101
4969 14971101 14649988 14360422 14325499 13959314 13558104 13468954 13034843 12693648 12649952 12310786
4959 12310786 12057831 11729857 11468641 11373287 11487507 11192876 10952406 10751436 10641642 10746239
4949 10746239 10563857 10163033 10026056 10152120 9846093 9834221 9626806 9696662 9638594 9235940
4939 9235940 9053132 9120019 9189250 8918497 8790468 8314249 8257174 8235483 8081593 8117348
4929 8117348 8202359 8190384 7784299 7566472 7350973 7307117 7544369 7411135 7280450 7132469
4919 7132469 7330485 7044044 6924946 6706387 6610046 6584392 6570329 6677262 6599075 6413223
4909 6413223 6407850 6390650 6353648 6150244 6083768 6283684 6325058 6176312 6196030 6122787 5834130
$$ packed form
4978A7885820k71258m21246l57016l07025k72470m18076l10283k13001l44344
4969A4971101l21113k89566l4923l66185m01210q9150m34111l41195m3696l39166
4959A2310786k52955l27974k61216r5354J14220k94631k40470k00970j09794J04597
4949A0746239j82382m00824j36977J26064l06027j1872k07415O9856n8068m02654
4939I235940j82808O6887O9231k70753j28029m76219n7075k1691j53890L5755
4929H117348Q5011j1975m06085k17827k15499m3856K37252j33234j30685j47981
4919G132469J98016k86441j19098k18559r6341k5654j4063J06933p8187j85852
4909F413223n373j7200l7002k03404o6476J99916M1374j48746J9718p3243k88657
$$ plain form
4898 5834130 5758987 6039798 5830143 5764626 6096853 6037048 5923020 5895052 5842504 5608813
4888 5608813 5443729 5314454 5486421 5039722 5206315 5177212 5163645 5212993 5352601 5356739
4878 5356739 5384219 5193332 5222795 4943466 4986326 5171202 5039260 5206379 5094240 5076294
4868 5076294 4883956 4576161 4366525 4543833 4802824 4734225 4693540 4458303 4455639 4647417
4858 4647417 4646825 4447320 4586800 4848083 4958687 4831286 4586287 4438586 4517142 4599037
4848 4599037 4582851 4464978 4275457 4370950 4506945 4593988 4562778 4584470 4576470 4579496 4605457
4837 4605457 4357101 4228562 4420723 4629651 4768512 4360801 4320699 4434552 4730631 4784823
4827 4784823 4916484 4604619 4466900 4528621 4514577 4714022 4592753 4442465 4325476 4477766
$$ packed form
4898E834130p5143K80811k09655o5517L32227n9805j14028k7968n2548k33691
4888E608813j65084j29275J71967m46699J66593k9103j3567M9348J39608M138
4878E356739K7480j90887K9463k79329M2860J84876j31942J67119j12139j7946
4868E076294j92338l07795k09636J77308K58991o8599m0685k35237k664J91778
4858D647417n92j99505J39480K61283J10604j27401k44999j47701P8556Q1895
4848D599037j6186j17873j89521R5493J35995Q7043l1210K1692q000L026K5961
4837D605457k48356j28539J92161K08928J38861m07711m0102J13853K96079N4192
4827D784823J31661l11865j37719O1721j4044J99445j21269j50288j16989J52290
$$ plain form
4817 4477766 4375622 4101596 4399306 4379450 4217552 4308660 4377200 4170184 3996337 4313172
4807 4313172 4570059 4269823 4227452 4287337 4416471 4509849 4492694 4522058 4294965 4083106
4797 4083106 4020905 4187851 4420518 4494433 4434995 4488210 4273810 4462895 4468126 4497556 4525661
4786 4525661 4436684 4334531 4444225 4629019 4496763 4428178 4537066 4623005 4748452 4659732
4776 4659732 4404375 4413924 4441069 4612401 4609694 4479876 4393121 4612272 4595834 4410349 4441876
4765 4441876 4400715 4461981 4275373 4426944 4593745 4603915 4545391 4530222 4722887 4902825
4755 4902825 4680954 4588709 4593180 4989038 5086252 4868488 4795318 4537676 4458808 4738899 4696935
4744 4696935 4494658 4818105 4856347 4848722 4922450 4836286 4636395 4570321 4620451 4656177 4673023
$$ packed form
4817D477766j02144k74026K97710j9856j61898R1108O8540k07016j73847L16835
4807D313172K56887l00236m2371N9885J29134R3378j7155K9364k27093k11859
4797D083106o2201J66946K32667P3915n9438N3215k14400J89085N231K9430K8105
4786D525661q8977j02153J09694J84794j32256o8585J08888Q5939J25447q8720
4776D659732k55357R549K7145J71332k707j29818q6755K19151j6438j85485L1527
4765D441876m1161O1266j86608J51571J66801J0170n8524j5169J92665J79938
4755D902825k21871r2245M471L95858R7214k17764p3170k57642p8868K80091m1964
4744D696935k02277L23447L8242p625P3728q6164j99891o6074N0130L5726J6846
$$ plain form
4733 4673023 4435248 4719574 4734988 4513721 4654503 4757233 4825037 4973523 4888024 4549260
4723 4549260 4739306 4602238 4741148 4996228 4939310 4832589 4934132 5131023 4976241 4754391
4713 4754391 4807675 4923785 4909452 4975213 4858107 4866426 4786912 4863500 4962923 4934238 4903226
4702 4903226 4919648 5083358 5018568 5149337 5288882 5287026 5137096 5330498 5420967 5200726
4692 5200726 4807071 4970934 4997128 5114187 5346476 5284447 5187602 5235655 5196079 5273237 5527995
4681 5527995 5586553 5533853 5367773 5452793 5342417 5340544 5440930 5408049 5433625 5442273 5622252
4670 5622252 5328379 5222418 5342758 5464205 5341785 5270177 5197838 5271243 5491387 5722545
4660 5722545 5947183 5834319 5534521 5662125 5647431 5707962 5792458 5467335 5642278 5495603
$$ packed form
4733D673023k37775K84326J5414k21267J40782J02730O7804J48486q5499l38764
4723D549260J90046j37068J38910K55080n6918j06721J01543J96891j54782k21850
4713D754391N3284J16110j4333O5761j17106Q319p9514P6588R9423k8685l1012
4702D903226J6422J63710o4790J30769J39545j856j49930J93402R0469k20241
4692E200726l93655J63863K6194J17059K32289o2029r6845M8053l9576P7158K54758
4681E527995N8558n2700j66080Q5020j10376j873J00386l2881K5576Q648J79979
4670E622252k93873j05961J20340J21447j22420p1608p2339P3405K20144K31158
4660E722545K24638j12864k99798J27604j4694O0531Q4496l25123J74943j46675
$$ plain form
4650 5495603 5607305 5615240 5196411 5048592 5205376 5522316 5674886 5638973 5384029 5235964
4640 5235964 5262194 5473904 5575760 5403723 5617485 5842652 6055019 6105183 5868116 5592216
4630 5592216 5863241 5992670 6023505 6001460 5615783 5671740 5594477 5497144 5656797 5603511 5872824
4619 5872824 5751270 5771900 6088417 6045853 5898303 5869287 6217107 6001447 5964076 6201572
4609 6201572 5958841 6070474 6075321 6336816 6340688 6460173 6363515 6254641 6352055 6184431 6252901
4598 6252901 6182111 6211270 6171839 6203325 6326574 6475050 6279886 6310464 6315025 6518954 6560065
4587 6560065 6302049 6236721 6009022 6187056 6348889 6872145 7024843 6468801 6434985 6620245
4577 6620245 6602776 6888509 6941203 6661799 6564449 6985162 6871647 6863710 7122918 6888015
$$ packed form
4650E495603J11702P935m18829j47819J56784L16940J52570l5913k54944j48065
4640E235964K6230K11710J01856j72037K13762K25167K12367N0164k37067k75900
4630E592216K71025J29429L0835k2045l85677N5957p7263r7333J59653n3286K69313
4619E872824j21554K0630L16517m2564j47550k9016L47820k15660l7371K37496
4609F201572k42731J11633M847K61495L872J19485r6658j08874R7414j67624O8470
4598F252901p0790K9159l9431L1486J23249J48476j95164L0578M561K03929M1111
4587F560065k58016o5328k27699J78034J61833N23256J52698n56042l3816J85260
4577F620245j7469K85733N2694k79404r7350M20713j13515p937K59208k34903
$$ plain form
4567 6888015 6744672 6963009 7034992 6885157 6827768 6838264 7080065 6883325 6554598 6840610
4557 6840610 6900783 6905888 6977989 7197197 7055218 7033464 7173318 7012292 7034975 7076590 7016195
4546 7016195 7073495 7184473 7159238 7216119 7334780 7399748 7519911 7451718 7201845 7362516
4536 7362516 7610317 7814473 7684689 7747911 7697518 7705579 7976481 7961576 7778581 7537020
4526 7537020 7382944 7683158 7927942 8049263 8339969 8372088 8320461 8530285 8568628 8737833
4516 8737833 8671411 8415832 8563854 8634933 8589027 8595202 8408428 8510756 8927089 8887030 8870142
4505 8870142 8938417 9015662 9095650 9346607 9436164 9420215 9642205 9753617 9535490 9579455 9347281
4494 9347281 9244869 9703437 9770015 9842867 9948955 10212041 10178322 10196145 9964015 10109503
$$ packed form
4567F888015j43343K18337P1983j49835n7389J0496K41801j96740l28727K86012
4557F840610O0173N105P2101K19208j41979k1754J39854j61026K2683M1615o0395
4546G016195N7300J10978k5235N6881J18661O4968J20163o8193k49873J60671
4536G362516K47801K04156j29784O3222n0393Q061K70902j4905j82995k41561
4526G537020j54076L00214K44784J21321K90706L2119n1627K09824L8343J69205
4516H737833o6422k55579J48022P1079m5906O175j86774J02328M16333m0059j6888
4505H870142O8275P7245P9988K50957Q9557j5949K21990J11412k18127M3965k32174
4494I347281j02412M58568O6578P2852J06088K63086l3719J7823k32130J45488
$$ plain form
4484 10109503 10273849 10354674 10419661 10486395 10671149 10864193 10796663 10814857 11021943 11238125
4474 11238125 11343801 11512654 11299215 11402372 11538377 11675932 11756895 12251767 12391817 12611131
4464 12611131 12620901 12425836 12806438 12658844 13099147 13580842 13713315 13394133 13785155 14182966
4454 14182966 14461404 14534041 14606725 14815814 15056221 15299904 15397534 15719367 16002426 16658803
4444 16658803 17030789 17144140 17386361 17620648 18169201 18638986 18973215 19461825 19960700
4435 19960700 20383556 20758679 21188942 21678560 22639568 23243254 23811932 24409517 25022257
4426 25022257 25690885 26235216 27146739 27720936 28634555 29565147 30434246 31462007 32405294
4417 32405294 33252094 34176099 34968309 35763410 36772293 37863527 38948485 40018780 41114835
$$ packed form
4484A0109503J64346Q0825O4987O6734J84754J93044o7530J8194K07086K16182
4474A1238125J05676J68853k13439J03157J36005J37555Q0963M94872J40050K19314
4464A2611131R770j95065L80602j47594M40303M81695J32473l19182L91022L97811
4454A4182966K78438P2637P2684K09089K40407K43683R7630L21833K83059O56377
4444A6658803L71986J13351K42221K34287N48553M69785L34229M88610M98875
4435A9960700M22856L75123M30263M89618R61008O03686N68678N97585O12740
4426B5022257O68628N44331R11523N74197R13619R30592Q69099J027761R43287
4417C2405294Q46800R24005P92210P95101J008883J091234J084958J070295J096055
$$ plain form
4408 41114835 42317952 43338391 44225073 45195019 46462252 47410101 48324396 49031722 49897184
4399 49897184 50693001 51742859 52609010 53332059 53869453 54454207 55125138 55895788 56279769
4390 56279769 56610790 56958309 57076679 57319666 57504708 57925225 57718367 57955002 58373433
4381 58373433 58370315 58163907 58137847 57927709 57702549 57560046 57384533 57023168 56711589 56445145
4371 56445145 56329030 56088954 55629528 55446747 55179981 54860988 54728166 54493640 54418885 54433904
4361 54433904 54388163 54077494 54192218 54220042 54067831 54302369 54368935 54602056 54702373 54764283
4351 54764283 54912097 55244240 55440247 55517677 55693779 56213794 56786761 57245032 57655133 58115418
4341 58115418 58561716 58942173 59288193 59670134 59920152 60558703 61150868 61422748 62216514
$$ packed form
4408D1114835J203117J020439Q86682R69946J267233R47849R14295P07326Q65462
4399D9897184P95817J049858Q66151P23049N37394N84754O70931P70650L83981
4390E6279769L31021L47519J18370K42987J85042M20517k06858K36635M18431
4381E8373433l118k06408k6060k10138k25160j42503j75513l61365l11579k66444
4371E6445145j16115k40076m59426j82781k66766l18993j32822k34526p4755J5019
4361E4433904m5741l10669J14724K7824j52211K34538O6566K33121J00317O1910
4351E4764283J47814L32143J96007P7430J76102N20015N72967M58271M10101M60285
4341E8115418M46298L80457L46020L81941K50018O38551N92165K71880P93766
$$ plain form
4332 62216514 62951089 63073713 63429084 63858548 64506974 64817887 65101947 65826100 66291858
4323 66291858 66837772 67294346 67495623 67866411 68510128 68770584 68827579 69079759 69388374 69681310
4313 69681310 69814209 69702501 69888784 70012291 69766631 69443659 69269669 68984212 68728565
4304 68728565 68506129 68255919 67727627 67143309 66299885 65821150 65181318 64311284 63677177
4295 63677177 62809560 62002283 61106715 60423257 59489320 58611927 57565720 56594050 55551813
4286 55551813 54531919 53511440 52652965 51789215 50888661 49555043 48400309 47672957 46992425
4277 46992425 46041494 44813790 43963907 43092198 42411319 41754616 41117458 40116596 39234407
4268 39234407 38251206 37583801 36919663 36287056 35678990 35099964 34511233 33566891 33180230
$$ packed form
4332F2216514P34575J22624L55371M29464O48426L10913K84060P24153M65758
4323F6291858N45914M56574K01277L70788O43717K60456N6995K52180L08615K92936
4313F9681310J32899j11708J86283J23507k45660l22972j73990k85457k55647
4304F8728565k22436k50210n28292n84318q43424m78735o39832q70034o34107
4295F3677177q67617q07277q95568o83458r33937q77393j046207r71670j042237
4286E5551813j019894j020479q58475q63750r00554j333618j154734p27352o80532
4277D6992425r50931j227704q49883q71709o80879o56703o37158j000862q82189
4268C9234407r83201o67405o64138o32607o08066n79026n88731r44342l86661
$$ plain form
4259 33180230 32556735 31922080 31446777 30853476 30556799 30150704 29577884 29079020 28933860
4250 28933860 28535563 28333210 27780626 27371695 27106505 26592575 26002486 25811284 25640778
4241 25640778 25296409 25058055 24825716 24434621 24503302 24254319 23771417 23607725 23672605 23551970
4231 23551970 23403714 23098443 22692634 22148012 22015198 21948556 21661005 21622764 21806347 21954144
4221 21954144 21754350 21289540 21111538 21038008 21053083 21046405 21074701 21096627 21012188 20983954 21056387
4210 21056387 20932815 20537979 20520139 20544788 20652766 20609613 20548781 20648945 20726915 20561693
4200 20561693 20673664 20665581 20553261 20664902 20907407 21216041 21176333 20894341 20831479 20882501
4190 20882501 20855963 20852935 21128409 21508526 21594268 21615482 21655899 21424101 21325389 21460690 21825958
$$ packed form
4259C3180230o23495o34655m75303n93301k96677m06095n72820m98864j45160
4250B8933860l98297k02353n52584m08931k65190n13930n90089j91202j70506
4241B5640778l44369k38354k32339l91095O8681k48983m82902j63692O4880j20635
4231B3551970j48256l05271m05809n44622j32814o6642k87551l8241J83583J47797
4221B1954144j99794m64810j78002p3530J5075o678K8296K1926q4439k8234P2433
4210B1056387j23572l94836j7840K4649J07978m3153o0832J00164P7970j65222
4200B0561693J11971q083j12320J11641K42505L08634l9708k81992o2862N1022
4190B0882501k6538l028K75474L80117Q5742K1214M0417k31798r8712J35301L65268
$$ plain form
4179 21825958 22140226 22193259 22165605 22267159 22124713 22416237 22410841 22786616 22801789 22763306
4169 22763306 23059849 23067794 23196228 23558619 23652095 23737955 23878021 24202050 24480426 24687040
4159 24687040 24783443 25218856 25202812 25136389 25193607 25776224 25961232 26148793 26264427 26285439
4149 26285439 26636582 26954043 27102984 27731224 27618678 27740330 28219273 28690642 29348584
4140 29348584 29416380 29683576 30043608 30442030 30562912 30685502 31097027 31441122 31814539 32431881
4130 32431881 32714078 33186716 33377682 33805800 34429774 34609429 34694826 35017126 35480784 36258234
4120 36258234 36672605 37110343 37706319 38300737 38563721 39107835 39393189 40088823 40790075
4111 40790075 40934643 41430219 41974906 42635731 43581985 43950852 44668704 45378786 45898931
$$ packed form
4179B1825958L14268N3033k7654J01554j42446K91524n396L75775J5173l8483
4169B2763306K96543P945J28434L62391R3476Q5860J40066L24029K78376K06614
4159B4687040R6403M35413j6044o6423N7218N82617J85008J87561J15634K1012
4149B6285439L51143L17461J48941O28240j12546J21652M78943M71369O57942
4140B9348584O7796K67196L60032L98422J20882J22590M11525L44095L73417O17342
4130C2431881K82197M72638J90966M28118O23974J79655Q5397L22300M63658P77450
4120C6258234M14371M37738N95976N94418K62984N44114K85354O95634P01252
4111D0790075J44568M95576N44687O60825R46254L68867P17852P10082N20145
$$ plain form
4102 45898931 46783083 47207989 48104414 48854083 49461240 50130245 50794454 51576820 52458222
4093 52458222 53187233 53589398 54493649 55275693 55831573 56709519 57450840 58289342 59153831
4084 59153831 60177868 60925900 61599529 62629495 63460976 64310479 65325894 66185633 67062011
4075 67062011 68002712 68878568 69916223 70391991 71182202 72017633 72893492 73559219 74493667
4066 74493667 75592404 76636669 77693433 78600064 79138994 79875618 80783749 81610821 82474105
4057 82474105 83628569 84494664 85381182 86348361 87105134 87974370 89230097 90247589 91375992
4048 91375992 92309361 93275243 93988641 94741810 95898683 97164565 98462184 99591090 100519362
4039 100519362 101733733 102882766 103876478 105081970 106465849 107705933 108794323 109838785
$$ packed form
4102D5898931Q84152M24906Q96425P49669O07157O69005O64209P82366Q81402
4093E2458222P29011M02165R04251P82044N55880Q77946P41321Q38502Q64489
4084E9153831J024037P48032O73629J029966Q31481Q49503J015415Q59739Q76378
4075F7062011R40701Q75856J037655M75768P90211Q35431Q75859O65727R34448
4066G4493667J098737J044265J056764R06631N38930P36624R08131Q27072Q63284
4057H2474105J154464Q66095Q86518R67179P56773Q69236J255727J017492J128403
4048I1375992R33369R65882P13398P53169J156873J265882J297619J128906R28272
4039A00519362J214371J149033R93712J205492J383879J240084J088390J044462
$$ plain form
4031 109838785 110784880 111880173 112947268 114087588 115279353 116178132 117248554 118304604
4023 118304604 119157115 119731504 120090770 120520560 121120565 121342403 121583762 121876655 122018556
4014 122018556 121941444 121830764 121584660 120856589 120510255 119684036 118688924 117750220 116720848
4005 116720848 115241325 113794294 111994532 110259669 108661084 107123992 105433401 103574824
3997 103574824 101174260 99242581 97406679 95661333 93994298 92085032 90115217 88127960
3989 88127960 85940045 84369186 82545929 80654713 78821042 77164003 75415417 73876336
3981 73876336 72335483 70436118 68931757 67450066 66060232 64946642 63763751 62450555
3973 62450555 61306347 60261943 58819376 57562439 56500036 55585830 54695189 53590764
$$ packed form
4031A09838785R46095J095293J067095J140320J191765Q98779J070422J056050
4023A18304604Q52511N74389L59266M29790O00005K21838K41359K92893J41901
4014A22018556p7112j10680k46104p28071l46334q26219r95112r38704j029372
4005A16720848j479523j447031j799762j734863j598585j537092j690591j858577
3997A03574824k400564j931679j835902j745346j667035j909266j969815j987257
3989H8127960k187915j570859j823257j891216j833671j657039j748586j539081
3981G3876336j540853j899365j504361j481691j389834j113590j182891j313196
3973F2450555j144208j044404j442567j256937j062403r14206q90641j104425
$$ plain form
3965 53590764 53002536 52133053 51373993 50886275 50119339 49258337 48553764 48067209 47521742
3956 47521742 46913735 46305019 45741103 45324050 44976303 44521750 44207927 44206231 43821737 43403598
3946 43403598 43045215 42776860 42422127 42198885 42201070 41973421 41877504 41629038 41713599 41844678
3936 41844678 41845969 41741849 41960645 41786918 41810323 42044372 42204880 42136824 42080298 42160277
3926 42160277 42306177 42298311 42395562 42812352 43018277 43383258 43771870 44067475 44181685 44589878
3916 44589878 44733501 45116650 45672653 46009849 46318090 46732050 47107780 47483300 47925239
3907 47925239 48577076 49260160 49606619 50014894 50500679 50931797 51535517 52334636 52868630
3898 52868630 53397876 53965235 54600132 55548499 56328173 57115246 57988782 58951475 59641162
$$ packed form
3965E3590764n88228q69483p59060m87718p66936q61002p04573m86555n45467
3956D7521742o08007o08716n63916m17053l47747m54553l13823j696l84494m18139
3946D3403598l58383k68355l54733k23242K185k27649r5917k48466Q4561J31079
3936D1844678J291j04120K18796j73727K3405K34049J60508o8056n6526P9979
3926D2160277J45900p866R7251M16790K05925L64981L88612K95605J14210M08193
3916D4589878J43623L83149N56003L37196L08241M13960L75730L75520M41939
3907D7925239O51837O83084L46459M08275M85785M31118O03720P99119N33994
3898E2868630N29246N67359O34897R48367P79674P87073Q73536R62693O89687
$$ plain form
3889 59641162 60383479 61327021 61960975 63214946 64624123 65606857 66748676 68034219 69573312
3880 69573312 70756475 72052574 73355723 74492469 75772126 77359429 78742190 80244656
3872 80244656 81528194 82969627 84760017 86083135 87481341 89145833 90591647 92146642
3864 92146642 93556819 95165670 96633618 98024275 99547134 100560697 101816932 103175439
3856 103175439 104496339 105662568 106589348 107717025 108752989 109961050 111108113 112060677
3848 112060677 112882086 113628006 114692596 115989281 116519096 117036441 118055961 118715339 119360041
3839 119360041 120281384 121010499 121663993 122205408 122922554 123830962 124921782 125629069 126610592
3830 126610592 127825804 129071972 130393464 131656662 132874939 134131252 135447465 136956840
$$ packed form
3889E9641162P42317R43542O33954J253971J409177R82734J141819J285543J539093
3880F9573312J183163J296099J303149J136746J279657J587303J382761J502466
3872H0244656J283538J441433J790390J323118J398206J664492J445814J554995
3864I2146642J410177J608851J467948J390657J522859J013563J256235J358507
3856A03175439J320900J166229R26780J127677J035964J208061J147063R52564
3848A12060677Q21409P45920J064590J296685N29815N17345J019520O59378O44702
3839A19360041R21343P29115O53494N41415P17146R08408J090820P07287R81523
3830A26610592J215212J246168J321492J263198J218277J256313J316213J509375
$$ plain form
3822 136956840 138195375 139631566 141252831 142674339 144095097 145919904 147455946 148798382
3814 148798382 149988453 151192271 152506401 153573507 154305846 154948750 155378097 155643287 155897085
3805 155897085 155430530 154819286 153709211 152862336 151549906 149809413 147881303 145471847
3797 145471847 143279208 140605513 137878711 135223336 132311378 129430044 126285852 123106978
3789 123106978 119997145 116892281 113731186 110527737 107361640 104769954 101772513 98667847
3781 98667847 95892056 92993945 90272982 88084502 85469482 83052355 80998007 79001360
3773 79001360 76634010 74279730 72416615 70679808 68969478 67430747 65857754 64241652
3765 64241652 62599377 61423400 60059812 58665223 57253782 56034460 55002273 54063600
$$ packed form
3822A36956840J238535J436191J621265J421508J420758J824807J536042J342436
3814A48798382J190071J203818J314130J067106P32339O42904M29347K65190K53798
3805A55897085m66555o11244j110075q46875j312430j740493j928110k409456
3797A45471847k192639k673695k726802k655375k911958k881334l144192l178874
3789A23106978l109833l104864l161095l203449l166097k591686k997441l104666
3781I8667847k775791k898111k720963k188480k615020k417127k054348j996647
3773G9001360k367350k354280j863115j736807j710330j538731j572993j616102
3765F4241652j642275j175977j363588j394589j411441j219322j032187r38673
$$ plain form
3757 54063600 53339227 52378158 51570151 50686040 49685673 49075185 48172142 47430601 46592299
3748 46592299 45545668 45154685 44481453 43281909 42731690 42275150 41677294 41278388 40423851
3739 40423851 39551144 38874025 38430412 37809741 37039325 36594534 35943188 35518125 35168928
3730 35168928 34622419 33976751 33617001 33043587 32602193 32101817 31635393 31036900 30664430
3721 30664430 29808528 29317511 28838962 28435476 28404989 28000338 27489373 27157634 26794461 26493075
3711 26493075 26196676 25433257 25310257 25376837 25111271 24870283 24396760 24302259 24152862 24050608
3701 24050608 24094743 23962040 23774756 23496531 23405751 23422505 23187214 22842046 22758213 22437540
3691 22437540 22579822 22580431 22616084 22365288 22289276 22179593 22040197 22180667 22266460 21767598
$$ packed form
3757E4063600p24373r61069q08007q84111j000367o10488r03043p41541q38302
3748D6592299j046631l90983o73232j199544n50219m56540n97856l98906q54537
3739D0423851q72707o77119m43613o20671p70416m44791o51346m25063l49197
3730C5168928n46509o45668l59750n73414m41394n00376m66424n98493l72470
3721C0664430q55902m91017m78549m03486l0487m04651n10965l31739l63173l01386
3711B6493075k96399p63419j23000O6580k65566k40988m73523r4501j49397j02254
3701B4050608M4135j32703j87284k78225r0780J6754k35291l45168q3833l20673
3691B2437540J42282O09L5653k50796p6012j09683j39396J40470Q5793m98862
$$ plain form
3681 21767598 21790905 21827659 22217229 22052625 21994679 21955973 22010995 22107987 22283662 22317877 22516847
3670 22516847 22480983 22575929 22881349 23011241 23362875 23558948 23603121 23659061 23852936 24001943
3660 24001943 24264500 24438946 24632014 25016777 25135114 25430406 25739485 26241280 26501393
3651 26501393 26923540 27326528 27533060 28021533 28389750 28918907 29343328 29755717 30370199
3642 30370199 31071914 31554403 31984632 32860544 33389719 34034933 34921268 35528123 36476542
3633 36476542 37104072 37859698 38517040 39262562 40174495 40945788 41651204 42265035 43035273
3624 43035273 43724531 44355497 45352723 46156567 47085433 48058581 48756279 49197055 49727161
3615 49727161 50428629 51165915 52029927 52904851 53507468 54192876 55015307 55503463 56180017
$$ packed form
3681B1767598K3307L6754L89570j64604n7946l8706N5022R6992J75675L4215J98970
3670B2516847l5864R4946L05420J29892L51634J96073M4173N5940J93875J49007
3660B4001943K62557J74446J93068L84763J18337K95292L09079N01795K60113
3651B6501393M22147M02988K06532M88473L68217N29157M24421M12389O14482
3642C0370199P01715M82489M30229Q75912N29175O45214Q86335O06855R48419
3633C6476542O27530P55626O57342P45522R11933P71293P05416O13831P70238
3624D3035273O89258O30966R97226Q03844R28866R73148O97698M40776N30106
3615D9727161P01468P37286Q64012Q74924O02617O85408Q22431M88156O76554
$$ plain form
3606 56180017 57207403 58206618 59132191 60159476 60941283 61971722 63179716 64347025 65807924
3597 65807924 67217891 69054150 70611086 72540555 74626400 76807242 78969436 81247761
3589 81247761 83872816 87140834 90282172 93369971 96995294 100647690 104853534 108972413
3581 108972413 113493523 118555713 123522605 128815020 134100021 139756288 145698600 151772658
3573 151772658 157848052 163981816 170256983 176417354 182429642 188198297 193765368 198843137
3565 198843137 203661837 208136568 212097365 215589522 218386185 220663196 222311337 223066323
3557 223066323 223493444 222886321 221701930 220080125 218046055 215103069 211742972 207859987
3549 207859987 203531181 199235127 194481030 189329607 183893449 178457540 173246465 168100636
$$ packed form
3606E6180017J027386R99215R25573J027285P81807J030439J207994J167309J460899
3597F5807924J409967J836259J556936J929469K085845K180842K162194K278325
3589H1247761K625055L268018L141338L087799L625323L652396M205844M118879
3581A08972413M521110N062190M966892N292415N285001N656267N942312O074058
3573A51772658O075394O133764O275167O160371O012288N768655N567071N077769
3565A98843137M818700M474731L960797L492157K796663K277011J648141P54986
3557B23066323M27121o07123j184391j621805k034070k942986l360097l882985
3549B07859987m328806m296054m754097n151423n436158n435909n211075n145829
$$ plain form
3541 168100636 162911330 157948525 153097824 148492810 143932800 139854006 135827480 131981837
3533 131981837 128458953 125418330 122311873 119766272 117153833 115100299 113399924 111895702
3525 111895702 110077954 108444169 107095065 105871257 105108843 104219711 103466798 103017002 102707043
3516 102707043 102006609 101448626 101012626 100459035 99943599 99202570 98597552 98067293 97457264
3507 97457264 96879215 96221461 95407050 94662400 93731332 92656208 92069257 91077475 90074668
3498 90074668 88922245 87787777 86101470 83955268 81683322 79674112 77446848 75151540
3490 75151540 73108367 70756101 68850645 67192575 65200084 63440695 61926399 60596045
3482 60596045 59258204 57962945 56929899 56060851 55736125 55167543 54619377 54452474 54516164
$$ packed form
3541A68100636n189306m962805m850701m605014m560010m078794m026526l845643
3533A31981837l522884l040623l106457k545601k612439k053534j700375j504222
3525A11895702j817748j633785j349104j223808p62414q89132p52913m49796l09959
3516A02707043p00434n57983m36000n53591n15436p41029o05018n30259o10029
3507I7457264n78049o57754q14411p44650r31068j075124n86951r91782j002807
3498I0074668j152423j134468j686307k146202k271946k009210k227264k295308
3490G5151540k043173k352266j905456j658070j992491j759389j514296j330354
3482F0596045j337841j295259j033046q69048l24726n68582n48166j66903O3690
$$ plain form
3473 54516164 54536719 54668514 55028006 55474948 55775314 56014981 56010804 55504763 55111562 54627093
3463 54627093 54152138 53963458 53834633 53541080 53283123 53252035 53343972 53289102 53506864 53474435
3453 53474435 53308210 53491716 53820901 53855477 53966960 53770638 53670538 53608922 53861563 54093866
3443 54093866 54117936 54269585 54555571 54813107 54869363 55305420 55920751 56449808 56903560 57627188
3433 57627188 58422722 59458534 61007152 62224968 63616749 65203105 67211500 69484474
3425 69484474 71512054 74112334 76880185 79887451 82981006 86393336 90204110 94020018
3417 94020018 98079816 102252039 107114073 111964770 116858173 121483721 125839020 130388460
3409 130388460 134342205 137773561 140484812 142641073 143248707 142671444 141944958 139839437
$$ packed form
3473E4516164K0555J31795L59492M46942L00366K39667m177n06041l93201m84469
3463E4627093m74955j88680j28825k93553k57957l1088R1937n4870K17762l2429
3453E3474435j66225J83506L29185L4576J11483j96322j00100o1616K52641K32303
3443E4093866K4070J51649K85986K57536N6256M36057O15331N29057M53752P23628
3433E7627188P95534J035812J548618J217816J391781J586356K008395K272974
3425F9484474K027580K600280K767851L007266L093555L412330L810774L815908
3417I4020018M059798M172223M862034M850697M893403M625548M355299M549440
3409A30388460L953745L431356K711251K156261O07634n77263p26486k105521
$$ plain form
3401 139839437 136787165 133247399 129419374 125701521 121931168 118229247 114706162 111231187
3393 111231187 108075074 105222617 103019716 100935808 98816916 97358069 96336522 95582900
3385 95582900 94632339 93791652 93250280 92471207 91731454 91242519 90724780 90003701 89386322
3376 89386322 88755624 87953176 86943908 86019519 84952936 83958893 82923780 81473788 80103131
3367 80103131 78840100 77591417 75828154 74102148 72295709 70306004 68411447 66623868
3359 66623868 64562656 62635277 60547905 58613402 56349299 54058277 52238773 50547360
3351 50547360 48447277 46250292 44217900 42822918 41129614 39259697 37608461 36262197
3343 36262197 35099516 33903726 32425449 31234063 30220302 29477132 28663909 27632726
$$ packed form
3401A39839437l052272l539766l828025l717853l770353l701921l523085l474975
3393A11231187l156113k852457k202901k083908k118892j458847j021547p53622
3385I5582900r50561q40687n41372p79073p39753m88935n17739p21079o17379
3376H9386322o30698q02448j009268r24389j066583r94043j035113j449992j370657
3367H0103131j263031j248683j763263j726006j806439j989705j894557j787579
3359F6623868k061212j927379k087372j934503k264103k291022j819504j691413
3351E0547360k100083k196985k032392j394982j693304j869917j651236j346264
3343C6262197j162681j195790j478277j191386j013761p43170q13223j031183
$$ plain form
3335 27632726 27093503 26641680 25905238 25177345 24688208 24395003 23839446 23216468 22979155
3326 22979155 22375342 21762137 21418992 21155056 20929457 20577583 20161485 19876836 19870509 19420640
3316 19420640 19174960 19477575 19493816 19431361 18944400 18797231 18885368 18769628 18657529 18532290
3306 18532290 18105076 17844752 17714045 17626352 17172979 16952423 16929837 16462246 16074073 15986767
3296 15986767 15532832 15502208 15133356 14898263 14882619 14787829 14573201 14452341 14279415 14210942
3286 14210942 14521480 14441835 14169992 13875832 13866320 14087808 14186534 14124573 14049096 14262280
3276 14262280 14501430 14649326 14405763 14370266 14284972 14453787 14722529 14710704 14686820 14536267
3266 14536267 14542242 14628586 14715818 14903997 15044817 14944889 15171398 15099850 15089332 15175225 15261945
$$ packed form
3335B7632726n39223m51823p36442p27893m89137k93205n55557o22978k37313
3326B2979155o03813o13205l43145k63936k25599l51874m16098k84649o327m49869
3316A9420640k45680L02615J6241o2455m86961j47169Q8137j15740j12099j25239
3306A8532290m27214k60324j30707q7693m53373k20556k2586m67591l88173q7306
3296A5986767m53935l0624l68852k35093j5644r4790k14628j20860j72926o8473
3286A4210942L10538p9645k71843k94160r512K21488R8726o1961p5477K13184
3276A4262280K39150J47896k43563l5497q5294J68815K68742j1825k3884j50553
3266A4536267N975Q6344Q7232J88179J40820r9928K26509p1548j0518Q5893Q6720
$$ plain form
3255 15261945 15108752 15218925 15488040 15672882 15759784 15861554 15943617 16062067 16320330 16514722
3245 16514722 16478268 16630722 16833920 17065453 17070083 17256261 17601878 17858416 17840710 18057019
3235 18057019 18256277 18338463 18555850 18687423 19035159 19164104 19735146 20330775 20239068 20471557
3225 20471557 20644653 20951464 21441909 21869446 22205878 22519200 22587239 23307209 24097044 24209369
3215 24209369 24543279 24813643 25244827 26061029 26560235 27060078 27529429 27737626 28217601
3206 28217601 28888875 29490534 30114402 30648738 31188930 31985153 32752501 33448779 34222402
3197 34222402 35304562 36075760 36937602 37648227 38821564 39789254 41015397 42327187 43655656
3188 43655656 45027211 46373829 47694517 49387396 50830953 52950796 55084270 57079577
$$ packed form
3255A5261945j53193J10173K69115J84842Q6902J01770Q2063J18450K58263J94392
3245A6514722l6454J52454K03198K31533M630J86178L45617K56538j7706K16309
3235A8057019J99258Q2186K17387J31573L47736J28945N71042N95629r1707K32489
3225B0471557J73096L06811M90445M27537L36432L13322O8039P19970P89835J12325
3215B4209369L33910K70364M31184Q16202M99206M99843M69351K08197M79975
3206B8217601O71274O01659O23868N34336N40192P96223P67348O96278P73623
3197C4222402J082160P71198Q61842P10625J173337R67690J226143J311790J328469
3188D3655656J371555J346618J320688J692879J443557K119843K133474J995307
$$ plain form
3180 57079577 59263072 61345067 63539772 66027513 68855990 71825836 75198222 78370836
3172 78370836 81786780 85568630 89427211 93809956 98651177 103506236 108751349 114203906
3164 114203906 120514256 127218358 134232690 141937307 150149210 159186146 168844525 179327772
3156 179327772 190586867 202979070 216282776 230327482 245024959 260402717 276757172
3149 276757172 293880238 310945445 327718005 344150733 359321239 372595976 382880935
3142 382880935 389370011 391227994 388491182 380895393 369448329 354329001 337151826 319233270
3134 319233270 301106847 283334700 266775493 251321734 237237050 224162762 212266084
3127 212266084 201702879 192159762 183622030 175920000 169377123 163639199 158530432 153812253
$$ packed form
3180E7079577K183495K081995K194705K487741K828477K969846L372386L172614
3172G8370836L415944L781850L858581M382745M841221M855059N245113N452557
3164A14203906O310350O704102P014332P704617Q211903R036936R658379J0483247
3156A79327772J1259095J2392203J3303706J4044706J4697477J5377758J6354455
3149B76757172J7123066J7065207J6772560J6432728J5170506J3274737J0284959
3142C82880935O489076J857983k736812p595789j1447064j5119328j7177175j7918556
3134C19233270j8126423j7772147j6559207j5453759j4084684j3074288j1896678
3127B12266084j0563205r543117q537732p702030o542877n737924n108767m718179
$$ plain form
3119 153812253 149792779 146401281 143569969 141534157 139708680 138060852 136734505 135881691
3111 135881691 135356969 134764202 134685635 134955438 135877036 136729695 137924607 140022323 142544217
3102 142544217 145559690 148982383 153170579 157815358 162935056 168633057 175297426 182383820
3094 182383820 189773457 197627056 205706291 213988498 222174677 230072205 237477130 244044077
3086 244044077 248987010 252494338 254053397 253330113 250250318 244808704 237076171 228082065
3078 228082065 218031826 207258787 196022249 184953797 174313860 163978389 153791871
3071 153791871 144111930 135350794 127073655 119107497 111848600 105181527 98672598 92569888
3063 92569888 86809475 81547943 76791713 72437946 68017981 64262906 60770938 57653950
$$ packed form
3119A53812253m019474l391498k831312k035812j825477j647828j326347q52814
3111A35881691n24722n92767p8567K69803R21598Q52659J194912K097716K521894
3102A42544217L015473L422693M188196M644779N119698N698001O664369P086394
3094A82383820P389637P853599Q079235Q282207Q186179P897528P404925O566947
3086B44044077M942933L507328J559059p23284l079795n441614p732533q994106
3078B28082065j0050239j0773039j1236538j1068452j0639937j0335471j0186518
3071A53791871r679941q761136q277139p966158p258897o667073o508929o102710
3063I2569888n760413n261532m756230m353767m419965l755075l491968l116988
$$ plain form
3055 57653950 54651131 51554805 48651336 46442526 44100933 41656232 39630597 37738292
3047 37738292 36251947 34585600 32790623 31319287 29976761 28622602 27445284 26166492
3039 26166492 24931235 23866064 23037760 22457453 21390291 20407381 19582000 18815534 18245028
3030 18245028 17480222 16847868 16016235 15574348 14867575 14008392 13561936 13037172 12609667
3021 12609667 11854272 11331980 10992508 10586754 10353512 9731935 9164458 8789510 8563244
3012 8563244 8351398 7895244 7638346 7227871 7166285 7043719 6455361 6128737 5983949 5442916
3002 5442916 5272496 5095921 4821547 4799528 4599366 4286174 4069972 3883756 3626883 3546010
2992 3546010 3339528 2996940 2654726 2483233 2468966 2763464 2489375 2479580 2194606 2089774
$$ packed form
3055E7653950l002819l096326k903469k208810k341593k444701k025635j892305
3047C7738292j486345j666347j794977j471336j342526j354159j177318j278792
3039B6166492j235257j065171q28304n80307j067162r82910q25381p66466n70506
3030A8245028p64806o32354q31633m41887p06773q59183m46456n24764m27505
3021A2609667p55395n22292l39472m05754k33242o21577n67477l74948k26266
3012H563244k11846m56154k56898m10475o1586j22566n88358l26624j44788n41033
3002E442916j70420j76575k74374k2019k00162l13192k16202j86216k56873q0873
2992C546010k06482l42588l42214j71493j4267K94498k74089r795k84974j04832
$$ plain form
2982 2089774 1923302 1929146 1937329 1925575 1821471 1346963 1336542 1268326 1044613 1022939 1171276
2971 1171276 889586 745163 717984 1020359 637270 318336 415459 257738 235257 59315
2961 59315 195002 172910 133763 -113521 -441112 -210492 -203595 -553252 -530900 -503120 -554350
2950 -554350 -695122 -1011667 -925051 -998343 -980371 -997956 -1218379 -1103881 -1155525 -1162073 -1311895
2939 -1311895 -1507926 -1325219 -1424003 -1457042 -1558605 -1511213 -1529077 -1445459 -1313080 -1285825 -1393461
2928 -1393461 -1489205 -1544364 -1419637 -1548518 -1668009 -1639072 -1601418 -1231616 -1432561 -1750487
2918 -1750487 -1670436 -1560859 -1528963 -1672270 -1926567 -1913250 -1898476 -1769251 -1692788 -1645078 -1488574
2907 -1488574 -1685157 -1666649 -1330430 -1565916 -1537644 -1643293 -1767567 -1885942 -1747893 -1960611
$$ packed form
2982B089774j66472N844Q183j1754j04104m74508j0421o8216k23713k1674J48337
2971A171276k81690j44423k7179L02375l83089l18934R7123j57721k2481j75942
2961E9315J35687k2092l9147k47284l27591K30620O897l49657K2352K7780n1230
2950e54350j40772l16545Q6616p3292J7972j7585k20423J14498n1644o548j49822
2939a311895j96031J82707r8784l3039j01563M7392j7864Q3618J32379K7255j07636
2928a393461r5744n5159J24727j28881j19491K8937L7654L69802k00945l17926
2918a750487Q0051J09577L1896j43307k54297J3317J4774J29225P6463M7710J56504
2907a488574j96583J8508L36219k35486K8272j05649j24274j18375J38049k12718
$$ plain form
2897 -1960611 -1805400 -1637919 -1534057 -1604602 -1519962 -1413761 -1470145 -1473096 -1363172 -1256260
2887 -1256260 -1371364 -1299377 -1414046 -1187226 -1364425 -1360155 -1407677 -1656619 -1361841 -1338227
2877 -1338227 -1563897 -1416916 -1338912 -1345531 -1271320 -1210460 -1248400 -1010942 -1117394 -851452 -631842
2866 -631842 -648298 -467448 -349890 -454384 -367157 -151986 -16937 -145267 -70122 22201
2856 22201 -91773 -342328 -549869 -388183 -365405 -548495 -432711 -392627 -679558 -1010760
2846 -1010760 -790821 -698009 -618411 -782713 -816489 -1019935 -840145 -741046 -732985 -933571 -1396905
2835 -1396905 -1547593 -1442034 -1267056 -1231570 -1282035 -1485808 -1346144 -1329211 -1598168 -1735756
2825 -1735756 -1552854 -1339845 -1270452 -1523973 -1515920 -1244034 -1218221 -1364433 -1368285 -1268613 -1199242
$$ packed form
2897a960611J55211J67481J03862p0545Q4640J06201n6384k951J09924J06912
2887a256260j15104P1987j14669K26820j77199M270m7522k48942K94778K3614
2877a338227k25670J46981P8004o619P4211O0860l7940K37458j06452K65942K19610
2866f31842j6456J80850J17558j04494Q7227K15171J35049j28330P5145R2323
2856B2201j13974k50555k07541J61686K2778j83090J15784M0084k86931l31202
2846a010760K19939R2812P9598j64302l3776k03446J79790R9099Q061k00586m63334
2835a396905j50688J05559J74978L5486n0465k03773J39664J6933k68957j37588
2825a735756J82902K13009O9393k53521Q053K71886K5813j46212l852R9672O9371
$$ plain form
2814 -1199242 -1289371 -1250558 -1183280 -1110282 -1091556 -1066711 -1068402 -840160 -1007609 -789308 -858583
2803 -858583 -769748 -971390 -967288 -881059 -1032417 -946872 -935919 -1004090 -984330 -1043936 -970264
2792 -970264 -1134319 -987190 -1145932 -1339980 -1354131 -1611596 -1522985 -1598675 -1502669 -1437995 -1489662
2781 -1489662 -1543815 -1410531 -1421099 -1495670 -1711920 -1647558 -1587939 -1712102 -1807892 -1845679 -2097259
2770 -2097259 -2087048 -2009801 -2167225 -1771047 -1794672 -1949924 -1872515 -1737281 -1516185 -1673599
2760 -1673599 -1755995 -1881036 -2108819 -2327711 -2326463 -2236663 -2304182 -2030585 -1835962 -1608302
2750 -1608302 -1454568 -1366099 -1739318 -1884448 -1596928 -1424397 -1817415 -1954885 -1823165 -1727079
2740 -1727079 -1523473 -1554105 -1629838 -1689907 -1584065 -1984471 -1993731 -2042802 -1718757 -1754887 -1673638
$$ packed form
2814a199242r0129L8813O7278P2998J8726K4845j691K28242j67449K18301o9275
2803h58583Q8835k01642M102Q6229j51358Q5545J0953o8171J9760n9606P3672
2792i70264j64055J47129j58742j94048j4151k57465Q8611p5690R6006O4674n1667
2781a489662n4153J33284j0568p4571k16250O4362N9619j24163r5790l7787k51580
2770b097259J0211P7247j57424L96178k3625j55252P7409J35234K21096j57414
2760a673599q2396j25041k27783k18892J248Q9800o7519K73597J94623K27660
2750a608302J53734Q8469l73219j45130K87520J72531l93018j37470J31720R6086
2740a727079K03606l0632p5733o0069J05842m00406r260m9071L24045l6130Q1249
$$ plain form
2729 -1673638 -1833779 -2098522 -2080360 -2211943 -2144868 -1933165 -2070042 -1956729 -1825362 -1672985
2719 -1672985 -1702735 -1872230 -2001108 -2043682 -2053432 -2056833 -1846193 -1670348 -2005123 -1913273 -1691639
2708 -1691639 -1677222 -1699604 -1842310 -1733894 -1692850 -1780156 -1916425 -1844615 -1618078 -1638346 -1526899
2697 -1526899 -1611320 -1894081 -1855510 -1837259 -1923341 -1776028 -1600591 -1794566 -1734267 -1868162
2687 -1868162 -1665252 -1647016 -1616722 -1729645 -1673118 -1673836 -1744245 -1822284 -1610407 -1726475 -1816778
2676 -1816778 -1841085 -1832207 -1742062 -1780726 -1901144 -1944135 -2142756 -2061702 -1745607 -1814453 -1942475
2665 -1942475 -1660680 -1492388 -1812321 -1954969 -1853491 -1779917 -1637097 -1426498 -1415066 -1444972
2655 -1444972 -1625209 -1700762 -1455660 -1487487 -1661369 -1873558 -1859926 -1742912 -1577974 -1806857
$$ packed form
2729a673638j60141k64743J8162j31583O7075K11703j36877J13313J31367J52377
2719a672985k9750j69495j28878m2574r750l401K10640J75845l34775R1850K21634
2708a691639J4417k2382j42706J08416M1044q7306j36269P1810K26537k0268J11447
2697a526899q4421k82761L8571J8251q6082J47313J75437j93975O0299j33895
2687a868162K02910J8236L0294j12923N6527p18p0409p8039K11877j16068r0303
2676a816778k4307Q878R0145l8664j20418m2991j98621Q1054L16095o8846j28022
2665a942475K81795J68292l19933j42648J01478P3574J42820K10599J1432k9906
2655a444972j80237p5553K45102l1827j73882k12189J3632J17014J64938k28883
$$ plain form
2645 -1806857 -1790149 -1956000 -1956795 -1982182 -1947185 -1621691 -1625128 -1750548 -1672549 -1919341 -1815120
2634 -1815120 -1665473 -1753234 -1773443 -2051431 -1997552 -2123075 -1824276 -1942253 -1874013 -1721275
2624 -1721275 -1549155 -1602532 -1906106 -1828191 -1614069 -1825456 -1780946 -1668450 -1415679 -1390628
2614 -1390628 -1503342 -1452766 -1521290 -1838728 -1888186 -1881959 -1525304 -1434691 -1294470 -1492617 -1567651
2603 -1567651 -1543332 -1605764 -1558059 -1748454 -1512116 -1276584 -1571739 -1709767 -1704271 -1631454 -1749491
2592 -1749491 -1430529 -1346946 -1336235 -1300240 -1181908 -1024106 -1174882 -1194503 -1362146 -1495715
2582 -1495715 -1765386 -1685238 -1593970 -1525186 -1330041 -1201055 -1463958 -1501232 -1328155 -872575
2572 -872575 -960829 -1170461 -1309880 -1137780 -932637 -1170088 -1212376 -1194154 -1287388 -1482624
$$ packed form
2645a806857J6708j65851p95k5387L4997L25494l437j25420P7999k46792J04221
2634a815120J49647q7761k0209k77988N3879j25523K98799j17977O8240J52738
2624a721275J72120n3377l03574P7915K14122k11387M4510J12496K52771K5051
2614a390628j12714N0576o8524l17438m9458O227L56655R0613J40221j98147p5034
2603a567651K4319o2432M7705j90395K36338K35532k95155j38028N496P2817j18037
2592a749491L18962Q3583J0711L5995J18332J57802j50776j9621j67643j33569
2582a495715k69671Q0148R1268O8784J95145J28986k62903l7274J73077M55580
2572h72575q8254k09632j39419J72100K05143k37451m2288J8222r3234j95236
$$ plain form
2562 -1482624 -1553731 -1515681 -1011637 -1075211 -1100355 -1067758 -1440895 -1482613 -1435952 -1423755 -1433417
2551 -1433417 -1291197 -1466672 -1550489 -1891469 -1714902 -1427639 -1551367 -1389860 -1503786 -1395191
2541 -1395191 -1059785 -1349798 -1483856 -1576736 -1539881 -1176651 -1310842 -1594918 -1438736 -1188418
2531 -1188418 -1108950 -829044 -974519 -1054960 -1182737 -1387714 -1470898 -1640848 -1291544 -1036774
2521 -1036774 -1123915 -1289351 -1411390 -1292616 -1221803 -1463065 -1186000 -1107387 -1243401 -1296413
2511 -1296413 -1228188 -1269182 -1024736 -953841 -979266 -1128138 -1014008 -1140781 -1086688 -824423
2501 -824423 -1128638 -1261209 -1142961 -1214744 -994370 -861733 -837733 -869999 -1122285 -1079195
2491 -1079195 -1096910 -1089883 -1194275 -969126 -925214 -901129 -1124892 -1348493 -1126004 -1202315 -1331296
$$ packed form
2562a482624p1107L8050N04044o3574k5144L2597l73137m1718M6661J2197r662
2551a433417J42220j75475q3817l40980J76567K87263j23728J61507j13926J08595
2541a395191L35406k90013j34058r2880L6855L63230j34191k84076J56182K50318
2531a188418P9468K79906j45475q0441j27777k04977q3184j69950L49304K54770
2521a036774q7141j65436j22039J18774P0813k41262K77065P8613j36014n3012
2511a296413O8225m0994K44446P0895k5425j48872J14130j26773N4093K62265
2501h24423l04215j32571J18248p1783K20374J32637K4000l2266k52286M3090
2491a079195j7715P027j04392K25149M3912K4085k23763k23601K22489p6311j28981
$$ plain form
2480 -1331296 -1048113 -909253 -1168397 -1158465 -1000322 -944271 -746454 -624885 -595305 -762934
2470 -762934 -734781 -700577 -677257 -699623 -909730 -731633 -835973 -788231 -809041 -852770 -897950
2459 -897950 -1061444 -913958 -725802 -717682 -653424 -592832 -938405 -911711 -996907 -1056489 -962766
2448 -962766 -867471 -702315 -676932 -832622 -661972 -593465 -681664 -795128 -796928 -622750 -701098
2437 -701098 -898354 -902173 -960215 -730834 -747684 -778093 -900618 -879722 -860680 -1103321 -808629
2426 -808629 -648329 -724865 -443238 -514231 -640516 -568899 -470916 -459805 -545367 -457842 -530354
2415 -530354 -599743 -646655 -373811 -252830 -226453 -118894 -323429 -315937 -172295 -411302 -420379
2404 -420379 -140506 -236196 11766 -41464 56986 27279 48864 -30108 -85548 -163084 -328125
$$ packed form
2480a331296K83183J38860k59144R932J58143N6051J97817J21569K9580j67629
2470g62934K8153L4204K3320k2366k10107J78097j04340M7742k0810m3729m5180
2459h97950j63494J47486J88156Q120O4258O0592l45573K6694q5196n9582R3723
2448i62766R5295J65156K5383j55690J70650O8507q8199j13464j800J74178p8348
2437g01098j97256l819n8042K29381j6850l0409j22525K0896J9042k42641K94692
2426h08629J60300p6536K81627p0993j26285P1617R7983J1111q5562Q7525p2512
2415e30354o9389m6912K72844J20981K6377J07559k04535P492J43642k39007r077
2404d20379K79873r5690K47962n3230R8450k9707K1585p8972n5440p7536j65041
$$ plain form
2393 -328125 -27703 -230295 -246805 231223 290272 274865 206535 -10128 96768 199737
2383 199737 244395 266821 520323 513277 311848 347785 490233 722340 557706 293276 216683
2372 216683 302715 624740 354639 510880 479001 439230 759664 720130 704457 795766 1023822
2361 1023822 1002051 1111972 1087245 663143 534056 706816 800958 847296 1198077 1439770
2351 1439770 1508223 1656136 1790232 1866310 2141956 2239153 2105131 2034528 2230420 2483124
2341 2483124 2680544 2425343 2396846 2623743 3132807 3329226 3449447 3654561 4084853 4237539
2331 4237539 4657075 5028393 5427497 5922829 6340083 6753539 7327363 8090463 8650682 9223654
2321 9223654 9885719 10448585 11413447 12297952 13520320 14972842 16441616 17872199 19419005
$$ packed form
2393c28125L00422k02592j6510M78028N9049j5407o8330k16663J06896J02969
2383A99737M4658K2426K53502p046k01429L5937J42448K32107j64634k64430p6593
2372B16683Q6032L22025k70101J56241l1879l9771L20434l9534j5673R1309K28056
2361A023822k1771J09921k4727m24102j29087J72760R4142M6338L50781K41693
2351A439770O8453J47913J34096P6078K75646R7197j34022p0603J95892K52704
2341B483124J97420k55201k8497K26897N09064J96419J20221K05114M30292J52686
2331D237539M19536L71318L99104M95332M17254M13456N73824P63100N60219N72972
2321I223654O62065N62866R64862Q84505J222368J452522J468774J430583J546806
$$ plain form
2312 19419005 21409950 23151347 25191800 27802938 31081474 34605195 38638604 43357243
2304 43357243 48896693 54886266 61383459 69213852 77689103 83402709 81946875 72934539
2296 72934539 60928958 50118791 41994578 35108365 29743603 25695839 22725432 20042332
2288 20042332 18217193 16510835 15197216 14310109 13466059 12452535 11273291 10124788
2280 10124788 8884163 7917594 7239297 6433692 6016609 5285613 4718243 4365363 4220484
2271 4220484 3925251 3683555 3388389 3230991 3167372 2810349 2803527 2356828 1832035 1888572
2261 1888572 1847683 1566775 1535574 1440965 1548301 1269010 1109805 1021321 1179495 1150194
2251 1150194 960845 543701 377618 247357 360605 338642 168681 153664 -6826 -15214
$$ packed form
2312A9419005J990945J741397K040453K611138L278536L523721M033409M718639
2304D3357243N539450N989573O497193P830393Q475251N713606j455834r012336
2296G2934539j2005581j0810167q124213o886213n364762m047764k970407k683100
2288B0042332j825139j706358j313619q87107q44050j013524j179244j148503
2280A0124788j240625r66569o78297q05605m17083p30996n67370l52880j44879
2271D220484k95233k41696k95166j57398o3619l57023o822m46699n24793N6537
2261A888572m0889k80908l1201r4609J07336k79291j59205q8484J58174k9301
2251A150194j89349m17144j66083j30261J13248k1963j69961j5017j60490q388
$$ plain form
2241 -15214 -190845 -209883 -221793 19324 -203471 -525364 -570414 -142491 -57960 66445 50754
2230 50754 -203422 -186867 -294516 -371495 -602866 -631207 -512370 -151237 -123757 -354939 -634361
2219 -634361 -596646 -365962 -449633 -566025 -486105 -625526 -719711 -813924 -793749 -651055 -545944
2208 -545944 -713991 -740041 -738334 -658845 -628134 -628269 -549085 -831370 -996365 -765234 -815028
2197 -815028 -865155 -775627 -814248 -694448 -479400 -800006 -823369 -700313 -804548 -1003237
2187 -1003237 -1011857 -946287 -811270 -809014 -745580 -630281 -577515 -767778 -827114 -807466 -891373
2176 -891373 -990237 -1022504 -1093756 -799892 -683393 -747673 -800043 -756754 -735964 -702288 -620933
2165 -620933 -389582 -582219 -875094 -672885 -775766 -947467 -925460 -752278 -710770 -953590
$$ packed form
2241a5214j75631j9038j1910K41117k22795l21893m5050M27923Q4531J24405j5691
2230E0754k54176J6555j07649p6979k31371k8341J18837L61133K7480k31182k79422
2219f34361L7715K30684q3671j16392P9920j39421r4185r4213K0175J42694J05111
2208e45944j68047k6050J707P9489L0711j35P9184k82285j64995K31131m9794
2197h15028n0127Q9528l8621J19800K15048l20606k3363J23056j04235j98689
2187a003237q620O5570J35017K256O3434J15299N2766j90263n9336J9648q3907
2176h91373r8864l2267p1252K93864J16499o4280n2370M3289K0790L3676Q1355
2165f20933K31351j92637k92875K02209j02881j71701K2007J73182M1508k42820
$$ plain form
2155 -953590 -1267592 -1170172 -1205372 -1077395 -1223388 -947498 -1175241 -1026389 -1029550 -614864
2145 -614864 -535016 -855829 -886545 -978565 -737158 -706584 -669414 -878256 -940585 -891767 -1176927
2134 -1176927 -1104891 -774936 -709564 -595329 -447627 -644967 -590631 -512971 -738274 -947755
2124 -947755 -1159616 -928269 -974802 -897194 -797215 -851990 -802370 -899771 -668548 -677175 -405512
2113 -405512 -715680 -727984 -666383 -909958 -941406 -1033076 -1052347 -728342 -804740 -882099 -844675
2102 -844675 -1126616 -951613 -1111384 -914836 -757820 -692227 -607610 -660105 -774040 -834068
2092 -834068 -728901 -661304 -800700 -1116842 -1107444 -1027102 -971302 -1014342 -938915 -745302 -854304
2081 -854304 -713145 -729103 -968301 -953057 -857560 -751364 -925768 -998718 -863814 -614116
$$ packed form
2155i53590l14002R7420l5200J27977j45993K75890k27743J48852l161M14686
2145f14864P9848l20813l0716r2020K41407L0574L7170k08842o2329M8818k85160
2134a176927P2036L29955O5372J14235J47702j97340N4336P7660k25303k09481
2124i47755k11861K31347m6533P7608R9979n4775M9620r7401K31223q627K71663
2113d05512l10168j2304O1601k43575l1448r1670j9271L24005p6398p7359L7424
2102h44675k81941J75003j59771J96548J57016O5593Q4617n2495j13935o0028
2092h34068J05167O7597j39396l16142R398Q0342N5800m3040P5427J93613j09002
2081h54304J41159j5958k39198J5244R5497J06196j74404p2950J34904K49698
$$ plain form
2071 -614116 -563047 -668620 -724202 -954033 -687136 -783575 -721796 -620823 -461671 -430361 -416496
2060 -416496 -351209 -381438 -413973 -412114 -560246 -577781 -516272 -678677 -733544 -636796 -574878
2049 -574878 -401237 -565866 -590625 -629506 -804503 -544292 -548888 -576835 -625755 -558637 -367718
2038 -367718 -244480 -323978 -528241 -543161 -533091 -294692 -304448 -290547 -88345 -252864 -233636
2027 -233636 -219158 -306163 -472589 -540715 -547616 -305860 -422663 -558754 -349895 -523145 -558920
2016 -558920 -203160 -442742 -476309 -597228 -616989 -488544 -604325 -574617 -781291 -661565
2006 -661565 -440068 -529286 -671419 -693433 -638752 -707706 -811985 -523213 -492788 -358230 -362966
1995 -362966 -767715 -740734 -744757 -770891 -643129 -827462 -843069 -764412 -708320 -683989 -689120
$$ packed form
2071f14116N1069j05573n5582k29831K66897r6439O1779J00973J59152L1310J3865
2060d16496O5287l0229l2535J859j48132j7535O1509j62405n4867R6748O1918
2049e74878J73641j64629k4759l8881j74997K60211m596k7947m8920O7118J90919
2038c67718J23238p9498k04263j4920J0070K38399r756J3901K02202j64519J9228
2027b33636J4478q7005j66426o8126o901K41756j16803j36091K08859j73250l5775
2016e58920L55760k39582l3567j20919j9761J28445j15781K9708k06674J19726
2006f61565K21497q9218j42133k2014N4681o8954j04279K88772L0425J34558m736
1995c62966m04749K6981m023k6134J27762j84333j5607P8657N6092K4331n131
$$ plain form
1984 -689120 -701718 -760231 -532636 -553341 -752729 -740157 -360515 -502343 -845634 -1021241
1974 -1021241 -694594 -426895 -712353 -496511 -566037 -718872 -909643 -764449 -709574 -775246
1964 -775246 -732829 -942147 -847756 -821447 -854502 -606935 -770651 -688449 -677745 -555233 -561678
1953 -561678 -538558 -655082 -811216 -1049083 -863051 -517483 -609509 -459359 -540844 -563830
1943 -563830 -886587 -555734 -780043 -852741 -602961 -573612 -600848 -592532 -549169 -634102 -787991
1932 -787991 -483827 -365519 -608827 -773245 -589575 -437182 -508066 -560893 -611007 -714542
1922 -714542 -698880 -599910 -545936 -619155 -641017 -373242 -647390 -708106 -653206 -501793 -396338
1911 -396338 -209201 -268010 -492531 -587500 -701988 -446620 -372142 -625923 -487224 -363750
$$ packed form
1984f89120j2598n8513K27595k0705j99388J2572L79642j41828l43291j75607
1974a021241L26647K67699k85458K15842o9526j52835j90771J45194N4875o5672
1964g75246M2417k09318R4391K6309l3055K47567j63716Q2202J0704J22512o445
1953e61678K3120j16524j56134k37867J86032L45568r2026J50150q1485k2986
1943e63830l22757L30853k24309p2698K49780K9349k7236Q316M3363q4933j53889
1932g87991L04164J18308k43308j64418J83670J52393p0884n2827n0114j03535
1922g14542J5662R8970N3974p3219k1862K67775k74148o0716N4900J51413J05455
1911c96338J87137n8809k24521r4969j14488K55368P4478k53781J38699J23474
$$ plain form
1901 -363750 -278559 -394411 -787418 -639368 -446161 -762755 -553729 -320557 -217911 -268845
1891 -268845 -406758 -260533 -216061 -328457 -324264 -250558 -108765 -122721 -388310 -325983 -238206
1880 -238206 -586753 -611365 -407649 -443384 -580366 -595169 -591475 -744511 -525233 -631843 -720622
1869 -720622 -715543 -429576 -287958 -368004 -409100 -303042 -444771 -436330 -414283 -497114 -492983
1858 -492983 -624268 -475746 -361917 -589628 -323451 -287122 -145061 -257830 -379194 -230566
1848 -230566 -317788 -285132 -236272 -220848 -183303 -126247 -228653 -305343 -403540 -485254 -725714
1837 -725714 -641700 -655276 -600185 -664624 -774392 -697778 -238132 -453268 -695189 -615326 -615181
1826 -615181 -575006 -467690 -299002 -505555 -531477 -546517 -490914 -400953 -339505 -392852 -419876
$$ packed form
1901c63750Q5191j15852l93007J48050J93207l16594K09026K33172J02646n0934
1891b68845j37913J46225M4472j12396M193P3706J41793j3956k65589O2327Q7777
1880b38206l48547k4612K03716l5735j36982j4803L694j53036K19278j06610q8779
1869g20622N079K85967J41618q0046m1096J06058j41729Q441K2047q2831M131
1858d92983j31285J48522J13829k27711K66177L6329J42061j12769j21364J48628
1848b30566q7222L2656M8860J5424L7545N7056j02406p6690r8197q1714k40460
1837g25714Q4014j3576N5091o4439j09768P6614M59646k15136k41921P9863J45
1826f15181M0175J07316J68688k06553k5922j5040N5603Q9961O1448n3347k7024
$$ plain form
1815 -419876 -337651 -324256 -475997 -537516 -589430 -531556 -527051 -672221 -496255 -479022 -213524
1804 -213524 -132109 -248639 -415960 -501181 -115836 -327010 -429134 -261515 -314950 -375388
1794 -375388 -420227 -279083 -233283 -219194 -49128 -422720 -448602 -176372 -267731 -461911 -452684
1783 -452684 -239856 -332017 -244333 -284100 -94449 -113515 -252254 -474268 -571565 -562299 -502051
1772 -502051 -357205 -289485 -359310 -497720 -232656 -135274 -287652 -609381 -620909 -325969
1762 -325969 -574202 -403253 -624464 -392804 -334230 -295420 -278325 -275039 -79400 58607 -97964
1751 -97964 -44559 127856 131034 122057 -35202 -91284 -285978 -291905 -253982 -120287 -44392 -347180
1739 -347180 -231230 -279315 -585664 -308560 -268652 -232812 -356020 -293215 -506538 -356783
$$ packed form
1815d19876Q2225J3395j51741o1519n1914N7874M505j45170J75966J7233K65498
1804b13524Q1415j16530j67321q5221L85345k11174j02124J67619n3435o0438
1794c75388m4839J41144M5800J4089J70066l73592k5882K72230r1359j94180R227
1783d52684K12828r2161Q7684l9767J89651j9066j38739k22014r7297R266O0248
1772e02051J44846O7720o9825j38410K65064R7382j52378l21729j1528K94940
1762c25969k48233J70949k21211K31660N8574L8810J7095L286J95639J38007j56571
1751i7964N3405J72415L178q977j57259n6082j94694n927L7923J33695P5895l02788
1739c47180J15950m8085l06349K77104L9908L5840j23208O2805k13323J49755
$$ plain form
1729 -356783 -390769 -343064 -422010 -297292 -418693 -251045 -460556 -464031 -363425 -438190 -392634
1718 -392634 -433933 -371501 -86021 -289700 -548557 -394725 -314325 -78764 -295867 -525881
1708 -525881 -316110 -220786 -390160 -275899 -431479 -262467 -28417 -348792 -254651 -317110
1698 -317110 -38470 162412 40950 -258659 -371794 -477504 -502854 -484762 -198996 -180156
1688 -180156 -298715 -306443 -430187 -100304 -320520 -325341 -458948 -426099 -367414 -90505 172226
1677 172226 359626 183855 -146545 -184155 -149787 -169549 -198029 -438603 -138427 -287164
1667 -287164 -165566 -67588 -218949 -24679 -230613 -582168 -538029 -715782 -596466 -402586
1657 -402586 -245955 -180960 -162667 30326 -366638 -410329 -284327 -360119 -327386 -412944 -291212
$$ packed form
1729c56783l3986M7705p8946J24718j21401J67648k09511l475J00606p4765M5556
1718c92634m1299O2432K85480k03679k58857J53832Q0400K35561k17103k30014
1708e25881K09771R5324j69374J14261j55580J69012K34050l20375R4141o2459
1698c17110K78640K00882j21462k99609j13135j05710k5350J8092K85766J8840
1688a80156j18559p728j23744L29883k20216m821j33607L2849N8685K76909K62731
1677A72226J87400j75771l30400l7610L4368j9762k8480k40574L00176j48737
1667b87164J21598R7978j51361J94270k05934l51555M4139j77753J19316J93880
1657d02586J56631O4995J8293J92993l96964m3691J26002p5792L2733q5558J21732
$$ plain form
1646 -291212 -369677 -337089 -98850 -45113 78155 353790 220349 107721 155462 81016 -18896
1635 -18896 24841 200988 1669 -138207 -471069 -587796 -451880 -259481 -173921 -267865
1625 -267865 -514251 -246788 -9320 -3964 -287822 -31466 32092 36420 130715 143944 -187782
1614 -187782 -48595 245868 31770 -196841 -244200 -226011 -309724 -341169 -154537 68117
1604 68117 63655 195030 -87490 -324503 -258968 -424632 -418256 -84033 -233798 -429598 -419690
1593 -419690 -335857 -415510 -436774 -380171 -423625 -483869 -330123 -211210 -287254 -162298 -238114
1582 -238114 -37069 -50108 -243906 -114911 114832 -18209 -256961 -311821 -175368 -92863
1572 -92863 -125821 -82842 -98699 -263228 -430742 -117519 254269 268191 -3341 -14290 -107861
$$ packed form
1646b91212p8465L2588K38239N3737J23268K75635j33441j12628M7741p4446r9912
1635a8896M3737J76147j99319j39876l32862j16727J35916J92399Q5560r3944
1625b67865k46386K67463K37468N356k83858K56356O3558M328R4295J3229l31726
1614a87782J39187K94463k14098k28611m7359J8189q3713l1445J86632K22654
1604F8117m462J31375k82520k37013O5535j65664O376L34223j49765j95800R908
1593d19690Q3833p9653k1264N6603m3454o0244J53746J18913p6044J24956p5816
1582b38114K01045j3039j93798J28995K29743j33041k38752n4860J36453Q2505
1572i2863l2958M2979j5857j64529j67514L13223L71788J3922k71532j0949r3571
$$ plain form
1561 -107861 -139651 -172158 -231833 -131088 -127368 -334187 -151304 -124345 -307595 -322453 -168354
1550 -168354 17136 -6792 -287531 -449425 -141629 -172155 14056 -133303 -375269 -229210
1540 -229210 -22377 -267038 -458468 -126386 -39468 -129256 -129757 -99754 -144316 -133471 -7930
1529 -7930 -122475 -244886 -168424 -155840 -183849 -454024 -339584 -158443 -97308 190928 331847
1518 331847 47157 71297 -84112 -311314 -226883 -170945 5405 -18822 -157457 77075
1508 77075 137279 -52958 -21512 57114 152467 32415 -274036 4240 95608 85275 50598
1497 50598 168395 -38211 -96948 -56365 329797 382147 280506 111975 34854 73797 -136420
1486 -136420 -211331 29839 167458 99882 129642 163761 104957 4385 -125576 -132266 -22218
$$ packed form
1561a07861l1790l2507n9675J00745L720k06819J82883K6959j83250j4858J54099
1550a68354J85490k3928k80739j61894L07796l0526J86211j47359k41966J46059
1540b29210K06833k44661j91430L32082Q6918q9788n01L0003m4562J0845J25541
1529g930j14545j22411P6462J2584k8009k70175J14440J81141O1135K88236J40919
1518C31847k84690K4140j55409k27202Q4431N5938J76350k4227j38635K34532
1508G7075O0204j90237L1446P8626R5353j20052l06451K78276R1368j0333l4677
1497E0598J17797k06606n8737M0583L86162N2350j01641j68531p7121L8943k10217
1486a36420p4911K41170J37619o7576K9760L4119n8804j00572j29961o690J10048
$$ plain form
1475 -22218 -91940 -57002 -82721 -236360 -122366 83117 88558 45530 167508 166265 -42383
1464 -42383 -65019 -253789 -241045 -178109 -137308 -41979 -3258 37785 120763 20829 11612 159963
1452 159963 -89308 -84255 113973 48007 -25179 27726 324191 47851 -121088 10779 -101266
1441 -101266 -36285 40422 -223118 -334762 -316169 7903 -133762 -8032 18761 104271 148033
1430 148033 282709 162340 339581 27700 -143350 -111739 155764 -39759 12818 -24539
1420 -24539 101019 121306 4362 -105287 -109926 82 -2627 29090 -61213 -16946 -31337
1409 -31337 267208 248015 196833 153676 187378 210867 75052 12825 63812 62669 68048 -85373
1397 -85373 -20776 -91142 227795 413337 142416 19063 214675 91918 265057 306398
$$ packed form
1475b2218o9722L4938k5719j53639J13994K05483N441m3028J21978j243k08648
1464d2383k2636j88770J2744O2936M0801R5329L8721M1043Q2978r9934r217J48351
1452A59963k49271N053J98228o5966p3186N2905K96465k76340j68939J31867j12045
1441a01266O4981P6707k63540j11644J8593L24072j41665J25730K6793Q5510M3762
1430A48033J34676j20369J77241l11881j71050L1611K67503j95523N2577l7357
1420b4539J25558K0287j16944j09649m639J10008k709L1717r0303M4267j4391
1409c1337K98545j9193n1182m3157L3702K3489j35815o2227N0987j143N379j53421
1397h5373O4597p0366L18937J85542k70921j23353J95612j22757J73139M1341
$$ plain form
1387 306398 354781 441103 208091 -190563 -150003 -30551 -103890 -306976 -292678 -303422 -153254
1376 -153254 159730 129678 43156 230411 57792 -274220 -298511 -268845 -144888 164018
1366 164018 159370 8908 112668 -96652 -49961 187864 374341 209050 307077 15528
1356 15528 -145717 246145 38135 97470 94350 -158656 -41342 -83371 -15874 47059 8152
1345 8152 82201 73428 -10514 38984 419490 354577 290077 -34130 159365 167035 261355 184245
1333 184245 68065 210578 52333 -93444 -43552 100044 379530 57330 -68715 -212003
1323 -212003 91341 267532 229687 100912 -18711 -12090 143191 71224 -99778 47143
1313 47143 -227829 -17115 91076 185452 105075 -166049 -78796 -73948 -5717 171252 107933
$$ packed form
1387C06398M8383Q6322k33012l98654M0560J19452p3339k03086J4298j0744J50168
1376a53254L12984l0052q6522J87255j72619l32012k4291K9666J23957L08906
1366A64018m648j50462J03760k09320M6691K37825J86477j65291R8027k91549
1356A5528j61245L91862k08010N9335l120k53006J17314m2029O7497O2933l8907
1345H152P4049q773q3942M9498L80506o4913o4500l24207J93495P670R4320p7110
1333A84245j16180J42513j58245j45777M9892J43596K79486l22200j26045j43288
1323b12003L03344J76191l7845j28775j19623O621J55281p1967j71002J46921
1313D7143k74972K10714J08191R4376q0377k71124Q7253M848O8231J76969o3319
$$ plain form
1302 107933 76213 -22962 20712 -89610 -259716 -199677 45534 408776 184131 -17104
1292 -17104 204552 273027 164277 221513 313201 177987 122601 -34613 168183 91263 240888
1281 240888 331371 301598 209904 236900 164370 290912 89425 -259431 -156359 -77237 -195456
1270 -195456 -252152 -189764 4418 210968 144522 -101880 151903 150272 162547 28873 -37680
1259 -37680 -20376 123335 89083 -40597 54295 212273 174924 169080 110830 20452 99348
1248 99348 45507 137945 56939 191125 132208 25165 -76256 -275743 -171980 146099 91796
1237 91796 240913 241949 263078 118671 105044 -104242 -242954 -137718 43059 85276 -93014
1226 -93014 4479 267360 -27050 -91289 184414 48061 2344 9912 -148326 -18614 205151
$$ packed form
1302A07933l1720r9175M3674j10322j70106O0039K45211L63242k24645k01235
1292a7104K21656O8475j08750N7236R1688j35214n5386j57214K02796p6920J49625
1281B40888R0483k9773r1694K6996p2530J26542k01487l48856J03072P9122j18219
1270a95456n6696O2388J94182K06550o6446k46402K53783j631J2275j33674o6553
1259c7680J7304J43711l4252j29680R4892J57978l7349n844n8250r0378P8896
1248I9348n3841R2438q1006J34186n8917j07043j01421j99487J03763L18079n4303
1237I1796J49117J036K1129j44407j3627k09286j38712J05236J80777M2217j78290
1226i3014R7493K62881k94410o4239K75703j36353m5717P568j58238J29712K23765
$$ plain form
1215 205151 257119 284269 116957 167597 188981 305828 338943 282825 412245 245438 142017
1204 142017 215811 203366 18994 -141666 114866 80403 135197 47126 17971 20088 257919
1193 257919 173119 97873 141450 16572 -126303 -196451 -19122 212570 138171 150900 326728
1182 326728 362552 462618 205536 -94725 152006 10278 -21220 237045 128195 116237
1172 116237 80345 -17910 22068 -2293 109341 161482 96854 249267 139369 -133713 -24176
1161 -24176 123626 311768 84890 -77354 22136 -37903 -9418 160510 97282 88803 4764
1150 4764 72128 265515 225474 288034 282016 325554 141667 303463 203013 263030 202120
1139 202120 203950 213817 249399 -101835 -47463 -93566 -33419 14572 242805 223385 214183 51134
$$ packed form
1215B05151N1968K7150j67312N0640K1384J16847L3115n6118J29420j66807j03421
1204A42017P3794j2445j84372j60660K56532l4463N4794q8071k9155K117K37831
1193B57919q4800p5246M3577j24878j42875p0148J77329K31692p4399J2729J75828
1182C26728L5824J00066k57082l00261K46731j41728l1498K58265j08850j1958
1172A16237l5892r8255L9978k4361J11634N2141o4628J52413j09898k73082J09537
1161b4176J47802J88142k26878j62244R9490o0039K8485J69928o3228q479q4039
1150D764O7364J93387m0041O2560o018M3538j83887J61796j00450O0017o0910
1139B02120J830R867L5582l51234N4372m6103O0147M7991K28233j9420r202j63049
$$ plain form
1127 51134 -75572 -108471 72841 297167 124400 364024 239172 93438 -185681 -355688
1117 -355688 -250408 -375388 -90723 101906 93252 219848 58690 18653 -63753 -29960 -6088
1106 -6088 202605 67814 33369 108001 9096 120401 227040 200786 221506 172896 285329
1095 285329 101348 147705 220390 -31266 -43309 36161 -40670 -111336 16435 169084 60282
1084 60282 -43216 -63850 -71334 51499 -107711 42785 388941 380986 387181 301142 145196
1073 145196 353305 390751 425874 235310 278978 157680 437167 437870 362966 458036 104544
1062 104544 108023 400667 249772 93735 -93735 -161349 -24219 78761 13704 12806 141340
1051 141340 -82006 -162928 -35298 139475 -2631 133790 315242 204169 -141901 -5471
$$ packed form
1127E1134j26706l2899J81312K24326j72767K39624j24852j45734k79119j70007
1117c55688J05280j24980K84665J92629q654J26596j61158m0037q2406L3793K3872
1106f088K08693j34791l4445P4632r8905J11305J06639k6254K0720m8610J12433
1095B85329j83981M6357P2685k51656j2043P9470p6831p0666J27771J52649j08802
1084F0282j03498k0634p484J22833j59210J50496L46156p955O195q6039j55946
1073A45196K08109L7446L5123j90564M3668j21298K79487P03p4904R5070l53492
1062A04544L479K92644j50895j56037j87470o7614J37130J02980o5057q98J28534
1051A41340k23346q0922J27630J74773j42106J36421J81452j11073l46070J36430
$$ plain form
1041 -5471 72289 27983 99200 328654 170263 50960 33917 84018 372400 223893 299917
1030 299917 64110 22383 328095 390607 148487 8968 240190 278169 -92250 -199388
1020 -199388 352519 429386 399000 160299 -4893 -48054 44318 149809 252409 217564 221560
1009 221560 101726 335580 225665 343304 28234 -256012 108209 320324 195346 186364
999 186364 184379 127927 205548 241694 83576 -9741 212888 225900 386980 573385 485694
988 485694 331976 190219 176614 292348 348473 180330 253260 166141 -103363 289529 276671
977 276671 54396 82934 -27237 -130212 47704 236022 18953 36891 94780 -62543
967 -62543 254407 314365 360203 -69292 23202 91632 59713 103438 -282069 -23656 101582
$$ packed form
1041e471P7760m4306P1217K29454j58391j19303j7043N0101K88382j48507P6024
1030B99917k35807m1727L05712O2512k42120j39519K31222L7979l70419j07138
1020a99388N51907P6867l0386k38701j65192m3161R2372J05491J02600l4845L996
1009B21560j19834K33854j09915J17639l15070k84246L64221K12115j24978q982
999A86364j985n6452P7621L6146j58118r3317K22629J3012J61080J86405q7691
988D85694j53718j41757j3605J15734N6125j68143P2930q7119k69504L92892j2858
977B76671k22275K8538j10171j02975J77916J88318k17069J7938N7889j57323
967f2543L16950N9958M5838m29495R2494O8430l1919M3725l85507K58413J25238
$$ plain form
956 101582 -33594 123966 108318 -95532 -202511 -65152 26508 221819 222462 240102 360178
945 360178 165440 86211 205021 84046 -32437 -59131 284647 331900 351333 338085 50410
934 50410 159009 -5508 60321 217814 -32330 199600 283641 127523 221260 213326 -28776
923 -28776 -74477 21935 191917 204259 -86528 -347995 -177805 324475 441824 168036 68228
912 68228 -237898 -248743 8335 50957 131268 -63365 152628 60940 159063 250141 16705
901 16705 142110 -144681 -46398 -160360 -47385 143248 -91969 -33101 -74055 -83179 -29371
890 -29371 -11941 200250 346901 274097 192934 126850 11685 700 84100 30476 121114
879 121114 -15563 -178273 -306183 -57315 334203 199754 97458 61435 95204 -122575
$$ packed form
956A01582j35176J57560j5648k03850j06979J37359R1660J95311O43J7640J20076
945C60178j94738p9229J18810j20975j16483k6694L43778M7253J9433j3248k87675
934E0410J08599j64517O5829J57493k50144K31930Q4041j56118R3737p934k42102
923b8776m5701R6412J69982J2342k90787k61467J70190N02280J17349k73788r9808
912F8228l06126j0845K57078M2622Q0311j94633K15993r1688R8123R1078k33436
901A6705J25405k86791R8283j13962J12975J90633k35217N8868m0954r124N3808
890b9371J7430K12191J46651p2804q1163o6084j15165j0985Q3400n3624R0638
879A21114j36677j62710j27910K48868L91518j34449j02296l6023L3769k17779
$$ plain form
869 -122575 -70003 167825 167853 91582 -50035 -65519 266932 186496 202175 -178575 -131739 255292
857 255292 135958 318287 99053 -11935 25088 338160 297558 42870 57202 489009
847 489009 283480 297309 128262 195229 -133293 -134005 165377 108780 -79041 -24368 116691
836 116691 62298 -18868 -14828 62629 -128069 -158018 239316 549440 115007 117383 11892
825 11892 -143781 -20945 261949 65303 41430 -9707 46717 83078 27017 23028 202396
814 202396 -19036 208079 385623 165652 -127743 -154367 40961 156487 146307 116932
804 116932 14755 -180958 2369 79341 129265 156204 -272 7873 162504 132604 110629
793 110629 92041 -32393 60177 287806 207197 213849 214950 382217 327197 413211 274001
$$ packed form
869a22575N2572K37828K8p6271j41617j5484L32451q0436J5679l80750M6836L87031
857B55292j19334J82329k19234j10988L7023L13072m0602k54688J4332M31807
847D89009k05529J3829j69047O6967l28522p12K99382n6597j87821N4673J41059
836A16691n4393q1166M040P7457j90698k9949L97334L10124m34433K376j05491
825A1892j55673J22836K82894j96646k3873n1137N6424L6361n6061l989J79368
814B02396k21432K27115J77544k19971k93395k6624J95328J15526j0180k9375
804A16932j02177j95713J83327P6972M9924K6939j56476Q145J54631k9900k1975
793A10629j8588j24434R2570K27629q0609O652J101J67267n5020Q6014j39210
$$ plain form
782 274001 272919 445642 151172 104162 185409 278317 512893 345907 170204 206685 307554
771 307554 410925 156796 -162450 35373 83382 127933 93499 134124 -46007 106704 115586
760 115586 -41775 141798 6402 -175713 16345 139555 120992 268610 -263146 -66973
750 -66973 188416 -33138 128433 473502 338744 77381 27116 154545 136165 -58707
740 -58707 -54800 -85090 62408 99965 41972 -147527 -197239 30582 25332 70615 267412 135329
728 135329 11422 -35688 -54933 -47806 50273 252893 342459 260973 212741 196042 7951
717 7951 128578 234354 172493 340511 503146 204056 142113 214171 4345 210355 163424
706 163424 -22655 -47716 56719 174373 417314 442700 141211 262586 -91412 -205030
$$ packed form
782B74001j082J72723k94470m7010Q1247R2908K34576j66986j75703L6481J00869
771C07554J03371k54129l19246J97823M8009M4551l4434M0625j80131J52711Q882
760A15586j57361J83573j35396j82115J92058J23210j8563J47618n31756J96173
750f6973K55389k21554J61571L45069j34758k61363n0265J27429j8380j94872
740e8707L907l0290J47498L7557n7993j89499m9712K27821n250M5283J96797j32083
728A35329j23907m7110j9245P127R8079K02620Q9566q1486m8232j6699j88091
717G951J20627J05776o1861J68018J62635k99090o1943P2058k09826K06010m6931
706A63424j86079k5061J04435J17654K42941K5386l01489J21375l53998j13618
$$ plain form
696 -205030 -61326 75696 323418 65838 163710 176717 293138 314844 195473 15307
686 15307 42599 -66604 194798 261846 192513 378909 336683 196920 -69860 -102587 -181952
675 -181952 -58253 -10956 94045 147635 314953 132282 150043 44485 -205096 71989
665 71989 56674 207254 431261 365836 121819 27495 159712 176108 14895 52949 404829
654 404829 292692 245609 68422 15121 80055 96450 -96999 -106746 -61657 64717 29862
643 29862 -106678 -7453 16010 212623 360109 64495 -209435 -68401 88084 -59158
633 -59158 -82540 -61867 -66179 -184539 -228482 -223847 -6951 71388 110782 309594 257869 144216
621 144216 292852 238138 225923 220792 382306 510701 153354 201918 206131 189144 69259
$$ packed form
696b05030J43704J37022K47722k57580R7872J3007J16421K1706j19371j80166
686A5307K7292j09203K61402O7048o9333J86396m2226j39763k66780l2727p9365
675a81952J23699M7297J05001N3590J67318j82671J7761j05558k49581K77085
665G1989j5315J50580K24007o5425k44017r4324J32217J6396j61213L8054L51880
654D04829j12137m7083j77187n3301O4934J6395j93449r747M5089J26374l4855
643B9862j36540R9225K3463J96613J47486k95614k73930J41034J56485j47242
633e9158k3382K0673m312j18360m3943M635K16896P8339L9394J98812n1725j13653
621A44216J48636n4714j2215n131J61514J28395l57347M8564M213j6987j19885
$$ plain form
610 69259 247405 506877 348590 376643 480780 535988 287150 7847 132822 122717 -9373
599 -9373 143849 247115 509432 351894 140809 82382 80253 140190 47089 -33598 111233
588 111233 347976 214699 12352 44252 250815 213718 128229 -23834 -160659 -6640
578 -6640 176876 50680 85437 6267 -2506 51723 74746 289073 291288 265943 411600 220103
566 220103 83161 146224 244345 66459 -99569 -77761 -53820 56696 -29788 -60326 86571
555 86571 91706 155415 291438 476183 184245 156566 79421 11858 15705 27938 -52844 96608
543 96608 -66085 146200 143753 69867 70201 -27212 123106 108636 241987 101749 261372
532 261372 286682 -102860 -137897 59939 173168 355804 217529 -242770 -134861 -126606 -141075
$$ packed form
610F9259J78146K59472j58287K8053J04137N5208k48838k79303J24975j0105j32090
599i373J53222J03266K62317j57538k11085n8427k129N9937r3101q0687J44831
588A11233K36743j33277k02347L1900K06563l7097q5489j52063j36825J54019
578f640J83516j26196L4757p9170q773N4229K3023K14327K215k5345J45657j91497
566B20103j36942O3063R8121j77886j66028K1808K3941J10516q6484l0538J46897
555H6571N135O3709J36023J84745k91938k7679p7145o7563L847J2233q0782J49452
543I6608j62693K12285k447p3886L34r7413J50318j4470J33351j40238J59623
532B61372K5310l89542l5037J97836J13229J82636j38275m60299J07909Q255j4469
$$ plain form
521 -141075 -146848 27253 226976 60694 -151507 -149738 107559 208715 33317 152961 233600
510 233600 271119 194079 94161 -55031 37599 5221 -2264 187488 13548 -70550 -18596
499 -18596 251733 119516 172860 228549 -52943 80960 208682 -149155 71224 897 -141054
488 -141054 43612 72694 203615 198874 109420 112404 249827 214631 8368 120707 182438
477 182438 202784 -15769 2449 -28990 -58775 -77387 60500 177747 18225 81251 224941
466 224941 290380 80473 14414 28752 -280753 -343362 -208244 -78023 -216253 105219 76663
455 76663 343456 136630 -271259 -223393 74205 197251 143962 185282 384041 559559 256388
444 256388 110196 264794 348892 324870 521301 340695 -125199 23394 119866 111014 231661
$$ packed form
521a41075n773J74101J99723j66282k12201J769K57297J01156j75398J19644Q0639
510B33600L7519p7040r9918j49192R2630l2378p485J89752j73940q4098N1954
499a8596K70329j32217N3344N5689k81492J33903J27722l57837K20379p0327j41951
488a41054J84666K9082J30921m741q9454K984J37423l5196k06263J12339O1731
477A82438K0346k18553J8218l1439k9785j8612J37887J17247j59522O3026J43690
466B24941O5439k09907o6059J4338l09505o2609J35118J30221j38230L21472k8556
455G6663K66793k06826m07889M7866K97598J23046n3289M1320J98759J75518l03171
444B56388j46192J54598Q4098k4022J96431j80606m65894J48593R6472q852J20647
$$ plain form
433 231661 247965 179742 145838 125007 285664 281497 255586 311433 252100 95226 -139938
422 -139938 -104121 -155133 137875 89461 -25996 119417 302099 277642 58241 297076 298863
411 298863 11823 -221912 112602 -200349 -234278 -110783 -77780 -6681 -12423 140135 94832
400 94832 223709 -13263 -66714 -336055 -323973 -305871 -26250 -193305 -1014 -138135 -41009
389 -41009 52997 70139 209346 -198213 -400936 -341959 -117525 356968 220660 143825 137390
378 137390 -216474 -244361 -195330 206509 -67125 -195677 -146103 -23378 266564 153461
368 153461 130331 266097 141403 -128830 -32982 -106613 -432202 -128987 -66765 -133762 107284
357 107284 -104962 -63605 -88054 -102321 -212076 -231301 -113672 135412 160207 231725 159868
$$ packed form
433B31661J6304o8223l3904k0831J60657m167k5911N5847n9333j56874k35164
422a39938L5817n1012K93008m8414j15457J45413J82682k4457k19401K38835J787
411B98863k87040k33735L34514l12951l3929J23495L3003P1099n742J52558m5303
400I4832J28877k36972n3451k69341J2082J8102K79621j67055J92291j37121R7126
389d1009R4006J7142J39207m07559k02723N8977K24434M74493j36308p6835o435
378A37390l53864k7887M9031M01839k73634j28552M9574J22725K89942j13103
368A53461k3130J35766j24694k70233R5848p3631l25589L03215O2222o6997K41046
357A07284k12246M1357k4449j4267j09755j9225J17629K49084K4795P1518p1857
$$ plain form
346 159868 -243325 -139633 -73234 -34567 245987 276243 99302 -193288 -215033 -99600 -183460
335 -183460 -188006 -85351 139260 -3125 9318 45352 266735 -21873 -266927 -8106 95681
324 95681 -47237 -60746 56625 -155506 -348291 -85692 41390 -267662 -22356 -80093
314 -80093 -95504 -164289 -160483 -148788 -88929 120114 -17816 -205542 -223007 -26521 -63631
303 -63631 -77645 111464 132074 -665 22068 -134109 -190402 -123610 -213934 34888 49590
292 49590 55887 -220307 -235531 -252646 -364131 -188436 -176932 -148426 -236160 -277705 -369326 -346744
280 -346744 67989 -132900 -311130 -292693 114234 279050 -57582 115998 44132 39749 170426
269 170426 597706 296487 160906 61423 -25991 -65360 88766 175270 106693 177932 34792
$$ packed form
346A59868m03193J03692O6399L8667K80554L0256j76941k92590k1745J15433q3860
335a83460m546J02655K24611j42385J2443L6034K21383k88608k45054K58821J03787
324I5681j42918j3509J17371k12131j92785K62599J27082l09052K45306n7737
314h0093j5411o8785L806J1695N9859K09043j37930j87726j7465J96486l7110
303f3631j4014J89109K0610j32739K2733j56177n6293O6792r0324K48822J4702
292D9590O297k76194j5224j7115j11485J75695J1504K8506q7734m1545r1621K2582
280c46744M14733k00889j78230J8437M06927J64816l36632J73580p1866m383J30677
269A70426M27280l01219j35581r9483q7414l9369J54126Q6504o8577P1239j43140
$$ plain form
258 34792 -64683 -238892 -287226 -354327 -86454 -57653 -176807 -157303 -271554 -122786 -213697
247 -213697 -192956 -184002 -18014 -65840 -32807 141526 53109 160999 144526 -298067 -392810
236 -392810 -94642 -31118 88612 61161 85500 29717 94377 45522 -82058 198882 -5618
225 -5618 -170335 -306860 -72022 65935 207965 -64770 -88267 -143195 210370 327022 144844
214 144844 -60159 -219928 -178978 -49716 -89802 18458 16169 -86687 -86342 -406520 -120820
203 -120820 1284 211184 116531 -11005 -53342 -43081 -122345 8010 106388 272578 235388
192 235388 96899 35425 139102 -46170 -11810 -56999 -256396 -94218 -54823 -376344 -234460
181 -234460 -283861 -248851 -185149 -242705 -157126 -154279 -316316 -321515 -64385 -6137 -375603 -79217
$$ packed form
258C4792r9475j74209m8334o7101K67873K8801j19154J9504j14251J48768r0911
247b13697K0741Q954J65988m7826L3033J74333q8417J07890j6473m42593r4743
236c92810K98168O3524J19730k7451K4339n5783O4660m8855j27580K80940k04500
225e618j64717j36525K34838J37957J42030k72735k3497n4928L53565J16652j82178
214A44844k05003j59769M0950J29262m0086J08260k289j02856L45l20178K85700
203a20820J22104K09900r4653j27536m2337J0261p9264J30355R8378J66190l7190
192B35388j38489o1474J03677j85272L4360m5189j99397J62178L9395l21521J41884
181b34460m9401L5010O3702n7556Q5579K847j62037n199K57130N8248l69466K96386
$$ plain form
169 -79217 142248 -35733 -102682 50680 -62734 -199311 -224371 -153388 -12002 -414067 -222976
158 -222976 -120821 -85342 -233973 38794 -76077 -253150 -11367 -27082 82823 310588
148 310588 95376 -85600 -84755 -284827 -37378 169705 96159 -138780 -152449 -151414 -77968
137 -77968 -130050 -262858 -263179 -194190 -142024 -325138 -357916 -152582 11129 -108604 -135541
$$ packed form
169g9217K21465j77981o6949J53362j13414j36577k5060P0983J41386m02065J91091
158b22976J02155L5479j48631K72767j14871j77073K41783j5715J09905K27765
148C10588k15212j80976Q45k00072K47449K07083p3546k34939j3669J035P3446
137g7968n2082j32808l21O8989N2166j83114l2778K05334J63711j19733k6937
$$ [...]
##END NTUPLES=NMR SPECTRUM
##END=
