##TITLE=1H_DE-80H_X3
 200.13MHz, d2o
 8 sc
 
 19ns.26.2.2025
##JCAMPDX= 6.0         $$ Bruker NMR JCAMP-DX V2.0
##DATA TYPE= NMR SPECTRUM
##DATA CLASS= NTUPLES
##ORIGIN= UXNMR, Bruker Analytische Messtechnik GmbH
##OWNER= pz
$$ XWIN-NMR		Version 3.5
$$ Thu Jul 31 09:27:36 2025 Russian Standard Time (UT+4h)  Yarkov@DPX200
##.OBSERVE FREQUENCY= 200.1313
##.OBSERVE NUCLEUS= ^1H
##.ACQUISITION MODE= SIMULTANEOUS
##.ACQUISITION SCHEME= undefined
##.AVERAGES= 8
##.DIGITISER RES= 18
##SPECTROMETER/DATA SYSTEM= spect
##.PULSE SEQUENCE= zg30
##.SOLVENT NAME= CDCl3
##.SHIFT REFERENCE= (INTERNAL, CDCl3, 0, 15.488)
##AUDIT TRAIL= $$ (NUMBER, WHEN, WHO, WHERE, WHAT)
$$ ##TITLE= Audit trail, XWIN-NMR		Version 3.5
$$ ##JCAMPDX= 5.01
$$ ##ORIGIN= Bruker BioSpin GmbH
$$ ##OWNER= Yarkov
$$ C:/Bruker/XWIN-NMR/data/yarkov2/nmr/H-C/1/pdata/1/auditp.txt
$$ ##AUDIT TRAIL=  $$ (NUMBER, WHEN, WHO, WHERE, WHAT)
(   1,<2025-07-31 09:26:43.53 +0400>,<Yarkov>,<DPX200>,
      <created by zg, POWCHK disabled, PULCHK disabled
       configuration hash MD5:
       00 E9 B6 7A A2 85 ED C7 34 08 36 98 17 FE 4E 26
       data hash MD5: 16K
       4D 16 C2 0E 1C EB 28 95 6E 46 B7 DE D8 90 FB E0>)
(   2,<2025-07-31 09:26:53.04 +0400>,<Yarkov>,<DPX200>,
      <Start of raw data processing
       efp BC_mod = 2 LB = 0.25 FT_mod = 6 PKNL = 1 PHC0 = -1348.879 PHC1 = -1.809091 SI = 16K 
       data hash MD5: 16K
       63 48 41 87 79 BF 6B 88 A4 14 CA A6 C3 13 AD 99>)
(   3,<2025-07-31 09:26:58.01 +0400>,<Yarkov>,<DPX200>,
      <abs ABSG = 5 
       data hash MD5: 16K
       99 1A 0D 8C 66 26 3E C8 49 B9 F2 02 CE 51 AF 84>)
$$ ##END=
$$ 
$$ hash MD5
$$ DA E5 A2 EB 3D E2 0E A4 A0 66 AF D5 BC 8B 09 EA
##$RELAX= 
##$RELAX= 
##$RELAX= 
##$RELAX= 
##$RELAX= 
##$RELAX= 
$$ Bruker specific parameters
$$ --------------------------
##$DU= <C:/Bruker/XWIN-NMR>
##$EXPNO= 1
##$NAME= <H-C>
##$PROCNO= 1
##$TYPE= <nmr>
##$USER= <yarkov2>
##$AMP= (0..31)
100 100 100 100 100 100 100 100 100 100 100 100 100 100 100 100 100 100 
100 100 100 100 100 100 100 100 100 100 100 100 100 100 
##$AQSEQ= 0
##$AQ_mod= 1
##$AUNM= <au_zg>
##$AUTOPOS= <>
##$BF1= 200.13
##$BF2= 200.13
##$BF3= 200.13
##$BF4= 200.13
##$BF5= 200.13
##$BF6= 200.13
##$BF7= 200.13
##$BF8= 200.13
##$BYTORDA= 1
##$CFDGTYP= 0
##$CFRGTYP= 5
##$CHEMSTR= <none>
##$CNST= (0..31)
1 1 145 1 1 1 1 1 1 1 1 1 1 1 1 1 1 1 1 1 1 1 1 1 1 1 1 1 1 1 1 1 
##$CPDPRG= <>
##$CPDPRG1= <>
##$CPDPRG2= <>
##$CPDPRG3= <>
##$CPDPRG4= <mlev>
##$CPDPRG5= <mlev>
##$CPDPRG6= <mlev>
##$CPDPRG7= <mlev>
##$CPDPRG8= <mlev>
##$CPDPRGB= <>
##$CPDPRGT= <>
##$D= (0..31)
0 0.7 0 0 0 0 0 0 0 0 0 0.03 0 0 0 0 0 0 0 0 0 0 0 0 0 0 0 0 0 0 0 0 
##$DATE= 1753939602
##$DBL= (0..7)
120 120 120 120 120 120 120 120 
##$DBP= (0..7)
150 150 150 150 150 150 150 150 
##$DBP07= 0
##$DBPNAM0= <>
##$DBPNAM1= <>
##$DBPNAM2= <>
##$DBPNAM3= <>
##$DBPNAM4= <>
##$DBPNAM5= <>
##$DBPNAM6= <>
##$DBPNAM7= <>
##$DBPOAL= (0..7)
0.5 0.5 0.5 0.5 0.5 0.5 0.5 0.5 
##$DBPOFFS= (0..7)
0 0 0 0 0 0 0 0 
##$DE= 6
$$ [...]
##$SUBNAM3= <"">
##$SUBNAM4= <"">
##$SUBNAM5= <"">
##$SUBNAM6= <"">
##$SUBNAM7= <"">
##$SUBNAM8= <"">
##$SUBNAM9= <"">
##$SW= 18.0517328524113
##$SWIBOX= (0..15)
0 0 2 0 0 0 0 0 0 0 0 0 0 0 0 0 
##$SW_h= 3612.71676300578
##$TD= 16384
##$TD0= 1
##$TE= 0
##$TE2= 300
##$TE3= 300
##$TEG= 300
##$TL= (0..7)
0 120 120 120 120 120 120 120 
##$TP= (0..7)
150 150 150 150 150 150 150 150 
##$TP07= 0
##$TPNAME0= <>
##$TPNAME1= <>
##$TPNAME2= <>
##$TPNAME3= <>
##$TPNAME4= <>
##$TPNAME5= <>
##$TPNAME6= <>
##$TPNAME7= <>
##$TPOAL= (0..7)
0.5 0.5 0.5 0.5 0.5 0.5 0.5 0.5 
##$TPOFFS= (0..7)
0 0 0 0 0 0 0 0 
##$TUNHIN= 0
##$TUNHOUT= 0
##$TUNXOUT= 0
##$USERA1= <user>
##$USERA2= <user>
##$USERA3= <user>
##$USERA4= <user>
##$USERA5= <user>
##$V9= 5
##$VALIST= <valist>
##$VCLIST= <CCCCCCCCCCCCCCC>
##$VD= 0
##$VDLIST= <DDDDDDDDDDDDDDD>
##$VPLIST= <PPPPPPPPPPPPPPP>
##$VTLIST= <TTTTTTTTTTTTTTT>
##$WBST= 1024
##$WBSW= 4
##$XGAIN= (0..3)
0 0 0 0 
##$XL= 0
##$YL= 0
##$YMAX_a= 92876
##$YMIN_a= -98716
##$ZGOPTNS= <>
##$ZL1= 120
##$ZL2= 120
##$ZL3= 120
##$ZL4= 120
##$ABSF1= 15.48796
##$ABSF2= -2.56389
##$ABSG= 5
##$ABSL= 3
##$ALPHA= 0
##$AQORDER= 0
##$ASSFAC= 0
##$ASSFACI= 0
##$ASSFACX= 0
##$ASSWID= 0
##$AUNMP= <proc_1d>
##$AZFE= 0.1
##$AZFW= 0.1
##$BCFW= 0
##$BC_mod= 2
##$BYTORDP= 0
##$COROFFS= 0
##$CY= -3
##$DATMOD= 1
##$DC= 0
##$DFILT= <>
##$DTYPP= 0
##$F1P= 0
##$F2P= 0
##$FCOR= 1
##$FTSIZE= 16384
##$FT_mod= 6
##$GAMMA= 0
##$GB= 0
##$INTBC= 1
##$INTSCL= 3.241238e-09
##$ISEN= 128
##$LB= 0.25
##$LEV0= 0
##$LPBIN= 0
##$MAXI= 10000
##$MC2= 0
##$MEAN= 0
##$ME_mod= 0
##$MI= 1.114404
##$NCOEF= 0
##$NC_proc= -8
##$NLEV= 6
##$NOISF1= 3.799351
##$NOISF2= 2.8
##$NSP= 0
##$NTH_PI= 0
##$NZP= 0
##$OFFSET= 15.48796
##$PC= 1
##$PHC0= -1348.879
##$PHC1= -1.809091
##$PH_mod= 1
##$PKNL= yes
##$PPARMOD= 0
##$PSCAL= 0
##$PSIGN= 0
##$REVERSE= no
##$SF= 200.130006751936
##$SI= 16384
##$SIGF1= 3
##$SIGF2= 2
##$SINO= 0.751879
##$SIOLD= 32768
##$SREGLST= <19F.Aceton>
##$SSB= 0
##$STSI= 16384
##$STSR= 0
##$SW_p= 3612.71676300578
##$SYMM= 0
##$S_DEV= 0
##$TDeff= 16384
##$TDoff= 0
##$TI= <>
##$TILT= no
##$TM1= 0
##$TM2= 0
##$TOPLEV= 0
##$USERP1= <user>
##$USERP2= <user>
##$USERP3= <user>
##$USERP4= <user>
##$USERP5= <user>
##$WDW= 1
##$XDIM= 16384
##$YMAX_p= 340454134
##$YMIN_p= -1344986
$$ End of Bruker specific parameters
$$ ---------------------------------
##NTUPLES= NMR SPECTRUM
##VAR_NAME=  FREQUENCY,     SPECTRUM/REAL,   SPECTRUM/IMAG
##SYMBOL=    X,             R,               I
##VAR_TYPE=  INDEPENDENT,   DEPENDENT,       DEPENDENT
##VAR_FORM=  AFFN,          ASDF,            ASDF
##VAR_DIM=   16384,         16384,           16384
##UNITS=     HZ,            ARBITRARY UNITS, ARBITRARY UNITS
##FACTOR=    0.220516191357247, 1,           1
##FIRST=     3099.60551170682, 0,            0
##LAST=      -513.111251298964, 0,           0
##MIN=       -513.111251298964, -1344986,    0
##MAX=       3099.60551170682, 340454134,    0
$$ Real data points
##PAGE= N=1
##DATA TABLE= (X++(R..R)), XYDATA
$$ [...]
5973A099382O2033k13035M1106l0275l96957J54468n8912K66996K62055J40096
$$ 1099382 1161415 948380 989486 959211 562254 716722 657810 924806 1186861 1326957
5963A326957j37805J050Q2059J16203k25377j16394L10155M1421k9343j52264
$$ 1326957 1189152 1190202 1272261 1388464 1163087 1046693 1356848 1398269 1368926 1216662
5953A216662j79101J41490k09052l8805k566P7339n5867j17172j26903K63885
$$ 1216662 1037561 1179051 969999 931194 928628 1005967 950100 832928 706025 969910
5943I69910J79477k80385J68054J8955l7830J60522k36775o177n9802L1154p5114
$$ 969910 1149387 869002 1037056 1056011 1018181 1178703 941928 935751 875949 907103 831989
5932H31989L5551J14786j6662j01631k2415J72817j1214k77074j62118K97971
$$ 831989 867540 982326 965664 864033 841618 1014435 1003221 726147 564029 862000
5922H62000L6934j07187J08977K6135j23147j21690J96933o5666j7292k27879
$$ 862000 898934 791747 900724 926859 803712 682022 878955 813289 795997 568118
5912E68118J03796j42391l34748l1029J05407K04337R9974O0601r0648r0876K20338
$$ 568118 671914 529523 194775 163746 269153 473490 573464 634065 543417 452541 672879
5901F72879m1080j27036J38504l8734j2012j50467p8498N6812K07314J32537j6002
$$ 672879 631799 504763 643267 604533 592521 442054 363556 420368 627682 760219 744217
5890G44217o9413l9180m15819K11327o311j63512N1660K98064j2613K3566J2676
$$ 744217 674804 635624 219805 431132 424821 261309 312969 611033 598420 621986 634662
5879F34662J13736k67822k0708n2538p102K08969J94241K577J4544O3065r2588
$$ 634662 748398 480576 459868 407330 400228 609197 803438 806015 820559 883624 791036
5868G91036k64975P4005p8949q6400K42000j3843q9336J53540l57450p6381K22379
$$ 791036 526061 600066 521117 434717 676717 662874 573538 727078 369628 293247 515626
5857E15626n1137L74751j34836j87935R650k1279K06079J21969j66290j23379
$$ 515626 464489 839240 704404 516469 526119 504840 710919 832888 666598 543219
5847E43219j65792O6630O8811l2341K3140J84185J3572k55695N27274j12656n8758
$$ 543219 377427 444057 512868 480527 503667 687852 701424 445729 973003 860347 801589
5836H01589J23369l0925N639m36723q7816K10226K2704M7812J0234K7633j22616
$$ 801589 924958 894033 899672 462949 375133 585359 608063 655875 666109 693742 571126
5825E71126m4927L2753J43043N7922m9840k27698M4655j58635o402J62713K12739
$$ 571126 526199 558952 701995 759917 710077 482379 527034 368399 361997 524710 737449
5814G37449K53197j74327l00361J4164K47341m3008k19857k34491Q4099L24071
$$ 737449 990646 816319 515958 530122 777463 734455 514598 280107 364206 688277
5804F88277L02248q1422o1938K5250j87451r1939m0725m452j22587j02676N74127
$$ 688277 990525 909103 847165 872415 684964 593025 552300 547848 425261 322585 896712
5793H96712J39836l11315p2708K50142j85697J9450J12869J84172j656j12967
$$ 896712 1036548 725233 652525 902667 716970 736420 849289 1033461 1031805 918838
5783I18838j37326j74246J53586L9972q2586K16870l3257J0980L7345j85612o6784
$$ 918838 781512 607266 760852 800824 718238 935108 901851 912831 950176 764564 697780
5772F97780K11568k25760J73282j16927j5577k3909J05513K2902o6423r6286K56434
$$ 697780 909348 683588 856870 739943 724366 700457 805970 828872 762449 666163 922597
5761I22597j13115k28481R8740n031l6038k26105L11320K4350L8937l3407L78804
$$ 922597 809482 581001 679741 674710 638672 412567 723887 748237 787174 753767 1132571
5750A132571r1212j36159J25314n6698j52271K05404p0641k78461M40052j48234
$$ 1132571 1041359 905200 1030514 973816 821545 1026949 956308 677847 1117899 969665
5740I69665J6641j29142o10q4851j400J98611M4021m2319j56689p0873K64945
$$ 969665 986306 857164 856554 771703 770303 968914 1012935 970616 813927 743054 1007999
5729A007999J99679R3380O8963r0657k87038K08771l72786J10875O689k95795
$$ 1007999 1207678 1301058 1370021 1279364 992326 1201097 828311 939186 945875 650080
5719F50080L66335J62946j35787j15798P5042k35705O5215K42971J15622j48882
$$ 650080 1016415 1179361 1043574 927776 1002818 767113 832328 1075299 1190921 1042039
5709A042039Q785O8862k96809L9149K27424J53154r2347j11841n1940m6380N2804
$$ 1042039 1050824 1119686 822877 862026 1089450 1242604 1150257 1038416 986476 940096 992900
5698I92900j05623K67398j17873k40972Q974K10466m8265j0485J48373J57971
$$ 992900 887277 1154675 1036802 795830 804804 1015270 967005 956520 1104893 1262864
5688A262864M3075j82424j83670m6649k61874j05421L99087L69978n4025j19687
$$ 1262864 1305939 1123515 939845 893196 631322 525901 924988 1294966 1240941 1121254
5678A121254q1428L66143p7293K65418j51922l8870k83617j17309J84563k482
$$ 1121254 1039826 1405969 1328676 1594094 1442172 1403302 1119685 1002376 1186939 1184457
5668A184457p2921K50886K1821k15192J70955m4121j55952J98402K07685j76922
$$ 1184457 1111536 1362422 1384243 1169051 1340006 1295885 1139933 1338335 1546020 1369098
5658A369098m0500J65304m742k25744k890J98116k67722o4790J40093j00645R0779
$$ 1369098 1328598 1493902 1489160 1263416 1260526 1458642 1190920 1126130 1266223 1165578 1256357
5647A256357r9742o3075J2536m449Q6801L13765K00771q7846K26459J18252k30830
$$ 1256357 1156615 1093540 1106076 1101627 1188428 1502193 1702964 1615118 1841577 1959829 1728999
5636A728999k23543J20440K5555J36298p1727j82320J45996l317j33663P208O2855
$$ 1728999 1505456 1625896 1651451 1787749 1716022 1533702 1679698 1676381 1542718 1549926 1612781
5625A612781j76334k31426L2929L36160J58075J69781k80632j208j03220j40934
$$ 1612781 1436447 1205021 1237950 1574110 1732185 1901966 1621334 1620126 1516906 1375972
5615A375972K37264J24828j70158J55295K40952J58958k27502k05442J50291K40867
$$ 1375972 1613236 1738064 1567906 1723201 1964153 2123111 1895609 1690167 1840458 2081325
5605B081325J06479k13384j54899l9645J70970j30404j07882J27581J40175j98047
$$ 2081325 2187804 1974420 1819521 1779876 1950846 1820442 1712560 1840141 1980316 1782269
5595A782269J33338L31156N2226j33330k12546j21559J31168R4168J52005K36051
$$ 1782269 1915607 2246763 2298989 2165659 1953113 1831554 1962722 2056890 2208895 2444946
5585B444946j45575j11910l4599J40919j65938o8414J23753p4148J33853J6024
$$ 2444946 2299371 2187461 2152862 2293781 2127843 2059429 2183182 2109034 2242887 2258911
5575B258911j59577J16206j9160O2630J80009J71269Q8961n1846j04457j17507
$$ 2258911 2099334 2215540 2196380 2259010 2439019 2610288 2699249 2647403 2542946 2425439
5565B425439N3598n8188j12881j10140l75779J20882K55013Q483k10165k05208
$$ 2425439 2479037 2420849 2307968 2197828 1822049 1942931 2197944 2206427 1996262 1791054
5555A791054Q3051J10880K65988m8523K38828j45421j35144r7504M9267O27584
$$ 1791054 1874105 1984985 2250973 2202450 2441278 2295857 2160713 2063209 2112476 2740060
5545B740060k34665j91301k22102P4630L51666R3699k68070L6568k21921r4719
$$ 2740060 2505395 2314094 2091992 2166622 2518288 2611987 2343917 2380485 2158564 2063845
5535B063845J20548o4707r6673J60881j37261M9799K7700l0012q9717k1695L6101
$$ 2063845 2184393 2119686 2023013 2183894 2046633 2096432 2124132 2094120 2004403 1982708 2018809
5524B018809K25224L17858j29093k03342O8648O3010K59959k3104l00721K42559
$$ 2018809 2244033 2561891 2432798 2229456 2298104 2361114 2621073 2597969 2297248 2539807
5514B539807M3756n41436j14490K11683k72838r5791R7617J17512R9794K39985
$$ 2539807 2583563 2042127 1927637 2139320 1866482 1770691 1868308 1985820 2085614 2325599
5504B325599j84755l90515J72015J15595l60050J25780L30941j26754q124N3127
$$ 2325599 2140844 1750329 1922344 2037939 1677889 1803669 2134610 2007856 1999732 2052859
5494B052859j19741P7872K31944J74251N0034k45816k06049J36080Q8106j00902
$$ 2052859 1933118 2010990 2242934 2417185 2467219 2221403 2015354 2151434 2239540 2138638
5484B138638k30111J21697j24951k90641J74048n586K4969J32698l29687J70575
$$ 2138638 1908527 2030224 1905273 1614632 1788680 1783094 1808063 1940761 1611074 1781649
5474A781649j61858J92440K33016J20480R0779J03176J8028o3671p2213q5292
$$ 1781649 1619791 1812231 2045247 2165727 2256506 2359682 2377710 2314039 2241826 2156534
5464B156534P7355l7864J40659j20858M262p2730k34431M7387J27344j46003l8083
$$ 2156534 2233889 2196025 2336684 2215826 2220088 2147358 1912927 1960314 2087658 1941655 1903572
5453A903572K57491K40379j08319j95218K26328p0234L6472j70701m760Q5979
$$ 1903572 2161063 2401442 2293123 2097905 2324233 2253999 2290471 2119770 2115010 2200989
5443B200989K71397j34732l4911K40489o0193q7580m8498J72217J71872N5423
$$ 2200989 2472386 2337654 2302743 2543232 2483039 2395459 2346961 2519178 2691050 2746473
5433B746473k07600L33803L7769P166p0946l13751J39844p6075j26545k72730
$$ 2746473 2538873 2872676 2910445 2917611 2846665 2532914 2672758 2596683 2470138 2197408
5423B197408L3792K11093j07318j11475J07241J20544j26655j67061j83332J8344
$$ 2197408 2231200 2442293 2334975 2223500 2330741 2451285 2324630 2157569 1974237 1992581
5413A992581M15240J03850p4986k4147j82101O1517p2373j95682Q2963m2554j59819
$$ 1992581 2407821 2511671 2436685 2412538 2230437 2291954 2219581 2023899 2106862 2064308 1904489
5402A904489j26275J89587J38487P5863k62562l17159J05116K53754j42622N816
$$ 1904489 1778214 1967801 2106288 2182151 1919589 1602430 1707546 1961300 1818678 1824494
5392A824494J18308j40362r2573j53948j15178j92625L15867J75187Q7523k82346
$$ 1824494 1942802 1802440 1709867 1555919 1440741 1248116 1563983 1739170 1826693 1544347
5382A544347q4611J30993l0135K48565J9654j22811L4472q5397l20877K9328k3042
$$ 1544347 1459736 1590729 1560594 1809159 1828813 1706002 1740474 1655077 1334200 1363528 1340486
5371A340486j44795J02907q1850J50909m0192k8433j49061J77977J93798o3042
$$ 1340486 1195691 1298598 1216748 1367657 1327465 1299032 1149971 1327948 1521746 1458704
5361A458704R1843K8943l01892R4687J90134k63201p4436j0384M8025J80122n5914
$$ 1458704 1550547 1579490 1277598 1372285 1562419 1299218 1224782 1214398 1262423 1442545 1386631
5350A386631J11749L9511o2943p4420L7343j56892k09439K4465J3686N9126Q01
$$ 1386631 1498380 1537891 1474948 1400528 1437871 1280979 1071540 1096005 1109691 1168817 1169618
5339A169618M7188J42936j51487j23478K45079q4789o0697M09918k31515j67032
$$ 1169618 1216806 1359742 1208255 1084777 1329856 1245067 1184370 1594288 1362773 1195741
5329A195741j49642J04965K28071k64999Q305J35220J94815M0709K3353k26700
$$ 1195741 1046099 1151064 1379135 1114136 1122441 1257661 1452476 1493185 1516538 1289838
5319A289838K9024J7286p4117j56355N4778P6823J60488m087j32850J11678K4902
$$ 1289838 1318862 1336148 1262031 1105676 1160454 1237277 1397765 1393678 1260828 1372506 1397408
5308A397408J52528l9520M1300L1922k28354o812J65208O260k22170P6160q781
$$ 1397408 1549936 1510416 1551716 1583638 1355284 1348472 1513680 1519940 1297770 1373930 1365149
5297A365149j23115L8159n2712J58385j6128l1103j57797K5389L24445j21132
$$ 1365149 1242034 1280193 1227481 1385866 1369738 1338635 1180838 1206227 1530672 1409540
5287A409540J0950j72554J23723j4315j19429l2071L9391P3573k03334N0998q1918
$$ 1409540 1420490 1247936 1371659 1357344 1237915 1205844 1245235 1318808 1115474 1166472 1084554
5276A084554K82115Q9808L5109k5968j47615O2642J2234j09097k80042J36789
$$ 1084554 1366669 1456477 1491586 1465618 1318003 1380645 1392879 1283782 1003740 1140529
5266A140529J97667j21158O1509j54842K45478J24044l70925M038L24115J41939
$$ 1140529 1338196 1217038 1278547 1123705 1369183 1493227 1122302 1126340 1450455 1592394
5256A592394k61815r9740j04884K1700M5222K52769P655O2009K90837j0593l97544
$$ 1592394 1330579 1230839 1125955 1147655 1192877 1445646 1453301 1515310 1806147 1795554 1398010
5245A398010j57918J85028J47126J4105m2164j44606J32903q0996j43020K93550
$$ 1398010 1240092 1425120 1572246 1586351 1544187 1399581 1532484 1451488 1308468 1602018
5235A602018j39816j60191K11434O5522l14611K26j1397K18230n8295j80579K02040
$$ 1602018 1462202 1302011 1513445 1578967 1264356 1264582 1253185 1471415 1413120 1232541 1434581
5224A434581R2991m5008O4956r2689N0928K59168l60906l51996J94524L31808
$$ 1434581 1527572 1482564 1547520 1454831 1505759 1764927 1404021 1052025 1246549 1578357
5214A578357k28472j31302K08486O7086j05316q795J10878j909J4626Q4080j06544
$$ 1578357 1349885 1218583 1427069 1494155 1388839 1380044 1490922 1489013 1503639 1587719 1481175
5203A481175p5050L63233k32582j53771L38538j94296J96015j8812j11067K68837
$$ 1481175 1406125 1769358 1536776 1383005 1721543 1527247 1723262 1704450 1593383 1862220
5193A862220J5225j77819j38657q7869K7026L2230J21288o8824K72200k9878j48948
$$ 1862220 1877445 1699626 1560969 1473100 1500126 1532356 1653644 1584820 1857020 1827142 1678194
5182A678194J86553j3569K0139n1444j13026K48656J66280l2902q6502r5611k0302
$$ 1678194 1864747 1851178 1871317 1819873 1706847 1955503 2121783 2088881 2002379 1906768 1886466
5171A886466K86235l04790j70343J69809N6465n0956j62541r2944J52948K76746
$$ 1886466 2172701 1867911 1697568 1867377 1923842 1872886 1710345 1617401 1770349 2047095
5161B047095L2787J27398j87254K4904k98933L15844j03201k12423p3347M6758
$$ 2047095 2079882 2207280 2020026 2044930 1745997 2061841 1958640 1746217 1672870 1719628
5151A719628K80104j17401j11940Q7974L1301p3317r7913m133L34699K88300J4683
$$ 1719628 1999732 1882331 1770391 1858365 1889666 1816349 1718436 1714303 2049002 2337302 2351985
5140B351985k15086q1400K42921m1691j8491j32082k0469K36182l09026n9079
$$ 2351985 2136899 2055499 2298420 2256729 2238238 2106156 2085687 2321869 2012843 1953764
5130A953764K90055r9724l9648J35624J8538j30223k17688M6474J38245m2073
$$ 1953764 2243819 2144095 2104447 2240071 2258609 2128386 1910698 1957172 2095417 2053344
5120B053344j36976J49768O3752J86596p1211r7420K7247O1734j2747J36217K1327
$$ 2053344 1916368 2066136 2129888 2316484 2245273 2147853 2175100 2236834 2224087 2360304 2381631
5109B381631K4445K42914K03236l98745j48032J89810o3454J67222k06867K00339
$$ 2381631 2406076 2648990 2852226 2453481 2305449 2495259 2431805 2599027 2392160 2592499
5099B592499J90762J57363j21790k05918Q110J14403j71074L21574P4737J30788
$$ 2592499 2783261 2940624 2818834 2612916 2621026 2735429 2564355 2885929 2960666 3091454
5089C091454J19922M366o2165L91570J53973J08974K93896J12560K87643J20670
$$ 3091454 3211376 3215742 3153577 3545147 3699120 3808094 4101990 4214550 4502193 4622863
5079D622863k05916O2199O3111k77936l4939k30073l6828k9673k4747l60733O987
$$ 4622863 4416947 4479146 4542257 4264321 4229382 3999309 3962481 3932808 3908061 3547328 3554315
5068C554315Q8920k11884j98054j14478k31865m3085K1356j08217q7390n9997
$$ 3554315 3643235 3431351 3233297 3118819 2886954 2843869 2865225 2757008 2669618 2609621
5058B609621j14649K23725j02443k05352j93798N6872J49247l55n24162J51529
$$ 2609621 2494972 2718697 2616254 2410902 2217104 2273976 2423223 2422868 1898706 2050235
5048B050235K64927J07089j52578N171K21228J47243l18789j30928N8834j5083
$$ 2050235 2315162 2422251 2269673 2274844 2496072 2643315 2324526 2193598 2252432 2237349
5038B237349l41799j44949n1011J9255L03452j73399n2207j6239K47777J30861
$$ 2237349 1895550 1750601 1699590 1718845 2022297 1848898 1796691 1780452 2028229 2159090
5028B159090J7875k52649J60351J02610P569l45824j67341j5374m4150k6324J95519
$$ 2159090 2176965 1924316 2084667 2187277 2194846 1849022 1681681 1666307 1622157 1595833 1791352
5017A791352M1693k06499R6164J76848k38994J15036K3028m6501K4216J01908
$$ 1791352 1833045 1626546 1722710 1899558 1660564 1775600 1798628 1752127 1776343 1878251
5007A878251J18517Q746j59584k24478o214P0204J47786N9566j16569k46107P4835
$$ 1878251 1996768 2005514 1845930 1621452 1615238 1685442 1833228 1892794 1776225 1530118 1604953
4996A604953r391k0864J20426j03207K54471l8589k68900M2522K74770q5098k11270
$$ 1604953 1595562 1574698 1695124 1591917 1846388 1807799 1538899 1581421 1856191 1771093 1559823
4985A559823L3528J08656K6088m93551l4238K24388P1057K68383J95802k1002
$$ 1559823 1593351 1702007 1728095 1234544 1200306 1424694 1495751 1764134 1959936 1938934
4975A938934j36053N3866j29545n6192r202k70299J29988N428q9713j5K21989
$$ 1938934 1802881 1856747 1727202 1671010 1661808 1391509 1521497 1526925 1437212 1437197 1659186
4964A659186K18357m8882m80966J01458J61041q8487l5276k25006R5425r1999
$$ 1659186 1877543 1828661 1347695 1449153 1610194 1521707 1486431 1261425 1356850 1264851
4954A264851L4451J60466L65588k43910k67314J25171J66121j25288k45046K47951
$$ 1264851 1299302 1459768 1825356 1581446 1314132 1439303 1605424 1480136 1235090 1483041
4944A483041j01151k6704K24708L1199j4675P7536m1221o4363P4945m5863j85237
$$ 1483041 1381890 1355186 1579894 1611093 1596418 1673954 1632733 1568370 1643315 1597452 1412215
4933A412215M04763O8997m8921m3885J69601k1482k14554l27625O3600J13318
$$ 1412215 1816978 1885975 1837054 1793169 1962770 1941288 1726734 1399109 1462709 1576027
4923A576027l9793K99706j10554j7447M0280j72516k76550J30860J11863r5977
$$ 1576027 1536234 1835940 1725386 1707939 1748219 1575703 1299153 1430013 1541876 1445899
4913A445899J39501J22821l6373o9514l90010P7171K80335K27184L1472j11214
$$ 1445899 1585400 1708221 1671848 1602334 1212324 1289495 1569830 1797014 1828486 1717272
4903A717272l44658o6590J03556m551L7040k63218J59413K92191l7052o8537N9795
$$ 1717272 1372614 1306024 1409580 1405029 1442069 1178851 1338264 1630455 1593403 1524866 1584661
4892A584661m02125J49216M25801j54606k28071L21408J32986J11826j28959k72528
$$ 1584661 1182536 1331752 1757553 1602947 1374876 1696284 1829270 1941096 1812137 1539609
4882A539609m335J84414j9205M2286n2641j52933O105j1789q9672j29099K55619
$$ 1539609 1535274 1719688 1700483 1742769 1690128 1537195 1543300 1531511 1441839 1312740 1568359
4871A568359L0588k53425J41274J63439k34309J69496N9228l5980r8157j24103
$$ 1568359 1598947 1345522 1486796 1650235 1415926 1585422 1644650 1608670 1510513 1386410
4861A386410J88046q4190J46680p7089n4994J82126k10163o7516K9789L52566
$$ 1386410 1574456 1490266 1636946 1559857 1504863 1686989 1476826 1409310 1439099 1791665
4851A791665k0347j26909l18903o7904K1727q2381P5538J54283J53496j21658
$$ 1791665 1771318 1644409 1325506 1257602 1279329 1196948 1272486 1426769 1580265 1458607
4841A458607j63071J08951J61950k04839j4588n8618J32740K2742J38915K06198
$$ 1458607 1295536 1404487 1566437 1361598 1347010 1288392 1421132 1443874 1582789 1788987
4831A788987m07652J9876j17017J28284q8929j11595J00337m40280K19567K90642
$$ 1788987 1381335 1401211 1284194 1412478 1323549 1211954 1312291 872011 1091578 1382220
4821A382220J27472J75417k42334r3787j03516J39406j63170r5664K46849o2316
$$ 1382220 1509692 1685109 1442775 1348988 1245472 1384878 1221708 1126044 1372893 1310577
4811A310577j38672q6906K53369L4479q696J25955K11322k95575j67829l9220
$$ 1310577 1171905 1084999 1338368 1372847 1364151 1490106 1701428 1405853 1238024 1198804
4801A198804R3612N22863j66043j93327n377j80981k4743K6019J83579K37811
$$ 1198804 1292416 1815279 1649236 1455909 1450532 1269551 1244808 1270827 1454406 1692217
4791A692217m2199J72625k04447j57561K6231O378j51852j70853J8858J00956
$$ 1692217 1650018 1822643 1618196 1460635 1486866 1493244 1341392 1170539 1189397 1290353
4781A290353n9902P0287q7264M09395n3254j14449J26837k23205J72293Q4522
$$ 1290353 1230451 1300738 1213474 1622869 1569615 1455166 1582003 1358798 1531091 1615613
4771A615613N2304J50902k40136j71387j22358j58067L07180R6867O8871O4283
$$ 1615613 1667917 1818819 1578683 1407296 1284938 1126871 1434051 1530918 1599789 1664072
4761A664072p3382j36121M8213j83994K0167J33288k0946L1244K8156O2100j12352
$$ 1664072 1590690 1454569 1502782 1318788 1338955 1472243 1451297 1482541 1510697 1572797 1460445
4750A460445O1637j6965j2928R1711n3223R5122j67461J69702J6160m0240J40974
$$ 1460445 1522082 1505117 1492189 1583900 1530677 1625799 1458338 1628040 1644200 1603960 1744934
4739A744934j59978n830J56813j30832j32306j3274J04706J02940j97361R8401
$$ 1744934 1584956 1579126 1735939 1605107 1472801 1459527 1564233 1667173 1469812 1568213
4729A568213P3165m2994O0102j29874j11952J56270J94660N9352N9013j00724
$$ 1568213 1641378 1598384 1658486 1528612 1416660 1572930 1767590 1826942 1885955 1785231
4719A785231K41813Q8732p4533j61588j07705k51159j17593j24071O2614J22809
$$ 1785231 2027044 2115776 2041243 1879655 1771950 1520791 1403198 1279127 1341741 1464550
4709A464550L34556k2345K4068R2313p9587k13664j55414J95675K75849j9142
$$ 1464550 1799106 1776761 1800829 1893142 1813555 1599891 1444477 1640152 1916001 1896859
4699A896859r546j75495j8986k62K8340J66536K2957j76985j37136J56874M6175
$$ 1896859 1887313 1711818 1692832 1692570 1720910 1887446 1910403 1733418 1596282 1753156 1799331
4688A799331K44640k05613j77201K9621L2189J04513J54502j79177K2034O4379
$$ 1799331 2043971 1838358 1661157 1690778 1722967 1827480 1981982 1802805 1824839 1889218
4678A889218q4585K22404p5327Q780Q996j16079L63719j10048k20255P2844J26309
$$ 1889218 1804633 2027037 1951710 1960490 1969486 1853407 2217126 2107078 1886823 1959667 2085976
4667B085976j17077J38162P766N956J2033l7418J33858m1062j58880J82390K13631
$$ 2085976 1968899 2107061 2114827 2120783 2132816 2095398 2229256 2188194 2029314 2211704 2425335
4656B425335k00464k77960K45389N9725k14593J67875l6539R2996j77422m1699
$$ 2425335 2224871 1946911 2192300 2252025 2037432 2205307 2168768 2261764 2084342 2042643
4646B042643J96437m7908j10350K37764m2156q6012j91520J28004k65150K998
$$ 2042643 2239080 2191172 2080822 2318586 2276430 2190418 1998898 2126902 1861752 1864750
4636A864750K87946J36651J24340k88147r7900L01540J46291k94612l1125k27773
$$ 1864750 2152696 2289347 2413687 2125540 2027640 2329180 2475471 2180859 2149734 1921961
4626A921961K49144J90091K99368l07497q3362P8092O6488J03934m10393j78629
$$ 1921961 2171105 2361196 2660564 2353067 2269705 2347797 2414285 2518219 2107826 1929197
4616A929197O45J83351J01561j31065L11205q5591l67748K33322j6922K4782K28269
$$ 1929197 1929842 2113193 2214754 2083689 2394894 2309303 1941555 2174877 2157955 2182737 2411006
4605B411006R6232p2336k69634M9562j382n624M2927J01692J08970K69799j75408
$$ 2411006 2507238 2434902 2165268 2214830 2213448 2207824 2250751 2352443 2461413 2731212 2555804
4594B555804M5338k39721k3242P1849n942l2301R2199R5939k37829J23853k8111
$$ 2555804 2601142 2361421 2338179 2410028 2404086 2371785 2463984 2559923 2322094 2445947 2417836
4583B417836j78796M7541K06174J80784K68053j38458r3835J18520j45805k64664
$$ 2417836 2239040 2286581 2492755 2673539 2941592 2803134 2709299 2827819 2682014 2417350
4573B417350m8851n7317J26593J00851L7681K38454j65291r383q2856l1585M0722
$$ 2417350 2368499 2311182 2437775 2538626 2576307 2814761 2649470 2640087 2557231 2525646 2566368
4562B566368M1201j431J96899L8253o8252j40014K06969L07060q0553K5945j89817
$$ 2566368 2607569 2606138 2803037 2841290 2773038 2633024 2839993 3147053 3066500 3092445 2902628
4551B902628n1573J9597m1354P6780K0762J67573k60999J12558p2683j03251J76676
$$ 2902628 2851055 2870652 2829298 2906078 2926840 3094413 2833414 2945972 2873289 2770038 2946714
4540B946714k73602L60088J6429K58021j84123k04780k70374J16875J95984J61194
$$ 2946714 2673112 3033200 3049629 3307650 3123527 2918747 2648373 2765248 2961232 3122426
4530C122426P5229N7617M3323m2042j6580M6848r1185R6594J4850o7925o8340
$$ 3122426 3197655 3255272 3298595 3256553 3239973 3286821 3195636 3292230 3307080 3239155 3170815
4519C170815J38440k0769J87751K9628L2124k27076K28278J81141l3067K8744
$$ 3170815 3309255 3288486 3476237 3505865 3537989 3310913 3539191 3720332 3687265 3716009
4509C716009j85311r4100Q9563K17604j422J8476K4047k31514j21465M4247M55496
$$ 3716009 3530698 3436598 3526161 3743765 3742343 3760819 3784866 3553352 3431887 3476134 3931630
4498C931630Q9823n2159J82213j44752L42020l2235j117Q35l196k4843m9876J46328
$$ 3931630 4021453 3969294 4151507 4006755 4348775 4316540 4315423 4316258 4313062 4288219 4238343 4384671
4486D384671j00447m9298j13111N4243J30337J28401K4652K16904q0076j37802
$$ 4384671 4284224 4234926 4121815 4176058 4306395 4434796 4459448 4676352 4596276 4458474
4476D458474J07765J62337J22729N5635J9050k11189M7630P5919q086Q2358J42470
$$ 4458474 4566239 4728576 4851305 4906940 4925990 4714801 4762431 4838350 4830264 4912622 5055092
4465E055092P8642K23745J88807K68240k55290R2496P2398o6658J73991j0198
$$ 5055092 5133734 5357479 5546286 5814526 5559236 5651732 5724130 5657472 5831463 5821265
4455E821265K21076L665k44738J27090K45270N4668j56952l7647k16250J67190
$$ 5821265 6042341 6046006 5801268 5928358 6173628 6228296 6071344 6033697 5817447 5984637
4445E984637K02533K28414K63941O5786r3087K62891J09322r1617L7521k0812
$$ 5984637 6187170 6415584 6679525 6745311 6652224 6915115 7024437 6932820 6970341 6949529
4435F949529k24260j1834K2457J25904J78183R970K25639K03130k22492j19942
$$ 6949529 6725269 6713435 6735892 6861796 7039979 7049949 7275588 7478718 7256226 7136284
4425G136284P5044Q9743k70340K98281K56416O54j64263O7321k91347k3343K15541
$$ 7136284 7211328 7301071 7030731 7329012 7585428 7586082 7421819 7489140 7197793 7174450 7389991
4414G389991j09327K61063k6504r5869o9939L51593l9549j37398q8669j33649
$$ 7389991 7280664 7541727 7515223 7419354 7349415 7701008 7661459 7524061 7435392 7301743
4404G301743K94355J79814K9749j57932O0942L78333l9215k21207K65297O6152
$$ 7301743 7596098 7775912 7805661 7647729 7708671 8087004 8047789 7826582 8091879 8158031
4394H158031n9224m6563L2766j02921J40989M74092J71120P8109o2640q4565J80177
$$ 8158031 8098807 8052244 8085010 7982089 8123078 8597170 8768290 8846399 8783759 8699194 8879371
4383H879371L31662K99693j0464r5425N37523K28268N9768J00900L69196K35205
$$ 8879371 9211033 9510726 9500262 9404837 9942360 10170628 10230396 10331296 10700492 10935697
4373A0935697P3548l4976K84400L98283L93810N59515K43724J28807K92450M16757
$$ 10935697 11009245 10974269 11258669 11656952 12050762 12610277 12854001 12982808 13275258 13692015
4363A3692015M87820M17591M99091L09675P20425O89618O44181L04219P10054
$$ 13692015 14179835 14597426 15096517 15406192 16126617 16816235 17460416 17764635 18474689
4354A8474689O84465K31794J005548P38683O09591R64179R99014L91045M02438
$$ 18474689 19159154 19390948 20396496 21135179 21744770 22708949 23707963 24099008 24501446
4345B4501446J256354J217182Q01307O19787Q02103P06372Q08611P67639Q68007
$$ 24501446 25757800 26974982 27776289 28396076 29198179 29904551 30713162 31480801 32348808
4336C2348808P02334M29790P49431P08833L05443O29114O70878J63758M39924
$$ 32348808 33051142 33480932 34230363 34939196 35244639 35873753 36544631 36708389 37148313
4327C7148313M85486N35326J22095M5485k2908j454k09350L1601j22581o62225
$$ 37148313 37633799 38169125 38291220 38336705 38313797 38312343 38102993 38134594 38012013 37349788
4317C7349788m74463p08133k13418m26706m30693o04528n47337p10611o64546
$$ 37349788 36875325 36167192 35953774 35527068 35096375 34491847 33944510 33233899 32569353
4308C2569353p00310q17951n65683n93355r88038r41661q95388p17815o46054
$$ 32569353 31869043 31051092 30485409 29892054 28904016 27962355 27066967 26349152 25703098
4299B5703098n44963o88556p03697m81892p25040o57615p27981n92910n88295
$$ 25703098 25158135 24469579 23765882 23283990 22558950 21901335 21173354 20580444 19992149
4290A9992149n17452n39643l28017l89897m55360n33263n19778n71242l45669
$$ 19992149 19474697 18935054 18607037 18217140 17761780 17228517 16708739 16137497 15791828
4281A5791828k67101m87279o02272k88478j11363k6096p5682l23175k94817j92553
$$ 15791828 15524727 15037448 14435176 14146698 14035335 14009239 13933557 13610382 13315565 13123012
4271A3123012j46481j98240m03777J9259J87680j22711l03372k1399J7972l01129
$$ 13123012 12976531 12778291 12374514 12393773 12581453 12458742 12155370 12133971 12151943 11850814
4261A1850814r5257j0467k18765j77914k48063R8772N9604J83510l0311j18453
$$ 11850814 11755557 11745090 11526325 11348411 11100348 11199120 11258724 11442234 11411923 11293470
4251A1293470j89783j84885K8724q9653M8482j47069J19867R9571l46708o818
$$ 11293470 11103687 10918802 10947526 10857873 10906355 10759286 10879153 10978724 10632016 10625198
4241A0625198o450J40692K31614R0603l62612j27760M6166J26966J97875m8489
$$ 10625198 10618748 10759440 10991054 11081657 10719045 10591285 10637451 10764417 10962292 10913803
4231A0913803j92234n5709J9835J08056K01961q1297q0864k25284J39501J81435
$$ 10913803 10721569 10665860 10685695 10793751 10995712 10914415 10833551 10608267 10747768 10929203
4221A0929203j5619M6314R3626L2666Q9737j01395L9420K34647K1219j25955j36178
$$ 10929203 10913584 10959898 11053524 11086190 11175927 11074532 11113952 11348599 11369818 11243863 11107685
4210A1107685J14649J73702J36342p7835j09128M4465m7553J45074l1064O1035
$$ 11107685 11222334 11396036 11532378 11454543 11345415 11389880 11342327 11487401 11456337 11517372
4200A1517372r1497j25619J83020J45526r6326K46913K9107J70833o3790M605
$$ 11517372 11425875 11300256 11483276 11628802 11532476 11779389 11808496 11979329 11915539 11920144
4190A1920144R3278J32527J91614J9905o6810L53611j25409m2494N9902J35831
$$ 11920144 12013422 12145949 12337563 12357468 12290658 12644269 12518860 12476366 12536268 12672099
4180A2672099J47073R8102R5695j28833O8338J91294J98923l30597j55608K02820
$$ 12672099 12819172 12917274 13012969 12884136 12952474 13143768 13342691 13012094 12856486 13059306
4170A3059306k2301p9792J45063O9593J84970k67528K86383P1832J36568o0760
$$ 13059306 13037005 12957213 13102276 13171869 13356839 13089311 13375694 13447526 13584094 13523334
4160A3523334K9037K17991R8517J27160n5706l99163j47095M98909K93862k83627
$$ 13523334 13552371 13770362 13868879 13996039 13940333 13541170 13394075 13892984 14186846 13903219
4150A3903219k14937J41415M25581K33428l8390J20484O6816l4363r3551m1060
$$ 13903219 13688282 13829697 14255278 14488706 14450316 14570800 14637616 14603253 14509702 14468642
4140A4468642l9130J06312k57998N7898L97883j81867k57695K87148N0244j9299
$$ 14468642 14429512 14535824 14277826 14335724 14733607 14551740 14294045 14581193 14631437 14612138
4130A4612138J06781K05162k1502j46437O4207J60443J15229N1986J26377k9000
$$ 14612138 14718919 14924081 14902579 14756142 14820349 14980792 15096021 15148007 15274384 15245384
4120A5245384M55581J07890k4234R8320k4455Q0952K57615Q3469N2709R9430M02351
$$ 15245384 15700965 15808855 15784621 15882941 15858486 15939438 16197053 16280522 16333231 16432661 16835012
4109A6835012q8724j27175J48711K22492n18o2488L72374K30081J48568J71744
$$ 16835012 16746288 16619113 16767824 16990316 16989798 16927310 17299684 17529765 17678333 17850077
4099A7850077N2408J49807M67103K29284M55415L32920o3961J51341L57890M97820
$$ 17850077 17902485 18052292 18519395 18748679 19204094 19537014 19473053 19624394 19982284 20480104
4089B0480104L68797L09140J01033L22287L29661M46932L17901M28135K5903K40422
$$ 20480104 20848901 21158041 21259074 21581361 21911022 22357954 22675855 23103990 23129893 23370315
4079B3370315O55726N65298P34805Q96863P38340M45424R13606O48020P57267
$$ 23370315 24026041 24591339 25326144 26223007 26961347 27406771 28320377 28968397 29725664
4070B9725664J045475N94964O74545Q78710R99182J129181J241060J254667Q53659
$$ 29725664 30771139 31366103 32040648 32919358 33918540 35047721 36288781 37543448 38397107
4061C8397107J556692J539389J703420J231087J463055J837720J862621J904124
$$ 38397107 39953799 41493188 43196608 44427695 45890750 47728470 49591091 51495215
4053E1495215K087911K034921K183089J741729J778878J949985J658140J437392
$$ 51495215 53583126 55618047 57801136 59542865 61321743 63271728 64929868 66367260
4045F6367260J659003J313326J259987R82015Q60855J118170N16588K52047N2439
$$ 66367260 68026263 69339589 70599576 71581591 72442446 73560616 74077204 74329251 74381690
4036G4381690K6074k70660l11259n34042o90920q81312q39561r95708j464835
$$ 74381690 74407764 74137104 73825845 73291803 72600883 71719571 70880010 69884302 68419467
4027F8419467j261042j491800j791560j855915j672320k033436j722237j826504
$$ 68419467 67158425 65666625 63875065 62019150 60346830 58313394 56591157 54764653
4019E4764653j906350j656330j768783j732129j656805j822386j624642j268125
$$ 54764653 52858303 51201973 49433190 47701061 46044256 44221870 42597228 41329103
4011D1329103j538080j052222j377905j287809r75571p98782j107236j010742
$$ 41329103 39791023 38738801 37360896 36073087 35097516 34298734 33191498 32180756
4003C2180756r83907p53900o34095r25514q45087m35475o60087n88872o29687
$$ 32180756 31196849 30442949 29808854 28883340 28038253 27602778 26942691 26353819 25724132
3994B5724132n38462k83240n47530k77831l79633l18091l09930m51079l54520
$$ 25724132 25185670 24902430 24354900 24077069 23697436 23379345 23069415 22618336 22263816
3985B2263816j67278n41237m79573j16695j82710j15540k49592J12128J26604
$$ 22263816 22096538 21555301 21075728 20959033 20776323 20660783 20411191 20523319 20649923
3976B0649923m02836k61638k21902l24383J15090J23592L8585l0640k11064m0650
$$ 20649923 20247087 19985449 19763547 19439164 19554254 19677846 19716431 19685791 19474727 19434077
3966A9434077N8650o8118J912J89441N3543J53130O9095J51044J08020J15235
$$ 19434077 19492727 19424609 19426521 19615962 19669505 19822635 19891730 20042774 20150794 20266029
3956B0266029L27529R8187J97959J97807N94434K70200L86544L11857L05844K63544
$$ 20266029 20593558 20691745 20889704 21087511 21681945 21952145 22338689 22650546 22956390 23219934
3946B3219934J91961K82698N55184M73320Q54875O76097L29471L91209O52061
$$ 23219934 23411895 23694593 24249777 24723097 25577972 26254069 26583540 26974749 27626810
3937B7626810N51406O85680Q71844L86042O36939N54450L17311M11969M47220
$$ 27626810 28178216 28863896 29735740 30121782 30758721 31313171 31630482 32042451 32489671
3928C2489671p10K90675N21270M36382J47212J80942p9547J29793K40101K53969
$$ 32489671 32488961 32779636 33300906 33737288 33884500 34065442 33985895 34115688 34355789 34609758
3918C4609758K27908N1401L14087M57932L95717L75805M68039Q53681N17789R74478
$$ 34609758 34837666 34889067 35203154 35661086 36056803 36432608 36900647 37754328 38272117 39246595
3908C9246595R96281P61458P76958P95708J197154R61366J263243J393331J418054
$$ 39246595 40242876 41004334 41781292 42577000 43774154 44735520 45998763 47392094 48810148
3899D8810148J648510J819290J761033J632935K037720K375112K215870K404898
$$ 48810148 50458658 52277948 54038981 55671916 57709636 60084748 62300618 64705516
3891F4705516K615788K764585K829930L028824K998793L413137L339581L306279
$$ 64705516 67321304 70085889 72915819 75944643 78943436 82356573 85696154 89002433
3883H9002433L109863K947736L328253K812514K944901K828483K489350K374284
$$ 89002433 92112296 95060032 98388285 101200799 104145700 106974183 109463533 111837817
3875A11837817K071254J935556J563374J489871J042535L15642L32814J91341
$$ 111837817 113909071 115844627 117408001 118897872 119940407 120256049 120588863 120780204
3867A20780204p7307l51494o08951r19879j327705j532823j737199k284571j964289
$$ 120780204 120702897 120351403 119742452 118822573 117494868 115962045 114224846 111940275 109975986
3858A09975986j802291k575503k441981k439050k696518l024742k925471l104331
$$ 109975986 108173695 105598192 103156211 100717161 98020643 94995901 92070430 88966099
3850H8966099k949280k691419l157204l018341k689777k532744k347483k327120
$$ 88966099 86016819 83325400 80168196 77149855 74460078 71927334 69579851 67252731
3842F7252731k686395k274152k184876k212057k097589j763529j702845j498466
$$ 67252731 64566336 62292184 60107308 57895251 55797662 54034133 52331288 50832822
3834E0832822j711456j547999j129930j062001j345246j331139j030728n70777
$$ 50832822 49121366 47573367 46443437 45381436 44036190 42705051 41674323 41103546
3826D1103546p58511j272641q28263o60548l05269m70828n50151n01395m26477
$$ 41103546 40345035 39072394 38244131 37583583 37278314 36807486 36257335 35755940 35329463
3817C5329463m48615l98929j17833m82366j98550j78372j13939j07576n32477
$$ 35329463 34880848 34481919 34364086 33881720 33683170 33504798 33390859 33283283 32750806
3808C2750806r7009o12633m64109k31404k99520n26384m95604o68642n71230n17379
$$ 32750806 32653797 32041164 31577055 31345651 31046131 30519747 30024143 29355501 28784271 28266892
3798B8266892q89395o17804n25703p55252o70104l83932o62563n38144l18283
$$ 28266892 27377497 26759693 26233990 25478738 24808634 24424702 23762139 23223995 22905712
3789B2905712n63144n54014p02851p94810j37226n31434j82183o04208o09553
$$ 22905712 22342568 21788554 21085703 20290893 20153667 19622233 19440050 18835842 18226289
3780A8226289k39979l10770m55713l85846l502Q0207k01429n02544m45049M7468
$$ 18226289 17986310 17675540 17219827 16833981 16830479 16910686 16709257 16206713 15761664 15809132
3770A5809132p206m81129m02157K1683j65583r4320O6795m733k63049m35691J05181
$$ 15809132 15801926 15320797 14918640 14940323 14774740 14680420 14747215 14742482 14479433 14043742 14148923
3759A4148923j43640r7618Q4842k58957J53116j56283j89040R1106j98509J97966
$$ 14148923 14005283 13907665 13992507 13733550 13886666 13730383 13541343 13632449 13433940 13631906
3749A3631906M3709O7744m0995m39419J98909J50303l16081L0196j29356N114
$$ 13631906 13675615 13743359 13702364 13262945 13461854 13612157 13296076 13326272 13196916 13202030
3739A3202030k59961k33812l75241j22936n5397m73830j14303k91799j67140O9123
$$ 13202030 12942069 12708257 12333016 12210080 12154683 11680853 11566550 11274751 11107611 11176734
3729A1176734r9651j60913k71423J32939j35044j31254K819Q2183j92056k22994
$$ 11176734 11077083 10916170 10644747 10777686 10642642 10511388 10514207 10596390 10404334 10181340
3719A0181340j62747k16044k787l2928j58118K40135J71141n1394P0298P9616
$$ 10181340 10018593 9802549 9799762 9766834 9608716 9848851 10019992 9968598 10038896 10118512
3709A0118512J13837j87404k52723K62744k74385j56022l5624l8947L1924J40623
$$ 10118512 10232349 10044945 9792222 10054966 9780581 9624559 9588935 9549988 9581912 9722535
3699I722535j96582J82497K93422l296P8516K66759J26972k43877n1965k02808
$$ 9722535 9525953 9708450 10001872 9998576 10077092 10343851 10470823 10226946 10174981 9972173
3689I972173l1850M19546K74645l1504p6063j70163J84409K33367q7648M385K3296
$$ 9972173 9940323 10359869 10634514 10603010 10526947 10356784 10541193 10774560 10686912 10691297 10714593
3678A0714593O7712K45567J99138P0142J71394K1853K87903K61117J42673J03471
$$ 10714593 10782305 11027872 11227010 11297152 11468546 11490399 11778302 12039419 12182092 12285563
3668A2285563j76596L71918L54742p0562L6453J78105L25372K24281j12855N06412
$$ 12285563 12108967 12480885 12835627 12765065 12801518 12979623 13304995 13529276 13416421 13922833
3658A3922833K37965K64154M37567K05057K91827L96049M30555O17348L08842
$$ 13922833 14160798 14424952 14862519 15067576 15359403 15755452 16186007 16803355 17112197
3649A7112197L71332N94962P34841R75621O97288N16258N77096N63001Q96639
$$ 17112197 17483529 18078491 18813332 19788953 20486241 21002499 21579595 22142596 23039235
3640B3039235O77682J085558Q78110P06320P78792O20755P22810O57055L04793
$$ 23039235 23716917 24802475 25680585 26386905 27165697 27786452 28509262 29166317 29471110
3631B9471110N54508N72634L70452L13179M41996J29909L20620L31125J91663
$$ 29471110 30025618 30598252 30968704 31281883 31723879 31853788 32174408 32505533 32697196
3622C2697196k8631O5287J79195J60678P7160j65693k48209q1931k52250j23501
$$ 32697196 32668565 32733852 32913047 33073725 33150885 32985192 32736983 32655052 32402802 32279301
3612C2279301N4021O1287J34353K09211M00335K43005l3935L80133M72909N40186
$$ 32279301 32333322 32394609 32528962 32738173 33138508 33381513 33347578 33727711 34200620 34740806
3602C4740806Q03821N21675Q16992Q24981J016975R70523J265505J005204J200180
$$ 34740806 35544627 36066302 36883294 37708275 38725250 39695773 40961278 41966482 43166662
3593D3166662J365076J827027J633301J259806J977506J844091J927367J789433
$$ 43166662 44531738 46358765 47992066 49251872 51229378 53073469 55000836 56790269
3585E6790269J752125K548499K069232J907459K094360K034493J908547K241037
$$ 56790269 58542394 61090893 63160125 65067584 67161944 69196437 71104984 73346021
3577G3346021J913040J178763J523277J276966P84925R07797N96170N84994M18240
$$ 73346021 75259061 76437824 77961101 79238067 80022992 80930789 81526959 82111953 82530193
3568H2530193Q8520J49808r6416m05748m45945l09147q34419p16047o85658j120030
$$ 82530193 82618713 82768521 82672105 82266357 81820412 81511265 80676846 79960799 79275141 78155111
3558G8155111j091887j069770q08266n03578p47876j196546n68329n6138j42982
$$ 78155111 77063224 75993454 75185188 74681610 73933734 72737188 72168859 72112721 71969739
3549G1969739O5361K01964K98473M76327M04987O76847R32233J071455J306674
$$ 71969739 72035100 72237064 72535537 73011864 73416851 74093698 75025931 76097386 77404060
3540G7404060R09547P59043J049427P47806P08389P08381P54977N00496L90628
$$ 77404060 78313607 79072650 80122077 80869883 81578272 82286653 83041630 83542126 83932754
3531H3932754K25675k97714m08935m35585m72109n48389j009791j010878j029428
$$ 83932754 84158429 83860715 83451780 83016195 82544086 81995697 80985906 79975028 78945600
3522G8945600j266022j385499j733684j762710j644256j595970j961724k319521
$$ 78945600 77679578 76294079 74560395 72797685 71153429 69557459 67595735 65276214
3514F5276214k482737k451626k400028k552781k147612k199282j821351j575052
$$ 65276214 62793477 60341851 57941823 55389042 53241430 51042148 49220797 47645745
3506D7645745j459731j358120j045403j146382j055706r10935r02508m62184n53393
$$ 47645745 46186014 44827894 43782491 42636109 41580403 40669468 39766960 39304776 38751383
3497C8751383k13697k60706k07074j77361o4487K98776J58159K27982M67114M72677
$$ 38751383 38537686 38276980 38069906 37892545 37828058 38126834 38284993 38512975 38980089 39452766
3487C9452766L64052J00363J01567r2765O2332J08132J50789L3805M86062P50675
$$ 39452766 39816818 39917181 40018748 39925983 39988315 40096447 40247236 40281041 40767103 41517778
3477D1517778K64878J85116L05473K75299J81475J17769L11818L73667J71146
$$ 41517778 41782656 41967772 42273245 42548544 42730019 42847788 43159606 43533273 43704419
3468D3704419R1133j6894q5182J11534J8499j89428m59669p80687o34413o34664
$$ 43704419 43795552 43778658 43693476 43805010 43823509 43634081 43174412 42393725 41759312 41124648
3458D1124648o54069j335239j230525p86750j058636o70566o46552p48242o99364
$$ 41124648 40470579 39135340 37904815 37118065 36059429 35388863 34742311 33994069 33294705
3449C3294705k96801p56880p64343n04701l89626l50198r8445J79483j92507j74862
$$ 33294705 32997904 32241024 31476681 30971980 30582354 30232156 30133711 30313194 30120687 29945825
3439B9945825j94639l32127J1053J14553j69887K35398J96103Q2745K78327N39239
$$ 29945825 29751186 29419059 29430112 29544665 29374778 29610176 29806279 29889024 30167351 30706590
3429C0706590M19384J14073O23199N95324L16894O34831R62123J050812R22969
$$ 30706590 31125974 31240047 31863246 32458570 32775464 33410295 34372418 35423230 36346199
3420C6346199R12671R09864J242784J254746J489786J760223J674247J662934
$$ 36346199 37258870 38168734 39411518 40666264 42156050 43916273 45590520 47253454
3412D7253454J877704K089023J864271J931436K124694K262998J803304J889664
$$ 47253454 49131158 51220181 53084452 55015888 57140582 59403580 61206884 63096548
3404F3096548J971689J571424J860096J264128J283070R19402R63700O81440P94319
$$ 63096548 65068237 66639661 68499757 69763885 71046955 71966357 72930057 73611497 74405816
3395G4405816P28580K02749M16011J91332K85303q6137n7168l94646m61317j122167
$$ 74405816 75134396 75337145 75753156 75944488 76229791 76143654 76086486 75691840 75230523 74108356
3385G4108356j515515j106915j975393j759935j869338j928821k009249k324617
$$ 74108356 72592841 71485926 69510533 67750598 65881260 63952439 61943190 59618573
3377E9618573k439587k298282k602339k813585k295664k572925k422210j868144
$$ 59618573 57178986 54880704 52278365 49464780 47169116 44596191 42173981 40305837
3369D0305837j751093j923663j619039j444696j307171r29066q75562j117058
$$ 40305837 38554744 36631081 35012042 33567346 32260175 31331109 30455547 29338489
3361B9338489p45498r29586p94264o74096p91997o72437L9949J20664k03482k05876
$$ 29338489 28592991 27663405 26869141 26195045 25403048 24730611 24770560 24891224 24687742 24481866
3351B4481866j46604l43443m52942p10660q08746p86443p50999l52734l31095
$$ 24481866 24335262 23991819 23538877 22828217 22019471 21233028 20482029 20129295 19798200
3342A9798200m91615n66165m22529m12604p0680j53775l4874R6102l47103k74788
$$ 19798200 19306585 18740420 18317891 17905287 17834607 17680832 17645958 17742060 17394957 17120169
3332A7120169j63309K57085J68620N2979l43008m98923j66711l80348l95879k87064
$$ 17120169 16956860 17213945 17382565 17435544 17092536 16593613 16426902 16046554 15650675 15363611
3322A5363611l85426n66713m82025j00651o39024l36610j37505k14515m14008
$$ 15363611 14978185 14411472 13929447 13828796 13189772 12853162 12715657 12501142 12087134
3313A2087134j11561l18378l13221j87544k35428k36524l69797k17104j80468
$$ 12087134 11975573 11657195 11343974 11156430 10921002 10684478 10314681 10097577 9917109
3304I917109j03368j1524k5752k23286Q4670k56580q3121j07459j2212j47102
$$ 9917109 9813741 9802217 9776465 9553179 9637849 9381269 9298148 9190689 9178477 9031375
3294I031375r1403k98389m6462j6474j05211j05778q7830p1675m4953j1861q0768
$$ 9031375 8939972 8641583 8595121 8578647 8473436 8367658 8279828 8208153 8163200 8151339 8070571
3283H070571q7515M4633Q4646j3866j46259l8292K2960m5034Q2500J00607k83727
$$ 8070571 7983056 8027689 8112335 8098469 7952210 7913918 7936878 7891844 7974344 8074951 7791224
3272G791224K01827K7878j46555N1461j45187R2564K7717K58039J66353q5788
$$ 7791224 7993051 8020929 7874374 7925835 7780648 7873212 7900929 8158968 8325321 8239533
3262H239533j72549j01686J66579n7956P2370Q7337K32324m122o4360R8771K49837
$$ 8239533 8066984 7965298 8131877 8073921 8146291 8233628 8465952 8461830 8397470 8496241 8746078
3251H746078K95459r0437L5247j4738R9517P692j54078K46066j40050L8227l6603
$$ 8746078 9041537 8951100 8986347 8971609 9071126 9078818 8924740 9170806 9030756 9068983 9032380
3240I032380K68208j09915L89569L04194K5196K34217J6391n9905l3203Q7865
$$ 9032380 9300588 9190673 9580242 9884436 9909632 10143849 10160240 10100335 10067132 10154997
3230A0154997L12324J78888r0617J97977Q1672L5715L08660J70722K27066K57411
$$ 10154997 10467321 10646209 10555592 10753569 10835241 10870956 11179616 11350338 11577404 11834815
3220A1834815J93158L7988k9789L54287j13604M75740J42152J85403K06345Q00127
$$ 11834815 12027973 12065961 12036172 12390459 12276855 12752595 12894747 13080150 13286495 14086622
3210A4086622K57239l7155K75337K78310L58509L61272L00380N11157M46125K51918
$$ 14086622 14343861 14306706 14582043 14860353 15218862 15580134 15880514 16391671 16837796 17089714
3200A7089714L96275N15510M99145L66151M02145P21083M82746N10649N62357
$$ 17089714 17485989 18001499 18500644 18866795 19268940 19990023 20472769 20983418 21545775
3191B1545775J32882O77479O56239N50332O55991M40380M31120N86934Q68160
$$ 21545775 21678657 22356136 23012375 23562707 24218698 24659078 25090198 25677132 26545292
3182B6545292P29475M50025M36511M96707L09982N92046J90277J08133L23701
$$ 26545292 27274767 27724792 28161303 28658010 28967992 29560038 29750315 29858448 30182149
3173C0182149M31538J50889n422Q1885m1712j07860o5652n8367o6868o4804J26310
$$ 30182149 30613687 30764576 30759154 30841039 30799327 30691467 30625815 30567448 30500580 30435776 30562086
3162C0562086J30836L80336O7116J35678M33014J30313J55686K83294L25287O02463
$$ 30562086 30692922 31073258 31140374 31276052 31709066 31839379 31995065 32278359 32603646 33206109
3152C3206109O92567O75179N08204O16205Q81153P67605R86959J166221R92426
$$ 33206109 33898676 34573855 35082059 35698264 36579417 37347022 38333981 39500202 40492628
3143D0492628J174448J234348J225802J546470J672403J672072J544103J987945
$$ 40492628 41667076 42901424 44127226 45673696 47346099 49018171 50562274 52550219
3135E2550219K138582J952899K397430K922842K826113L128015L371280L595315
$$ 52550219 54688801 56641700 59039130 61961972 64788085 67916100 71287380 74882695
3127G4882695L847314L957778M536985N296607N339952N990732O423011P124134
$$ 74882695 78730009 82687787 87224772 92521379 97861331 103852063 110275074 117399208
3119A17399208P629309Q418096R309573J0390380J0797087J2010769J3379494
$$ 117399208 125028517 133446613 142756186 153146566 163943653 175954422 189333916
3112A89333916J4692187J5245869J6486478J7577756J7876347J8475772J7163748
$$ 189333916 204026103 219271972 235758450 253336206 271212553 289688325 306852073
3105C06852073J5049253J1378671O610831N63306n243779j0139190j4653265j7180316
$$ 306852073 321901326 333279997 339890828 340454134 335210355 325071165 310417900 293237584
3097B93237584j7705624j8028414j7454186j5995201j5289737j3877083j3097460
$$ 293237584 275531960 257503546 240049360 224054159 208764422 194887339 181789879
3090A81789879j2242466j1466706j0402898r439988q975370q466700p503026o644354
$$ 181789879 169547413 158080707 147677809 138237821 129262451 120795751 113292725 106648371
3082A06648371o414977n761328n332025n021240m448310m162421l726642l319571
$$ 106648371 100233394 94472066 89140041 84118801 79670491 75508070 71781428 68461857
3074F8461857l309678l409023l115592k597615k428662k031946k040658k307639
$$ 68461857 65152179 61743156 58627564 56029949 53601287 51569341 49528683 47221044
3066D7221044k105045k054818j766791j547107j772800j343417j264542j282216
$$ 47221044 45115999 43061181 41294390 39747283 37974483 36631066 35366524 34084308
3058C4084308j283880j226241j254088j039498j056405p54789r75627j042071
$$ 34084308 32800428 31574187 30320099 29280601 28224196 27469407 26493780 25451709
3050B5451709n91063j083709j199640n52500l23330o29948n33268n51608p72980
$$ 25451709 24860646 23776937 22577297 22024797 21701467 21071519 20538251 19986643 19213663
3041A9213663l95682q30769o24055m74646n18201o13153m34909J570m78113l84157
$$ 19213663 18817981 17987212 17363157 16888511 16370310 15757157 15322248 15323818 14845705 14461548
3031A4461548l15126l63265k07022l52440m15215l55758l04923k01865k89647
$$ 14461548 14146422 13783157 13576135 13223695 12808480 12452722 12147799 11945934 11656287
3022A1656287k39860p0058o42884m8441n7554l90011k80348k26803r7934k33844
$$ 11656287 11416427 11346369 10703485 10655044 10597490 10207479 9927131 9700328 9602394 9368550
3012I368550k71030k14969k54012o8263l33909k44989J06658k35459k3496k09758
$$ 9368550 9097520 8882551 8628539 8560276 8226367 7981378 8088036 7852577 7829081 7619323
3002G619323n03973p4094K69539k30887j96374k44499N1809j83200K2860m2507
$$ 7619323 7115350 7041256 7310795 7079908 6883534 6639035 6690844 6507644 6530504 6487997
2992F487997k27540J8872j16187j21407k16621j35728N2723j98636k5320j58839
$$ 6487997 6260457 6279329 6163142 6041735 5825114 5689386 5742109 5543473 5518153 5359314
2982E359314R2881l33002m93259j11829J54575q2905j63640k2050j26069r8827
$$ 5359314 5452195 5119193 4625934 4514105 4668680 4585775 4422135 4400085 4274016 4175189
2972D175189m3799J38816l38897j2853o4606o2888o2695o3277J24099o4989r3977
$$ 4175189 4131390 4270206 3931309 3918456 3853850 3790962 3728267 3664990 3789089 3724100 3630123
2961C630123M7903L83357k59106m78897P5586J5848k40299J141J04827k46255
$$ 3630123 3678026 4061383 3802277 3323380 3398966 3414814 3174515 3175656 3280483 3034228
2951C034228j3690k0439O0876m04995o9050p6935p8536J74350l4489j18300j10073
$$ 3034228 3020538 3000099 3060975 2655980 2586930 2509995 2431459 2605809 2571320 2453020 2342947
2940B342947n6882Q3450J42636p1216P9124r7721p9111M9622k15137O0652O2926
$$ 2342947 2286065 2369515 2512151 2440935 2520059 2422338 2343227 2392849 2177712 2238364 2301290
2929B301290j66446q1371L18294l048r9795j81467k2712J95891Q0505j98129j65413
$$ 2301290 2134844 2053473 2371767 2368719 2268924 2087457 2064745 2260636 2341141 2143012 1977599
2918A977599n1338K24472o0877M9626k53355j14774M1219q1j68148l18566M35861
$$ 1977599 1926261 2150733 2089856 2139482 1886127 1771353 1812572 1812491 1644343 1325777 1761638
2907A761638M457j92477J18584k13622p9609j68657o2387P1785j64053O0799J7916
$$ 1761638 1766095 1573618 1692202 1478580 1398971 1230314 1167927 1239712 1075659 1136458 1154374
2896A154374j3006k06286k3636J23329J83030k09276L9550J32809L5750M5839
$$ 1154374 1141368 935082 911446 1034775 1217805 1008529 1048079 1180888 1216638 1262477
2886A262477r7890k04810p5324k5218p761R0070O0816j89720J42286m8196Q9902
$$ 1262477 1164587 959777 884453 859235 851474 941544 1002360 812640 954926 906730 996632
2875I96632J75780l25998R4125N2866r1447J10247k23637j61235M8729J48825
$$ 996632 1172412 846414 940539 993405 901958 1012205 788568 627333 676062 824887
2865H24887j51561K62779J15142j75371r9962j14586n1524J20288j17957k8616
$$ 824887 673326 936105 1051247 875876 775914 661328 609804 730092 612135 583519
2855E83519N4125l15965K17097K15261L8904J12243k14482K33806n5169j26035
$$ 583519 637644 321679 538776 754037 792941 905184 690702 924508 869339 743304
2845G43304J50568L04713O6275k29184r6785q5477L1361m9720j27812L30118k0201
$$ 743304 893872 1198585 1264860 1035676 938891 853414 884775 835055 707243 1037361 1017160
2834A017160j52194J02874O3301J2873L09329j1359j34879P8002j1067M35769
$$ 1017160 864966 967840 1031141 1044014 1353343 1341984 1207105 1285107 1274040 1709809
2824A709809K3680O3390K00600j1612j36881j9344J77848J70289O5489k01861
$$ 1709809 1733489 1796879 1997479 1985867 1848986 1829642 2007490 2177779 2243268 2041407
2814B041407r7147k14200k14925O962K8589Q6679k3715J33821j93702l98956L21173
$$ 2041407 1944260 1730060 1515135 1522097 1550686 1637365 1613650 1747471 1553769 1154813 1475986
2803A475986q0006m79093J82734K28369K6956l26020k31827O6399K98695k84702
$$ 1475986 1395980 916887 1099621 1327990 1354946 1028926 797099 863498 1162193 877491
2793H77491j08222J5031J84983j27792P6554n4518n7056q3488P7716k23332r5578
$$ 877491 769269 784300 969283 841491 918045 863527 806471 722983 800699 577367 481789
2782D81789r865O6014J36050k08418J93719j16798k47780J39741j18818J10965
$$ 481789 471924 537938 673988 465570 659289 542491 294711 434452 315634 426599
2772D26599L28243j36117j36702k39051J2810J52522j59980J70828K0720q0338
$$ 426599 754842 618725 482023 242972 255782 408304 248324 419152 439872 359534
2762C59534n8772j78259P0536P1080J35716j48046j9181O7326j25543j2884p2544
$$ 359534 300762 122503 193039 264119 399835 251789 232608 299934 174391 161507 88963
2751H8963p1681k8928N7434o3893j43924L18627j5382R7014K2341j09632M757
$$ 88963 17282 -11646 45788 -18105 -162029 156598 141216 238230 260571 150939 155696
2740A55696J0156j97502j96409L14035O5496j10269J18102j33147l6938n5988
$$ 155696 165852 -31650 -228059 85976 151472 41203 159305 26158 -10780 -66768
2730f6768M7867j63522k69674J13863J26998L08291M3892o428K1785k99069J79485
$$ -66768 -18901 -182423 -452097 -338234 -211236 97055 140947 134519 156304 -142765 36720
2719C6720p4772j50738J48508J6568j17329p1068J43606m7656j70775P2447K56153
$$ 36720 -38052 -188790 -40282 -23714 -141043 -212111 -68505 -116161 -286936 -214489 41664
2708D1664K28797k70869l4943J1435K53004J71989l76132J17467N2987q7106k73716
$$ 41664 270461 -408 -35351 -23916 229088 401077 24945 142412 195399 108293 -165423
2697a65423J52833k13050j54942K29010Q7036J4823R3454K38140k12409j27299
$$ -165423 -12590 -225640 -380582 -151572 -64536 -49713 43741 281881 69472 -57827
2687e7827R7389j34337l52482K34969m787J53664j27751l1650P9669k76328R8563
$$ -57827 39562 -94775 -447257 -212288 -217075 -63411 -191162 -222812 -143143 -419471 -320908
2676c20908K22278N2797j08315r1600j6744p5577q6653K04464j47933j81040L42245
$$ -320908 -98630 -45833 -154148 -245748 -262492 -338069 -424722 -220258 -368191 -549231 -206986
2665b06986M27370j76416k63335k9046L5393Q4322J61988j7974R153K1073K1474
$$ -206986 220384 43968 -219367 -248413 -213020 -128698 33290 15316 24469 45542 67016
2654F7016l5379J53462j99137j3441N9553l32064J84817n7609M0650j17892K066
$$ 67016 31637 185099 -14038 -27479 32074 -299990 -115173 -172782 -132132 -250024 -247958
2643b47958L31313L39920r1198k59435J3038K91194j92769l83018o6183O0167
$$ -247958 83355 423275 332077 72642 85680 376874 184105 -198913 -265096 -204929
2633b04929j08451P6778P6075J27602L15246j26161l47056J24872J06737j47263
$$ -204929 -313380 -236602 -160527 -32925 282321 156160 -190896 -66024 40713 -106550
2623a06550Q0255j48366R3117p2346k7729J04998M21467n5185m98217o2910J70507
$$ -106550 -26295 -174661 -81544 -153890 -181619 -76621 344846 289661 -208556 -271466 -100959
2612a00959J00313j18663P4147Q2644j78546K886J0276K18334k16037n443J61660
$$ -100959 -646 -119309 -45162 37482 -141064 -138178 -127902 90432 -125605 -131048 30612
2601C0612Q4003q783o4173l3820p5481n360J81348J59421n3477K62293J61910
$$ 30612 114615 105832 41659 7839 -67642 -73002 108346 267767 214290 476583 638493
2590F38493l40566m6211J7421k69739m1096J18753k53168k73974J83539R2829
$$ 638493 297927 251716 269137 -602 -41698 77055 -176113 -450087 -266548 -173719
2580a73719J46961K0672J1514N7463L6910k00404L6313L84221k75932j62447J75777
$$ -173719 -26758 -6086 5428 62891 99801 -100603 -64290 319931 43999 -118448 57329
2569E7329k308j16998j53257K96356J04854k67222K5954l6382M9717R5832o3493
$$ 57329 55021 -61977 -215234 81122 185976 -81246 -55292 -91674 -41957 53875 -9618
2558i618j64876j84010J21082M7269N4390o7737L3032Q1611R3631j37611L765
$$ -9618 -174494 -358504 -237422 -190153 -135763 -203500 -170468 -88857 4774 -132837 -129072
2547a29072J14204N9380l8629j68558r9836J81532j25547j69868N2368J75652
$$ -129072 -14868 44512 5883 -162675 -262511 -80979 -206526 -376394 -324026 -148374
2537a48374K85808j24996l2383k49655l2673K03662J22441p2559P7006J10484
$$ -148374 137434 12438 -19945 -269600 -302273 -98611 23830 -48729 28277 138761
2527A38761j58161N1862n7842l1702J84085K86157l87381j0374j28614j65708
$$ 138761 -19400 32462 -25380 -57082 127003 413160 25779 15405 -113209 -278917
2517b78917N7707j23354Q3363L28449l04530O1064K96110q6054q1965L5881L17045
$$ -278917 -221210 -344564 -261201 67248 -237282 -176218 119892 33838 -48127 -12246 304799
2506C04799j78829J00016r5417K94378k17403j52085O7175k48948j35204j31204
$$ 304799 125970 225986 130569 424947 207544 55459 122634 -126314 -261518 -392722
2496c92722K33463K17803M5738K73872k11336j80257L0034o9203R3160k0191J68858
$$ -392722 -159259 58544 104282 378154 166818 -13439 16595 -52608 40552 20361 189219
2485A89219j83752L5548N1819p7029q6719o4164J62679j68712J45698k29148J67713
$$ 189219 5467 41015 92834 15805 -70914 -135078 27601 -141111 4587 -224561 -56848
2474e6848J20304K188L04710j19767l97798j90642M25701J04540o6693L0415l6960
$$ -56848 63456 65644 370354 250587 -147211 -337853 87848 192388 125695 156110 119150
2463A19150J30547q7282L40419J05728J1065o6175p07j47569l34895K57869J72077
$$ 119150 249697 162415 502834 608562 619627 553452 552745 405176 70281 328150 500227
2452E00227o145l06881K84596L9544j90057M3059J19914m29731j83255J53294
$$ 500227 494082 187201 471797 511341 321284 364343 484257 54526 -128729 24565
2442B4565L58697K0068j54171m3644q2472J28048J5808o9615J28446J39010J34456
$$ 24565 383262 403330 249159 205515 123043 251091 266899 197284 325730 464740 599196
2431E99196p7643m7570m9590j58877J904K13702K74130k77360J03115k12650j234
$$ 599196 521553 473983 424393 265516 267420 481122 755252 477892 581007 368357 367123
2420C67123J13890k6871J67700k8368j33840L3711k2409Q4422l1968J17088J58220
$$ 367123 481013 454142 621842 593474 459634 493345 470936 555358 523390 640478 798698
2409G98698J3074l9711n3080K07527k67420n9976n4315Q4020K22168Q8919k90597
$$ 798698 811772 772061 718981 926508 659088 599112 544797 628817 850985 939904 649307
2398F49307K01031J09873k60085J6281L23533J6977K24723l9052k48620K34900
$$ 649307 850338 960211 700126 716407 1039940 1056917 1281640 1242588 993968 1228868
2388A228868l00279J03767J39230j61946k41762L17760K46488j13745R7796J36680
$$ 1228868 928589 1032356 1171586 1009640 767878 1085638 1332126 1218381 1316177 1452857
2378A452857p5810N1915J22675J62530R1503q5549K90066M9031j00915J16398
$$ 1452857 1377047 1428962 1551637 1714167 1805670 1720121 2010187 2059218 1958303 2074701
2368B074701J68121K38508N6742K05477j31425p370M31944L36059J44688L97576
$$ 2074701 2242822 2481330 2538072 2743549 2612124 2604754 3036698 3372757 3517445 3915021
2358C915021K34163M9603K92028P231M85886J46058M85895L99796K26450K97303
$$ 3915021 4149184 4198787 4490815 4498046 4983932 5129990 5615885 6015681 6242131 6539434
2348F539434L99069Q00927P19470K98952P22164J056403N69211J232209J109697
$$ 6539434 6938503 7739430 8458900 8757852 9480016 10536419 11105630 12337839 13447536
2339A3447536J253563J367897J219883J287494J345556J765682J924505K229174
$$ 13447536 14701099 16068996 17288879 18576373 19921929 21687611 23612116 25841290
2331B5841290L080132L876936M487322N604374P087208R130508J0939380J0744170
$$ 25841290 28921422 32798358 37285680 42890054 49977262 59107770 70047150 80791320
2323H0791320O460104k918597r872176j2003642j0737806q036666o287189m825647
$$ 80791320 87251424 84332827 74460651 62457009 51719203 43682537 37395348 32569701
2315C2569701l948267l058574k415318j868313j477194j247190j056804j197064
$$ 32569701 28621434 25562860 23147542 21279229 19802035 18554845 17498041 16300977
2307A6300977j245720j219404j159586j361065p75139q67689o67046l42035o59410
$$ 16300977 15055257 13835853 12676267 11315202 10540063 9672374 9005328 8663293 8003883
2298H003883p76525o41222l21849k70007k93926l50180n53243j31498J26680j08614
$$ 8003883 7227358 6586136 6264287 5994280 5700354 5350174 4796931 4665433 4792113 4683499
2288D683499l85075l97031m11900n1770L39845m15954k00313l25919j28363K51518
$$ 4683499 4298424 3901393 3489493 3437723 3777568 3361614 3161301 2835382 2707019 2958537
2278B958537k30895m32254j85623j29587j83063L0315O0812k42643r4326J2451
$$ 2958537 2727642 2295388 2109765 1980178 1797115 1827430 1888242 1645599 1551273 1563724
2268A563724K63840r4667j69322j00857J5338Q0119j80552j88682r8704R1457
$$ 1563724 1827564 1732897 1563575 1462718 1478056 1558175 1377623 1188941 1090237 1181694
2258A181694k08334N8016j21306M6762O8379j09770R2360J32418l6476k76295
$$ 1181694 973360 1031376 910070 956832 1025211 915441 1007801 1140219 1103743 827448
2248H27448K046k04678l5248j04123J05779p610j02396R9288Q1545j71225K5473
$$ 827448 829494 624816 589568 485445 591224 583614 481218 580506 662051 490826 516299
2237E16299Q969j68757P6899L2724j79300j30829J94446R7319j18788J69200J20220
$$ 516299 525268 356511 433410 466134 286834 156005 350451 447770 328982 498182 618402
2226F18402m22077j30212J38841Q0547J08150j5853j7110o5340O5615N9856p607
$$ 618402 196325 66113 204954 285501 393651 377798 360688 295348 360963 420819 413212
2215D13212k43841Q0255j4344K01038p740l71894J68303K37454j47045k23229
$$ 413212 169371 249626 235282 436320 428580 56686 224989 462443 315398 92169
2205I2169k7240n4821J29033r4805R0854K66546k75266j70395K05773M7321j26025
$$ 92169 64929 10108 139141 44336 135190 401736 126470 -43925 161848 209169 83144
2194H3144q4626j62498J63261R2155j37106M34043R9891j81110P619J01282J4716
$$ 83144 -1482 -163980 -719 91436 -45670 388373 488264 307154 314773 416055 430771
2183D30771O8281j36307k66230k60162L35935K85584j62646k32409J19848j87127
$$ 430771 499052 362745 96515 -163647 172288 457872 295226 62817 182665 -4462
2173d462j7432K36989k34927r8652J75874l2202M5436j42915j27123J55227K07113
$$ -4462 -21894 215095 -19832 -118484 57390 25188 70624 -72291 -199414 -44187 162926
2162A62926l53743K09328K16855L314J16085r4799j43610p5893j79058J75428
$$ 162926 -190817 18511 235366 238680 354765 259966 116356 40463 -138595 36833
2152C6833l5583k6484Q2552j50122P5088J98251j14838j02633N9601j01626R4293
$$ 36833 1250 -25234 57318 -92804 -17716 180535 65697 -36936 22665 -78961 15332
2141A5332k8313J25557j77392j5177J00700q8654j9440O1532k26425L1630j97894
$$ 15332 -12981 112576 -64816 -79993 20707 -67947 -87387 -25855 -252280 -220650 -418544
2130d18544J6553J54217M80614J05832m47903m8504M8012l18254p509P9737q7361
$$ -418544 -401991 -247774 232840 338672 -109231 -157735 -109723 -427977 -435486 -355749 -443110
2119d43110j77272K6348N01582p014l14952J89718M4801j16863r645J33095k03213
$$ -443110 -620382 -594034 -92452 -99466 -414418 -224700 -179899 -296762 -306407 -173312 -376525
2108c76525J12120O2615J34684J47898k33444j97593j12610K42232L2346J0629
$$ -376525 -264405 -201790 -67106 80792 -152652 -350245 -462855 -220623 -188277 -177648
2098a77648M2096N4084Q4648J8350j90731n3423k03627K7682q4165j6473J9314
$$ -177648 -135552 -81468 3180 21530 -169201 -222624 -426251 -398569 -482734 -499207 -479893
2087d79893M1991K25403L33604Q7085k55199j95192N4115Q3459l8823P677j96046
$$ -479893 -437902 -212499 121105 208190 -47009 -242201 -188086 -104627 -143450 -135773 -331819
2076c31819Q8951L24394j21187m2125J13882L3186k47380n9659J84305J36843
$$ -331819 -242868 81526 -39661 -81786 32096 65282 -182098 -241757 -57452 79391
2066G9391K8746r4755J11987J4249j44064o7105P8746J0925l13081l2118j17980
$$ 79391 108137 13382 125369 139618 -4446 -71551 7195 18120 -294961 -327079 -445059
2055d45059K73100K73134J15496J66670k09033m129q9272j19311o0324J89232
$$ -445059 -171959 101175 216671 383341 174308 170179 80907 -38404 -98728 90504
2045I0504k51524k2499K05544j43158k94841j01183J58438K83160m7111N2678
$$ 90504 -161020 -183519 22025 -121133 -415974 -517157 -358719 -75559 -122670 -69992
2035f9992j61361K26422J79917j97901k91258M4706K04469r953j41179n0499J15379
$$ -69992 -231353 -4931 174986 -22915 -314173 -269467 -64998 -74951 -216130 -266629 -151250
2024a51250J13928m72976L9983J84873o8493j29500J30914O7266Q1339L5371k99136
$$ -151250 -37322 -510298 -470315 -285442 -353935 -483435 -352521 -285255 -203916 -168545 -467681
2013d67681p0164J34289K60791J27386j71369k26473m9124K1722J65268K4544
$$ -467681 -537845 -403556 -142765 -15379 -186748 -413221 -462345 -440623 -275355 -250811
2003b50811K66776j52952O6706j36956L0381K05544o3843r4777n825k6798L8621
$$ -250811 15965 -136987 -70281 -207237 -176856 28688 -35155 -129932 -135757 -162555 -123934
1992a23934K22804j21341l88488j19605J77844K17111m4260K01067k85805O4549
$$ -123934 98870 -22471 -410959 -530564 -352720 -135609 -179869 21198 -264607 -200058
1982b00058J3062j06114J33841N9926o697j1520j28301L01830j35027j73552l4371
$$ -200058 -186996 -293110 -159269 -99343 -106040 -117560 -245861 55969 -79058 -252610 -286981
1971b86981j66030j7340J63900J85383J02534j56889k70221J50994n2910J26192
$$ -286981 -453011 -470351 -306451 -121068 -18534 -175423 -445644 -294650 -347560 -221368
1961b21368L08736j47331J15192N3963q3179k089P1331q0350l14790j43048Q476
$$ -221368 87368 -59963 55229 109192 26013 23924 95255 14905 -299885 -442933 -434457
1950d34457J15955L3237J02589l0318J2874K303k7378K4410P2048J20337R2187
$$ -434457 -318502 -285265 -182676 -212994 -200120 -197817 -225195 -200785 -128737 -8400 83787
1939H3787j84031J20102M05482k98392l95376K33572K02078l31692j50096J98374
$$ 83787 -100244 19858 425340 126948 -268428 -34856 167222 -164470 -314566 -116192
1929a16192J13239Q2995j28622k43992J08843q726R143R0163O5682K4017R754
$$ -116192 -2953 80042 -48580 -292572 -183729 -192455 -183312 -93149 -27467 -3450 6304
1918F304j26155q3301k6999M0039M6940p256K75062J49848p4168k65412K12926
$$ 6304 -119851 -203152 -230151 -190112 -143172 -150428 124634 274482 200314 -65098 147828
1907A47828k22639n3615j3524K81991k05438k99753m1626L9200j96090J75062
$$ 147828 -74811 -128426 -141950 140041 -65397 -365150 -406776 -367576 -563666 -388604
1897c88604k0154K49156K28121k26362O6573K5853j599K284j01909p4995L1960
$$ -388604 -408758 -159602 68519 -157843 -91270 -65417 -67016 -64732 -166641 -241636 -209676
1886b09676o381j54785N3619N0663n6502Q0781J30327N2658j14881K62200Q7851
$$ -209676 -216057 -370842 -317223 -266560 -323062 -242281 -111954 -59296 -174177 88023 175874
1875A75874j3421k94258K11109M5412k39578m9958M6947q3253Q0709o844R6293
$$ 175874 162453 -131805 79304 124716 -114862 -164820 -117873 -201126 -120417 -127261 -30968
1864c0968j3265k32413j48322Q1978K40993j95657j6065r8J26158P883o4659k61272
$$ -30968 -44233 -276646 -424968 -342990 -101997 -297654 -313719 -313817 -187659 -179776 -244435 -505707
1852e05707r6145J12619J99340M8719j10562K18728L62904k39839k75162J16697
$$ -505707 -601852 -489233 -289893 -241174 -351736 -133008 229896 -9943 -285105 -168408
1842a68408j99393j5058J40947N0228n854k0225J12147K43590m08722O6479J46338
$$ -168408 -367801 -382859 -241912 -191684 -197538 -217763 -105616 137974 -270748 -204269 -57931
1831e7931M6172j53869r8180Q2251k00751j0371L11898K00712k32721J21531J86287
$$ -57931 -11759 -165628 -263808 -181557 -382308 -392679 -80781 119931 -112790 8741 195028
1820A95028n9343p3873J07370l01570O1577n9487j07748J94983k1697K871k8499
$$ 195028 135685 61812 169182 -132388 -70811 -130298 -238046 -43063 -64760 -61889 -90388
1809i0388j55708o8740K46730J55632o3212J30504K48677k84794j280J49578p0094
$$ -90388 -246096 -314836 -68106 87526 24314 154818 403495 118701 117421 266999 196905
1798A96905k69764k7123j73380m8818M23405K7805O2798P706J05737j39108N9216
$$ 196905 -72859 -99982 -273362 -322180 101225 129030 191828 199534 305271 166163 225379
1787B25379k98897l27872J81591N5973j1609M5900K581M8324K68143n0019r091
$$ 225379 -73518 -401390 -219799 -163826 -175435 -129535 -126954 -78630 189513 139494 130403
1776A30403k09460r0662m19108j53152K14895K96893J78376J5645J46965j55943
$$ 130403 -79057 -169719 -588827 -741979 -527084 -230191 -51815 -36170 110795 -45148
1766d5148j80552j54938l4625N4962J88942J05673J4034M1589q5949J98200k4338
$$ -45148 -225700 -380638 -415263 -360301 -171359 -65686 -51652 -10063 -96012 102188 77850
1755G7850m4072q5330j41037m5209l9147j12626o600l0971n1431j4307K00351
$$ 77850 33778 -51552 -192589 -237798 -276945 -389571 -396171 -427142 -478573 -492880 -292529
1744b92529L07303p1828k14927m660J8351k00313J50589J09071j17326r4333J11337
$$ -292529 14774 -57054 -271981 -276641 -258290 -458603 -308014 -198943 -316269 -410602 -299265
1733b99265J62525K54097n6211l55632L3971K4085Q4991J17197J43856j98029
$$ -299265 -136740 117357 61146 -294486 -260515 -236430 -151439 -34242 109614 -88415
1723h8415j3361J75203K2828l4711k9685p2752l75746J20614R7212j37829M0170
$$ -88415 -101776 73427 96255 61544 31859 -40893 -416639 -296025 -198813 -336642 -296472
1712b96472J53087J56209j04621J61016m7110J1794j44980N9875J76384j93130
$$ -296472 -143385 12824 -91797 69219 22109 33903 -111077 -51202 125182 -67948
1702f7948j9397o2067o9878J01647R5168l4459l05244k4948J71871k00195J32737
$$ -67948 -87345 -149412 -219290 -117643 -22475 -56934 -362178 -387126 -215255 -415450 -282713
1691b82713J13522j24446Q2677k15305K2334R8673L8595N0512R4034k6797q5076
$$ -282713 -169191 -293637 -210960 -426265 -403931 -305258 -266663 -216151 -122117 -148914 -233990
1680b33990Q4821K6929r3637p3130K45227r782J36134k45935L9104J43992j59404
$$ -233990 -149169 -122240 -215877 -289007 -43780 -53562 82572 -163363 -124259 19733 -139671
1669a39671l3135J69801j41699O9141k18517K06546J06129J87001o0203k36611
$$ -139671 -172806 -3005 -144704 -75563 -294080 -87534 18595 205596 145393 -91218
1659i1218j6418j95383O3615K75728p0316J07759J58987j92812l93154n604J51417
$$ -91218 -107636 -303019 -239404 36324 -33992 73767 232754 39942 -353212 -358816 -207399
1648b07399j28389K48835K85190j66373m4858k11782Q0167Q1686r1643l2368O6866
$$ -207399 -335788 -86953 198237 31864 -12994 -224776 -144609 -62923 -154566 -186934 -120068
1637a20068P5559k51380J75552J25554k55269N0656k7960n319P3191J13463J41002
$$ -120068 -44509 -295889 -120337 5217 -250052 -199396 -227356 -232675 -159484 -46021 94981
1626I4981j97972j13074K63121J60811j93813K05074j8884q4725l5850j06320
$$ 94981 -102991 -216065 47056 207867 14054 219128 200244 115519 79669 -26651
1616b6651k17061n1457o5120L6220K91374J35823j54829q5457J62703j277k2104
$$ -26651 -243712 -295169 -360289 -324069 -32695 103128 -51701 -137158 25545 24268 2164
1605B164N9256J3694r7528K76427J18292m09677q2694J35579q0711j23902P7799
$$ 2164 61420 75114 -22414 254013 372305 -37372 -120066 15513 -65198 -189100 -111301
1594a11301m0348M8027J32127k575k7023o1711k63284J18969j62691K15130m4019
$$ -111301 -151649 -103622 28505 25930 -1093 -62804 -326088 -207119 -369810 -154680 -198699
1583a98699M7352n3212J19411L3975j25377k3850R1973j78453K9993J17015J49701
$$ -198699 -151347 -204559 -85148 -51173 -176550 -200400 -108427 -286880 -256887 -139872 9829
1572I829K42549k95005k97700R2300j01922L1963K41334n0388k45005L44376K90564
$$ 9829 252378 -42627 -340327 -248027 -349949 -317986 -76652 -127040 -372045 -27669 262895
1561B62895k14897l13627R6728K25511j39608N1450m6817j25388K18673j5631
$$ 262895 47998 -265629 -168901 56610 -82998 -31548 -78365 -203753 14920 -711
1551g11P167J4265k28115K5785j84652K33265J17765M53j29954J08967K15616
$$ -711 6456 20721 -207394 -181609 -366261 -132996 -15231 -14778 -144732 -35765 179851
1540A79851k3496k60365j28020K19040K4009j75633J97855j6971k55505K57409
$$ 179851 156355 -104010 -232030 -12990 11019 -164614 33241 16270 -239235 18174
1530A8174r5162M4595J08846J15971j21376j68062M73714q4652k14638q9190P8425
$$ 18174 -76988 -32393 76453 192424 71048 -97014 376700 292048 77410 -11780 66645
1519F6645O3256n3182J70565p4417j31169p9279K032J0209j11155L36512k93230
$$ 66645 129901 76719 247284 172867 41698 -37581 -35549 -25340 -136495 200017 -93213
1508i3213l16638J22018J07371P1985K72607k45771j18512R2575J37033j31257
$$ -93213 -409851 -287833 -180462 -108477 164130 -81641 -200153 -107578 29455 -101802
1498a01802k08412P8118J30626M0883p5330J53694N0185j79958K959J93644o3764
$$ -101802 -310214 -232096 -101470 -60587 -135917 17777 67962 -111996 -109037 84607 20843
1487B0843j65960k14030R4432J44302K24936o5495j84332m544Q3067K44596k14150
$$ 20843 -145117 -359147 -264715 -120413 104523 39028 -145304 -149848 -66781 177815 -36335
1476c6335n2527o3106n2618J728o739j22928L70866Q1418j9805K94429N0111j4453
$$ -36335 -88862 -151968 -204586 -202858 -209597 -332525 38341 119759 99954 394383 444494 430041
1464D30041j75990n9714N5171l38799r1157N5047K98162n9627k28624N2845j70044
$$ 430041 254051 194337 249508 -89291 -180448 -125401 172761 113134 -115490 -62645 -232689
1453b32689j1962Q2485J42480k27647j9847O7952L56515J11j36393j70775J90045
$$ -232689 -244651 -162166 -19686 -247333 -267180 -199228 157287 157398 21005 -149770 40275
1442D0275K35270o7988j85848k34592L40240J77825n83466N5714J32874K36784
$$ 40275 275545 207557 21709 -212883 127357 305182 -278284 -222570 -89696 147088
1432A47088j11163l02595K04797j30924P7594J25233j14216j26689O2744N2610
$$ 147088 35925 -266670 -61873 -192797 -115203 10030 -104186 -230875 -168131 -115521
1422a15521N979j51642J76357j24052j4491l6554K16068J49477m4002R7774k00058
$$ -115521 -109542 -261184 -84827 -208879 -223370 -259924 -43856 105621 61619 159393 -40665
1411d0665R5861j04055N4822K15927J25701j70929j19378j29452J33893k9992
$$ -40665 55196 -48859 5963 221890 347591 176662 57284 -72168 61725 31733
1401C1733j4521j2190M4044J29701k69531j92657K91923k2196N1314j92070j24198
$$ 31733 17212 5022 49066 178767 -90764 -283421 8502 -13694 37620 -154450 -278648
1390b78648K92846p9084k0043k1626j9962P2943K11617l40611J15334m8123r183
$$ -278648 14198 -64886 -84929 -106555 -126517 -53574 158043 -182568 -67234 -115357 -124540
1379a24540L5862k0688K33217L09040J11319k55555j20660P133r2244n1863K44099
$$ -124540 -88678 -109366 123851 432891 544210 288655 167995 175128 82884 31021 275120
1368B75120k55537k40528P7273J9487j58566j02430J61170j32130J70689J34368
$$ 275120 19583 -220945 -143672 -124185 -282751 -385181 -224011 -356141 -185452 -51084
1358e1084L8651o9776m8589m2214P1115K31968l03324k669j9567O178J50293K06652
$$ -51084 -12433 -82209 -130798 -173012 -101897 130071 -173253 -175922 -195489 -189311 -39018 167634
1346A67634J87849j67475l47995N888j18007Q6968N3048k0575M6815J73581j94272
$$ 167634 355483 188008 -159987 -154099 -272106 -185138 -132090 -152665 -105850 67731 -126541
1335a26541k15685K48987j01578J40386K25908j3961m804j54295m9603p885J387
$$ -126541 -342226 -93239 -194817 -54431 171477 157516 152712 -1583 -51186 -59071 -57684
1324e7684J6993J43502q9837J97359M23405l62167k23085M5220N9687l8128k05816
$$ -57684 -40691 102811 12974 210333 633738 271571 48486 93706 153393 115265 -90551
1313i0551N7883j15087Q2543m7244J3882J60887j25096l4030k79223J22237m261
$$ -90551 -32668 -147755 -65212 -112456 -98574 62313 -62783 -96813 -376036 -253799 -258060
1302b58060l414K85213K74700o1192p5216p921j15162p2602k45429N2420K17381
$$ -258060 -261474 23739 298439 237247 162031 154110 38948 -33654 -279083 -226663 -9282
1291i282K7741j9833j10841j90587J06657J6831p5193o4984n035K31858K3542
$$ -9282 18459 -1374 -112215 -302802 -196145 -179314 -254507 -319491 -324526 -92668 -69126
1280f9126j54769J15928K74090j28097j63008J02488j13637j10320J66651K53096
$$ -69126 -223895 -107967 166123 38026 -124982 -22494 -136131 -246451 -79800 173296
1270A73296K3277j11613l093N0899n1266p7720J12683n9344j70131j58426K16431
$$ 173296 196573 84960 81867 132766 81500 3780 116463 57119 -113012 -271438 -55007
1259e5007M4650l67735J43183L55423j74868j37385j00723Q3335J1047R6629Q9789
$$ -55007 -10357 -378092 -234909 120514 -54354 -191739 -292462 -209127 -198080 -101451 -11662
1248a1662K15770O7377l32230j2896N1971n4265J50993l4787n740k28600J22476
$$ -11662 204108 271485 -60745 -73641 -21670 -75935 75058 40271 34531 -194069 -71593
1237g1593K09389k68500P414J03126J49392P1663k2564j85339J42561K29777M0418
$$ -71593 137796 -130704 -123290 -20164 129228 200891 178327 -7012 135549 365326 405744
1226D05744l21524j04701J68463J67843k80611n2214M9775j52671m4861k3544
$$ 405744 84220 -20481 147982 315825 35214 -17000 32775 -119896 -164757 -188301
1216a88301L11225n5416j77352k28577N596L58749J87146j70297j21783j50274
$$ -188301 122924 67508 -109844 -338421 -332825 25924 213070 42773 -79010 -229284
1206b29284j40881K7287K53695J014P6993j42260N8186l922k06242L87720q9697
$$ -229284 -370165 -342878 -89183 -88169 -11176 -153436 -95250 -99172 -305414 82306 -7391
1195g391k11376p9101K41532k04814k9544k13143J58071K19130j31997J39602
$$ -7391 -218767 -297868 -56336 -261150 -290694 -503837 -345766 -126636 -258633 -119031
1185a19031m3700q0853J91620J1848k48026J41646K54474Q1515q4027j85698L1390
$$ -119031 -162731 -243584 -51964 -40116 -288142 -146496 107978 189493 105466 -80232 -48842
1174d8842K97969P3310J23488j90282m4803O5948j72811k6956q8328k12176L62663
$$ -48842 249127 322437 445925 255643 210840 276788 103977 77021 -11307 -223483 139180
1163A39180k62168N4903k60539J78316M40068j07731j01204j0889O2201q1093
$$ 139180 -122988 -68085 -328624 -150308 289760 182029 80825 69936 132137 51044
1153E1044k58620j86212K78814r6336k6709Q9786K31932K83294o1245p5835J6243
$$ 51044 -207576 -393788 -114974 -211310 -238019 -148233 83699 366993 305748 229913 246156
1142B46156l12146J69862K09848q069j94388l5137j35768J58888k69602j28158
$$ 246156 -65990 103872 313720 305651 111263 76126 -59642 99246 -170356 -298514
1132b98514J32132J59988j35899L8966K37522J26845l93259j64175L06J68357
$$ -298514 -166382 -6394 -142293 -103327 134195 261040 -132219 -296394 -296088 -127731
1122a27731K06768k42606J90234Q2336j3937k58120k1479M2308P5912J06719J71103
$$ -127731 79037 -163569 26665 109001 95064 -163056 -184535 -142227 -66315 40404 211507
1111B11507k17755m6430k4988J0005J01855o5486k29485J13202K9279N1376K39820
$$ 211507 -6248 -52678 -77666 -67661 34194 -31292 -260777 -147575 -118296 -66920 172900
1100A72900j60668j19004k06645K07696k0899J89874l06709J56479K38808j61349
$$ 172900 12232 -106772 -313417 -105721 -126620 63254 -243455 -86976 151832 -9517
1090i517o5491J85636j1755J20626j43807k34316l2873J05858J14827K05407o3774
$$ -9517 -75008 110628 98873 219499 75692 -158624 -191497 -85639 29188 234595 170821
1079A70821j1116K55802n13683J16949p5912o3218K21911L0828R3394J10727k15115
$$ 170821 159705 415507 -98176 18773 -57139 -120357 101554 132382 225776 336503 121388
1068A21388m6528k871K21639l63815J6436l1942j62776Q8332J07550j3087j3513
$$ 121388 74860 71989 293628 -70187 -53751 -85693 -248469 -160137 -52587 -65674 -79187
1057g9187O2489k7714m8314L29392j6550j19271O6115k63313J16887J27337J396
$$ -79187 -16698 -44412 -92726 236666 220116 100845 166960 -96353 20534 147871 149267
1046A49267o2317k34242Q976K7699k02156j86258j23693L33636J00328J77456
$$ 149267 86950 -147292 -138316 -110617 -312773 -499031 -622724 -289088 -188760 -11304
1036a1304j1381J18110J36436j48904R6876K90626J07314m26223N2611j78493
$$ -11304 -22685 95425 231861 82957 179833 470459 577773 151550 204161 25668
1026B5668j56992N4888K4123k64168L09026K61079j783J7026n6339m12351r641
$$ 25668 -131324 -76436 -52313 -316481 -7455 253624 251841 268867 212528 -199823 -209464
1015b09464j19515J42720K91638j25320K4012P385j2334J29144J02989j42067
$$ -209464 -328979 -186259 105379 -19941 4071 11456 -878 128266 231255 89188
1005H9188M59214k29119k64786N8459J53678J27488l9963k5259k27913k88275
$$ 89188 548402 319283 54497 112956 266634 394122 354159 328900 100987 -187288
995a87288K10476j15309K19912j06440j79749J4770N2443J6138K05019k01187
$$ -187288 23188 -92121 127791 21351 -158398 -143628 -91185 -75047 129972 -71215
985g1215j56810K25175J36423l09181j69722K13128l90764L94181J61956K5428
$$ -71215 -228025 -2850 133573 -175608 -345330 -132202 -522966 -128785 33171 58599
975E8599k57324J12221j41289J95143K32776l0543J14541O0408l13625k10010
$$ 58599 -198725 -86504 -227793 -32650 200126 169583 284124 344532 30907 -179103
965a79103L04701N903N1399j01827l9708j32303m4361j30467J58959K44429J56488
$$ -179103 125598 131501 182900 81073 41365 -90938 -135299 -265766 -106807 137622 294110
954B94110l47033l86151K68801N5880o0113R1259L9252q8190j19678J27624J3700
$$ 294110 -52923 -439074 -170273 -114393 -174506 -83247 -43995 -132185 -251863 -124239 -110539
943a10539n6386L43664O7658j61024k19003p2639J26142J8169K01196K31227j93272
$$ -110539 -166925 176739 244397 83373 -135630 -208269 -82127 -63958 137238 368465 175193
932A75193k46399K48571K51964l19007j50859K04153k60700K9283j16498N2848
$$ 175193 -71206 177365 429329 110322 -40537 163616 -97084 -67801 -184299 -131451
922a31451L79660P2620j89387K14510k43885k6649O3123m3694j83521L13575j02001
$$ -131451 248209 320829 131442 345952 102067 75418 138541 94847 -88674 224901 122900
911A22900P7112N6338j42091n7370j00412j91559K21474K80805k10868J58708
$$ 122900 200012 256350 114259 56889 -43523 -235082 -13608 267197 56329 215037
901B15037J13671j28411J84905p2368n9943J81958N3251n6962l63597P38k18355
$$ 215037 328708 200297 385202 312834 252891 434849 488100 431138 67541 68279 -150076
890a50076R2081Q1535K40591p6675n329j51996o2673j5765l0396K79419J22210
$$ -150076 -57995 23540 264131 187456 182127 30131 -32542 -48307 -78703 200716 322926
879C22926k96870M7321P0238q7661k70486P9628K14018J22495j7971k34634l5142
$$ 322926 26056 73377 143615 55954 -214532 -134904 79114 201609 183638 -50996 -86138
868h6138J29932m6146N8293J70904p4128J37778p5017k23064J5227m9718Q8803
$$ -86138 43794 -2352 55941 226845 152717 290495 215478 -7586 7641 -42077 46726
857D6726K1715J00712J07347j49533k0927L864m6864j25315K3632M5619J83851
$$ 46726 68441 169153 276500 126967 106040 109904 63040 -62275 -38643 6976 190827
846A90827r3348l36555K1077n6198K88047m1536m4932N4218J01069K335R6338
$$ 190827 97479 -239076 -217999 -274197 13850 -27686 -72618 -18400 82669 85004 181342
835A81342m4540K797j46121O3251p9056l31540J40811J44105J48520K95089j17274
$$ 181342 136802 139599 -6522 56729 -22327 -353867 -213056 -68951 79569 374658 257384
824B57384k98242K7098J17137p7259J56446K42272m1285J67059l05755j01193
$$ 257384 -40858 -13760 103377 26118 182564 424836 383551 550610 244855 143662
814A43662N0413k53111j74719K17497P2616L4261k7043M2519Q4776m1322P417
$$ 143662 194075 -59036 -233755 -16258 56358 90619 63576 106095 190871 149549 156966
803A56966r2129q1216j32301P719J78671m2853o2480P1050R5215J45139j25951
$$ 156966 64837 -16379 -148680 -140961 37710 -5143 -67623 3427 98642 243781 117830
792A17830K26426l5131o6128J12953R1271k90734k02787j14374K67276K09261
$$ 117830 344256 309125 242997 355950 447221 156487 -46300 -160674 106602 315863
782C15863l42546N7583q897K52856M5245M781j62032L0679k09932J62727j15026
$$ 315863 -26683 30900 22003 274859 320104 324885 162853 193532 -16400 146327 31301
771C1301K2686r4241L60256j04082j14919R3528n4900Q8807j5041J01777M9579
$$ 31301 53987 -40254 320002 215920 101001 194529 139629 228436 213395 315172 364751
760C64751p1902j95833P8223J61541k96970Q7936j3387k07327J59401j34502L0510
$$ 364751 292849 97016 175239 336780 39810 127746 114359 -92968 66433 -68069 -37559
749c7559n8375j84551K42995L18888J07272p5149k74924o1163J386J26820R074
$$ -37559 -95934 -280485 -37490 281398 388670 313521 38597 -22566 -21180 105640 114714
738A14714j95825k13645J50364K2539K04686o7414o1615K81031R6566j2792r2443
$$ 114714 -81111 -294756 -144392 -121853 82833 15419 -46196 234835 331401 318609 226166
727B26166k6765j34590J31545J7901k46756j16629l46424J45864K91898n7422
$$ 226166 199401 64811 196356 214257 -32499 -149128 -495552 -349688 -57790 -115212
717a15212o996Q9445r3442R0382R5122o514k22319q8042J6752P1439P5956k4475
$$ -115212 -122208 -32763 -126205 -35823 59299 52785 -169534 -257576 -240824 -169385 -93429 -117904
705a17904j29468J09082J71905j14K37242j33820m3132j08119j68037p9073J70391
$$ -117904 -247372 -138290 33615 33501 270743 136923 93791 -14328 -182365 -261438 -91047
694i1047K83346J06329r4054l55737O5594K24026J60262j94104k30067R6626P3426
$$ -91047 192299 298628 204574 -151163 -85569 138457 298719 104615 -125452 -28826 44600
683D4600K59752j1678r0486m8833q830R6107q5135j8992j16077Q6862N9010N850
$$ 44600 304352 292674 202188 153355 144525 240632 155497 136505 20428 107290 166300 172150
671A72150k63545L65086J03655k24838L1911m8301J9791K06435l17647m19943
$$ 172150 -91395 273691 377346 152508 184419 136118 155909 362344 44697 -375246
661c75246J14553M48785M8911J41649J7272j21347j68238J9633n335n35566l218
$$ -375246 -260693 188092 237003 378652 395924 274577 106339 125972 120637 -414929 -418147
650d18147N35175J8267k49942J64150m2928J56677M0963k62821p3786N0400J18022
$$ -418147 117028 135295 -114647 49503 6575 163252 204215 -58606 -132392 -81992 36030
639C6030J11400j86902j31701R9028P4083O8822o3229k3185J50877k1103k24649
$$ 36030 147430 -39472 -171173 -72145 1938 70760 7531 -15654 135223 114120 -110529
628a10529n2688L68971M8939J22228n4534j78203k15081j01946R6242L6314m48777
$$ -110529 -163217 205754 254693 376921 322387 144184 -70897 -172843 -76601 -40287 -489064
617d89064K95953M71926K31438j63565J78802n4608k92412l90374P5962O3557
$$ -489064 -193111 278815 510253 346688 525490 470882 178470 -211904 -135942 -72385
607g2385k66865R8639j19497J17786L69392Q7190J38832r5715l60952k8621K57271
$$ -72385 -339250 -240611 -360108 -242322 127070 214260 353092 257377 -103575 -132196 125075
596A25075M1693j33716j58743J73359J87163j98345L99063j7604k85591j13006
$$ 125075 166768 33052 -125691 47668 234831 36486 435549 417945 132354 19348
586A9348O8707o1322J14709L6433k63059J60415J57074M1938j20136k36163j0984
$$ 19348 88055 26733 141442 177875 -85184 75231 232305 274243 154107 -82056 -93040
575i3040o3690m2179K41478J39748k08331q305J94703j556j57063j97272k5162
$$ -93040 -156730 -198909 42569 182317 -26014 -34319 160384 158828 1765 -195507 -220669
564b20669L26001p3287J75240K20724n5696j27657l89207R1934J70761L2380m76258
$$ -220669 105332 32045 207285 428009 372313 244656 -144551 -52617 118144 150524 -325734
553c25734L93704K69220k15453j55345Q8474J81428j29599J13517j57819J9979
$$ -325734 67970 337190 121737 -33608 54866 236294 106695 220212 62393 82372
543H2372J3904J05688o6403P8952P8694j40159j80405J09425m9107o1632k86362
$$ 82372 96276 201964 135561 214513 293207 153048 -27357 82068 32961 -28671 -315033
532c15033J55804l3015R5863O2589J5796J87534o8410j75146j44078k7388J02737
$$ -315033 -159229 -192244 -96381 -33792 -17996 169538 101128 -74018 -218096 -245484 -142747
521a42747Q3661p0020n7760K08657o483o1522K4556K89474o4531j55322j70900
$$ -142747 -59086 -129106 -186866 21791 15308 -46214 -21658 267816 203285 47963 -122937
510a22937R2589K69299J78451J64920j95201q7133j87444K87969r3576J35929
$$ -122937 -30348 238951 417402 582322 387121 299988 112544 400513 306937 442866
500D42866k00122q3910k5158Q8348l2312l14324K59945j78938K0915k3563K80398
$$ 442866 242744 158834 133676 222024 189712 -124612 135333 -43605 -22690 -46253 234145
489B34145J87475l61535j86460K17804J27659j20427q5801J23409n4981l53287
$$ 234145 421620 60085 -126375 91429 219088 98661 12860 136269 81288 -271999
479b71999K34625J53221q9051K02922p2910j7677j63774J16471J8714J39181K05462
$$ -271999 -37374 115847 26796 229718 156808 139131 -24643 91828 110542 249723 455185
468D55185m14288o8128K68408M9459j82697m5629R3617J7139k04371Q9270j39028
$$ 455185 40897 -27231 241177 290636 107939 62310 155927 173066 -31305 57965 -81063
457h1063P9523N2648K56930k59661r5712k02236P6455L38590K18223L6745j41514
$$ -81063 -1540 51108 308038 48377 -47335 -249571 -173116 165474 383697 420442 278928
446B78928l44012q7824J92135K381R383m6641o7432J3732P3170J30601l2175q3442
$$ 278928 -65084 -152908 39227 41608 50991 4350 -63082 -49350 23820 154421 122246 38804
434C8804J16717o2935j92379j46295J21473J39278j88788K01291j48024m5260
$$ 38804 155521 92586 -99793 -246088 -124615 14663 -174125 27166 -120858 -166118
424a66118K40681j02906J00289j30784Q3283J36511l29r0743N4793j79613K2984
$$ -166118 74563 -28343 71946 -58838 24445 160956 160627 69884 124677 -54936 -31952
413c1952M6911j35905l2886q6069P1224K2353J94439J89273N3904j00656j13053
$$ -31952 14959 -120946 -153832 -239901 -168677 -146324 48115 237388 291292 190636 77583
402G7583K2433K02237q3644k03737l14673J79177J10523P5959K59918k18064j74998
$$ 77583 100016 302253 218609 14872 -299801 -120624 -10101 65858 325776 107712 -67286
391f7286j37771J75358J07206R8992K2330R9160m1432p226j26637l13091L0164
$$ -67286 -205057 -29699 77507 176499 198829 297989 256557 249331 122694 -190397 -160233
380a60233J19046j00613J78922L00699r4630k06357J60182k34939n3268P5085
$$ -160233 -41187 -141800 37122 337821 243191 36834 197016 -37923 -91191 -16106
370a6106L0030k04007j3975K76569P6435j55177r0348K26853L1205k01748P2651
$$ -16106 13924 -190083 -204058 72511 148946 -6231 -96579 130274 161479 -40269 32382
359C2382J4828J55011j86977j30796j7972r3398O547j9681k2677Q2996J82081
$$ 32382 47210 202221 15244 -115552 -133524 -226922 -220375 -240056 -262733 -179737 2344
348B344K02454K18695L5384j56520m69886p8666J7840Q0766J41743k45778N9945
$$ 2344 204798 423493 458877 302357 -167529 -246195 -228355 -147589 -5846 -251624 -191679
337a91679Q4763J8304N2414n4491J84939L01108J26338k19511R4976o1192j91686
$$ -191679 -106916 -88612 -36198 -90689 94250 395358 521696 302185 397161 335969 144283
326A44283l2224O4421n5639l08576k6757L86089N5642N6068O10k00862K13275
$$ 144283 112059 176480 120841 -187735 -214492 171597 227239 283307 283917 83055 296330
315B96330n1926J960k68857p075O5466j62797Q9249n0136J02001K64917k45785
$$ 296330 244404 246364 -22493 -29568 35898 -126899 -37650 -87786 14215 279132 33347
304C3347k14696O2979J27281J59011l16208K15207q7739M6947j53674J47301k5827
$$ 33347 -181349 -118370 8911 167922 -148286 66921 -20818 26129 -127545 19756 -6071
293f071J39336R4617j43132J02232J60331p8339k56643Q9377m5683J1124k40064
$$ -6071 133265 227882 84750 186982 347313 268974 12331 101708 56025 67149 -172915
282a72915j29692k785P1456Q1686J28446J64723m1824j73720o9857j88797J18327
$$ -172915 -302607 -305392 -233936 -152250 -23804 140919 99095 -74625 -144482 -333279 -214952
271b14952J73745P2219o1795P6714R2444N6065K4528J01270k34747n054J8764
$$ -214952 -41207 31012 -30783 45931 138375 194440 218968 320238 85491 80437 99201
260I9201J04431J35939Q0216m35717m4786M171N5408R6839l61987J32604J53047
$$ 99201 203632 339571 419787 -15930 -60716 -56545 -1137 95702 -266285 -133681 19366
249A9366O2473j66196J09478j09942l9969n0114N8797O4328J47561l4061K48283
$$ 19366 81839 -84357 25121 -84821 -124790 -174904 -116107 -51779 95782 61721 310004
238C10004p2544N6305J11966j47507k06668j3286j10869J53156R9411K1972r8541
$$ 310004 237460 293765 405731 258224 51556 38270 -72599 80557 179968 201940 103399
227A03399j82958m4763M1340K6358R8457L6818K45640o0686k16552N5169n2798
$$ 103399 -79559 -124322 -82982 -56624 41833 78651 324291 263605 47053 102222 49424
216D9424k7827m5862J25695J28606l240k60671r7382J71087J36918q3632O1156
$$ 49424 21597 -24265 101430 230036 226796 -33875 -131257 39830 176748 93116 154272
205A54272K1602m3977k60689n8473p413J923m244K4806K75648L6217j70842K28317
$$ 154272 175874 131897 -128792 -187265 -194678 -192755 -196999 -172193 103455 139672 -31170 197147
193A97147l4040N6526r0794j39726p7773J40248N3599Q9882r5964o9918R915k02416
$$ 197147 163107 219633 128839 -10887 -88660 51588 105187 195069 99105 29187 39102 -163314
181a63314J54742o9595l73749K55236O4421n3293k14610K98699R9611J3498j47275
$$ -163314 -8572 -78167 -451916 -196680 -132259 -185552 -400162 -101463 -1852 11646 -135629
170a35629j28283J75603O0835K7295r5852J14575J9850r544j61681m0284k12512
$$ -135629 -263912 -88309 -27474 -179 -96031 18544 38394 28850 -132831 -173115 -385627
159c85627P1352J96837K63626j98135j64026J26944j06885P7273l7410J18078
$$ -385627 -314275 -117438 146188 -51947 -215973 -89029 -195914 -118641 -156051 -37973
149c7973J21918R3630m6044p3211R8813k17720J31957j2043J5135J8706N232n3180
$$ -37973 83945 177575 131531 58320 157133 -60587 71370 59327 74462 93168 98400 45220
137D5220r8160j0315j9591L2549o7661J28298Q5153j0062J61152P1101j32794
$$ 45220 -52940 -63255 -82846 -50297 -117958 10340 95493 85431 246583 317684 184890
126A84890j87135J53852N7880p9638o1587n942J63239q4985q3598q2312J00580
$$ 184890 -2245 151607 209487 129849 68262 62320 225559 140574 56976 -25336 75244
115G5244o4259k478j7331n0198P979R8577J61311l4863N5177j84430j23956J31345
$$ 75244 10985 8507 -8824 -59022 -51043 47534 208845 173982 229159 44729 -79227 52118
103E2118O3994l5137q6170J9451N5717k03995J69071l7135J37163j94456k7521
$$ 52118 116112 80975 -5195 14256 69973 -134022 35049 -2086 135077 -59379 -86900
92h6900J24687N7996n1362j39028P9525M4596q0923J04047P5855o7963l00121
$$ -86900 37787 95783 44421 -94607 -15082 29514 -51409 52638 128493 60530 -239591
81b39591m6743L72808l2291m8564j7009P1498j4918m2803j360m405P4643q2766
$$ -239591 -286334 86474 54183 5619 -11390 60108 45190 2387 1027 -3378 71265 -11501
69a1501j5061n1849J8910J48714o6190J04063p3833j57680J12880J25761n0431
$$ -11501 -26562 -78411 -59501 89213 23023 127086 53253 -104427 8453 134214 83783
58H3783l8068n0972N6107K7337k6726j23916K303r8853J69220p4654J15319r346
$$ 83783 45715 -5257 50850 78187 51461 -72455 -70152 -169005 215 -74439 40880 31534
46C1534k37372j6075K6625K27065J58176P6995k53557J0560O0992n4993J04931
$$ 31534 -205838 -221913 -195288 31777 189953 266948 13391 23951 84943 29950 134881
35A34881j45358Q8672j17196k8473P4174q8136J8320P3031j26204j34721J06078
$$ 134881 -10477 78195 -39001 -67474 6700 -81436 -63116 9915 -116289 -251010 -144932
24a44932L0591J09909J54548n7657j76120O1432J48105P398j49285k38723N4752
$$ -144932 -114341 -4432 150116 92459 -83661 -22229 125876 133274 -16011 -254734 -199982
$$ [...]
##END NTUPLES=NMR SPECTRUM
##END=
