##TITLE=1H_DE-80H_X3
 200.13MHz, d2o
 8 sc
 
 19ns.26.2.2025
##JCAMPDX= 6.0         $$ Bruker NMR JCAMP-DX V2.0
##DATA TYPE= NMR SPECTRUM
##DATA CLASS= NTUPLES
##ORIGIN= UXNMR, Bruker Analytische Messtechnik GmbH
##OWNER= pz
$$ XWIN-NMR		Version 3.5
$$ Tue Jul 29 09:57:37 2025 Russian Standard Time (UT+4h)  Yarkov@DPX200
##.OBSERVE FREQUENCY= 200.1313
##.OBSERVE NUCLEUS= ^1H
##.ACQUISITION MODE= SIMULTANEOUS
##.ACQUISITION SCHEME= undefined
##.AVERAGES= 8
##.DIGITISER RES= 18
##SPECTROMETER/DATA SYSTEM= spect
##.PULSE SEQUENCE= zg30
##.SOLVENT NAME= CDCl3
##.SHIFT REFERENCE= (INTERNAL, CDCl3, 0, 15.5221)
##AUDIT TRAIL= $$ (NUMBER, WHEN, WHO, WHERE, WHAT)
$$ ##TITLE= Audit trail, XWIN-NMR		Version 3.5
$$ ##JCAMPDX= 5.01
$$ ##ORIGIN= Bruker BioSpin GmbH
$$ ##OWNER= Yarkov
$$ C:/Bruker/XWIN-NMR/data/yarkov2/nmr/H-C/1/pdata/1/auditp.txt
$$ ##AUDIT TRAIL=  $$ (NUMBER, WHEN, WHO, WHERE, WHAT)
(   1,<2025-07-29 09:56:08.40 +0400>,<Yarkov>,<DPX200>,
      <created by zg, POWCHK disabled, PULCHK disabled
       configuration hash MD5:
       00 E9 B6 7A A2 85 ED C7 34 08 36 98 17 FE 4E 26
       data hash MD5: 16K
       BE 3B B4 8F 18 49 1C EF 63 D9 3C B7 77 40 20 80>)
(   2,<2025-07-29 09:56:25.01 +0400>,<Yarkov>,<DPX200>,
      <Start of raw data processing
       efp BC_mod = 2 LB = 0.25 FT_mod = 6 PKNL = 1 PHC0 = -1365.756 PHC1 = 13.59091 SI = 16K 
       data hash MD5: 16K
       CA 48 F5 C2 B6 04 CD 23 8B 2D FE CC 32 AC C6 D5>)
(   3,<2025-07-29 09:56:38.65 +0400>,<Yarkov>,<DPX200>,
      <pk PHC0 = 6.962707 PHC1 = -0.2000001 
       data hash MD5: 16K
       86 73 30 8D 78 B6 84 31 A0 EF 4F E0 58 B1 C1 22>)
(   4,<2025-07-29 09:56:41.62 +0400>,<Yarkov>,<DPX200>,
      <abs ABSG = 5 
       data hash MD5: 16K
       AA D0 DD 5E 21 7D B6 A0 1D 9D 04 C0 D4 3A 60 99>)
$$ ##END=
$$ 
$$ hash MD5
$$ C7 A4 87 A3 E1 2C FB 0F 74 8A BD 0B 08 E9 B4 35
##$RELAX= 
##$RELAX= 
##$RELAX= 
##$RELAX= 
##$RELAX= 
##$RELAX= 
$$ Bruker specific parameters
$$ --------------------------
##$DU= <C:/Bruker/XWIN-NMR>
##$EXPNO= 1
##$NAME= <H-C>
##$PROCNO= 1
##$TYPE= <nmr>
##$USER= <yarkov2>
##$AMP= (0..31)
100 100 100 100 100 100 100 100 100 100 100 100 100 100 100 100 100 100 
100 100 100 100 100 100 100 100 100 100 100 100 100 100 
##$AQSEQ= 0
##$AQ_mod= 1
##$AUNM= <au_zg>
##$AUTOPOS= <>
##$BF1= 200.13
##$BF2= 200.13
##$BF3= 200.13
##$BF4= 200.13
##$BF5= 200.13
##$BF6= 200.13
##$BF7= 200.13
##$BF8= 200.13
##$BYTORDA= 1
##$CFDGTYP= 0
##$CFRGTYP= 5
##$CHEMSTR= <none>
##$CNST= (0..31)
1 1 145 1 1 1 1 1 1 1 1 1 1 1 1 1 1 1 1 1 1 1 1 1 1 1 1 1 1 1 1 1 
##$CPDPRG= <>
##$CPDPRG1= <>
##$CPDPRG2= <>
##$CPDPRG3= <>
##$CPDPRG4= <mlev>
##$CPDPRG5= <mlev>
##$CPDPRG6= <mlev>
##$CPDPRG7= <mlev>
##$CPDPRG8= <mlev>
##$CPDPRGB= <>
##$CPDPRGT= <>
##$D= (0..31)
0 0.7 0 0 0 0 0 0 0 0 0 0.03 0 0 0 0 0 0 0 0 0 0 0 0 0 0 0 0 0 0 0 0 
##$DATE= 1753768567
##$DBL= (0..7)
120 120 120 120 120 120 120 120 
##$DBP= (0..7)
150 150 150 150 150 150 150 150 
##$DBP07= 0
##$DBPNAM0= <>
##$DBPNAM1= <>
$$ [...]
##$SUBNAM3= <"">
##$SUBNAM4= <"">
##$SUBNAM5= <"">
##$SUBNAM6= <"">
##$SUBNAM7= <"">
##$SUBNAM8= <"">
##$SUBNAM9= <"">
##$SW= 18.0517328524113
##$SWIBOX= (0..15)
0 0 2 0 0 0 0 0 0 0 0 0 0 0 0 0 
##$SW_h= 3612.71676300578
##$TD= 16384
##$TD0= 1
##$TE= 0
##$TE2= 300
##$TE3= 300
##$TEG= 300
##$TL= (0..7)
0 120 120 120 120 120 120 120 
##$TP= (0..7)
150 150 150 150 150 150 150 150 
##$TP07= 0
##$TPNAME0= <>
##$TPNAME1= <>
##$TPNAME2= <>
##$TPNAME3= <>
##$TPNAME4= <>
##$TPNAME5= <>
##$TPNAME6= <>
##$TPNAME7= <>
##$TPOAL= (0..7)
0.5 0.5 0.5 0.5 0.5 0.5 0.5 0.5 
##$TPOFFS= (0..7)
0 0 0 0 0 0 0 0 
##$TUNHIN= 0
##$TUNHOUT= 0
##$TUNXOUT= 0
##$USERA1= <user>
##$USERA2= <user>
##$USERA3= <user>
##$USERA4= <user>
##$USERA5= <user>
##$V9= 5
##$VALIST= <valist>
##$VCLIST= <CCCCCCCCCCCCCCC>
##$VD= 0
##$VDLIST= <DDDDDDDDDDDDDDD>
##$VPLIST= <PPPPPPPPPPPPPPP>
##$VTLIST= <TTTTTTTTTTTTTTT>
##$WBST= 1024
##$WBSW= 4
##$XGAIN= (0..3)
0 0 0 0 
##$XL= 0
##$YL= 0
##$YMAX_a= 527193
##$YMIN_a= -527612
##$ZGOPTNS= <>
##$ZL1= 120
##$ZL2= 120
##$ZL3= 120
##$ZL4= 120
##$ABSF1= 15.49127
##$ABSF2= -2.560579
##$ABSG= 5
##$ABSL= 3
##$ALPHA= 0
##$AQORDER= 0
##$ASSFAC= 0
##$ASSFACI= 0
##$ASSFACX= 0
##$ASSWID= 0
##$AUNMP= <proc_1d>
##$AZFE= 0.1
##$AZFW= 0.1
##$BCFW= 0
##$BC_mod= 2
##$BYTORDP= 0
##$COROFFS= 0
##$CY= -3
##$DATMOD= 1
##$DC= 0
##$DFILT= <>
##$DTYPP= 0
##$F1P= 0
##$F2P= 0
##$FCOR= 1
##$FTSIZE= 16384
##$FT_mod= 6
##$GAMMA= 0
##$GB= 0
##$INTBC= 1
##$INTSCL= 3.241238e-09
##$ISEN= 128
##$LB= 0.25
##$LEV0= 0
##$LPBIN= 0
##$MAXI= 10000
##$MC2= 0
##$MEAN= 0
##$ME_mod= 0
##$MI= 1.114404
##$NCOEF= 0
##$NC_proc= -5
##$NLEV= 6
##$NOISF1= 3.799351
##$NOISF2= 2.8
##$NSP= 0
##$NTH_PI= 0
##$NZP= 0
##$OFFSET= 15.52212
##$PC= 1
##$PHC0= -1358.793
##$PHC1= 13.39091
##$PH_mod= 1
##$PKNL= yes
##$PPARMOD= 0
##$PSCAL= 0
##$PSIGN= 0
##$REVERSE= no
##$SF= 200.129999915882
##$SI= 16384
##$SIGF1= 3
##$SIGF2= 2
##$SINO= 0.751879
##$SIOLD= 32768
##$SREGLST= <19F.Aceton>
##$SSB= 0
##$STSI= 16384
##$STSR= 0
##$SW_p= 3612.71676300578
##$SYMM= 0
##$S_DEV= 0
##$TDeff= 16384
##$TDoff= 0
##$TI= <>
##$TILT= no
##$TM1= 0
##$TM2= 0
##$TOPLEV= 0
##$USERP1= <user>
##$USERP2= <user>
##$USERP3= <user>
##$USERP4= <user>
##$USERP5= <user>
##$WDW= 1
##$XDIM= 16384
##$YMAX_p= 321070912
##$YMIN_p= -104621
$$ End of Bruker specific parameters
$$ ---------------------------------
##NTUPLES= NMR SPECTRUM
##VAR_NAME=  FREQUENCY,     SPECTRUM/REAL,   SPECTRUM/IMAG
##SYMBOL=    X,             R,               I
##VAR_TYPE=  INDEPENDENT,   DEPENDENT,       DEPENDENT
##VAR_FORM=  AFFN,          ASDF,            ASDF
##VAR_DIM=   16384,         16384,           16384
##UNITS=     HZ,            ARBITRARY UNITS, ARBITRARY UNITS
##FACTOR=    0.220516191357247, 1,           1
##FIRST=     3106.44196950997, 0,            0
##LAST=      -506.274793495812, 0,           0
##MIN=       -506.274793495812, -104621,     0
##MAX=       3106.44196950997, 321070912,    0
$$ Real data points
##PAGE= N=1
##DATA TABLE= (X++(R..R)), XYDATA
$$ [...]
6218C03524j0538J3553j280J7034N0865M0640O473K3748J1455J3515J9767L9224
6206E27980j5478L6426M5924O3852N6741O176M3623M0130P224N2493J9954L0445
6194I15490l4613l2147K4867J9192j9785j9745k7623K0726L4102K1254L2103o570
6182I27251L321k6012J7229J7327M7649K9834O0211K9711N1366L7692M5040n862
6170A234757n8324r1781j16553o4542o5903k9634n5179q4459k1147j8678l3550
6159E95007j5784j2445Q060O882l182l8053J4986N3772j7137j25K9401K6735O432
6146F54549q086J3360L4426l2541p5684r4101k1133n9365m9442j9135J0242j9837
6134C33253l2686J75L598J8350L671k5838J0092L414l4217j7491k1595r904K1472
$$ plain form
6218 303524 292986 306539 305259 322293 373158 413798 420271 444019 455474 468989 488756 527980
6206 527980 512502 548928 594852 658704 715445 721621 765244 805374 812598 865091 885045 915490
6194 915490 880877 848730 873597 892789 873004 853259 825636 846362 880464 901718 933821 927251
6182 927251 930572 904560 921789 939116 986765 1016599 1076810 1106521 1157887 1195579 1240619 1234757
6170 1234757 1176433 1084652 968099 903557 837654 808020 752841 668382 647235 628557 595007
6159 595007 579223 566778 574838 581720 578538 540485 555471 609243 592106 591981 621382 648117 654549
6146 654549 646463 659823 694249 661708 586024 491923 470790 411425 361983 342848 353090 333253
6134 333253 300567 300742 304340 322690 326361 300523 310615 314029 279812 262321 240726 230822 252294
6121B52294K5381k30J3480j0165K0865O633J9189L2021N5136R253j2353L8211
6109D49715N2274L2166J9648N6734L0696l8945l8882L8982J3716k1448L205L202
6097F01063J1278j599J1748K1937M4969J5783Q3501J9365M3719N8347R5141J27989
6085A133241O9927L3088L3284M0847K5027R504J6260L4300o9110j04705m9579
6074A172084m8172K2269J1331m4825k1262N7939L1059j922J7740L4220Q751O742
6062A245954N0188P7470O0346Q6249J25930P4591R6973K314j01252j52580j16042
6051A450141j32986j13235j22252q6423q0925m943n0525m8283P811l4949r634
6040G73797N6133n091l5265r708j096n833k442J652J2118p372q902Q0261J7202
$$ plain form
6121 252294 277675 277445 290925 280760 301625 308258 327447 359468 414604 423857 411504 449715
6109 449715 501989 534155 553803 610537 641233 602288 563406 602388 616104 594656 597861 601063
6097 601063 612341 610742 622490 644427 689396 705179 788680 808045 851764 910111 1005252 1133241
6085 1133241 1203168 1236256 1269540 1310387 1335414 1344918 1361178 1395478 1326368 1221663 1172084
6074 1172084 1123912 1146181 1157512 1112687 1091425 1149364 1180423 1178501 1196241 1230461 1239212 1245954
6062 1245954 1296142 1373612 1433958 1520207 1646137 1720728 1817701 1820015 1718763 1566183 1450141
6051 1450141 1317155 1203920 1081668 995245 914320 909377 858852 810569 818380 783431 773797
6040 773797 829930 824839 789574 779866 778770 772937 770495 772147 784265 776893 767991 848252 865454
6027H65454n237J3817k0420r8354o3554p9658l5834p3533j3478k0655k5937j4424
6015D28187j1548k6882r815L6493r613j2322K5405l7448k3975m4857j6941l044
6003B93640O74k9697l611K4424p924k1352k669k8937m0256J4282K6595J4920j6074
5990B24015j9175k3725L1266j0045J108R133J4511l5114j4377k8169N904J7518
5978A72850Q928Q182k1587K163j6485k9089L1543J0004K7231p968J5320j0501
5966A90591j5681q942J4147J2301p884j4448j844J5799J1892K6334J2842k75n714
5953B29118n56Q896P270p854Q89r199k0296L7671K543J1115j622j2529j2312k4209
5939B08925j3519K9058J2442J5965R79N856k736j79L163J329j4416k3201L936
$$ plain form
6027 865454 860217 874034 853614 755260 691706 612048 576214 502681 489203 468548 442611 428187
6015 428187 416639 389757 379942 416435 406822 394500 419905 382457 358482 313625 296684 293640
6003 293640 294314 264617 261006 285430 277506 256154 253485 224548 184292 198574 225169 240089 224015
5990 224015 204840 181115 212381 202336 203444 212577 227088 191974 177597 149428 155332 172850
5978 172850 181778 189960 168373 170536 154051 124962 156505 166509 193740 185772 201092 190591
5966 190591 174910 165968 180115 192416 184532 170084 168240 184039 195931 222265 235107 234832 229118
5953 229118 228562 237458 244728 236874 237763 228564 208268 245939 248482 259597 257975 245446 233134 208925
5939 208925 195406 224464 236906 252871 253850 259706 256970 256791 259954 261283 246867 223666 227602
5926B27602j5696j1513L615Q025j5151P066p584O297M1581k7757k7228l5272L086
5913A57071J2112m438K2365L1132n08j4954p423p269n490k7947M7112l6942K4841
5900A89662l461r161r26j6044k5990K9449K0803N569m1104k6381J7972J0759k4322
5887A26825K342r540l2613j172O056k672j3423L27K2343L4407M317k1069m946
5874A11182m442k2533l1686k95J9601q19J6465M013J1042j5046k8076K5321k1577
5861F3150k3286k5293K9303K2081j9252K3186r659l128L5650n318l1605J0138
5849F5967N496K7197j031P329l6089L7156L0496k2509k0382K4568M170m5432k214
5836G4722J9338K7410m4788k1277J4627p988J8247j9911j5955Q469L3969l4354
$$ plain form
5926 227602 211906 200393 204008 212033 196882 203948 196364 202661 244242 216485 189257 153985 157071
5913 157071 169183 164745 187110 218242 217734 202780 195357 188088 182598 154651 201763 164821 189662
5900 189662 186201 177040 176114 160070 134080 163529 184332 189901 148797 122416 140388 151147 126825
5887 126825 129167 119627 87014 85842 91898 89226 75803 76130 98473 132880 137197 116128 111182
5874 111182 106740 84207 52521 52226 71827 71008 87473 91486 102528 87482 59406 84727 63150
5861 63150 39864 14571 43874 65955 46703 69889 60230 57102 92752 87434 55829 65967
5849 65967 71463 98660 97629 104958 68869 106025 136521 114012 93630 118198 122368 76936 74722
5836 74722 94060 121470 76682 55405 70032 62044 80291 60380 44425 52894 86863 52509
5824E2509P559p124k3234M4757j5985j0003o244K5794K156O390j8745p819M450
5811E4461P441j3035L4156q29J0645J1446l1271K9188k7020K4152l9292p098L313
5798E6257O087M696j8643J0862o389j34L169L7357o665R831J5450J0039K4677
5785A46594l4579l4307J1877J5171j7998l3201J6876n117J7860J8231k2859l0596
5773D7952M980M260N158M792j1922M1334j3106k0981m426p26j4005P934L806J3228
5759F8278K55L978M2309l6961j8005K0131J2396k6467J3817k3112J4767J728J8089
5746I1203N065J3378q666k4024J8610K7470r84j5994p345R281k9643n2194K7112
5733E3269P409r466j9316J5917N177R763K5297J6855k3252K183j5902L7528l061
$$ plain form
5824 52509 60068 52944 29710 74467 58482 48479 42235 68029 70185 76575 57830 50011 54461
5811 54461 61902 48867 83023 82194 92839 104285 73014 102202 75182 99334 60042 52944 56257
5798 56257 62344 67040 48397 59259 52870 52736 55905 93262 86597 96428 111878 121917 146594
5785 146594 112015 77708 89585 104756 86758 53557 70433 65316 83176 101407 78548 47952
5773 47952 52932 57192 62350 67142 55220 96554 83448 62467 58041 57315 43310 51244 55050 68278
5759 68278 68533 72511 114820 77859 59854 79985 92381 65914 79731 56619 71386 73114 91203
5746 91203 96268 109646 100980 76956 95566 123036 122052 106058 98713 107994 78351 26157 53269
5733 53269 60678 51212 31896 47813 52990 62753 88050 104905 81653 83836 67934 105462 102401
5720A02401p265L8857R009n2827j195k3121J0566Q738L731l162m446J2525n5806
5707C8005L1534J1456K3652j5106k5045J2156k1390M0642J3591j0670Q633L355
5695A10813k6708J4594j7282K2987J1373m7973n374L6856m951N35P55j3182K389
5682H4832J8971l0748J4075J4737l60K6491k238q986P93J2423j5962J1263R139
5669A34430n7302m7658L8334K8036L2463L049L487p061j7509k1022J1744j2421
5657H8570J4256K2049O459j7029j2328J2594J2464O379L7918j1632j0420j9138
5645A30142j885K959J7421m6743K680K2031k0456J2696J4904Q246k9181n115j2528
5632I5171J3237M0081L6778q358k8208l5042n548L4838j9832L5680R698J0792
$$ plain form
5720 102401 95136 133993 143002 90175 88980 65859 76425 85163 88894 85732 81286 93811 38005
5707 38005 69539 80995 104647 89541 64496 76652 55262 95904 109495 98825 107458 110813
5695 110813 84105 98699 81417 104404 115777 67804 62430 99286 94335 94870 95625 82443 84832
5682 84832 103803 73055 87130 101867 101507 127998 125760 116774 117567 129990 114028 125291 134430
5669 134430 77128 29470 67804 95840 128303 131352 134839 127778 110269 89247 100991 88570
5657 88570 102826 124875 131334 114305 101977 114571 127035 133414 171332 159700 149280 130142
5645 130142 128257 131216 148637 101894 104574 126605 106149 118845 133749 141995 112814 107699 95171
5632 95171 108408 148489 185267 176909 148701 113659 108111 142949 123117 158797 168495 179287
5620A79287K3564O630L3312m7909j0302K2615k1758l664J7067l454o938J9020
5608B07470k0613j7037M3644J9964k607q165J3067j5778k607J6663K6466p816
5596B52651M1089k8101j1161L9940j6143K7472K7208J2680K170L953m438K2421
5584C69741o917N9183Q867J1269j1589k1801M5584K1401K9269M537k4020j8256
5572D67268L6972L7869J5329K3496J9232L1088j3575o756L651j306m348q375k0075
5559E80470n169q235m8535L610n564L5393q477J3061L6196j3246j2037L8926L275
5546F09668J9471N2520M9807M1166L2605K1314N4195K3475l1312j2103q2165p9190
5534F99451p1028k0716j4835l7630j9265k0388k5279J4914J2167O57j8563J7386
$$ plain form
5620 179287 202851 209481 242793 194884 184582 207197 185439 181775 198842 195388 188450 207470
5608 207470 186857 169820 213464 233428 230821 222656 235723 219945 217338 234001 260467 252651
5596 252651 293740 265639 254478 294418 278275 305747 332955 345635 347805 351758 347320 369741
5584 369741 362824 422007 430874 442143 430554 408753 454337 475738 505007 509544 485524 467268
5572 467268 504240 542109 557438 580934 600166 631254 617679 610923 614574 613268 608920 600545 580470
5559 580470 575301 567066 518531 522141 516577 551970 543493 556554 592750 579504 567467 606393 609668
5546 609668 629139 681659 731466 772632 805237 826551 880746 904221 872909 860806 778641 699451
5534 699451 628423 607707 592872 555242 535977 515589 490310 505224 517391 518048 499485 516871
5522E16871L4745K1650J0812M8576J7058K5479Q8343M8529N4714J9362N4978K8833
5510I69950J8308p6237j25469q7598l0700l7131p6801p0954j1829K1033m3j7606
5498D74923j0775k1015l2110l835L2709K6682L5217M22L3717M9386M8686M8884
5486F82891K6806L9598J2908J3531k8106p2332j01886o3071m7983m0863J5692
5475D37185q696j3758J0501k7783j3983J839o660J3828L464j8768J4280N437j578
5462C95308j2873K8960K0303N3605L2340M5847M4279k7156r126l0922l9289n330
5450D95946K4794j0373J322L9376N407j4966Q991J0665k0356M9538L3408P6583
5438G00335N7262M1689J22556M5088M6348K4551R3k5266m4377o2511n2036l0196
$$ plain form
5522 516871 551616 573266 584078 632654 649712 675191 763534 812063 866777 886139 941117 969950
5510 969950 988258 912021 786552 698954 668254 631123 554322 483368 471539 492572 492529 474923
5498 474923 464148 443133 411023 407188 439897 466579 501796 502218 535935 585321 634007 682891
5486 682891 709697 749295 762203 775734 747628 675296 573410 510339 462356 421493 437185
5475 437185 428489 414731 425232 397449 383466 385305 378645 392473 395937 377169 391449 396886 395308
5462 395308 382435 411395 431698 485303 517643 563490 607769 580613 571487 540565 501276 495946
5450 495946 520740 510367 511689 551065 556472 541506 550497 561162 540806 590344 623752 700335
5438 700335 757597 799286 921842 966930 1013278 1037829 1037922 1012656 968279 905768 853732 823536
5426H23536R894j093M7849M283J5966K6645r174J8818O2295O4071N6639O4384
5414A184113J0372K3999O0580Q5158P4530N4465R5020J41595J10108L2534o8409
5403A804065j37613j35072j02003o6569k8288n7504l93j1475k22l7505N606J899
5391A234926K7744O7609N6314J5828M5848O5402L4409j1180l6206r0703o6453
5380A343538k6697m5890l4244m0228n7881p8852j03504q5420o2151l6979k3367
5369G48325k8503k0546k5730L427K638j7758R378M1847k3582l5795K8145L5694
5357G17540J5465j3916k7769m0635p9828o8181o2933J1506K980J108n9835l0996
5345C64506j9743O11k86k0289j3666n0684J1592p46j2579J5070Q562j6194k2202
$$ plain form
5426 823536 833430 832337 880186 884469 900435 927080 917906 936724 999019 1063090 1119729 1184113
5414 1184113 1194485 1218484 1279064 1364222 1438752 1493217 1588237 1729832 1839940 1872474 1804065
5403 1804065 1666452 1531380 1429377 1362808 1334520 1277016 1276623 1265148 1264926 1227421 1233027 1234926
5391 1234926 1262670 1330279 1386593 1402421 1448269 1513671 1548080 1536900 1500694 1409991 1343538
5380 1343538 1316841 1270951 1236707 1196479 1138598 1059746 956242 870822 808671 771692 748325
5369 748325 719822 699276 673546 676973 679611 661853 671231 713078 689496 653701 681846 717540
5357 717540 733005 719089 691320 650685 570857 502676 439743 451249 454229 455337 395502 364506
5345 364506 344763 345374 345088 324799 311133 260449 272041 271295 258716 273786 282348 266154 243952
5332B43952k6102j3078L977j0906O273O156J9547k2896O156N9M207j4354k0563
5319A82428J4187J894K3808j0625j4300J6945r678l0853J7225k1308k289k4044
5307A43390j0280L1012k090J1580k1178P903O761l8304J623N5929k0492r610J7328
5294A73572K1588j8783j53J5671l9088p659j2496K2304j397q190J6424k01Q588
5281A70180Q44l5660J3959j167J1399J9824k1342j6860k7978R14J1951Q639r978
5268A24725J8063k1289K5836o389k0680L1637j4251j9861P379K1770J0613Q917
5256A66470n76k4151k4840k2221O263j2377J3508K031o222k4465K8873J5938l111
5243A15120J5209k0096k4921m740K3371k3687o550M4338K8812m2034J7580O910
$$ plain form
5332 243952 217850 204772 208749 197843 204116 210272 229819 206923 213079 213138 217345 202991 182428
5319 182428 196615 198509 222317 211692 197392 214337 204659 173806 191031 169723 167434 143390
5307 143390 133110 164122 162032 173612 152434 160337 167098 128794 130417 186346 165854 156244 173572
5294 173572 195160 176377 176224 191895 152807 145148 132652 154956 153559 145369 161793 161592 170180
5281 170180 171024 135364 149323 148156 159555 179379 158037 141177 113199 114113 126064 134703 124725
5268 124725 142788 121499 147335 140946 120266 151903 137652 117791 125170 146940 157553 166470
5256 166470 165894 141743 116903 94682 100945 88568 102076 104107 97885 73420 102293 118231 115120
5243 115120 130329 110233 85312 80572 103943 80256 73706 118044 146856 104822 122402 129312
5231A29312R33l5363M2975K7992k9110k0961R805J5549K288p024K0564o737l0565
5218A19658K6583q982k3228j1656L2844j5496j1737L0226j8371j554J3054K5009
5206A56350k969K1242m0212j2726L569l136k4779K8736M0197o854M70l8338k8357
5193I3193J0070J6874K1151q478l580M783p124K6067k9103M132l2200K4069L4366
5180A54220j5790K9609r617k5767k7048l6858L1720j3126J3611K2811j908K0192
5168A42049k051Q083J4069N464l6163j2087J1970K9535p512k1744P785M715q489
5155A35624j3285N147L134k7094K9984j229l645J4539J656k60j2802j3667p10
5142A17392p481L5036J421k2031P601k0466J1433j2771R354K0917j4171j576J0970
$$ plain form
5231 129312 130245 94882 137857 165849 136739 115778 125583 141132 143420 136396 156960 150223 119658
5218 119658 146241 137259 114031 102375 135219 119723 107986 138212 119841 118287 131341 156350
5206 156350 153381 174623 134411 121685 125254 122118 97339 126075 166272 159418 159888 121550 93193
5193 93193 103263 120137 141288 132810 129230 134013 126889 152956 123853 127985 95785 119854 154220
5180 154220 138430 168039 158422 132655 105607 68749 100469 87343 100954 123765 121857 142049
5168 142049 139998 148081 162150 167614 131451 119364 131334 160869 153357 131613 139398 144113 135624
5155 135624 122339 127486 130620 103526 133510 132281 128636 143175 144831 144571 131769 118102 117392
5142 117392 109911 144947 146368 124337 131938 111472 122905 110134 119488 140405 126234 124658 135628
5129A35628j1680J5924K2392r192j7246j614K4018J7002l0054Q985L825K0406
5117A78394n465j1250J0431K0585p525J6189j8409j4370M1587L633l0072J1960
5105A95688N784M041J3772l671n567R154M681L826J8539o92k1730l616K8228J9721
5091B68158j2916p810j5106K1231J381J1121j0527L2597P6j1875R057k901J4463
5078B96949L8369J513K3971K5097M1861J9773L9968R244k2392K3355n587O1656
5066E53777M7566O7082L4156O1232L0399P2048N6372O3989M4405J37392J34294
5055A302712J07378J49389J85074K17337K86253K87641K15753l740m8235R0844
5045B790406J81790K17700J06056J2581Q6657K45839L63717K90259j48722o31718
$$ plain form
5129 135628 123948 139872 162264 153072 135826 134212 158230 175232 145178 154163 157988 178394
5117 178394 172929 161679 172110 192695 185170 201359 182950 168580 210167 213800 183728 195688
5105 195688 201472 205513 219285 215614 210047 219201 223882 227708 246247 245555 223825 220209 248437 268158
5091 268158 255242 247432 232326 253557 254938 266059 255532 288129 288205 276330 285387 282486 296949
5078 296949 335318 336831 360802 385899 427760 447533 487501 496745 474353 497708 492121 553777
5066 553777 601343 668425 702581 763813 794212 866260 922632 986621 1031026 1168418 1302712
5055 1302712 1410090 1559479 1744553 1961890 2248143 2535784 2751537 2747797 2699562 2790406
5045 2790406 2972196 3189896 3295952 3308533 3395190 3641029 4004746 4295005 4146283 3514565
5035C514565o03731m26576k81106j92223j39701j24804n3987r3923j02886j54937
5025A340691j44216q1838q8801m9063l9061k9740o3775j0549m7108n9521q446
5014G18573q137m3633k7357k4483k028k7297j2093L316j8573k4185k0510m538
5002E09055K4874j4659k7286l9688m0562R711J628j12K8700l4865l5517j0425
4990C70854J3415K353J1764K9140q774l3182J7605k6204k5316M204j4459k5494
4978C15906K6820L7878k7850k3490L2080J4828l4457q363K2030K737K260j3457
4966C46922K2701k0882K5785l405L018k6997K310N213r409L885k3152L143J7962
4953C47094K7294J0780J1332k7088Q291j9272q672L3567K2723k2322R380j5375
$$ plain form
5035 3514565 2910834 2484258 2203152 2010929 1871228 1746424 1692437 1598514 1495628 1340691
5025 1340691 1196475 1114637 1025836 976773 937712 907972 844197 833648 786540 727019 718573
5014 718573 710436 666803 639446 614963 612935 585638 573545 576861 558288 534103 513593 509055
5002 509055 533929 519270 491984 452296 411734 421445 423073 422961 451661 416796 381279 370854
4990 370854 384269 386622 398386 427526 418752 385570 403175 376971 351655 355859 341400 315906
4978 315906 342726 380604 352754 329264 361344 376172 341715 333352 355382 358119 360379 346922
4966 346922 369623 348741 374526 371121 374139 347142 349452 354665 345256 349141 325989 329132 347094
4953 347094 374388 385168 396500 369412 377703 358431 349759 383326 406049 383727 393107 377732
4941C77732p378K5460j7821K4506m708O623j2725P061J0133p026J8206J3421K3711
4928D57195n0173N7068L0607l3395k1385j7980o281J0878J9566J6179l5066K9793
4916D57006k761k4400r053N974L938j4372j5674J464N187L406K229j0135P084
4903D09893J0146N61j1253Q529J7958Q186l4373k4334L5057m808j1469j1410J8879
4890D11562P135q627J7154K8258K5303m8p736l169J1983r891O306j4934J2239
4877D75535J4286J9166M1601l3918j9541L6384J649M3776J262k0294K4653l616
4865E80943O103j098k471R843j3940J8022L7815q753R476Q596j3635K0189M1564
4852F92654L1595K1396O265Q253K4390K8980N4052M6422L7802L1214m9429m8177
$$ plain form
4941 377732 370354 395814 377993 402499 397791 404414 391689 398750 408883 401857 420063 433484 457195
4928 457195 407022 464090 494697 461302 439917 421937 415656 426534 446100 462279 427213 457006
4916 457006 454245 429845 420792 426766 430704 416332 400658 402122 407309 410715 412944 402809 409893
4903 409893 420039 420600 409347 417876 435834 444020 409647 385313 420370 415562 404093 392683 411562
4890 411562 418697 410070 427224 455482 480785 480737 473001 469832 481815 471924 478230 463296 475535
4877 475535 489821 508987 550588 516670 497129 533513 535162 578938 580200 559906 584559 580943
4865 580943 587046 585948 583477 593320 579380 597402 635217 626464 635940 644536 630901 651090 692654
4852 692654 724249 745645 751910 760163 784553 813533 867585 914007 951809 983023 933594 885417
4840H85417J7115j2478j3570J3940m7161N860K902M1652L5170j2816K3269L233
4828I42533J0743R316K2749M96M7999M7081K9992j1034K1125L5962N8917R680
4816A225559P4348O3535O620r132j769L9065N542J9314O6152M9919L2585L8854
4804A610592J8722L9928N2722M392Q4703R7255L6060L6356M7118L2090M0943Q8373
4792B189254R8358R2012J07255J33688J11087J59459J39072J52670J46029K03800
4782C532684J72508J69374K08332J99910K53867L03618K99822L02416L16923L45518
4772F104972L29479L64755L68276M38831M76436N29036O12364O30674N96351O59919
4762A1111093P42887Q35684J000948J200585J357200J564414J588248J296767
$$ plain form
4840 885417 902532 890054 876484 890424 843263 849123 852025 893677 928847 916031 939300 942533
4828 942533 953276 962592 985341 985837 1033836 1080917 1110909 1099875 1121000 1156962 1215879 1225559
4816 1225559 1299907 1363442 1370062 1360930 1359161 1398226 1403768 1423082 1489234 1539153 1571738 1610592
4804 1610592 1629314 1669242 1721964 1726356 1811059 1908314 1944374 1980730 2027848 2059938 2100881 2189254
4792 2189254 2287612 2379624 2486879 2620567 2731654 2891113 3030185 3182855 3328884 3532684
4782 3532684 3705192 3874566 4082898 4282808 4536675 4840293 5140115 5442531 5759454 6104972
4772 6104972 6434451 6799206 7167482 7606313 8082749 8611785 9224149 9854823 10451174 11111093
4762 11111093 11853980 12689664 13690612 14891197 16248397 17812811 19401059 20697826
4754B0697826P90744L04069K36736L46163M21129L28925K23895K26998L16063
4745B3892548N19657O96324P12628O76959P19889Q67145J036079J152840J081450
4736C1355519J038455R08148Q11932R17813J103618J279100J440280J515888J652164
4727D2022917J768441J790871J400076M83382p76473j736206j827111j630318
4719D1495579j406405j270158j125829r32602p87548p44635q59480j082429j253454
4710C2033039j222569j103897q45996o78738m97585m41335n01329m45895k72445
4701B6023250o0200M8724o4444k66472m27439m60697l57887n01288j065491j718376
4691B1149680k010082j815488j422165j104172q67805o57674n58474n48333n59015
$$ plain form
4754 20697826 21488570 21792639 22029375 22375538 22796667 23125592 23349487 23576485 23892548
4745 23892548 24412205 25108529 25821157 26498116 27218005 28085150 29121229 30274069 31355519
4736 31355519 32393974 33302122 34114054 35031867 36135485 37414585 38854865 40370753 42022917
4727 42022917 43791358 45582229 46982305 47465687 46689214 44953008 43125897 41495579
4719 41495579 40089174 38819016 37693187 36760585 35973037 35228402 34368922 33286493 32033039
4710 32033039 30810470 29706573 28860577 28181839 27684254 27242919 26741590 26295695 26023250
4701 26023250 25963050 26011774 25947330 25680858 25253419 24792722 24434835 23933547 22868056 21149680
4691 21149680 19139598 17324110 15901945 14797773 13929968 13272294 12713820 12165487 11606472
4682A1606472n66858n57508m97133m28521l68104l63662l52121l43503l25130
4673G803932l41402l13355k89218l17063k52494k36210j85428k32810j94182k11786
4663E229984k08294j97047j86906j90832j10463r0132j23717j22301p5737r1125
4653C833430q3271m9204j7547l2414r3293k7870m7100k9561m2273o0258j4451
4642C336188j5712k2490j6708n4016o3784l7281l5063o5285j07455j00751j12177
4631B705466q7755j05903r2159q7252o6717m5149p9438k9034m1210p4162k3497
4620A973190p2494l0630j8757R445j7055l8541l1824j9442j940k7636J0779n6682
4608A678413n1318j7726n0441m1830l0191l2830j7249p0925q0933l6275k4267
$$ plain form
4682 11606472 11039614 10482106 9984973 9556452 9188348 8824686 8472565 8129062 7803932
4673 7803932 7462530 7149175 6859957 6542894 6290400 6054190 5868762 5635952 5441770 5229984
4663 5229984 5021690 4824643 4637737 4446905 4336442 4246310 4122593 4000292 3924555 3833430
4653 3833430 3750159 3700955 3683408 3650994 3557701 3529831 3482731 3453170 3410897 3350639 3336188
4642 3336188 3320476 3297986 3281278 3227262 3163478 3126197 3091134 3025849 2918394 2817643 2705466
4631 2705466 2617711 2511808 2419649 2332397 2265680 2220531 2141093 2112059 2070849 1996687 1973190
4620 1973190 1900696 1870066 1851309 1860754 1843699 1805158 1773334 1753892 1751952 1724316 1735095 1678413
4608 1678413 1627095 1609369 1558928 1517098 1486907 1454077 1436828 1365903 1284970 1248695 1224428
4597A224428k7738p5201k2869j0718n6680j3561k4880j924m984k4428j0103m979
4585I46363l9172m1129k1945r287K665j457j7959q565j3020j5725o908K0708k9768
4572G64801J381K7199j6735j5243m804l2486o363l1565l409L0428k2478l6399
4560F54327K2488J140k8444p371J0740r020O124r234J3234k907m8156N100J4382
4547F22403m090L918k9j0197K1157r435n595p262k918j9050J437J2012o130l95
4533E95826J5361P586k9338j284j0562J2429j8946j7703K131j7955m419J5514
4521E48640K6825j3924J2117j3967k4794p473M34j311k7392O799k0253J0777j0812
4508D85666l195j3399m737J4407r222K4283j9043J007j3414k8079J4128l9232
$$ plain form
4597 1224428 1196690 1121489 1098620 1087902 1031222 1017661 992781 990857 985873 961445 951342 946363
4585 946363 907191 866062 844117 834830 837495 836038 818079 809514 796494 780769 773861 794569 764801
4572 764801 766182 793381 776646 761403 756599 724113 717750 686185 682776 713204 690726 654327
4560 654327 676815 677955 649511 642140 652880 643860 649984 640750 653984 651077 602921 608021 622403
4547 622403 618313 622231 622202 612005 633162 623727 618132 610870 607952 588902 590339 602351 596221 595826
4533 595826 611187 618773 589435 588151 577589 590018 571072 553369 555500 537545 533126 548640
4521 548640 575465 561541 573658 559691 534897 527424 527858 526547 499155 505954 485701 496478 485666
4508 485666 482471 469072 464335 478742 469520 493803 474760 475767 462353 434274 448402 409170
4496D09170n27K5339M228l4258r5J8382j85j2001j309J6992m5376O24N982R331
4482C96297m184n599m745K0510J9519l8441j4952M4034n362l819l827J2057k1842
4469C89646J839J3448J8739j9116q70k3044m465k0453O058J908j4650K7083k6341
4456C49782L1924K8794l3892M305P836N3893p950r837p570k0355M2395J1015l1018
4443D19322J6652O1302j5854l7810j1873L978L3711M0757j3755K646k2777J6160
4431D92459K0412J2051r743M602j4091L5253J7095k9084L9868j058r686J6087
4419E74165R463J2034R202R615K2022J1257j0174N351k9305l0147q256j5253j1576
4406E48398L1187J8529k0311M389k4342J634m298L001k0764J3882k9252o821K6653
$$ plain form
4496 409170 408643 433982 438210 403952 403857 422239 422054 410053 408744 425736 380360 380984 386966 396297
4482 396297 392113 386514 381769 402279 421798 383357 368405 412439 407077 403258 399431 411488 389646
4469 389646 391485 404933 423672 404556 403686 380642 376177 355724 361782 363690 349040 376123 349782
4456 349782 381706 410500 376608 380913 388749 442642 434692 424855 417285 396930 439325 450340 419322
4443 419322 435974 497276 481422 443612 431739 435717 469428 510185 496430 499076 476299 492459
4431 492459 512871 524922 515179 519781 505690 540943 558038 528954 568822 567764 558078 574165
4419 574165 583628 595662 604864 614479 636501 647758 637584 642935 613630 583483 575227 559974 548398
4406 548398 579585 598114 577803 582192 557850 559484 555186 558187 537423 551305 522053 515232 541885
4393E41885L8753k4386l1496j255j1618J7285k4165j1641J3955N535m4025K8818
4381D97645l87J6582m007k1842M942J7264O385K885j3302J2210j9525k3301K5260
4368E00809q0l1722p947K0275L740J1884k0071R297L1409l671o124k2202J3448
4355D99045n500J8016K6615M6276m121N755k2235l9650j2102L4675m0828q111
4343D97835K2059k6268L4338m71M2507L7412k7306L864n704O72P971P95J2910
4330F00614k2833l447M4L0283Q341J638j3647N589M6350J0075j8941m486J6103
4317F55683J0108l0298M0771L4248L2471j0674K953M4843l3575K2866K1985N63
4305G91944K9504J7887L3007R411L5623M9228J6515J4217L5081L5823q513M5281
$$ plain form
4393 541885 580638 556252 524756 523501 511883 529168 505003 493362 507317 512852 468827 497645
4381 497645 497258 513840 509833 487991 492933 510197 516582 519467 506165 518375 498850 475549 500809
4368 500809 500729 469007 461060 481335 485075 496959 476888 486185 517594 513923 507799 485597 499045
4355 499045 493545 511561 538176 584452 580331 586086 563851 524201 512099 546774 505946 497835
4343 497835 519894 493626 527964 527493 570000 607412 580106 583970 578266 578938 586909 587704 600614
4330 600614 577781 574334 574378 604661 613002 614640 600993 606582 652932 663007 644066 639580 655683
4317 655683 665791 635493 676264 710512 742983 732309 735262 780105 746530 769396 791381 791944
4305 791944 821448 839335 872342 881753 917376 966604 983119 997336 1032417 1068240 1059727 1105008
4293A105008M6708L9005M5159Q9120Q2690L6621R5675R0384J15778N6434J16438
4282A919020J26658J49799J36865J02645J21577J55675J69368J22730J86843K03200
4272C394380K48828K70155K68393L50976L51849L78488L94973L97078L28266L26408
4262F709794K40292K09873K23096K71502L30837M56557N51809N89011P02571P76198
4252A1061540P66740P04061O62782N11831L51999K22792J13136M9911J23204K21918
4242A4789914M15493N63632O65776P90900Q86675Q75683Q03403N87711M31826
4233B0811013J53460j36353l24242m16682m09117k96241r9053Q6473K14871L45110
4223A9929239M60835M77777M33633K93619O4175k08111n32387p88655q90870r49015
$$ plain form
4293 1105008 1151716 1190721 1235880 1325000 1407690 1444311 1539986 1630370 1746148 1802582 1919020
4282 1919020 2045678 2195477 2332342 2434987 2556564 2712239 2881607 3004337 3191180 3394380
4272 3394380 3643208 3913363 4181756 4532732 4884581 5263069 5658042 6055120 6383386 6709794
4262 6709794 6950086 7159959 7383055 7654557 7985394 8441951 8993760 9582771 10285342 11061540
4252 11061540 11828280 12532341 13195123 13706954 14058953 14281745 14394881 14444792 14567996 14789914
4242 14789914 15205407 15769039 16434815 17225715 18112390 18988073 19791476 20379187 20811013
4233 20811013 20964473 20828120 20503878 20087196 19678079 19381838 19282785 19369258 19584129 19929239
4223 19929239 20390074 20867851 21301484 21595103 21659278 21451167 20918780 20130125 19239255 18290240
4213A8290240q50462o91548m69626k81388j64310l1376K2325O6663k2631k01204
4203A5666683l92419o12541q49180r45264r49582q32740o63460n74270m41159
4194I406068l30566k25302j78992j36549j26620k38898l46217m85824n20403n07480
4184F309217m81795l82840l40116l14779k59454j94446j84430q6496j14495j18347
4174C832019j61722j25429j38396j71079j67563j54394j37348j27120j02966j04448
4164B441554l9576p5440r6340m9787q3434p9353l3355n1846n0085p3031j3463
4153A795844o8989n5070l8992k2773l2133l6657l9921k1509j3934q951l3277q067
4141A415571q074J1691k8803q1697j1601J2857j960l9426K9842j6237n422o775
$$ plain form
4213 18290240 17439778 16748230 16278604 15997216 15832906 15801530 15823855 15890518 15867887 15666683
4203 15666683 15274264 14661723 13812543 12867279 11917697 11084957 10421497 9847227 9406068
4194 9406068 9075502 8850200 8671208 8534659 8408039 8169141 7822924 7337100 6816697 6309217
4184 6309217 5827422 5444582 5104466 4789687 4530233 4335787 4151357 4064861 3950366 3832019
4174 3832019 3670297 3544868 3406472 3235393 3067830 2913436 2776088 2648968 2546002 2441554
4164 2441554 2401978 2326538 2230198 2180411 2096977 2017624 1984269 1932423 1882338 1809307 1795844
4153 1795844 1726855 1671785 1632793 1610020 1577887 1541230 1501309 1479800 1465866 1456915 1423638 1415571
4141 1415571 1407497 1419188 1390385 1308688 1297087 1309944 1307984 1268558 1298400 1282163 1276741 1269966
4129A269966k8777m8490j5632n778l4892N572K103m4682m6343j2342k3784j2880
4117A004041K143n984L5817k6885j0750k9918J2944K0174m3110L2126Q504k261
4105I96841j5271o052k9052L5179O953l8903N3790L241j2758k0456k5616j7684
4093I30212j4428L5559J8618j9788J0612Q355M4734l0289Q949M6704k8540k1344
4081I89354j3268L2196N5076R733q635J2135N099P513M1128J3446J8882J9621
4069A182280k5567J3322L5821M5135p099K2478K155L486j41K1934M1174j8065
4057A316913J5745O6418L453M0796L0864m070K3715j6742l2530M012j2845J0221
4045A445950J0023k7442J079M3957L4235j9578R971K9370K7518l1569j2602n1995
$$ plain form
4129 1269966 1241189 1192699 1177067 1171289 1136397 1141969 1144072 1099390 1053047 1040705 1016921 1004041
4117 1004041 1006184 1000200 1036017 1009132 998382 968464 981408 1001582 958472 990598 999102 996841
4105 996841 981570 975518 946466 981645 988598 949695 1003485 1006726 993968 973512 947896 930212
4093 930212 915784 951343 969961 950173 960785 969140 1013874 983585 992534 1039238 1010698 989354
4081 989354 976086 1008282 1063358 1073091 1064456 1076591 1081690 1089203 1130331 1143777 1162659 1182280
4069 1182280 1156713 1170035 1205856 1250991 1243892 1266370 1268525 1272011 1271870 1293804 1334978 1316913
4057 1316913 1332658 1399076 1402529 1443325 1474189 1470119 1493834 1477092 1444562 1448574 1435729 1445950
4045 1445950 1455973 1428531 1429610 1473567 1507802 1488224 1498195 1527565 1555083 1523514 1510912 1458917
4033A458917O720j7743l2950J6638m30L0065J5349J5434j833J1135k2763l4790
4021A443749j9618M1697J1119j2272j5097O6128N0620l625q756K3379N9329J2071
4009A648724m907j5144J6442k2169K920K6760L1804N143Q6210J7934k3865L7883
3997A807735M515L7749J1991K8083K6196K1146L8200M3690L2305K2185L0559M8163
3985B152517L0358q772K4825M3253j8648P834M8391N7150L3875K2458M5642J9157
3973B458040L1297M410j048K1770M0792L4958K026J6820O9978M0397P1663O0866
3961B851969M9234O6202L9191O5197M4401P2364K0441K9307L6835K6265N9959
3950C361365J3881M5149L505k6057R490J2918N7858N7798O7576R5661R8913J16117
$$ plain form
4033 1458917 1465637 1447894 1414944 1431582 1431152 1461217 1476566 1492000 1490167 1501302 1478539 1443749
4021 1443749 1424131 1465828 1476947 1464675 1449578 1515706 1566326 1562701 1553945 1577324 1636653 1648724
4009 1648724 1643817 1628673 1645115 1622946 1625866 1652626 1684430 1689573 1775783 1793717 1769852 1807735
3997 1807735 1812250 1849999 1861990 1890073 1916269 1937415 1975615 2019305 2051610 2073795 2104354 2152517
3985 2152517 2182875 2174103 2198928 2242181 2223533 2231367 2279758 2336908 2370783 2393241 2438883 2458040
3973 2458040 2489337 2493747 2492699 2514469 2555261 2590219 2592245 2609065 2679043 2719440 2791103 2851969
3961 2851969 2901203 2967405 3006596 3071793 3116194 3188558 3208999 3238306 3275141 3301406 3361365
3950 3361365 3375246 3420395 3423900 3397843 3407333 3420251 3478109 3535907 3603483 3699144 3798057 3914174
3938C914174J91415J80636J70956K31524J97213J90466R6289J06254M5718k1615
3928E303030O198k86N8890J24570J34247J38649J63812K16107K43979K69184L05991
3917F964371L76350M03113M04912M99259N99020O78493O66153P17929P26087O54811
3907A2690498P61816Q70913J013268J209249J439401J553135J681487J642410
3899B2862177J244721N85007L8434r2702Q3435K83412L70737N08064O59821R47166
3889B7490272J199904J348571J361878J280249R80471N73091K28504J33047J79119
3880C4775106K31203L50952N85957Q37164J157018J490632J750949K065683K215789
3871D5460453K304942K174701J538212q903k056050l252834l323771k766855k013928
$$ plain form
3938 3914174 4105589 4286225 4457181 4688705 4885918 5076384 5172673 5278927 5324645 5303030
3928 5303030 5309228 5308942 5367832 5492402 5626649 5765298 5929110 6145217 6389196 6658380 6964371
3917 6964371 7340721 7743834 8148746 8648005 9247025 9925518 10591671 11309600 12035687 12690498
3907 12690498 13452314 14323227 15336495 16545744 17985145 19538280 21219767 22862177
3899 22862177 24106898 24691905 24730339 24637637 24721072 25004484 25375221 25883285 26543106 27490272
3889 27490272 28690176 30038747 31400625 32680874 33661345 34234436 34462940 34595987 34775106
3880 34775106 35006309 35357261 35943218 36780382 37937400 39428032 41178981 43244664 45460453
3871 45460453 47765395 49940096 51478308 51469405 49413355 46160521 42836750 40069895 38055967
3862C8055967j413782r85493o83368n53365l37226k56798j05443q1724j50143
3853C3488625l74465o61876j068074j522803j658412j476381j166619p87709m31481
3844B4340805k29678j90901k40448k19421j33456k26276n74953j157645j602056
3835A9765971j668404j461125j251419r97060p29831o23021n14227n28531n23177
3826A1469176n21046n33730m49079m17758m07731l29543k71435k11626k06068
3817H121160j57481j54956j15557p7227j21924r4342M967n4065o5052m4699l9602
3806G201222q5005j34482j89381k23445k24251j77772j42566r0407j26855r2330
3796E714728p7779m8479o592o1004k7923j5323n6698l4340j5076l129j6083m7114
$$ plain form
3862 38055967 36642185 35656692 34973324 34419959 34082733 33825935 33720492 33638768 33488625
3853 33488625 33114160 32452284 31384210 29861407 28202995 26726614 25559995 24772286 24340805
3844 24340805 24111127 23920226 23679778 23460357 23326901 23100625 22525672 21368027 19765971
3835 19765971 18097567 16636442 15385023 14387963 13658132 13035111 12520884 11992353 11469176
3826 11469176 10948130 10414400 9965321 9547563 9139832 8810289 8538854 8327228 8121160
3817 8121160 7963679 7808723 7693166 7615939 7494015 7399673 7404640 7350575 7285523 7240824 7201222
3806 7201222 7116217 6981735 6792354 6568909 6344658 6166886 6024320 5933913 5807058 5714728
3796 5714728 5636949 5588470 5581878 5520874 5492951 5477628 5420930 5386590 5371514 5368385 5352302 5305188
3784E305188j9897m9187n2766l605k3285l5515l8334l1595j0734j7163N443j9144
3772E009406j3766J5988k5072K2913M9849N0430P6182O2171L6357O0932Q2030
3761E427420J11360M7549O2160J01846J22312J73869J50701J61993J89254K23892
3751F772356K12776K72338L03443K80175L36090L56557M14885M73006N12275N80654
3741A0514555O07673P22688P91686Q98097R91265J161877J345443J510205J727351
3732B0270840J875484K035483K140953K155118J984407J757183J463006J053163
3724C4735637O17686K67319j60407l58908n05360n45430m07438k19346k58K14945
3714C3638440L69679L40475K70709m407l84461p53229j087322j421544j680702
$$ plain form
3784 5305188 5285291 5236104 5183338 5179733 5156448 5120933 5082599 5051004 5040270 5023107 5028550 5009406
3772 5009406 4995640 5011628 4986556 5009469 5059318 5109748 5185930 5248101 5284458 5345390 5427420
3761 5427420 5538780 5586329 5648489 5750335 5872647 6046516 6197217 6359210 6548464 6772356
3751 6772356 6985132 7257470 7560913 7841088 8177178 8533735 8948620 9421626 9933901 10514555
3741 10514555 11122228 11844916 12636602 13534699 14525964 15687841 17033284 18543489 20270840
3732 20270840 22146324 24181807 26322760 28477878 30462285 32219468 33682474 34735637
3724 34735637 35353323 35620642 35460235 35101327 34595967 34050537 33643099 33423753 33423495 33638440
3714 33638440 34008119 34348594 34619303 34614896 34230435 33477206 32389884 30968340 29287638
3705B9287638j902558k013096j994383j873396j781464j531182j371185j189443
3697A5630931j005664q68656p92392o62569o23753n36253n05915m67199l93443
3688I775087l65229l15856k99514k25724k16198k17088k01459j71670j39714j45143
3678G477492j80489r2034q1739j28428o4312o8227q4693q8161n5983p4411p8273
3667F480742n9204q4392m2958l5733o3598q7123n9493k1397q119j1343j3509k2540
3655E971333J5061k0974K553K7571P105q217K1062M9342K1825L0316O1336M4558
3643F222871M1327M6906O528M0414R5679R0996O0176P7284P0957P9834J02973
3632F935945R9114J47079J39367J10160R6392R2178R3945J10442J36186J11281
$$ plain form
3705 29287638 27385080 25371984 23377601 21504205 19722741 18191559 16820374 15630931
3697 15630931 14625267 13756611 12964219 12301650 11677897 11141644 10635729 10168530 9775087
3688 9775087 9409858 9094002 8794488 8568764 8352566 8135478 7934019 7762349 7622635 7477492
3678 7477492 7297003 7204969 7123230 6994802 6930490 6862263 6777570 6689409 6633426 6559015 6480742
3667 6480742 6421538 6337146 6294188 6258455 6194857 6107734 6048241 6026844 6018725 6007382 5993873 5971333
3655 5971333 5986394 5965420 5967973 5995544 6002649 5994432 6015494 6064836 6086661 6116977 6178313 6222871
3643 6222871 6264198 6311104 6317632 6358046 6453725 6544721 6604897 6682181 6753138 6832972 6935945
3632 6935945 7035059 7182138 7321505 7431665 7528057 7620235 7714180 7824622 7960808 8072089
3622H072089R8415J50206J32084J58216J71103J58391K10146K66680K24073K80575
3612I921978L00971L53275L80896L81261M41282N05672N78315N95462P05361Q39689
3602A5004162R30809J051557J233785J411413J625937J874373K081281K223873
3594B7437190K303193K342479K269511K025049J649028J315672R88009O47282
3586D0977413K90070P2024l6719p3611M9351K05850L16106M08318M07332L10350
3576D2926484Q7163k86024o32017r47210j366012j704111j951171k136678k197172
3567C1793252k076951j863503j741055j519595j286016j020416q86522p30504
3559B0668690n78678m30905l68323k84968j62365p3935n5675M6532J58427K35536
$$ plain form
3622 8072089 8170504 8320710 8452794 8611010 8782113 8940504 9150650 9417330 9641403 9921978
3612 9921978 10222949 10576224 10957120 11338381 11779663 12285335 12863650 13459112 14164473 15004162
3602 15004162 15934971 16986528 18220313 19631726 21257663 23132036 25213317 27437190
3594 27437190 29740383 32082862 34352373 36377422 38026450 39342122 40330131 40977413
3586 40977413 41267483 41339507 41302788 41229177 41278528 41484378 41800484 42208802 42616134 42926484
3576 42926484 43013647 42727623 42095606 41148396 39782384 38078273 36127102 33990424 31793252
3567 31793252 29716301 27852798 26111743 24592148 23306132 22285716 21399194 20668690
3559 20668690 20090012 19659107 19290784 19005816 18843451 18769516 18713841 18760373 18918800 19154336
3549A9154336L59663M44174N33082N83572O65383Q38790R46319J094636J265550
3540B5885505J420572J590017J752093J988034K253430K484751K762803L039981
3532D3177186L255291L388233L402322L261238L098420K898848K690507K536186
3524F7708231K362434K141633J731764J247495P95466K92419j41635m36008p54096
3515G4947703j020828j235706j382608j587688j704229j830985j995005k127699
3507F2062955k220045k253422k226770k215576k060151j870935j688783j431658
3499D6095615j126947q48046m72901j02285L34237O61818Q09092O66095P00800
3490D6717478J178257J763600K250442K594354K634817K322068K616485L175001
$$ plain form
3549 19154336 19513999 19958173 20491255 21074827 21740210 22579000 23525319 24619955 25885505
3540 25885505 27306077 28896094 30648187 32636221 34889651 37374402 40137205 43177186
3532 43177186 46432477 49820710 53223032 56484270 59582690 62481538 65172045 67708231
3524 67708231 70070665 72212298 73944062 75191557 75987023 76279442 76137807 75701799 74947703
3515 74947703 73926875 72691169 71308561 69720873 68016644 66185659 64190654 62062955
3507 62062955 59842910 57589488 55362718 53147142 51086991 49216056 47527273 46095615
3499 46095615 44968668 44120622 43647721 43545436 43879673 44541491 45350583 46016678 46717478
3490 46717478 47895735 49659335 51909777 54504131 57138948 59461016 62077501 65252502
3482F5252502L628229L842640L832416L744934L530154L246235K851533K477325
3474I2405968K160292J980558J919690K085436K519220L104723L692391M263091
3466A14131369M776163N000247M697136M041932L407289K623617J593436K62506
3458A40533695j371500l273099m671215n086048n125734m817819m218591l560464
3450A08409225k857373k268806j937856j791722j749874j895655k119733k485368
3442I1302838l001736l551122m000104m322913m460822m360583m156001l907988
3434E9541569l598450l246479k878059k501909k115776j815370j468655j198033
3426D0718838r59818p39309m86027k96518j66605Q1808L11429N12217P78822J059256
$$ plain form
3482 65252502 68880731 72723371 76555787 80300721 83830875 87077110 89928643 92405968
3474 92405968 94566260 96546818 98466508 100551944 103071164 106175887 109868278 114131369
3466 114131369 118907532 123907779 128604915 132646847 136054136 138677753 140271189 140533695
3458 140533695 139162195 135889096 131217881 126131833 121006099 116188280 111969689 108409225
3450 108409225 105551852 103283046 101345190 99553468 97803594 95907939 93788206 91302838
3442 91302838 88301102 84749980 80749876 76426963 71966141 67605558 63449557 59541569
3434 59541569 55943119 52696640 49818581 47316672 45200896 43385526 41916871 40718838
3426 40718838 39759020 39019711 38533684 38237166 38070561 38152369 38463798 38976015 39754837 40814093
3416D0814093J365469J658659J956448K282838K597434K705225K682906K472391
3408E8535463K175271J942990J801716J622708J356094J039301N91551M0767m50344
3399F8655517p54071q89570r95453j014389r66951r24344q61019p04999o24513
3390F0920208o71827p11382q20096j043035j297235j609948j860119k077626k314690
3381D8514250k473449k562539k519378k469788k283458k085371j870189j770769
3373C0479309j533764j370713j172176r79023q56573q35821p46827o70082n69127
3364B1745203m71643m16977k63944j39891j01422q6510L5192J26603K49155L44645
3354B1020411N27371O39746P08666P31393O49133K71762k41304o14587r49150
$$ plain form
3416 40814093 42179562 43838221 45794669 48077507 50674941 53380166 56063072 58535463
3408 58535463 60710734 62653724 64455440 66078148 67434242 68473543 69065094 69105861 68655517
3399 68655517 67901446 67011876 66016423 65002034 64035083 63110739 62249720 61544721 60920208
3390 60920208 60248381 59536999 58716903 57673868 56376633 54766685 52906566 50828940 48514250
3381 48514250 46040801 43478262 40958884 38489096 36205638 34120267 32250078 30479309
3373 30479309 28945545 27574832 26402656 25423633 24567060 23731239 22984412 22314330 21745203
3364 21745203 21273560 20856583 20592639 20452748 20351326 20264816 20300008 20426611 20675766 21020411
3354 21020411 21547782 22187528 22896194 23627587 24276720 24548482 24307178 23692591 22743441
3345B2743441p52522l56767j42412R149J00697Q6520M0164R8362J74014J59839
3335B2160485J04153j4886M064J9512O7144J51563K01622L28261M54419N92455
3325B4068792P45365R40131J055251J056331O72800L41283P8554K8316M23007
3316B9409830R38447J322509J566754J862833J977790K071069K073341K072565
3308D3295138K171742K194555K205489K165400J911635J720941J465770J258626
3300E8389296J231335J228673J192290J025173P94636M63809J25068j00066k23349
3291F4126865k60351l16626n74567r64582j368614j742898j949753k062509k222399
3282E2664566k404827k622044k771029k906086k945157k897479k716776k590790
$$ plain form
3345 22743441 21990919 21634152 21491740 21500889 21601586 21688106 21728270 21826632 22000646 22160485
3335 22160485 22264638 22249752 22253816 22273328 22340472 22492035 22693657 23021918 23476337 24068792
3325 24068792 24814157 25754288 26809539 27865870 28538670 28879953 28958507 28986823 29409830
3316 29409830 30348277 31670786 33237540 35100373 37078163 39149232 41222573 43295138
3308 43295138 45466880 47661435 49866924 52032324 53943959 55664900 57130670 58389296
3300 58389296 59620631 60849304 62041594 63066767 63861403 64325212 64450280 64350214 64126865
3291 64126865 63866514 63549888 62975321 62010739 60642125 58899227 56949474 54886965 52664566
3282 52664566 50259739 47637695 44866666 41960580 39015423 36117944 33401168 30810378
3274C0810378k377772k189379k009280j806476j538453j322875j233559j067530
3266A7265054r14846q02516p54894o81953n71911n38486n05376m23725m21722
3257A1649625l56006k96351k84537k28124j88649k02505j44301q1036j00200n5395
3247I712521p8076q2054o0495n4033j7854l5140p5943n4971j05909j21627j55520
3236H870899j59886j58292j56297j63074j58587j29631j32208j36336j47479j47105
3226G382004j27603j31650j60246j46330j76042j86337j75234j91716j56893j54357
3216E775596j52831j27847j37703j07599r2537j27812p2017l0691o4153n3020
3206D809386o5055n1157n0864k8439k4541l3395j8298O485j3068K978l536J820
$$ plain form
3274 30810378 28432606 26243227 24233947 22427471 20889018 19566143 18332584 17265054
3266 17265054 16350208 15547692 14792798 14110845 13538934 13000448 12495072 12071347 11649625
3257 11649625 11293619 10997268 10712731 10484607 10295958 10093453 9949152 9868116 9767916 9712521
3247 9712521 9634445 9552391 9491896 9437863 9420009 9384869 9308926 9253955 9148046 9026419 8870899
3236 8870899 8711013 8552721 8396424 8233350 8074763 7945132 7812924 7676588 7529109 7382004
3226 7382004 7254401 7122751 6962505 6816175 6640133 6453796 6278562 6086846 5929953 5775596
3216 5775596 5622765 5494918 5357215 5249616 5157079 5029267 4957250 4926559 4862406 4809386
3206 4809386 4744331 4693174 4642310 4613871 4589330 4555935 4537637 4544122 4531054 4534032 4530496 4532316
3194D532316P927J4982J934m533j6708p717J4015N772r539J2663l3153m597m3413
3181D469949r46J2246n697Q028L610K3386O609J0768R736L5118l692p869k6833
3168D534413n898J0831j720m7923n9922l0715j1381l4494l3250Q188p697J0257
3156D330689m2372j1045J2434j7737J9170l3170M360J7631K6396L044K3918J654
3144D334972L0450O2463P5267K8442J5649R6419P1442M5669O0992N7838M0554
3133D920157N5873M4425N3788Q6522R0911J09019P9482Q7732J07108J26087J23957
3122E885061R5767J13957J62725K24638J69925J45294J50547K25151J91526K09940
3112G574531K63014K60340K54290K57356L01253L60641L21342L59946M04544M71582
$$ plain form
3194 4532316 4540243 4555225 4557159 4552626 4535918 4528201 4542216 4547988 4538449 4551112 4517959 4513362 4469949
3181 4469949 4469003 4481249 4475552 4483580 4487190 4510576 4517185 4527953 4537689 4572807 4569115 4561246 4534413
3168 4534413 4528515 4539346 4537626 4489703 4429781 4399066 4387685 4353191 4319941 4328129 4320432 4330689
3156 4330689 4288317 4277272 4289706 4271969 4291139 4257969 4262329 4279960 4306356 4309400 4333318 4334972
3144 4334972 4365422 4427885 4503152 4531594 4547243 4643662 4715104 4760773 4821765 4879603 4920157
3133 4920157 4976030 5020455 5074243 5160765 5251676 5360695 5440177 5527909 5635017 5761104 5885061
3122 5885061 5980828 6094785 6257510 6482148 6652073 6797367 6947914 7173065 7364591 7574531
3112 7574531 7837545 8097885 8352175 8609531 8910784 9271425 9592767 9952713 10357257 10828839
3102A0828839N03813N05661N35234N90140O45794P14346P42776P73697Q66582
3093A6706882R04278R90682J061870J187521J266945J422548J582548J741060
3085B6864334J924661K190851K464226K763834L085466L493263L851989M265166
3077E0903790M762015N417675O281807P123225Q062145R074335J0324026J1850309
3069A13799327J3895769J6355705J8738218K1205705K4245436K8156468L1356539
3062B67753167K9847304J9645427L825014n548535k979853K743941K97975j4905482
3054C00678958l3360692m0202493l5524512k7666062k0972834j6148849j2757748
3047A14045768j0387576q738560p730511p102663o557536n807253n104611m508605
$$ plain form
3102 10828839 11332652 11838313 12373547 12963687 13609481 14323827 15066603 15840300 16706882
3093 16706882 17611160 18601842 19663712 20851233 22118178 23540726 25123274 26864334
3085 26864334 28788995 30979846 33444072 36207906 39293372 42786635 46638624 50903790
3077 50903790 55665805 61083480 67365287 74488512 82550657 91624992 101949018 113799327
3069 113799327 127695096 144050801 162789019 183994724 208240160 236396628 267753167
3062 267753167 297600471 317245898 321070912 315522377 312542524 315286465 315584440 300678958
3054 300678958 267318266 227115773 191591261 163925199 142952365 126803516 114045768
3047 114045768 103658192 94919632 87189121 80086458 73528922 67721669 62617058 58108453
3039E8108453m051278l658442l270293k839409k506880k293223k081778j923646
3031C5483504j796636j654619j550874j443138j329876j260089j175764j156020
3023B4116488j057535r88479r27256q82127q20619p19536o92275o38625o15891
3014A6774145n79556n23808n29500m82499m31073m36087l72872l72612l61418
3005A2684720l77311l31183l09895k99456k95967k63425k74863k61804k37998
2996A0032818k35587k46858k31862k09545k71320k21160k49357k07970k24046
2987G935113k10077j88074j77817j98347j55335j74560j26420j29745r9763j36856
2977F338119j25126j05684j18712j18342j19152p8036j15148r8933q0968q7246
$$ plain form
3039 58108453 54057175 50398733 47128440 44289031 41782151 39488928 37407150 35483504
3031 35483504 33686868 32032249 30481375 29038237 27708361 26448272 25272508 24116488
3023 24116488 23058953 22070474 21143218 20261091 19440472 18720936 18028661 17390036 16774145
3014 16774145 16194589 15670781 15141281 14658782 14227709 13791622 13418750 13046138 12684720
3005 12684720 12307409 11976226 11666331 11366875 11070908 10807483 10532620 10270816 10032818
2996 10032818 9797231 9550373 9318511 9108966 8837646 8616486 8367129 8159159 7935113
2987 7935113 7725036 7536962 7359145 7160798 7005463 6830903 6704483 6574738 6474975 6338119
2977 6338119 6212993 6107309 5988597 5870255 5751103 5673067 5557919 5458986 5378018 5290772
2967E290772j10932q6900r4650n6473j09189r7870j04574p8934o5853j08269p2250
2956D304878r5922r7980q8004o0736o8185j01370l2745m8522o3340l5288n4628
2945C558158q8542m8552l6934o8845n0107m6839l2229m6043r9324n5508m8602
2934B936633l3740n6652r062p8792m6703j1721l6626l7896k3734l3469k0021k7423
2922B520794j5176m9771m9470l3847r601j1525j0618k1041m3579J9177j2263m2726
2910B240354l8643j2945l6647J8800m4129n9737l7822j6709k3232K1975k0417
2899A990848l3464j8242N9841j528l9550o4752m0705j3550j5856j9439l0293l5518
2887A737792m0783q3682k5590l3039n4975k0062l6769n2682l354k2600k8805K7433
$$ plain form
2967 5290772 5179840 5092940 4998290 4941817 4832628 4734758 4630184 4551250 4485397 4377128 4304878
2956 4304878 4208956 4110976 4022972 3962236 3894051 3792681 3759936 3711414 3648074 3612786 3558158
2945 3558158 3469616 3421064 3384130 3315285 3265178 3218339 3186110 3140067 3040743 2985235 2936633
2934 2936633 2902893 2846241 2837179 2758387 2711684 2699963 2663337 2625441 2601707 2568238 2548217 2520794
2922 2520794 2505618 2455847 2406377 2372530 2362929 2351404 2340786 2319745 2276166 2295343 2283080 2240354
2910 2240354 2201711 2188766 2152119 2170919 2126790 2067053 2029231 2012522 1989290 2011265 1990848
2899 1990848 1957384 1939142 1998983 1997455 1957905 1893153 1852448 1838898 1823042 1803603 1773310 1737792
2887 1737792 1697009 1613327 1587737 1554698 1499723 1479661 1442892 1390210 1386856 1364256 1335451 1362884
2875A362884j1615j3389p790K5638m2299k8800j5685o598j4672j8956j1227N650
2863A223141p257j9834N984l9636k932j2245n0213L9104k1044j4875J6477j3548
2851A103122K339k5231m2251r029L678k8994j8822l971j4213J0110K8646k780
2839A002604k5253n821L3350j7177k1548K6542l2102j9173k8075K165L066n3097
2827H65481j9948k0358n510M0687j9314l6222l3306L3809P860o773R33Q566n471
2814H10434j0996k8047L2408M1524j7250q369M376J4955n650j1887N585J2550
2802H39633J5912l780l066L2292L2164o484K4479M5951j0410R783K3254L6135
2790A035863P6330N3309L7757Q6660L0544O3681J16584R0818J08279J51183J60127
$$ plain form
2875 1362884 1351269 1337880 1330090 1355728 1313429 1284629 1268944 1262346 1247674 1228718 1217491 1223141
2863 1223141 1215884 1196050 1202034 1162398 1159466 1147221 1097008 1136112 1115068 1100193 1116670 1103122
2851 1103122 1105461 1080230 1037979 1028950 1032628 1003634 984812 980841 966628 976738 1005384 1002604
2839 1002604 977351 971530 1004880 987703 966155 992697 960595 941422 913347 915512 918578 865481
2827 865481 845533 825175 819665 860352 841038 804816 771510 805319 813179 806406 807339 815905 810434
2814 810434 799438 771391 803799 845323 828073 819704 824080 839035 833385 821498 827083 839633
2802 839633 855545 851765 848699 880991 913155 906671 931150 977101 966691 976474 999728 1035863
2790 1035863 1112193 1165502 1203259 1289919 1320463 1384144 1500728 1591546 1699825 1851008 2011135
2779B011135J89682J03508K2828j4092j1363K8571k253q4379j84086k04661j94140
2768A660750j65791j14691j01415m0620n9493o0978n3223p3267l4411L235o278
2757I53818m2359n3522l9922j4479j1463j9824l2820k8857K4880n892l4138l6878
2745F58544o58j2914K3467J0030j4109j4716j8517j7636l1226L8537Q212M446
2733F33460q624l8656k4647J3560k910N960k4607J6195k087k9467j3427n353L7026
2720E56423l3139m405q468P944k2218j9574K7567n507j3116k822l3945k2747O478
2707D32471J1951k6652k2831J2969j3012k144o549r653p097j6828j1133K0454
2695C61946J6899r410j3404q143O990L7345k5320k3164R253Q856J9227j423j1907
$$ plain form
2779 2011135 2200817 2304325 2327153 2313061 2301698 2330269 2328016 2243637 2059551 1854890 1660750
2768 1660750 1494959 1380268 1278853 1238233 1178740 1117762 1064539 991272 956861 960096 953818
2757 953818 911459 857937 818015 803536 792073 772249 739429 710572 735452 729560 695422 658544
2745 658544 657886 644972 668439 678469 664360 649644 631127 613491 582265 620802 629014 633460
2733 633460 624836 586180 561533 575093 572183 578143 553536 569731 567644 538177 524750 519397 556423
2720 556423 523284 518879 510411 518355 496137 476563 504130 498623 485507 482685 448740 425993 432471
2707 432471 444422 417770 394939 407908 394896 392752 386203 376550 369453 352625 341492 361946
2695 361946 378845 369435 356031 347888 354878 392223 366903 343739 352992 361848 381075 379652 367745
2682C67745J3157m8098j4780Q227R925J6055J3736j8213N658J2403k7087J2026
2670C50754J2377K103k1178O095j5199k8175Q963M9207r300r11M96k7119p628
2657C20485q400n068j8125o138J6300l746R261j05p872n875j3678j1284J7676
2644B83431K2787l2072p735K53j3079j574K2657P804o655k7409J1945n363M053
2631B59043o147P483K602m7305J2441M4148k3684m489J489l9423l198L973j788
2618B05145P172O36j5447o512J6814k1040P185J2631K7465j192k2805r397J8250
2605B18905j491R773L1058k4986m9541N865j788J1068m139k0891K6368r293N432
2592A96340q273J7627K8357M1417j6660j5806n376J3378k3950l9844m503L3198
$$ plain form
2682 367745 380902 332804 318024 326251 336176 352231 365967 347754 353412 365815 338728 350754
2670 350754 363131 365234 344056 350151 334952 306777 315740 364947 355647 354736 355232 328113 320485
2657 320485 312085 307017 288892 282754 299054 295308 304569 304464 296592 290717 277039 265755 283431
2644 283431 306218 274146 266411 266664 253585 252011 274668 282472 275817 248408 260353 254990 259043
2631 259043 252896 260379 262981 215676 228117 272265 248581 244092 245581 206158 202960 206933 205145
2618 205145 212317 212953 197506 190994 207808 186768 193953 206584 234049 232857 210052 200655 218905
2605 218905 217414 227187 258245 233259 183718 189583 187795 198863 194724 173833 200201 190908 196340
2592 196340 188067 205694 234051 275468 258808 243002 237626 251004 227054 187210 182707 215905
2580B15905k1488J6774j1327K1933K373m6412p34q630j1092L5170J3862K5031
2568B31365O035j8156j1880M247J113m351J8005r254O429R415j9752J533j3517
2555B01232l6627K3447M283m533J4405J2583J421N070J3099J4667k5540n779j8834
2542A98894j8464N056j2084L7357n060j6108q408J0265R320k9393k91K4199j4493
2529A80790k0031N742Q227M3082l1549k3478K3280j1603j70q460n950L792k1143
2516A42529L0991l7240k8281J9732K8798P642J6107R770J639j6356J4710q197
2504A81844j3317J483l306j9348L0983l602j1110r509J2661j5157l3173J0637
2492A29086J7671J0123n013J4384k8722J6983q554j0516j1997k2724P195K3333
$$ plain form
2580 215905 194417 211191 199864 221797 224170 177758 177024 168394 157302 192472 206334 231365
2568 231365 237400 219244 207364 211611 212724 208373 226378 217124 223553 232968 213216 214749 201232
2555 201232 164605 188052 192335 187802 202207 214790 216211 221281 234380 249047 223507 217728 198894
2542 198894 180430 185486 173402 210759 205699 189591 181183 191448 200768 171375 171084 195283 180790
2529 180790 160759 166501 174728 217810 186261 162783 186063 174460 174290 165830 159880 163672 142529
2516 142529 173520 136280 107999 127731 156529 164171 180278 190048 191687 175331 190041 181844
2504 181844 168527 170010 166704 147356 178339 174737 163627 154118 166779 151622 118449 129086
2492 129086 146757 156880 151867 166251 137529 154512 145958 135442 123445 100721 107916 131249
2480A31249k3817k0941L0354N1407j4458k4773k6347K4503j1364j0937K8142R87
2468A34005J4440q851p538P929o678O463m407P207n457k8196k9660M4950j3918
2455A10289m604j4456l735N692K8016k1537k4069K6219J0594j578m388k4545J8603
2442A00501K4148m0850N7194l2056m034M489K4256M811J2102j3385o539r530J232
2429A22339j930j4919m192K0476l9709J1942K5534jJ8877k1228j9767K5564j8255
2416A04731k3559o43L8613n736k528K759K6086o590m702M189p13j9647j0505L4021
2402A35776j5611J5167M353k0587P727M2232j8648k5034K9806m387k7483L7908
2390A61219k6269K2383K3478l8043j1688n996j2047K7341j5726J7366k700L478
$$ plain form
2480 131249 107432 86491 116845 168252 153794 129021 102674 127177 115813 104876 133018 134005
2468 134005 148445 139594 132056 139985 133307 139770 135363 142570 137113 108917 79257 124207 110289
2455 110289 105685 91229 87494 93186 121202 99665 75596 101815 112409 110831 106443 81898 100501
2442 100501 124649 83799 140993 108937 104903 109392 133648 138459 150561 137176 130637 121107 122339
2429 122339 120409 105490 101298 121774 82065 94007 119541 119540 138417 117189 97422 122986 104731
2416 104731 81172 80529 119142 113406 110878 113637 139723 133133 128431 132620 131907 112260 101755 135776
2402 135776 120165 135332 139685 119098 126825 169057 150409 125375 155181 150794 123311 161219
2390 161219 134950 157333 180811 142768 131080 125084 113037 140378 124652 142018 139318 142796
2378A42796l2025j155j1457J5675J0842j1795K0292J6937K5756J467J1985Q76
2366A90194k3680J9814J3104l4077l8456N6304M258Q318M449n931o863J6758J2934
2353B17126k2585L85K4054Q178q616L3711k7063P403k2851j9586M3912L474K7787
2340B65329L1056K3173K1354N932J5251j388J9336N8351O332m248K3211J3084
2328D76773K2196L7104M562L5566M9867M1670N0321O3657Q4530P7992N1473J13057
2316A108768J26567R5738J19656J67891J59102J92524R4423J48414J99569K91330
2306B703982L15551M06113N54027O46215P23201P30150Q62123J227975J535681
2297I705018J485200J62077k206802k117696j431208r72396o62051m62118l70063
$$ plain form
2378 142796 110771 109616 98159 113834 124676 112881 133173 150110 175866 177333 189318 190194
2366 190194 166514 186328 199432 165355 126899 183203 187461 195779 200228 194297 187434 204192 217126
2353 217126 194541 194926 218980 227158 218542 252253 225190 232593 209742 190156 234068 237542 265329
2340 265329 296385 319558 340912 346844 362095 360707 380043 438394 444726 440478 463689 476773
2328 476773 498969 536073 540635 576201 626068 667738 718059 781716 866246 944238 995711 1108768
2316 1108768 1235335 1331073 1450729 1618620 1777722 1970246 2064669 2213083 2412652 2703982
2306 2703982 3019533 3425646 3979673 4625888 5349089 6079239 6941362 8169337 9705018
2297 9705018 11190218 11352295 9145493 7027797 5596589 4624193 3962142 3500024 3129961
2288C129961l32333k60909j92636j69415j15188o8847q7516r8833j96144j53726
2278A454414j34190n0373j13229o7890m0040p5989r1637m0835k8350l8851n0327
2267G22703l027J6808j3408m1997m7648j2495n2747l8392m398l4959J8570m2096
2255D66914l3906J6296j2452l876q815J1817j9388m2948n786k5596k4597K877
2243C20540o119j5033j4531q416J1563K1608O916n7342K1610j4742M956J5134
2231B86144J367k8946J0926j330l5712K9j2164j0139M837J2676k0075n75m243
2218B02795j4547J0457J7871j5740Q071r522r453j7912M320J9417k0154l3589
2206A42014k7978o03K4009L2324k1617j9764L2203K7487k2740k1549Q748R113
$$ plain form
2288 3129961 2797628 2536719 2344083 2174668 2059480 1990633 1903117 1804284 1608140 1454414
2278 1454414 1320224 1269851 1156622 1088732 1048692 972703 881066 840231 811881 773030 722703
2267 722703 719676 736484 723076 681079 633431 620936 568189 529797 525399 490440 509010 466914
2255 466914 433008 449304 436852 432976 424161 435978 416590 373642 367856 342260 317663 320540
2243 320540 314421 299388 284857 276441 288004 309612 316528 259186 280796 266054 271010 286144
2231 286144 287511 258565 269491 268161 232449 232478 220314 210175 215012 227688 207613 207038 202795
2218 202795 188248 198705 216576 200836 208907 199385 189932 172020 176340 195757 175603 142014
2206 142014 114036 113433 137442 169766 148149 128385 160588 188075 165335 143786 152534 161647
2194A61647l9228k0401O614L7855J625o40j8406j8563P756k5543R614K4582j0630
2181A16282L4172K28k1856l3585j4245J6635m1452j4839K0414M1286K3275j1040
2169A15275J3654q775J7942j3865o841O534j7662l3335R13M2184l5262J4226J567
2156I6555r372O84K013k1965Q619K6993k8029J5488K8201j6364j2971K4697k903
2143A11646j223j7038M210L5698m1753k9883K1931L4043j8125l3841K6083j1551
2131H0197r395K9557J2956j3805P364j3584j7888N234k2559K7255R311j6001J680
2118H0322n809J2890J4038j3096l7697k0794K5873J6440J3890k7737q234J7990
2106F8076J1496m8530j5935J5071M9435J7609k2891j9225O581Q23J1713L69q685
$$ plain form
2194 161647 122419 102018 108632 146487 148112 147472 129066 110503 118259 92716 102330 126912 116282
2181 116282 150454 150682 128826 95241 80996 97631 56179 41340 61754 103040 126315 115275
2169 115275 128929 120154 138096 124231 117390 123924 106262 72927 73840 116024 80762 94988 96555
2156 96555 87183 87867 89880 67915 76534 103527 75498 90986 119187 102823 89852 114549 111646
2143 111646 110423 93385 97595 133293 91540 61657 83588 117631 99506 65665 91748 80197
2131 80197 70802 100359 113315 99510 106874 93290 75402 80636 58077 85332 94643 78642 80322
2118 80322 74513 87403 101441 88345 50648 29854 55727 72167 86057 58320 50086 68076
2106 68076 79572 31042 15107 30178 79613 97222 74331 55106 61687 62510 74223 74592 65907
2093F5907k805J100j8409k0480J878J4966o017l2492M1496m467n450k984o79P109
2079C8673N4536M202k1268J1004K5423l066k7938j2032o509o818k0594R716o772
2066C8557L1708j1734j5592j7935k904N560M869L80r229J1769N795j9234L3051
2053E5061M3098l8496k2267J8013n905j7056J181k4368P185K0567K8678k0445
2041D5246J9887J4257L2647J092l7819j7640o37k69M75M3402k5153l512K0470
2028I2446r860L0237L1501j606l4434k965k8906l7074j8043N761K1003k2772j9889
2015E399P110R220J9114O647R539j5177J8113K2013m9178p286K7829m44L2710
2002H5609r812n8252J8926l256K2251l1759q902j516J6249q617J5187o135j5652
$$ plain form
2093 65907 63102 64202 45793 25313 27191 42157 36140 3648 45144 40677 35227 32243 31564 38673
2079 38673 93209 97411 76143 87147 112570 109504 81566 69534 63025 56207 35613 45329 38557
2066 38557 70265 58531 42939 25004 22100 27660 32529 32909 23680 35449 41244 22010 55061
2053 55061 98159 59663 37396 55409 49504 32448 33629 9261 16446 37013 65691 45246
2041 45246 65133 79390 112037 113129 75310 57670 57033 56764 57239 100641 75488 71976 92446
2028 92446 82586 112823 144324 142718 108284 105319 76413 39339 21296 27057 48060 25288 5399
2015 5399 12509 21729 40843 47490 57029 41852 59965 81978 32800 25514 53343 52899 85609
2002 85609 75797 17545 36471 33215 55466 23707 14805 13289 29538 20921 36108 29973 14321
1989A4321K5308k456J6725J4884l101m902j4678j344K644K4707q765L694L1855
1976I8892l8323j0187n93k6629m294K763J4471j746k5849L3940J0719Q331o567
1963E4928k7464n08k55j3375J2242j9541j8379K8933L2211n571o044k1493j184
1950A4500J4511J525K2126L888l1052m934j5501r67J9275O189k85O958j3933L1797
1936E4097m230j0114j973l3436N626K405K686l439K9521J8410j9991M401K0132
1923F4095j6141P39R037m2119J6038j1414J982J6339j0407q654J4180L523k4791
1910A2407n976J6403N518q815j8198P266P812o110k1144J4031l605J6934L1384
1897D7907M638J3835l0093k0374J0931k1788j4834J3860N372J4515m390l310j1843
$$ plain form
1989 14321 39629 37173 53898 68782 65681 60779 46101 44757 47401 72108 63343 67037 98892
1976 98892 60569 50382 49789 23160 18866 21629 36100 34354 8505 42445 53164 61495 54928
1963 54928 27464 26956 26701 13326 25568 6027 -12352 16581 48792 43221 37177 15684 14500
1950 14500 29011 30536 52662 56550 25498 20564 5063 4096 23371 29560 29275 36233 22300 54097
1936 54097 49867 39753 37780 4344 9970 12375 15061 11622 41143 59553 39562 43963 64095
1923 64095 47954 48693 57730 15611 31649 20235 22217 38556 28149 19495 33675 37198 12407
1910 12407 6431 22834 28352 19537 1339 8605 16417 10307 -10837 3194 -411 16523 47907
1897 47907 52545 66380 36287 15913 26844 5056 -9778 4082 9454 23969 19579 16269 4426
1884D426J2660J8047m860n7974L5608K9930J0996J2381k803l5435J2998j2806
1872B3168l3051K4068K5318k1363j2645j3154N3208o799K7708o382m4051J1381
1860B7406R28J5070k5127K896j6689J9941j4220j5798j42K9619j2393J2580K5741
1847D9812J295o783k0020Q34j4919J2243j0127m54p584l8424l199K4263n279K6400
1833H058K0066J4677k8603l886j9347p146K5596q46J6115k9085L518j7325q607
1820b6815M0299J9019L826o976J9016k5146q899k3502J8031J1171N896M78l3170
1807f772J7001j312J6203j8823O074j1452R18K5760l3752o049L8827L539K8528
1794E8690k3892n148K72k8158P657o402q694J5983J7835r375m124l809l792M274
$$ plain form
1884 4426 17086 35133 30273 -27701 7907 37837 48833 61214 58411 22976 35974 23168
1872 23168 -9883 14185 39503 18140 5495 -7659 45549 38750 66458 60076 16025 27406
1860 27406 28334 43404 18277 21173 4484 24425 10205 -5593 -5735 23884 11491 24071 49812
1847 49812 51107 44324 24304 25138 10219 22462 12335 11881 4297 -34127 -37326 -13063 -18342 8058
1833 8058 28124 42801 14198 10312 -9035 -16181 9415 8569 24684 -4401 -883 -18208 -26815
1820 -26815 13484 32503 36329 29353 48369 23223 14324 -9178 8853 20024 25920 26398 -6772
1807 -6772 10229 8917 25120 6297 12371 919 1837 27597 -6155 -12204 26623 30162 58690
1794 58690 34798 29650 29922 1764 9421 3019 -5675 10308 28143 18768 14644 10835 7043 11317
1780A1317J7599K293l4975K4337Q142O442l180o821j9125o037K6166l7024M464
1767f402M1019J8961r351O829J7033l3566r039K1750j5329J98J9026j0266q951
1754C1912k3992M772J9613K2764j1520k7842r418J4379J7619K7199p780r754p208
1741D0744r537o053K5920j9398j4615r251J933J303K4583k2612j7492J8560R173
1728B3258K0098l6289K3564r484j2390m9163J5347K8045N312L3694l339O281k1871
1715B3063J2876J0428k3577L176l4750L6840k1033n83R540K834M75m4617J2280
1702a3048n448K1422L6373k5901j4566l993J4209j1214l1356J5246K1046j2477
1690i707J5721O370o739J5987M3976L014j1091k2920k7954j2096k8309r04J3358
$$ plain form
1780 11317 28916 31209 -3766 20571 28713 35155 31975 25154 6029 -8 26158 -10866 -6402
1767 -6402 34617 53578 44227 51056 68089 34523 25484 47234 31905 32103 51129 40863 31912
1754 31912 7920 12692 32305 55069 43549 15707 6289 20668 38287 65486 57706 47952 40744
1741 40744 31207 25154 51074 31676 17061 7810 9743 11046 35629 13017 -4475 14085 23258
1728 23258 43356 7067 30631 21147 8757 -40406 -25059 2986 8298 41992 38653 44934 23063
1715 23063 35939 46367 22790 25966 -8784 28056 7023 6440 15980 18814 19289 -25328 -13048
1702 -13048 -18496 2926 39299 13398 -1168 -5161 9048 -2166 -33522 -18276 2770 -9707
1690 -9707 6014 12384 5645 21632 65608 68622 57531 34611 6657 -5439 -33748 -34652 -21294
1677b1294J3159K3805K037J139J2399k9133J71m874q752j5909k4998L842M7486
1664i22Q119j2466Q489K307K0257k309j56j6402k6179L3265k1565j5280K4508
1651A666Q192j4981J849K0940K1840M308R570n319l3924r197J2376J4j0336l6804
1637b9806K649n14R295o020j8404R199K6072L187J884L6297k0242N479k4911K7992
1623B2157M492j2261L3185k3934k4445p929J1457J3311k6121j532K9373K2768
1611D0521J5619l9445k7811J4897k8776m104L4675L0247R549k1976J2218q743
1599B6871m0485J4444j3917J678q609L1345O2045L779l4495k8078r126K0129p452
1586A8129k2645m086J688N437K2734k657j0302k4470K645Q278K582K8781j6214
$$ plain form
1677 -21294 -8135 15670 17707 18846 31245 2112 2283 -2591 -11343 -27252 -52250 -48408 -922
1664 -922 7197 -5269 3220 5527 25784 23475 23319 6917 -19262 14003 -7562 -22842 1666
1651 1666 9858 -5123 -3274 17666 39506 43814 53384 48065 14141 4944 17320 17334 6998 -29806
1637 -29806 -27157 -27671 -18376 -24396 -42800 -33601 -7529 -4342 -2458 33839 13597 19076 -5835 22157
1623 22157 26649 14388 47573 23639 -806 -8735 2722 16033 -10088 -11620 17753 40521
1611 40521 56140 16695 -11116 3781 -24995 -29099 5576 35823 45372 23396 35614 26871
1599 26871 -13614 830 -13087 -11409 -20018 11327 73372 77151 42656 14578 5452 25581 18129
1586 18129 -4516 -8602 -6914 -1477 21257 18600 8298 -16172 -13527 -5249 -2667 26114 9900
1573I900l372K076J5424j499k8601J606L7179K0556p517m1647J7078k1303l8051
1560c8171N178L5482J5989J6721K0687m1708J4070K513r972l0502L4741J8779
1548D3807j7639j4509k2182k423K4595J5640j7604j4136k5033J1362J2691K4601
1536A9170j3766K2797o380j3642j2610N2771m480k9050l2295L440K3181q276j2375
1523a1515k1201M0091Q57J1719L1408j9421O14J0106p553l3719L692J1777n505
1510A1350j839L728r623p928J1882k4804J5208n948l4200R650L3185J8874n312
1497A4223M075k2671k9389j6348j0082K4780k241N3785J1811k8612j5217j0947
1485b6833j7842P014K1610L3882L378o424K3545n976K6133k8010l7501Q389J2929
$$ plain form
1573 9900 6528 8604 24028 22529 -6072 -4466 32713 53269 45752 4105 21183 -120 -38171
1560 -38171 -32993 2489 18478 35199 55886 14178 28248 30761 20789 -9713 25028 43807
1548 43807 26168 11659 -10523 -12946 11649 27289 9685 -4451 -29484 -18122 -5431 19170
1536 19170 5404 28201 21821 8179 -4431 48340 43860 14810 -17485 -14045 9136 860 -11515
1523 -11515 -32716 7375 8232 19951 51359 31938 32552 42658 35105 1386 5078 16855 11350
1510 11350 9511 13239 3616 -4312 7570 -17234 -2026 -7974 -42174 -32524 661 19535 14223
1497 14223 18298 -4373 -33762 -50110 -60192 -35412 -37653 16132 27943 -669 -15886 -26833
1485 -26833 -44675 -37661 -16051 17831 21209 14785 38330 32354 58487 30477 -7024 1365 14294
1472A4294L803k0715J1822P469K2982r835l3275j4655M52Q71L3937J7741J6082
1459E0973l5295j8342n728l3880L9469j7652n291M68R337j7034M662J0545J0175
1446g593O330k107l4475J9247N1930L2396r93k9787L068k5378l077L0922Q2J2533
1432E3098l8972j003K5726k819K2341J6041l5758j2013j0421j1920K1265j7611
1420G954J9879l3644O181J3619K0329k9760P704j7583k3450P734P282J1866K1877
1407A9988L0140l2227j6854O078r091K9407j883J9868L957j2923j3647l8277K0824
1394E360m54N56M1741M535j8936r350O817j2792j3037k2318J0392R593p963Q253
1380B397R406K6441j9980J8610k0031k4808N172J292J300Q28J136P180j2606N656
$$ plain form
1472 14294 18097 -2618 9204 16673 39655 29820 -3455 -18110 -17658 -16787 17150 34891 50973
1459 50973 15678 -2664 -8392 -42272 -2803 -20455 -25746 -25278 -15941 -32975 -28313 -17768 -7593
1446 -7593 -1263 -3370 -37845 -18598 33332 65728 64735 34948 38016 12638 9561 40483 40565 53098
1432 53098 14126 13123 38849 36030 58371 74412 38654 26641 16220 4300 25565 7954
1420 7954 27833 -5811 370 13989 34318 4558 12262 -5321 -28771 -21037 -13755 -1889 19988
1407 19988 50128 17901 1047 7125 -1966 27441 25558 45426 49383 36460 22813 -15464 5360
1394 5360 4906 5462 47203 51738 32802 23452 30269 17477 4440 -17878 -7486 2107 -5856 2397
1380 2397 11803 38244 18264 36874 16843 -7965 -2793 -1501 -201 627 1763 8943 -3663 1993
1366A993k2489j4186L0296L0094J008k3594p427j3467J0400l532J5086K4458K696
1353C1336L061j8202J439k0894r77j668J8509K7568k5955K6868k990P592j5746
1340B9941o3815K1502K7672J036O893j0850N199J2179j5951k7122J9058J5972
1328B1714k8559R798l0159j0099L326P696M1982P668j3873j457J1385k9301l9842
1315d9721K8456K7277j4761J6025K436O370P962q29k155j3062o956J6042L543
1302B0627j8843k051l3964K5057J228k0983M408k4249J612L6711K0793j4498k1870
1289b6022M4435j835K4799j1986k4780q50J1913l5561j7936L4805L1776j5884
1277A2874M621J2069k6478J3008K346P894j5104m1j712j7380m1220M1107m209
$$ plain form
1366 1993 -20496 -34682 -4386 25708 26716 3122 -4305 -17772 -7372 -10904 4182 28640 31336
1353 31336 34397 16195 17634 -3260 -4237 -5905 12604 40172 14217 41085 38095 45687 29941
1340 29941 -33874 -12372 15300 16336 23229 12379 17578 29757 13806 -13316 5742 21714
1328 21714 -6845 2953 -27206 -37305 -33979 -26283 15699 23367 9494 8037 19422 -9879 -49721
1315 -49721 -21265 6012 -8749 7276 9712 16082 24044 23215 21060 7998 1042 17084 20627
1302 20627 1784 -267 -34231 -9174 -7946 -28929 -24521 -48770 -47158 -10447 10346 -4152 -26022
1289 -26022 18413 16578 41377 29391 4611 3761 15674 -19887 -37823 -3018 28758 12874
1277 12874 17495 29564 3086 16094 18440 26334 11230 11189 9477 -7903 -49123 -8016 -12225
1264a2225o713J5660K074q530P899O45k1793m809K6085J1011k7741R28j264J945
1250a6828j7382R212L6610K4447j0136Q533K021l2749j1234O205j9175K4412n284
1237a348j5079M4415l0333J4300k5227j6497M442K0274M923j6511k5560N4155
1225A1954j3973k5365p172K0592N64Q274L4899k1442j346J2308k8234Q998L6029
1212C6086k6511j6533L4083r33m8681P463J3078K1881K910k6483q731J017K83
1199a1071j5702j3483L8304l182j794j1251k5Q84K2323k872m640j9048J1660m956
1185a4853m35J1966J6422j4880n373J6866N073l777o516k632L501K3555k4840
1172D077m322Q522p922n536K4933q875k5982k7990K9707J2698J0758J9073o3389
$$ plain form
1264 -12225 -18938 -3278 -1204 -9734 -1835 -1190 -22983 -27792 -1707 9304 -18437 -17509 -18773 -16828
1250 -16828 -34210 -24998 11612 36059 25923 34456 36477 3728 -7506 -1301 -20476 3936 -1348
1237 -1348 -16427 27988 -2345 11955 -13272 -29769 -25327 -5053 -130 -16641 -42201 11954
1225 11954 -2019 -27384 -34556 -13964 -13400 -5126 29773 8331 6985 19293 -8941 57 36086
1212 36086 9575 -6958 27125 26192 -22489 -15026 -1948 19933 22843 -3640 -12371 -11354 -11071
1199 -11071 -26773 -40256 -1952 -5134 -6928 -18179 -18204 -17320 5003 2131 -2509 -21557 -9897 -14853
1185 -14853 -15288 -3322 13100 -1780 -7153 9713 14786 11009 4493 1861 5362 28917 4077
1172 4077 -245 8277 355 -5181 19752 10877 -15105 -43095 -13388 -690 10068 29141 -34248
1159c4248K0401K0157q905J1125K615k0595J5906L7708o205n25j1012j035l3809
1146h422K853K9291q332k5934m5352K3888J1682k8413J8968J3071k1837k0114
1134e8651j6762J0287P5223O052l114L155k9289K502k89O970l75j892K1537J2215
1120B7569k9865Q631k4487K0245J5110q555k588L2504J2171r999j528j1640L684
1107C1252j2362r948o758j0126j569p032K0366l149j4918K1549J5955P743k1375
1094I628j2800p139p430j0898L7066K728o034m2805J6460J0553J2835J8276K6767
1081D7207l2820k7595l173P60K993j9835K3907L5604J3498k6030j3724q02k2985
1068b2995k8993O0294J4301k3238j4117P060l781K1841J7545l3292j183o647L8562
$$ plain form
1159 -34248 -13847 6310 -2595 8530 11145 -9450 6456 44164 37959 37434 26422 25387 -8422
1146 -8422 -5569 23722 15390 -10544 -55896 -32008 -20326 -48739 -29771 -16700 -38537 -58651
1134 -58651 -75413 -65126 10097 16149 13035 16190 -13099 -10597 -10886 -3916 -4291 -6183 15354 27569
1120 27569 -2296 6335 -18152 2093 17203 8648 6060 38564 50735 40736 39208 27568 31252
1107 31252 18890 8942 2184 -7942 -9511 -16543 3823 674 -14244 7305 23260 31003 9628
1094 9628 -3172 -10311 -17741 -28639 8427 11155 5121 -37684 -21224 -10671 2164 20440 47207
1081 47207 14387 -13208 -16381 -15621 -12628 -32463 -8556 27048 40546 14516 792 -10 -22995
1068 -22995 -51988 8306 22607 -631 -14748 -7688 -11469 10372 27917 -5375 -6558 -13205 25357
1055B5357r568k1809K0977r094O548l211m291L0689n514j1271O088J0309K1421
1042E6631p899m9120k9392l768J4897K5414k786k1959j2293J7270M4482K1343
1030E2820k8327l4610J7285K7362o345k3167l965K3253p265l3852j9802O451J0460
1017a9702L2475j9415O105l5878o858O448K3891K2455rK820J6661n2363n071J6838
1003a1603K5815M20j9635J7359j997J3890k2163j1563k890J0414p521J055K746
990e673j698j3929K3245p541j727O977k095j0367o969j7489j3547n293L2531j2387
976c5962J9499K2408j6560Q943l968M091l9688L0604L6931p784Q565q883j4194
963D002K613J4410j0651M317M344J7766O96l8899j1752j1344J0241J5516L464
$$ plain form
1055 25357 15789 -6020 14957 5863 12411 9200 4909 35598 30084 18813 24901 35210 56631
1042 56631 48732 -388 -29780 -33548 -18651 6763 3977 -17982 -30275 -13005 31477 52820
1030 52820 24493 -10117 7168 34530 28185 5018 1053 24306 17041 -16811 -36613 -30162 -19702
1017 -19702 12773 -6642 -537 -36415 -43273 -36825 -12934 9521 9512 12332 28993 -23370 -28441 -11603
1003 -11603 14212 14632 -5003 12356 10359 24249 2086 -9477 -12367 -1953 -9474 -8419 -5673
990 -5673 -7371 -21300 1945 -5596 -7323 -346 -2441 -12808 -19777 -37266 -50813 -56106 -23575 -35962
976 -35962 -16463 5945 -10615 -1672 -5640 -1549 -41237 -10633 26298 18514 27079 18196 4002
963 4002 6615 21025 10374 14691 19035 36801 37497 -1402 -13154 -24498 -14257 1259 4723
950D723J6642k3811n153q090j2986K1279r747L3747L516k4382o752K3036j5423
937c401o751J181n704J3776J9902k670k4773K542J4344j9219o633l973j0804J0737
923b1446j6063n301P055K9500l064L3846K9121l6646k7094j878L1558J4765j1753
910B2600k3192m4957J3322K0035K2861k3286r831j916J0516J1753J7997l9184
898b3282k3018N232m497J8671J4900J4051M708J3670j5634k5044J0985k5247J088
885c3417L9669J387K0117o729l2642j0557J3390L677j1960q433m81n937N5158
872B3242j6787k6074L39q963L8922L1467n079l3473R441j5016k5361K7789K2676
859B3123r057M823k6945j6266N3498k8986j6436k4805R774P406J2096k0505K6183
$$ plain form
950 4723 21365 -2446 -7599 -15689 -28675 -7396 -17143 16604 20120 -4262 -11014 12022 -3401
937 -3401 -10152 -8971 -14675 -899 19003 16333 -8440 -5898 8446 -10773 -17406 -21379 -32183 -21446
923 -21446 -37509 -42810 -35755 -6255 -9319 24527 53648 17002 -10092 -11970 19588 34353 22600
910 22600 -592 -45549 -32227 -12192 10669 -12617 -22448 -24364 -13848 -2095 15902 -23282
898 -23282 -46300 -41068 -45565 -26894 -11994 2057 6765 20435 4801 -20243 -9258 -34505 -33417
885 -33417 6252 7639 27756 21027 -11615 -22172 -8782 -5105 -17065 -25498 -25979 -31916 23242
872 23242 6455 -19619 -19280 -28243 10679 42146 37067 3594 13035 -1981 -27342 447 23123
859 23123 14066 18889 -8056 -24322 29176 190 -16246 -41051 -31277 -23871 -11775 -32280 -6097
846f097J3378k5918J0971m919J8186p155J9453q194m5454k129K3429J443J4933
833A927k6307k7234K3529J4272q525J9337K0205J039n702j2128J5987j4939k5833
820b4372O480K5906J9034j7830N913k3637k4916J5756P145j7517J7215o083p073
807b3979J506Q17Q771L387O41M642J0752k6462R962K4710k309r668p941r313J8734
792D250o181K7971l0441j531J9995l425k3364l6213K638J0888j8902K729K270
779d9316m463J3490L4537K2480P746L4930j3334l1751j5689J9265q941J2721n652
766A6023l3379j9068J0678K6281K2532l3726R202j2002J3370K263k1444k2228
754d1498J488K7704m093j5103J2367K5103k3741K8647m1633j1208R36K3556J0753
$$ plain form
846 -6097 7281 -18637 -7666 -12585 5601 -1554 17899 9705 -35749 -37878 -14449 -13006 1927
833 1927 -24380 -51614 -28085 -13813 -22338 -3001 17204 18243 12541 413 16400 1461 -24372
820 -24372 -17892 8014 27048 9218 15131 -8506 -33422 -17666 -10521 -28038 -10823 -16906 -23979
807 -23979 -22473 -21656 -12885 -9498 -8857 -4215 6537 -19925 -9963 14747 12438 2770 -5171 -14484 4250
792 4250 -1931 26040 -4401 -5932 14063 10638 -12726 -48939 -46301 -35413 -54315 -51586 -49316
779 -49316 -53779 -40289 -5752 16728 24474 59404 46070 14319 -1370 17895 8954 21675 16023
766 16023 -17356 -36424 -25746 535 23067 -10659 -1457 -13459 -89 2174 -19270 -41498
754 -41498 -40010 -12306 -16399 -31502 -19135 5968 -17773 10874 -30759 -41967 -41031 -17475 -6722
741f722J3173N0650l4760j6371K1362k7074m0850r74K2982N296k565R329L06J2697
727F479O261o37l6111K607J2175k7417J1419j99K0081M3179l6403m1421M3967
714C980K981J433k5181J709j6039j263M736J4361Q345r276J8597k6134Q38j4526
700c5439Q174j0361J8560O046N037l0465m337q57L0568K0235k8941P892K4048
687A0160k1119j4427k548J2800k7338K9324J3795q271J6200j6225l65L575j219
674e658j2349P265K459r945Q382m031k702n513J7836o825q483J2061j2589J2798
660g294J984k4504k7243K1999J0128K3222J93J863n388R492r465k1672l192r458
646c9335k4490M044L3918j05k8872k070M6123L925q133k3187J2909J1835k1579
$$ plain form
741 -6722 6451 57101 22341 5970 27332 258 -40592 -41566 -18584 -13288 -15853 -6524 -6218 6479
727 6479 12740 12103 -24008 -21401 -9226 -36643 -25224 -25423 -5342 37837 1434 -39987 3980
714 3980 6961 8394 -16787 -15078 -31117 -32380 -27644 -13283 -4938 -14214 4383 -21751 -20913 -35439
700 -35439 -27265 -37626 -19066 -13020 -7983 -38448 -42785 -43642 -13074 7161 -21780 -13888 10160
687 10160 -10959 -25386 -27934 -15134 -42472 -13148 647 -7624 8576 -7649 -8014 -4439 -5658
674 -5658 -18007 -10742 -8283 -18228 -9846 -13877 -16579 -22092 -4256 -11081 -19564 -7503 -20092 -7294
660 -7294 -5310 -29814 -57057 -35058 -24930 -1708 -1515 348 -5040 4452 -5013 -26685 -29877 -39335
646 -39335 -63825 -59781 -25863 -25968 -54840 -56910 -10787 -6862 -14995 -38182 -25273 -13438 -35017
633c5017L7870j1601j2868l1389k2372j731O1190m99k41J7919j3628K3851j1500
620a6K771K284j3510K375M7773r872m5220j5931K9539K5678j9240J996j7591R9
606h865k8957p467K5967J3180p996j1145M4126K2707l356J9823q265r964j9480
593B0308j0590j8799j903n602M059O978r575l6266j8653L6298J8196J6028J565
580B044J7483N195J2891j4231p468q415l6593J4724j9100O790J7508q216m357
567b1745J1718K1278L971J5113k6044l1052K3960l418l764O103k3053K1772j2874
554a8035K0010k46L959J2008p143R267p196k8065k2206J9599L9978J0866O979
541C9775j2638l4753K0129n6655m297K2779N909M734l501q819Q413O3815R90l2194
$$ plain form
633 -35017 2853 -8748 -21616 -53005 -75377 -77108 -15918 -16417 -16658 1261 -12367 11484 -16
620 -16 2755 5039 -8471 -6096 41677 31805 -13415 -29346 193 25871 6631 8627 -8964 -8865
606 -8865 -37822 -45289 -19322 -6142 -14138 -25283 18843 41550 38194 58017 49752 39788 20308
593 20308 9718 -9081 -10984 -16586 -12527 -5549 -15124 -51390 -70043 -33745 -15549 479 2044
580 2044 19527 24722 37613 23382 15914 7499 -29094 -14370 -33470 -26680 -9172 -17388 -21745
567 -21745 -10027 11251 15222 30335 4291 -26761 -2801 -6219 -9983 -3880 -26933 -5161 -18035
554 -18035 1975 1729 5688 17696 10553 19820 12624 -15441 -37647 -18048 21930 32796 39775
541 39775 27137 -7616 12513 -44142 -48439 -25660 -19751 -15017 -18518 -27337 -18924 44891 45881 13687
527A3687J8l0165j269L9969K5297l7231N651K5147k1447j3131k6389j3317J3168
514b0012j0282j7391O9928j8510j17K9088q124o3861N821J8730L5401k3080k7554
501b9963K22j2677P521J669K4576J4684j7931N509L837R868J4812R348K4023j8434
487C7064k3160J7212j5880l5114j1030L0318J4667K4852R657l4408J347J485k6763
474i753k716J0484j4482j6436P555L3871r753m836j97Q609k1071Q681J6829k901
460C884J1295J2002k391k4114J4948j4k336K9786l3361J0901k52j4688j7446K622
446i164P433j2258J6150j4715j3870K8946N9462l6063l5015j2286J2383L0004
434B1007J6440p068k1634l5048J2812O882K05J0994j1851J6938n2382J1650J8798
$$ plain form
527 13687 13705 -16460 -17729 22240 47537 10306 15957 41104 19657 6526 -19863 -33180 -20012
514 -20012 -30294 -47685 22243 3733 3616 32704 24580 -39281 -33460 -14730 20671 -2409 -29963
501 -29963 -29741 -42418 -34897 -33228 -8652 6032 -11899 -6390 -2553 7315 22127 31475 55498 37064
487 37064 13904 31116 15236 -19878 -30908 -590 14077 38929 48586 14178 15525 17010 -9753
474 -9753 -12469 -1985 -16467 -32903 -25348 8523 -1230 -6066 -6263 2346 -18725 -10044 6785 3884
460 3884 15179 27181 24790 676 15624 15610 13274 43060 9699 20600 20348 5660 -11786 -9164
446 -9164 -1731 -13989 2161 -12554 -26424 2522 61984 25921 -9094 -21380 -8997 21007
434 21007 37447 30379 8745 -26303 -13491 -6609 -6404 4590 -7261 9677 -42705 -31055 -12257
421a2257L6631p348m940K444j7630l492L1450j1222k4973r838r291r903j2515
408e2884M6325K4054j0350J4900N873m4607n96L217k7326N7362L2643o952l3950
395G709k8476J4059K9288K4502J9386k0447l0867l5438k665N0894O827j6798j3631
382D343j3364k182J0061K3002l3359l7534J5311J9038l1708J6307L5374J2037
370A7326j0398l3075J5011q376R927Q533J5873Q574k8555n998J3795l2233k414
357c2010L1438J4702K91O24j4116O25J3189L6271M882k139j2460J534o803j5827
343B0201j0963J7843K897j0616k0030K4983M025l6332k6193j3809J4963J0834
331b2197k778K0299L2720l6936J1979j3503L0345p287K0190k8251j4699J0659
$$ plain form
421 -12257 24374 17026 12086 14530 -3100 -6592 24858 13636 -11337 -21175 -30466 -40369 -52884
408 -52884 -6559 17495 7145 22045 27918 -16689 -17285 -14068 -41394 15968 48611 41659 7709
395 7709 -20767 -6708 22580 47082 66468 46021 15154 -20284 -22949 27945 34772 17974 4343
382 4343 -9021 -11203 -1142 21860 -11499 -49033 -33722 -14684 -46392 -30085 5289 17326
370 17326 6928 -26147 -11136 -19512 -9585 -1052 14821 23395 -5160 -11158 2637 -29596 -32010
357 -32010 -572 14130 14421 15045 929 1554 14743 51014 55896 53757 41297 42831 36028 20201
343 20201 9238 27081 29978 19362 -668 24315 28340 -7992 -34185 -47994 -33031 -22197
331 -22197 -24975 -4676 28044 -8892 3087 -10416 19929 12642 32832 4581 -10118 541
319E41Q151L3466m8741l2955Q166N3863M10N675r047j8532j8893K6024L015L795
305A4938o761k709j3990J76L238p115J8635P708j1823k6342k7042M8291J586j5444
291a6654K814M482J7767k6932J034J3394p423m872l310K3517K8831j9704J6038
278B8982J5893k1667J5094j1250j3755J1880j233J6984j0838j4879j8682K083
266a388K4673O323j2576j3045J9935r173k3752L7926j2211J5017N637l7548L2082
253C1900m572K3792o53j9943j0418O644P599m5917m013r569L2030J1753j1642
240F991j1898J615j0217n814j740j0680K1716K398K0578p263m2261J6992K4310
227D727K6569j5436q394j0005K4044p313K4721J2648n8831J4412J6074j0698l522
$$ plain form
319 541 8692 42158 -6583 -39538 -31372 22491 22901 28576 19529 997 -17896 8128 11143 14938
305 14938 8177 5468 -8522 -8346 -5108 -12223 6412 14120 2297 -24045 -51087 -2796 -1210 -16654
291 -16654 -13840 -9358 8409 -18523 -17489 -4095 -11518 -16390 -19700 3817 32648 12944 28982
278 28982 44875 23208 38302 27052 13297 25177 23944 40928 30090 15211 -3471 -1388
266 -1388 23285 29608 17032 3987 23922 14749 -9003 28923 16712 31729 37366 -182 31900
253 31900 27328 51120 50467 30524 20106 26750 34349 -11568 -15581 -25150 6880 18633 6991
240 6991 -4907 -3292 -13509 -19323 -21063 -31743 -10027 -7629 12949 5686 -36575 -19583 4727
227 4727 31296 15860 7466 -2539 21505 14192 38913 51561 -7270 7142 23216 12518 8996
214H996J1572n322mJ7522k0688r519J4184j0976r01j5026j1858j9138L3430M3380
200C5652j1930L800M091k8942p136k599P099K2891p919p744J1037r2n029j0778
186B401J2955m435p069j7504j9964K3767L704J2967J2252J1840j3554j1067K672
173H965j9898q590L4231K9764J0535l9267j3186J573j6767J4955o711J4011j1577
160a962J4207K6033k4912j7720J2939j2689P448j2272M5880K6968k4978q671m921
147B5350m417k2529N604k062j1177L116K8476r765P023L397J2957k1873k1350
134g250O336K890R399L054R364K238n773k3817j2297J1670M381L8758J974l4396
120F531j1982j3273J5412M677k115K3322r145L266j7444n118l811J5683R138o96
$$ plain form
214 8996 20568 15246 15242 32764 12076 2557 16741 5765 4864 -10162 -22020 -41158 -7728 35652
200 35652 23722 27522 31613 2671 -4465 -7064 35 22926 15007 7263 18300 18208 13179 2401
186 2401 15356 10921 3852 -13652 -33616 -9849 -6145 6822 19074 30914 17360 6293 8965
173 8965 -10933 -19523 14708 44472 55007 15740 2554 4127 -12640 2315 -4396 9615 -1962
160 -1962 12245 38278 13366 -4354 8585 -4104 3344 -8928 36952 63920 38942 30271 25350
147 25350 20933 -1596 4008 1946 -9231 -6115 22361 12596 19619 23016 35973 14100 -7250
134 -7250 -914 1976 11375 14429 23793 26031 20258 -3559 -15856 -4186 195 38953 40927 6531
120 6531 -5451 -18724 -3312 1365 -750 22572 13427 16693 -751 -5869 -9680 6003 15141 14445
106A4445K5440J3944m0920O886Q778j4215M581R510K2268l1994j182j8088K2218
93B1671p582k0192J5161j259j0597J4318J3589J4417j538j4147j4633l906o69
80D633k688J5682l52P488l3717J6855J783p005K1943P92j891l470J8404k5363
66A3094r392M408J937N739J04P437k661o023K072J0082j4220j5746K0996L324
52B1151m717k4325J1091M819N21L776l299j795Q369o27N056j7466O031k14M043
37A2414K806q063K5688J1328p045j3396J0319J7590l1892p371L347j3878L140
24D987j1008L043J4023R837n744j5725J6643j1348J4678j3676J3941m183j5105
11C63N839M840K3051r921j1940k629K3649p350j5774J1773l145
$$ plain form
106 14445 39885 53829 12909 19795 28573 14358 18939 28449 50717 18723 17541 -547 21671
93 21671 14089 -6103 9058 7799 -2798 11520 25109 39526 37988 23841 9208 5302 4633
80 4633 1945 17627 17275 24763 -8954 7901 9684 2679 24622 25414 23523 20053 38457 13094
66 13094 3702 8110 10047 15786 15890 23327 20666 14643 16715 26797 12577 -3169 17827 21151
52 21151 16434 -7891 3200 8019 8540 12316 9017 7222 15591 14964 20020 2554 8585 8371 12414
37 12414 15220 7157 32845 44173 37128 23732 34051 51641 19749 12378 15725 1847 4987
24 4987 -6021 -2978 11045 20882 15138 -587 16056 4708 19386 5710 19651 15468 363
11 363 6202 11042 34093 24172 12232 9603 33252 25902 10128 21901 18756
0A8756
$$ plain form
0 18756
$$ Imaginary data points
##PAGE= N=2
##DATA TABLE= (X++(I..I)), XYDATA
16383a123357K2315J8827p01K3787R992J3866q834J1200J4877K3283m745J9220
16371i80270K6512R689j5258K9281J1416j0093L3802K3433K4848r697K1875J4246
16359h20216J9211L4199K322K330J5611J8370k114P208M4624Q044K2752p720j2937
16346f68316K1062K4089L0655K1582M750J6087J0898j3442K1011K0997Q164L7496
16334d64967O485O50J6765J5172k7220K1533P992K6653M2249j0872J4547J2090
16322c38923j6424M6813N632O903K705m775M9573r502J0258K4265K3605M090K2826
16309a72954p30j6389K1456J2361M5903k563K3344n640J9974M8995m273J848o792
16296c5460j6963J8234L5074K8150J1566R971j2292m223J3464P102N449K819J5807
$$ plain form
16383 -1123357 -1101042 -1082215 -1082916 -1059129 -1049137 -1035271 -1044105 -1032905 -1018028 -994745 -999490 -980270
16371 -980270 -953758 -944069 -959327 -930046 -918630 -928723 -894921 -871488 -846640 -856337 -834462 -820216
16359 -820216 -801005 -766806 -764484 -762154 -746543 -728173 -730287 -723079 -678455 -670411 -647659 -655379 -668316
16346 -668316 -647254 -623165 -592510 -570928 -566178 -550091 -539193 -552635 -531624 -510627 -502463 -464967
16334 -464967 -458482 -457832 -441067 -425895 -453115 -431582 -423590 -396937 -354688 -365560 -351013 -338923
16322 -338923 -355347 -308534 -302902 -295999 -293294 -298069 -248496 -257998 -247740 -223475 -199870 -195780 -172954
16309 -172954 -173684 -190073 -168617 -156256 -110353 -112916 -89572 -95212 -75238 -26243 -30516 -28668 -35460
16296 -35460 -52423 -34189 885 29035 40601 50572 38280 34057 47521 54623 60072 62891 78698
16283G8698J363M3950q520k0720J0032K826M3631J2059q211n330L4644j150O815
16270A90087j429J0779J9876J4512O416j5608M8905K1821O090R460P007j9674
16258B98242J4118K6140J0751L621O996J1259K2321j1230K3572J9000n902k7904
16246C90984j4426M5688J6511K2753p375j638R674n875K472J8139j6532L9834
16234E00209J4462j0930j059J2498J2684L4412m956j6430K0362j291J2445j366
16222E71040n473Q077P056j8266L1881K164L5504K1772l4361J3591K4166j4543
16210F42608J6370J1202j1026j0103M0844o567j26K0656J473j7288P563K2368
16198G17974M264j2709l1779M9515k1312L5155K7016j7632m869K0509R066r56
$$ plain form
16283 78698 80061 124011 115491 94771 104803 107629 151260 163319 155108 149778 184422 183272 190087
16270 190087 188658 199437 219313 233825 240241 224633 273538 295359 301449 310909 317916 298242
16258 298242 312360 338500 349251 352872 359868 371127 393448 382218 405790 424790 418888 390984
16246 390984 376558 422246 438757 461510 454135 452497 462171 456296 458768 476907 460375 500209
16234 500209 514671 503741 502682 515180 527864 562276 557320 540890 561252 559961 572406 571040
16222 571040 565567 573644 580700 562434 594315 596479 631983 653755 619394 632985 657151 642608
16210 642608 658978 670180 659154 649051 689895 683328 683202 703858 705331 688043 695606 717974
16198 717974 722238 709529 677750 727265 705953 741108 768124 750492 745623 766132 775198 774242
16186G74242k7039R31L4078P561p842J2894n88m822J3454j8636L106m796J8918
16173H01461p474L5627j0091l56K4185j634j7319P616l1708Q638M1315K0771k1616
16160H49415l187J498j6919j1134K3939n383P390N6016k1706k7239k747L5440
16148H85383j0930P194p584L7092j2018j5219P055l0782N9014o453P499p060J0709
16135I23900J07l089j2987k822L339K4007R000j5011J3434M468r063j7887J0436
16122I27832n610K8950j3409j8142N021J1248L2841K9577k5700k3355m87l77K0900
16109I69289K959M071o795m6560Q84L021J4360Q620K8661j4226r509k83k648J622
16095I53466R052L1046n372n2652K6886J9250m901J6635q201J1301K2848P08j9709
$$ plain form
16186 774242 747203 748134 782212 789773 781931 794825 794237 789415 802869 784233 787339 782543 801461
16173 801461 793987 829614 819523 819167 843352 841718 824399 832015 800307 808945 850260 871031 849415
16160 849415 846228 847726 830807 819673 843612 838229 845619 901635 879929 852690 849943 885383
16148 885383 874453 881647 874063 911155 899137 883918 890973 860191 919205 912752 920251 913191 923900
16135 923900 924007 920918 907931 905109 908448 932455 941455 926444 939878 944346 935283 917396 927832
16122 927832 922222 951172 937763 919621 924642 935890 968731 998308 972608 949253 948766 948389 969289
16109 969289 972248 976319 969524 922964 923848 926869 941229 949849 978510 964284 954775 954492 951844 953466
16095 953466 962518 993564 988192 935540 962426 981676 976775 993410 985209 996510 1019358 1020066 1000357
16082A000357r466k4333j2865J0164K2869j14o343J3134j241m7287j0088L374
16070I38161J3514J9549N731j3407q989L6558k5528j1897N668n057l774k171K8972
16057I77330R770n307K2750J3963q253J609L2480l6001l5212J6407J8841P140
16045A015517m574p398m813j989j6865n682l112M2912j0434n82O985j1632J3960
16032A012293j4380o829K9795K387j8602r506j1590K1031K4807L4767m3664m158
16020A016351k3467m2291J2632K2325Q696J5165j2519N835p346K416K5164k9323
16008I93638O95j772J9083Q234Q058l014k4027l1147J0674J9632J1857R207q575
15995A012543J954j3871N396M2917l2639q115L77j2756j9782j9391J5753m162
$$ plain form
16082 1000357 990891 966558 953693 963857 986726 986612 980269 993403 992162 944875 934787 938161
16070 938161 951675 971224 976955 963548 954559 991117 965589 953692 959360 954303 950529 948358 977330
16057 977330 987100 981793 1004543 1018506 1010253 1011862 1044342 1008341 973129 989536 1008377 1015517
16045 1015517 1010943 1003545 998732 996743 979878 974196 971084 1013996 1003562 1002980 1009965 998333 1012293
16032 1012293 997913 991084 1020879 1023266 1004664 995158 983568 1004599 1029406 1064173 1020509 1016351
16020 1016351 992884 950593 963225 985550 994246 1009411 996892 1002727 995381 997797 1022961 993638
16008 993638 994333 992561 1011644 1019878 1027936 1024922 1000895 969748 980422 1000054 1011911 1021118 1012543
15995 1012543 1014497 1000626 1006022 1048939 1016300 1008185 1008562 995806 976024 956633 972386 968224
15983I68224J5546L468J252J8567j464K4542k6899p082J2110m776m6652L7897
15971I94733K4037m0458j0388M694j795j12O893J0604L4148K6132J2744l2555
15959A028677m1358k2462j603L1835j0174j7852J8584j5483r078n607K6025J2670
15947I94174J1603K4037l648O95j6754J2154J6669j966j7272p848M228J9609k6272
15934A009409m0613L2921J5758K7272j0264j200j8427l2236J4947K8202K6159
15923A051928j9586k6692J2888J0550k9854j4155K5580L1514k389r998k7876p836
15911I94074P856j017P401j2056j4182K8858K4369m5201J5073K541M802n708j149
15898A005661K0213k8074M023q373M212L2498n75j0756k58J4307K4133m8054j3120
$$ plain form
15983 968224 983770 987238 988490 1007057 1005593 1030135 1003236 996154 1008264 1003488 956836 994733
15971 994733 1018770 978312 967924 972618 970823 970711 977604 988208 1022356 1048488 1061232 1028677
15959 1028677 987319 964857 963254 995089 984915 967063 985647 970164 961086 955479 981504 994174
15947 994174 1005777 1029814 1026166 1026861 1010107 1022261 1038930 1036964 1019692 1011844 1016072 1035681 1009409
15934 1009409 968796 1001717 1017475 1044747 1034483 1033283 1014856 982620 997567 1025769 1051928
15923 1051928 1032342 1005650 1018538 1029088 999234 985079 1010659 1042173 1039784 1029786 1001910 994074
15911 994074 1001930 1000913 1008314 996258 982076 1010934 1035303 990102 1005175 1007716 1012518 1006810 1005661
15898 1005661 1025874 997800 1001823 993450 997662 1030160 1029585 1018829 1018571 1032878 1057011 1008957 995837
15885I95837m228L741K3994k5809j0795Q358L8463j1952l9298J7586J9008n315
$$ plain form
15885 995837 991609 995350 1019344 993535 982740 991098 1029561 1017609 978311 995897 1014905 1009590
$$ [...]
##END NTUPLES=NMR SPECTRUM
##END=
