##TITLE=1H_DE-80H_X3
 200.13MHz, d2o
 8 sc
 
 19ns.26.2.2025
##JCAMPDX= 6.0         $$ Bruker NMR JCAMP-DX V2.0
##DATA TYPE= NMR SPECTRUM
##DATA CLASS= NTUPLES
##ORIGIN= UXNMR, Bruker Analytische Messtechnik GmbH
##OWNER= pz
$$ XWIN-NMR		Version 3.5
$$ Wed Jul 30 10:38:53 2025 Russian Standard Time (UT+4h)  Yarkov@DPX200
##.OBSERVE FREQUENCY= 200.1313
##.OBSERVE NUCLEUS= ^1H
##.ACQUISITION MODE= SIMULTANEOUS
##.ACQUISITION SCHEME= undefined
##.AVERAGES= 8
##.DIGITISER RES= 18
##SPECTROMETER/DATA SYSTEM= spect
##.PULSE SEQUENCE= zg30
##.SOLVENT NAME= MeOD
##.SHIFT REFERENCE= (INTERNAL, MeOD, 0, 15.5342)
##AUDIT TRAIL= $$ (NUMBER, WHEN, WHO, WHERE, WHAT)
$$ ##TITLE= Audit trail, XWIN-NMR		Version 3.5
$$ ##JCAMPDX= 5.01
$$ ##ORIGIN= Bruker BioSpin GmbH
$$ ##OWNER= Yarkov
$$ C:/Bruker/XWIN-NMR/data/yarkov2/nmr/H-C/1/pdata/1/auditp.txt
$$ ##AUDIT TRAIL=  $$ (NUMBER, WHEN, WHO, WHERE, WHAT)
(   1,<2025-07-30 10:38:00.48 +0400>,<Yarkov>,<DPX200>,
      <created by zg, POWCHK disabled, PULCHK disabled
       configuration hash MD5:
       00 E9 B6 7A A2 85 ED C7 34 08 36 98 17 FE 4E 26
       data hash MD5: 16K
       6C 52 38 C0 A6 1E 0E 56 47 3F AC 8F 3C 29 2B 7B>)
(   2,<2025-07-30 10:38:04.81 +0400>,<Yarkov>,<DPX200>,
      <Start of raw data processing
       efp BC_mod = 2 LB = 0.25 FT_mod = 6 PKNL = 1 PHC0 = -1348.879 PHC1 = -1.809091 SI = 16K 
       data hash MD5: 16K
       F2 43 5C F2 32 89 DE FB 1C 0F AF B8 11 4A E9 2C>)
$$ ##END=
$$ 
$$ hash MD5
$$ 11 8D 71 FB D8 1E 9D 3C 5B B1 81 02 31 24 8E BF
##$RELAX= 
##$RELAX= 
##$RELAX= 
##$RELAX= 
##$RELAX= 
##$RELAX= 
$$ Bruker specific parameters
$$ --------------------------
##$DU= <C:/Bruker/XWIN-NMR>
##$EXPNO= 1
##$NAME= <H-C>
##$PROCNO= 1
##$TYPE= <nmr>
##$USER= <yarkov2>
##$AMP= (0..31)
100 100 100 100 100 100 100 100 100 100 100 100 100 100 100 100 100 100 
100 100 100 100 100 100 100 100 100 100 100 100 100 100 
##$AQSEQ= 0
##$AQ_mod= 1
##$AUNM= <au_zg>
##$AUTOPOS= <>
##$BF1= 200.13
##$BF2= 200.13
##$BF3= 200.13
##$BF4= 200.13
##$BF5= 200.13
##$BF6= 200.13
##$BF7= 200.13
##$BF8= 200.13
##$BYTORDA= 1
##$CFDGTYP= 0
##$CFRGTYP= 5
##$CHEMSTR= <none>
##$CNST= (0..31)
1 1 145 1 1 1 1 1 1 1 1 1 1 1 1 1 1 1 1 1 1 1 1 1 1 1 1 1 1 1 1 1 
##$CPDPRG= <>
##$CPDPRG1= <>
##$CPDPRG2= <>
##$CPDPRG3= <>
##$CPDPRG4= <mlev>
##$CPDPRG5= <mlev>
##$CPDPRG6= <mlev>
##$CPDPRG7= <mlev>
##$CPDPRG8= <mlev>
##$CPDPRGB= <>
##$CPDPRGT= <>
##$D= (0..31)
0 0.7 0 0 0 0 0 0 0 0 0 0.03 0 0 0 0 0 0 0 0 0 0 0 0 0 0 0 0 0 0 0 0 
##$DATE= 1753857479
##$DBL= (0..7)
120 120 120 120 120 120 120 120 
##$DBP= (0..7)
150 150 150 150 150 150 150 150 
##$DBP07= 0
##$DBPNAM0= <>
##$DBPNAM1= <>
##$DBPNAM2= <>
##$DBPNAM3= <>
##$DBPNAM4= <>
##$DBPNAM5= <>
##$DBPNAM6= <>
##$DBPNAM7= <>
##$DBPOAL= (0..7)
0.5 0.5 0.5 0.5 0.5 0.5 0.5 0.5 
##$DBPOFFS= (0..7)
0 0 0 0 0 0 0 0 
##$DE= 6
##$DECBNUC= <off>
##$DECIM= 32
##$DECNUC= <off>
##$DECSTAT= 4
##$DIGMOD= 1
##$DIGTYP= 9
##$DL= (0..7)
0 120 120 120 120 120 120 120 
##$DP= (0..7)
$$ [...]
##$SUBNAM2= <"">
##$SUBNAM3= <"">
##$SUBNAM4= <"">
##$SUBNAM5= <"">
##$SUBNAM6= <"">
##$SUBNAM7= <"">
##$SUBNAM8= <"">
##$SUBNAM9= <"">
##$SW= 18.0517328524113
##$SWIBOX= (0..15)
0 0 2 0 0 0 0 0 0 0 0 0 0 0 0 0 
##$SW_h= 3612.71676300578
##$TD= 16384
##$TD0= 1
##$TE= 0
##$TE2= 300
##$TE3= 300
##$TEG= 300
##$TL= (0..7)
0 120 120 120 120 120 120 120 
##$TP= (0..7)
150 150 150 150 150 150 150 150 
##$TP07= 0
##$TPNAME0= <>
##$TPNAME1= <>
##$TPNAME2= <>
##$TPNAME3= <>
##$TPNAME4= <>
##$TPNAME5= <>
##$TPNAME6= <>
##$TPNAME7= <>
##$TPOAL= (0..7)
0.5 0.5 0.5 0.5 0.5 0.5 0.5 0.5 
##$TPOFFS= (0..7)
0 0 0 0 0 0 0 0 
##$TUNHIN= 0
##$TUNHOUT= 0
##$TUNXOUT= 0
##$USERA1= <user>
##$USERA2= <user>
##$USERA3= <user>
##$USERA4= <user>
##$USERA5= <user>
##$V9= 5
##$VALIST= <valist>
##$VCLIST= <CCCCCCCCCCCCCCC>
##$VD= 0
##$VDLIST= <DDDDDDDDDDDDDDD>
##$VPLIST= <PPPPPPPPPPPPPPP>
##$VTLIST= <TTTTTTTTTTTTTTT>
##$WBST= 1024
##$WBSW= 4
##$XGAIN= (0..3)
0 0 0 0 
##$XL= 0
##$YL= 0
##$YMAX_a= 358266
##$YMIN_a= -342201
##$ZGOPTNS= <>
##$ZL1= 120
##$ZL2= 120
##$ZL3= 120
##$ZL4= 120
##$ABSF1= 0
##$ABSF2= 0
##$ABSG= 0
##$ABSL= 0
##$ALPHA= 0
##$AQORDER= 0
##$ASSFAC= 0
##$ASSFACI= 0
##$ASSFACX= 0
##$ASSWID= 0
##$AUNMP= <proc_1d>
##$AZFE= 0.1
##$AZFW= 0.1
##$BCFW= 0
##$BC_mod= 2
##$BYTORDP= 0
##$COROFFS= 0
##$CY= -3
##$DATMOD= 1
##$DC= 0
##$DFILT= <>
##$DTYPP= 0
##$F1P= 0
##$F2P= 0
##$FCOR= 1
##$FTSIZE= 16384
##$FT_mod= 6
##$GAMMA= 0
##$GB= 0
##$INTBC= 1
##$INTSCL= 3.241238e-09
##$ISEN= 128
##$LB= 0.25
##$LEV0= 0
##$LPBIN= 0
##$MAXI= 10000
##$MC2= 0
##$MEAN= 0
##$ME_mod= 0
##$MI= 1.114404
##$NCOEF= 0
##$NC_proc= -7
##$NLEV= 6
##$NOISF1= 3.799351
##$NOISF2= 2.8
##$NSP= 0
##$NTH_PI= 0
##$NZP= 0
##$OFFSET= 15.53424
##$PC= 1
##$PHC0= -1348.879
##$PHC1= -1.809091
##$PH_mod= 1
##$PKNL= yes
##$PPARMOD= 0
##$PSCAL= 0
##$PSIGN= 0
##$REVERSE= no
##$SF= 200.129997489407
##$SI= 16384
##$SIGF1= 3
##$SIGF2= 2
##$SINO= 0.751879
##$SIOLD= 32768
##$SREGLST= <19F.Aceton>
##$SSB= 0
##$STSI= 16384
##$STSR= 0
##$SW_p= 3612.71676300578
##$SYMM= 0
##$S_DEV= 0
##$TDeff= 16384
##$TDoff= 0
##$TI= <>
##$TILT= no
##$TM1= 0
##$TM2= 0
##$TOPLEV= 0
##$USERP1= <user>
##$USERP2= <user>
##$USERP3= <user>
##$USERP4= <user>
##$USERP5= <user>
##$WDW= 1
##$XDIM= 16384
##$YMAX_p= 534074175
##$YMIN_p= -1581487
$$ End of Bruker specific parameters
$$ ---------------------------------
##NTUPLES= NMR SPECTRUM
##VAR_NAME=  FREQUENCY,     SPECTRUM/REAL,   SPECTRUM/IMAG
##SYMBOL=    X,             R,               I
##VAR_TYPE=  INDEPENDENT,   DEPENDENT,       DEPENDENT
##VAR_FORM=  AFFN,          ASDF,            ASDF
##VAR_DIM=   16384,         16384,           16384
##UNITS=     HZ,            ARBITRARY UNITS, ARBITRARY UNITS
##FACTOR=    0.220516191357247, 1,           1
##FIRST=     3108.8673659662, 0,             0
##LAST=      -503.849397039579, 0,           0
##MIN=       -503.849397039579, -1581487,    0
##MAX=       3108.8673659662, 534074175,     0
$$ Real data points
##PAGE= N=1
##DATA TABLE= (X++(R..R)), XYDATA
$$ [...]
6171D067524K6692n7245j85506J89523m059j76626N5343J6377N6354L1371j62185
$$ 4067524 4094216 4036971 3851465 4040988 4036929 3860303 3915646 3932023 3988377 4019748 3857563
6160C857563j21850n1833Q8862J93789j71030j07900r625k8910J28946k5122l0590
$$ 3857563 3735713 3683880 3772742 3966531 3795501 3687601 3677976 3649066 3778012 3752890 3722300
6149C722300P0305r5076k7560J35827L6763j58535K202o4995o5466j3640J47674
$$ 3722300 3792605 3697529 3669969 3805796 3842559 3684024 3686226 3621231 3555765 3542125 3689799
6138C689799j9720r5413J31890k1475j27226m8811j5457J46258P4918n2394J6083
$$ 3689799 3670079 3574666 3706556 3685081 3557855 3509044 3493587 3639845 3714763 3662369 3678452
6127C678452q8804K5510m778J0333k8051K0258J38845N2053R4312j02726q2490
$$ 3678452 3589648 3615158 3610380 3620713 3592662 3612920 3751765 3803818 3898130 3795404 3712914
6116C712914N7469q4065l4175J49334M8632n5687J61213K108K0530J01667q5373
$$ 3712914 3770383 3686318 3652143 3801477 3850109 3794422 3955635 3957743 3978273 4079940 3994567
6105C994567k6326j5006Q8136j1692J31228P4318J02016k6534J25293P4419N4045
$$ 3994567 3968241 3953235 4041371 4029679 4160907 4235225 4337241 4310707 4436000 4510419 4564464
6094D564464m9971L937K02732J28617R3503Q5577J28047J81233M3617J32972J52850
$$ 4564464 4514493 4518430 4721162 4849779 4943282 5028859 5156906 5338139 5381756 5514728 5667578
6083E667578L7574J41120N4570J12252J25309R6645J59698L28338K19685Q0092
$$ 5667578 5705152 5846272 5900842 6013094 6138403 6235048 6394746 6723084 6942769 7022861
6073G022861P8218J59295K32326M6643J88679K03652L32812M8227L17051L66761
$$ 7022861 7101079 7260374 7492700 7539343 7728022 7931674 8264486 8312713 8629764 8996525
6063H996525J37842L76053J59243O4138O6986L47050K42646J92463Q2604J08696
$$ 8996525 9134367 9510420 9669663 9733801 9800787 10147837 10390483 10582946 10665550 10774246
6053A0774246K57125J61737K24183L27133K43324M17030L09689L65711L95532
$$ 10774246 11031371 11193108 11417291 11744424 11987748 12404778 12714467 13080178 13475710
6044A3475710N56425L90778L32995M00789N66415P10815O66661O47695O56565
$$ 13475710 14032135 14422913 14755908 15156697 15723112 16433927 17100588 17748283 18404848
6035A8404848P13329N69812K92027K84374R5886j03334n403j94802J2686r7214
$$ 18404848 19118177 19687989 19980016 20264390 20360276 20256942 20251539 20056737 20069423 19972209
6025A9972209J01674J93116J13720J67637M13537O77090O70806O34605P42560
$$ 19972209 20073883 20266999 20380719 20548356 20961893 21638983 22309789 22944394 23686954
6016B3686954R43176Q65905J046871J291289J303568J395735J429199J467847
$$ 23686954 24630130 25496035 26542906 27834195 29137763 30533498 31962697 33430544
6008C3430544J526740J237697J000903M75880R1244l05225p14269r33871r60804
$$ 33430544 34957284 36194981 37195884 37671764 37763008 37457783 36743514 35809643 34848839
5999C4848839q22813p22977o56702m38802n53938r1764J94816K66591L81531N62619
$$ 34848839 34026026 33303049 32646347 32207545 31653607 31561843 31756659 32023250 32404781 32967400
5989C2967400Q16823J073565J017223J002070J304803J501414J610360J630120
$$ 32967400 33784223 34857788 35875011 36877081 38181884 39683298 41293658 42923778
5981D2923778J639218J439735J101912O73429L7129n83518j091897j757000j987168
$$ 42923778 44562996 46002731 47104643 47778072 47815201 47231683 46139786 44382786 42395618
5972D2395618j817449j500064j494060j408798j160349p99058n66291n48298m51181
$$ 42395618 40578169 39078105 37584045 36175247 35014898 34215840 33649549 33101251 32650070
5963C2650070j0479L8790J03693K30071N21708M83005O73473Q62180P88997Q30565
$$ 32650070 32639591 32678381 32782074 33012145 33533853 34016858 34690331 35552511 36341508 37172073
5953C7172073O92365O40207L66138j02001m85005j079277j402736j607695j778874
$$ 37172073 37864438 38504645 38870783 38768782 38283777 37204500 35801764 34194069 32415195
5944C2415195j756466j595089j378454j338116j181778r55361p46120p15000n82209
$$ 32415195 30658729 29063640 27685186 26347070 25165292 24209931 23463811 22748811 22166602
5935B2166602n24899l51569k55242k07716j09521q3090J3544o3703j77503m3562
$$ 22166602 21641703 21290134 21034892 20827176 20717655 20634565 20648109 20584406 20406903 20363341
5925B0363341Q9524j19152j97353l21647o90228p27459q89849q12203p43927q36306
$$ 20363341 20452865 20333713 20136360 19814713 19124485 18397026 17507177 16694974 15951047 15114741
5915A5114741q75931p23983n70647m20929n78307n60171l72185k22255m16887
$$ 15114741 14238810 13514827 12944180 12523251 11944944 11384773 11012588 10790333 10373446
5906A0373446n14165l38732j13827k39990k90174k32821j85489q5593j64669l5372
$$ 10373446 9859281 9520549 9406722 9166732 8876558 8643737 8458248 8372655 8207986 8172614
5896H172614k32424j67919j48255m25047k31164j28790l21119l03031k39328k38909
$$ 8172614 7940190 7772271 7624016 7198969 6967805 6839015 6517896 6214865 5975537 5736628
5886E736628j68209j46094k48123r2394j75719j08407n9670j20854r9260o2599
$$ 5736628 5568419 5422325 5174202 5081808 4906089 4797682 4738012 4617158 4517898 4455299
5876D455299j75356j26202o0510l7313j00561j80430J291j9824j04468j4792k4389
$$ 4455299 4279943 4153741 4093231 4055918 3955357 3774927 3776218 3756394 3651926 3637134 3612745
5865C612745K1950j84757l3499J45957r6510j76283r5756j5308O1414L7141j44326
$$ 3612745 3634695 3449938 3416439 3562396 3465886 3289603 3193847 3178539 3239953 3277094 3132768
5854C132768n0726N4918j43848j41227o7124k4336R0432o9616r1718l4218o626
$$ 3132768 3082042 3136960 2993112 2851885 2784761 2760425 2850857 2781241 2689523 2655305 2648679
5843B648679O5974j25279k9729n3303P7497q4782Q0369O7453k7468j3756l3861
$$ 2648679 2714653 2589374 2559645 2506342 2583839 2499057 2579426 2646879 2619411 2605655 2571794
5832B571794k55745J408J34328K365P473n5579R9668j18914j13008m9244l8160
$$ 2571794 2316049 2317457 2451785 2454150 2461623 2406044 2505712 2386798 2273790 2224546 2186386
5821B186386L0233K164m2293O4401k167p0816o5996R3324n4114N0297Q7300M2677
$$ 2186386 2216619 2218783 2176490 2240891 2238724 2167908 2101912 2195236 2141122 2191419 2278719 2321396
5809B321396p0964o0669l1865o6005q3221J06539M5616K06707k7815j30190n3027
$$ 2321396 2250432 2189763 2157898 2091893 2008672 2115211 2160827 2367534 2339719 2209529 2156502
5798B156502j3156l984Q013P7534p809l2436j14907K1622j2766N7766l0490r8459
$$ 2156502 2143346 2139362 2147375 2224909 2217100 2184664 2069757 2091379 2078613 2136379 2105889 2007430
5786B007430J4498J26584l7728o2053l6910m8485L7678K36323k2666m1576Q924
$$ 2007430 2021928 2148512 2110784 2048731 2011821 1963336 2001014 2237337 2214671 2173095 2182019
5775B182019j19597K9926n8817m4772Q3176l3382p6115m3850O8884J18150r9183
$$ 2182019 2062422 2092348 2033531 1988759 2071935 2038553 1962438 1918588 1987472 2105622 2006439
5764B006439R1120j3962J55L9943m3640j602J04009j11209j33095J63846p2126
$$ 2006439 2097559 2083597 2083752 2123695 2080055 2078453 2182462 2071253 1938158 2102004 2029878
5753B029878l1206K644n9387N8061J7781o095j17613J16163K391J8850M8543Q6926
$$ 2029878 1998672 2001316 1941929 1999990 2017771 2011676 1894063 2010226 2012617 2031467 2080010 2166936
5741B166936L4264Q0029p9270q3978P7145k2635Q39n1503k5546K6616L6682J1909
$$ 2166936 2201200 2281229 2201959 2117981 2195126 2172491 2173330 2121827 2096281 2122897 2159579 2171488
5729B171488J13941L0632n9179J3400J3327m3499j82331r1138L2542J75630J37357
$$ 2171488 2285429 2316061 2256882 2270282 2283609 2240110 2057779 1966641 1999183 2174813 2312170
5718B312170P6106n353j01239Q8438r974J8059P0007Q6981j37488J01349Q2459
$$ 2312170 2388276 2382923 2281684 2370122 2360148 2378207 2448214 2535195 2397707 2499056 2581515
5707B581515j20933J03634m9699K2267Q4169J01730J7035j02167J3986L6985P2203
$$ 2581515 2460582 2564216 2514517 2536784 2620953 2722683 2739718 2637551 2651537 2688522 2760725
5696B760725K3986L9670R4789p2988l5608j3849K3448J01876n5873O5535r5060
$$ 2760725 2784711 2824381 2919170 2846182 2810574 2796725 2820173 2922049 2866176 2931711 2836651
5685B836651Q7465J09352R9960J84299o8897j65720L2254q4771R9648L4300p0265
$$ 2836651 2924116 3033468 3133428 3317727 3248830 3083110 3115364 3030593 3130241 3164541 3094276
5674C094276p4287J0219K0013J32856J49725l0841m7295J05117o099p6358R5514
$$ 3094276 3019989 3030208 3050221 3183077 3332802 3301961 3254666 3359783 3353684 3277326 3372840
5663C372840O9370J07531o0730p6850J15887j9777N3905J7095P9160R6700j5667
$$ 3372840 3442210 3549741 3489011 3412161 3528048 3508271 3562176 3579271 3658431 3755131 3739464
5652C739464J7152l2780P7163J07987K4551j78528J41425J2887J19329L2782Q3350
$$ 3739464 3756616 3723836 3800999 3908986 3933537 3755009 3896434 3909321 4028650 4061432 4144782
5641D144782l6461J6348P2922j05485J01776J16152l5080j1841J2277J8075m5582
$$ 4144782 4108321 4124669 4197591 4092106 4193882 4310034 4274954 4263113 4275390 4293465 4247883
5630D247883p5313J21741K33237K92471M3412j55462J17292M7880l3155o8419
$$ 4247883 4172570 4294311 4527548 4820019 4863431 4707969 4825261 4873141 4839986 4771567
5620D771567J43704J75985m9253J19993J0510k4947l5742k0072R5861J30974P5329
$$ 4771567 4915271 5091256 5042003 5161996 5172506 5147559 5111817 5091745 5187606 5318580 5393909
5609E393909J40414k8117R6379N7247L4953K30830j5546R2763J09201R4952L2225
$$ 5393909 5534323 5506206 5602585 5659832 5694785 5925615 5910069 6002832 6112033 6206985 6239210
5598F239210J06028K24219l2531N1940M2976J48489J41295k8400L4488J77411
$$ 6239210 6345238 6569457 6536926 6588866 6631842 6780331 6921626 6893226 6927714 7105125
5588G105125J8315Q9661J22687O4601k9326P2453P7619J23488N502K10509J69359
$$ 7105125 7123440 7213101 7335788 7400389 7371063 7443516 7521135 7644623 7650125 7860634 8029993
5577H029993O2119J70432J72892l6216J35077L62940R6158K4118P5721K41224
$$ 8029993 8092112 8262544 8435436 8399220 8534297 8897237 8993395 9017513 9093234 9334458
5567I334458Q7489K35443J26657J72607J07789J61046Q8184Q5599P5186J51808
$$ 9334458 9421947 9657390 9784047 9956654 10064443 10225489 10313673 10399272 10474458 10626266
5557A0626266K27828K29001P4487o6577J076K38516K00249J02054J45513K27339
$$ 10626266 10854094 11083095 11157582 11091005 11092081 11330597 11530846 11632900 11778413 12005752
5547A2005752J68516M5349J18228P8518J30062K44431J93273Q5234J76521Q1426
$$ 12005752 12174268 12219617 12337845 12416363 12546425 12790856 12984129 13069363 13245884 13327310
5537A3327310M1888J10964J02158J02032J67605Q8517n5254j32691L7741o0788
$$ 13327310 13369198 13480162 13582320 13684352 13851957 13940474 13885220 13752529 13790270 13729482
5527A3729482P2439O2242O39J34468p5135J11509J5409j03577K07455K27661J19958
$$ 13729482 13801921 13864163 13864802 13999270 13924135 14035644 14051053 13947476 14154931 14382592 14502550
5516A4502550Q5152q691P681J52784P8961J29602J3948l5784j8107L591M4693
$$ 14502550 14587702 14579011 14586692 14739476 14818437 14948039 14961987 14926203 14908096 14911687 14956380
5505A4956380j00141m498k7532j9104k17717o0475M7502j7840n1089r6201N0471
$$ 14956380 14856239 14851741 14824209 14805105 14587388 14526913 14574415 14556575 14505486 14409285 14459756
5494A4459756r63q1678l7669j01437m4999L0257j2290K7835m3945j60913j03973
$$ 14459756 14458793 14377115 14339446 14238009 14193010 14223267 14210977 14238812 14194867 14033954 13929981
5483A3929981J17922K48q8086q7546j46887k8092p6907R6177r8242k10761n3196
$$ 13929981 14047903 14048151 13960065 13872519 13725632 13697540 13620633 13716810 13618568 13407807 13354611
5472A3354611M4373r3191j99834o1831r6342R601j04994j65053r6969j30153j13028
$$ 13354611 13398984 13305793 13105959 13044128 12947786 12957387 12852393 12687340 12590371 12460218 12347190
5461A2347190m7750K9361j01814j6484j38060r7257j08999j17319m1697o2636
$$ 12347190 12299440 12328801 12226987 12210503 12072443 11975186 11866187 11748868 11707171 11644535
5451A1644535p7807j57705p6187j77264r9871j23307j36265k11989l8887m8751
$$ 11644535 11566728 11409023 11332836 11155572 11055701 10932394 10796129 10584140 10545253 10496502
5441A0496502l0664J1625j25903o1972N3262j60389k35046K5723J26722m8627
$$ 10496502 10465838 10477463 10351560 10289588 10342850 10182461 9947415 9973138 10099860 10051233
5431A0051233k31721J16817Q369j37693r7946m0726j26363o0958j84732k91314
$$ 10051233 9819512 9936329 9944698 9807005 9709059 9668333 9541970 9481012 9296280 9004966
5421I004966j14423p7746l3025j14072j45023j12134L3685j25583M5922J48235
$$ 9004966 8890543 8812797 8779772 8665700 8520677 8408543 8442228 8316645 8362567 8510802
5411H510802o9570l7815j04810j96543o0999J28697q7848L0844J57245j7594p6691
$$ 8510802 8441232 8403417 8298607 8102064 8041065 8169762 8081914 8112758 8270003 8252409 8175718
5400H175718q3214J41421j16094j23040j30068k07669j77227j08084k40969q5926
$$ 8175718 8092504 8233925 8117831 7994791 7864723 7657054 7479827 7371743 7130774 7044848
5390G044848j04886r171j71077m6651P1682j24985j39408J7286k1519p8796K5553
$$ 7044848 6939962 6930791 6759714 6713063 6784745 6659760 6520352 6537638 6516119 6437323 6462876
5379F462876j47634o1979p583N9112l5495j6188M6003j36347r4516l1189p1208
$$ 6462876 6315242 6253263 6245680 6304792 6269297 6253109 6299112 6162765 6068249 6037060 5965852
5368E965852j21860j39760j58658j6115j3622k09200m810k8361o9538j957k43245
$$ 5965852 5843992 5704232 5545574 5529459 5515837 5306637 5301827 5273466 5203928 5201971 4958726
5357D958726m9900J00633j35560p8551L726M7344o1416l6282K182j04191m3832
$$ 4958726 4908826 5009459 4873899 4795348 4799074 4846418 4785002 4748720 4750902 4646711 4602879
5346D602879m992j5185k0576k5755j8611M8402P539n1523L947L0015j34749n1883
$$ 4602879 4597887 4582702 4562126 4536371 4517760 4566162 4573701 4522178 4526125 4556140 4421391 4369508
5334D369508o7339l1694J2974M8509n1558l1817R071j13213R513P1165m1819J3325
$$ 4369508 4302169 4270475 4283449 4331958 4280400 4248583 4257654 4144441 4153954 4225119 4183300 4196625
5322D196625J32697J1019N40r6474j63224J3691M5350L8576j3242m8306Q010j59247
$$ 4196625 4329322 4340341 4340881 4244407 4081183 4094874 4140224 4178800 4165558 4117252 4125262 3966015
5310C966015N8372j267R0934o8335K7073m1907k0346K5998k927J1310P7116m4691
$$ 3966015 4024387 4023120 4114054 4045719 4072792 4030885 4010539 4036537 4033610 4044920 4122036 4077345
5298D077345q065k1111l8442J39518j65897o6519J32812Q3784J1038n6257Q2899
$$ 4077345 4069280 4048169 4009727 4149245 3983348 3916829 4049641 4133425 4144463 4088206 4171105
5287D171105N1382r5068o2017p3030j1599j5779l1036J38181P0601l3390k54859
$$ 4171105 4222487 4127419 4065402 3992372 3980773 3964994 3933958 4072139 4142740 4109350 3854491
5276C854491k6286P8300J65830k8851R2640l4397j20991N5582L714Q8019P7758
$$ 3854491 3828205 3906505 4072335 4043484 4136124 4101727 3980736 4036318 4040032 4128051 4205809
5265D205809m1711J1226L8509K8101K3532q3585j9426j1307J41584K8323L9523
$$ 4205809 4164098 4175324 4213833 4241934 4265466 4181881 4162455 4151148 4292732 4321055 4360578
5254D360578k6925P0165J6145J30948L6986k49881m7683R7687O5254l2210O5099
$$ 4360578 4333653 4403818 4419963 4550911 4587897 4338016 4290333 4388020 4453274 4421064 4486163
5243D486163r1138J05836l5411o478J03011q5314L5624K6904K6651J442o3898
$$ 4486163 4395025 4500861 4465450 4458972 4561983 4476669 4512293 4539197 4565848 4567290 4503392
5232D503392J2329p607p4715J23985l2666R9444k8060J62230J7355M834q5863
$$ 4503392 4515721 4508114 4433399 4557384 4524718 4624162 4596102 4758332 4775687 4780521 4694658
5221D694658M2538J14782m9929k3323J75107M562j20522K38793o5678K1957J03352
$$ 4694658 4737196 4851978 4802049 4778726 4953833 4958395 4837873 5076666 5010988 5032945 5136297
5210E136297O0249o4199O772L6361n11J29026Q7523J3979j09658J21759J8377
$$ 5136297 5196546 5132347 5139119 5175480 5174969 5303995 5391518 5405497 5295839 5417598 5435975
5199E435975R859O3743r935q4610P1319J68907J1998j47283J29761J73362N5881
$$ 5435975 5445834 5509577 5499642 5415032 5486351 5655258 5667256 5519973 5649734 5823096 5878977
5188E878977l1389n4987J04220J7268J1579J10754k3925O5423J64849M2448Q8070
$$ 5878977 5847588 5792601 5896821 5914089 5925668 6036422 6012497 6077920 6242769 6285217 6373287
5177F373287K5734m5411K9526n059J01541P6465l5859O8167p106K06891Q4568
$$ 6373287 6399021 6353610 6383136 6378077 6479618 6556083 6520224 6588391 6581285 6788176 6872744
5166F872744q8482J3945O2262R3224l0104K11343o7462J09753l323n8282J06803
$$ 6872744 6784262 6798207 6860469 6953693 6923589 7134932 7067470 7177223 7173900 7115618 7222421
5155G222421L6398J15087j12969q4046J73412J77164O9107l3623n2912J04956
$$ 7222421 7258819 7373906 7260937 7176891 7350303 7527467 7596574 7562951 7510039 7614995
5145G614995Q1306k5609J00683O1086J08237P0732P2787J83523j11642p1842K71251
$$ 7614995 7696301 7670692 7771375 7832461 7940698 8011430 8084217 8267740 8156098 8084256 8355507
5134H355507P4650O0991K6657J3834J44420j60104Q4106L0146o4934J25054R1395
$$ 8355507 8430157 8491148 8517805 8531639 8676059 8515955 8600061 8630207 8565273 8690327 8781722
5123H781722r8391J98116N5662K12092p2736l0715N8865N1813n2615K44321R1280
$$ 8781722 8683331 8881447 8937109 9149201 9076465 9045750 9104615 9156428 9103813 9348134 9439414
5112I439414L8263M6067p4422J00574o1455K8757P144n7101J15452R1938j9220
$$ 9439414 9477677 9523744 9449322 9549896 9488441 9517198 9524342 9467241 9582693 9674631 9655411
5101I655411J56168n3752N6121j236k846q1539J65676R4833P7320R7493j69307
$$ 9655411 9811579 9757827 9813948 9812712 9809866 9728327 9894003 9988836 10066156 10163649 9994342
5090I994342N2465n0851K04197l0270r3212N7790R2096N1311r4302K5897O6653
$$ 9994342 10046807 9995956 10200153 10169883 10076671 10134461 10226557 10277868 10183566 10209463 10276116
5079A0276116j78812L2679O2998K7280J28158j26338k451O8967M24j65880J09701
$$ 10276116 10097304 10129983 10192981 10220261 10348419 10222081 10219630 10288597 10289021 10123141 10232842
5068A0232842R902L3615o35n7294j08454N2034J26005k6251L5693k8174Q2942
$$ 10232842 10242744 10276359 10275724 10218430 10109976 10162010 10288015 10261764 10297457 10269283 10352225
5057A0352225o5178n4907m5204k6845L3677j5721p7020L8427R4496m7752K7628
$$ 10352225 10287047 10232140 10186936 10160091 10193768 10178047 10101027 10139454 10233950 10186198 10213826
5046A0213826p9393k6400j5257o8163R0415j16639q0704j333j12269p0053l904
$$ 10213826 10134433 10108033 10092776 10024613 10115028 9998389 9917685 9916352 9804083 9734030 9730126
5035I730126q4872R271k64419k15273j9425k8389l111r5797J27926j3494j7677
$$ 9730126 9645254 9654525 9390106 9174833 9155408 9127019 9123908 9028111 9156037 9142543 9124866
5024I124866r6230j82175m292m7140k2744P0531l8810q8089o842j5248p1175n6765
$$ 9124866 9028636 8846461 8842169 8795029 8772285 8842816 8804006 8715917 8709075 8693827 8622652 8565887
5012H565887n6712n8814m8523M3499k2408O0294l1172j37950l2669j35619j52301
$$ 8565887 8509175 8450361 8401838 8445337 8422929 8483223 8452051 8314101 8281432 8145813 7993512
5001G993512q1764n1938M2119M9811r8235j19225k6879j132m1567J646j1718P4350
$$ 7993512 7911748 7859810 7901929 7951740 7853505 7734280 7707401 7706269 7664702 7666348 7654630 7728980
4989G728980j28020k0124m5027j26575l0889q9032O9818j45563l8067N8641o0187
$$ 7728980 7600960 7580836 7535809 7409234 7378345 7289313 7359131 7213568 7175501 7234142 7173955
4978G173955M90j5159K2224j8193k08170K4039p8090n6176R6525L2777J6192p9210
$$ 7173955 7174445 7159286 7181510 7163317 6955147 6979186 6901096 6844920 6941445 6974222 6990414 6911204
4966F911204K8708q4256m1936N8602m6791r7942j14885R2705L7294k28088m5461
$$ 6911204 6939912 6855656 6813720 6872322 6825531 6727589 6612704 6705409 6742703 6514615 6469154
4955F469154O3576n8246K6694j9078o7083P3629M6397j18658k187N6735r7377
$$ 6469154 6532730 6474484 6501178 6482100 6415017 6488646 6535043 6416385 6414198 6470933 6373556
4944F373556n5204J57879p1165n8841M6161k5197j61076q7109M4947k6565r9290
$$ 6373556 6318352 6476231 6405066 6346225 6392386 6367189 6206113 6119004 6163951 6137386 6038096
4933F038096k513J996J01361j95753q4381J42954l3293j07814M143R1589L2001
$$ 6038096 6035583 6037579 6138940 5943187 5858806 6001760 5968467 5860653 5864796 5956385 5988386
4922E988386k03479O440o9893k0659l9250r1067j64372j72496J30314o8073P9790
$$ 5988386 5784907 5791347 5721454 5700795 5661545 5570478 5406106 5233610 5363924 5295851 5375641
4911E375641O3387J3524P020p1266j35252Q2331m7071n946L735m5104K7297Q1675
$$ 5375641 5439028 5452552 5459572 5388306 5253054 5335385 5288314 5282368 5286103 5240999 5268296 5349971
4899E349971R0471L5683k8861l3656k8474K8162K53696L06684j10929j59382J0514
$$ 5349971 5440442 5476125 5447264 5413608 5385134 5413296 5666992 5973676 5862747 5703365 5713879
4888E713879P7252J03075J21669J05486K34720J27470L5546J95799L39515K49428
$$ 5713879 5791131 5894206 6015875 6121361 6356081 6483551 6519097 6714896 7054411 7303839
4878G303839P1725K11764K27131M9741K3504J06276Q8423o1671j12798k0201j58904
$$ 7303839 7375564 7587328 7814459 7864200 7887704 7993980 8082403 8020732 7907934 7887733 7728829
4867G728829k76868k81666j62214j79087j87756j15736l00576j39848k15910k69766
$$ 7728829 7451961 7170295 7008081 6828994 6641238 6525502 6224926 6085078 5869168 5599402
4857E599402j67742j82017j19762r4632k77542l3460q3740j55572j05537j65641
$$ 5599402 5431660 5249643 5129881 5035249 4757707 4724247 4640507 4484935 4379398 4213757
4847D213757r7749J7396l2190j28697j00910J17546j07299p6003M483j15040k6146
$$ 4213757 4116008 4133404 4101214 3972517 3871607 3989153 3881854 3805851 3810334 3695294 3669148
4836C669148j61690q1581P0443J39046J0239n6175j13552j45421Q2396l9928k8025
$$ 3669148 3507458 3425877 3496320 3635366 3645605 3589430 3475878 3330457 3412853 3372925 3344900
4825C344900K3189N3643j9327J32788j23587j15201J7812N8058p583j72761j17079
$$ 3344900 3368089 3421732 3402405 3535193 3411606 3296405 3314217 3372275 3364692 3191931 3074852
4814C074852m6923j2853P7836j5344q5364J05509q8374l4925K9819j0788m8879
$$ 3074852 3027929 3015076 3092912 3077568 2992204 3097713 3009339 2974414 3004233 2993445 2944566
4803B944566P454J6141m4079j68071O2002Q7512m05j90624M6693n0726j4129R5359
$$ 2944566 2952020 2968161 2924082 2756011 2818013 2905525 2905120 2714496 2761189 2710463 2696334 2791693
4791B791693P4635n679P3397o4323j8899K8522n9732k18549j45963K6288J94759
$$ 2791693 2866328 2860649 2934046 2869723 2850824 2879346 2819614 2601065 2455102 2481390 2676149
4780B676149l9370j17846j9050J0190J11957Q4659K6179p5315N7351l4105q8937
$$ 2676149 2636779 2518933 2499883 2510073 2622030 2706689 2732868 2657553 2714904 2680799 2591862
4769B591862m8550J61566q629k8214p9899k19671N2646R1021L5999p2123k0450
$$ 2591862 2543312 2704878 2696249 2668035 2588136 2368465 2421111 2512132 2548131 2476008 2455558
4758B455558M9200K6852j4087l3458j1023L3000J03074M0979m9850q0997j00420
$$ 2455558 2504758 2531610 2517523 2484065 2473042 2506042 2609116 2650095 2600245 2519248 2418828
4747B418828J30301J7601P9075j08759k5913J00131Q2111l6677l7349k2426o3726
$$ 2418828 2549129 2566730 2645805 2537046 2511133 2611264 2693375 2656698 2619349 2596923 2533197
4736B533197R636p948J17181r2903m171q850J68998o5731j48459O5150M8529m4609
$$ 2533197 2542833 2534885 2652066 2559163 2554992 2546142 2715140 2649409 2500950 2566100 2614629 2570020
4724B570020j26056M6621J40319r7913n7703J07640K4077k4473j3650p592Q8509
$$ 2570020 2443964 2490585 2630904 2532991 2475288 2582928 2607005 2582532 2568882 2561290 2649799
4713B649799j38737r3915m6742J14932m9669j00075J32784P5706J30934k2425
$$ 2649799 2511062 2417147 2370405 2485337 2435668 2335593 2468377 2544083 2675017 2652592
4703B652592r0382j17249J03958r2315n7537k1907J21526J74065o4145o8764k2384
$$ 2652592 2562210 2444961 2548919 2456604 2399067 2377160 2498686 2672751 2608606 2539842 2517458
4692B517458j295q342l9394K7679Q3578K2541M9403j03379m2172M8544N6113N8617
$$ 2517458 2516163 2507821 2468427 2496106 2579684 2602225 2651628 2548249 2506077 2554621 2610734 2669351
4680B669351r5487O2093R6023r2246l3376n7661L1641K21854K3713J8490J4332
$$ 2669351 2573864 2635957 2731980 2639734 2606358 2548697 2580338 2802192 2825905 2844395 2858727
4669B858727k09269L6889l9981J0363M5420L7231J4572l8492q4094M308J3229
$$ 2858727 2649458 2686347 2646366 2656729 2702149 2739380 2753952 2715460 2631366 2635674 2648903
4658B648903L6684P6764J01053k1284m7302k51549J7233J21268p2119J9205J0617
$$ 2648903 2685587 2762351 2863404 2842120 2794818 2543269 2560502 2681770 2609651 2628856 2639473
4647B639473N6846O4138J5721l4688O8180Q123l3073J2442p8058J18L5455m015
$$ 2639473 2696319 2760457 2776178 2741490 2809670 2817793 2784720 2797162 2719104 2719222 2754677 2750662
4635B750662o1491O6220N228l5029P3953P6133J31535o0116P1351L78k6322j11765
$$ 2750662 2689171 2755391 2760619 2725590 2799543 2875676 3007211 2947095 3018446 3018824 2992502 2880737
4623B880737O5201l394q0489J75115l1126l7288J5101m5241m8382j5988J13421
$$ 2880737 2945938 2942544 2862055 3037170 3006044 2968756 2983857 2938616 2890234 2874246 2987667
4612B987667R0756J03215k9866j19202j3102J2556m184K8896l1267L9257l7791
$$ 2987667 3078423 3181638 3151772 3032570 3019468 3032024 3027840 3056736 3025469 3064726 3026935
4601C026935o222M6465n8890P3788L1421L4194J6138J6384q6226n5170j417J0257
$$ 3026935 3020713 3067178 3008288 3082076 3113497 3147691 3163829 3180213 3093987 3038817 3037400 3047657
4589C047657M9460p6713J04349N6047o3896R5499o2873N7571N8031k3262P9866
$$ 3047657 3097117 3020404 3124753 3180800 3116904 3212403 3149530 3207101 3265132 3241870 3321736
4578C321736Q6073k2O9307j08932k06242L9464J66371N439L6073J01606l8745
$$ 3321736 3407809 3407787 3477094 3368162 3161920 3201384 3367755 3373194 3409267 3510873 3472128
4567C472128o6669P2486n855K1037Q015N0282j8257q9239O2761p1610R2894p1445
$$ 3472128 3405459 3477945 3472090 3493127 3501142 3551424 3533167 3443928 3506689 3435079 3527973 3456528
4555C456528O1161p6319J34562P2194M4149r2075N1311Q2976q2099n2946M0474
$$ 3456528 3517689 3441370 3575932 3648126 3692275 3600200 3651511 3734487 3652388 3599442 3639916
4544C639916Q3464J11215L2874J0658O571R4466M8814r5066J0626p0410O9288
$$ 3639916 3723380 3834595 3867469 3878127 3884698 3979164 4027978 3932912 3943538 3873128 3942416
4533C942416l0966J9846O387L4053M9906O8672J5385J2220R6269K6501o5055Q3872
$$ 3942416 3911450 3931296 3937683 3971736 4021642 4090314 4105699 4117919 4214188 4240689 4175634 4259506
4521D259506k7339k5116Q6902Q7534j29527o4071J47604J09476L6739Q619M3264
$$ 4259506 4232167 4207051 4293953 4381487 4251960 4187889 4335493 4444969 4481708 4490327 4533591
4510D533591J04587j5390j09302O9386p397n360K182k585J16573k3016P7569m390
$$ 4533591 4638178 4622788 4513486 4582872 4575475 4570115 4572297 4569712 4686285 4663269 4740838 4736448
4498D736448M6536N7141J02004j6624m2297J01220J10045P1178K5110m3736P5062
$$ 4736448 4782984 4840125 4942129 4925505 4883208 4984428 5094473 5165651 5190761 5147025 5222087
4487E222087O2438P1681M2129J22823K6268n033J11721K4478l8767j4190J38704
$$ 5222087 5284525 5356206 5398335 5521158 5547426 5542393 5654114 5678592 5639825 5625635 5764339
4476E764339K00983J37661p5185M3403L5205J29181P4753Q5600l1449L8695P8015
$$ 5764339 5965322 6102983 6027798 6071201 6106406 6235587 6310340 6395940 6364491 6403186 6481201
4465F481201J27763K5174J42943k6211J94722O7184J4710J90653J70682J20934
$$ 6481201 6608964 6634138 6777081 6750870 6945592 7012776 7027486 7218139 7388821 7509755
4455G509755Q9531J21192J31588P9091P8139R6560R6248J71784J37688K15544
$$ 7509755 7599286 7720478 7852066 7931157 8009296 8105856 8202104 8373888 8511576 8727120
4445H727120J07912J78118J43529P9105L0754K97218K55180J76030J64829K34469
$$ 8727120 8835032 9013150 9156679 9235784 9266538 9563756 9818936 9994966 10159795 10394264
4435A0394264Q0613J25933K79873K58765J89616K27341M43866J20975K52089K77667
$$ 10394264 10474877 10600810 10880683 11139448 11329064 11556405 12000271 12121246 12373335 12651002
4425A2651002L53432L32829J26664L48459L00830K43288K92287K89264K96772
$$ 12651002 13004434 13337263 13463927 13812386 14113216 14356504 14648791 14938055 15234827
4416A5234827L10362L22994L93524L99609K84518K91510L98067L58381M34862
$$ 15234827 15545189 15868183 16261707 16661316 16945834 17237344 17635411 17993792 18428654
4407A8428654K57981K68126N04530M03644L09434L16292K78450L54349M44810
$$ 18428654 18686635 18954761 19459291 19862935 20172369 20488661 20767111 21121460 21566270
4398B1566270K84329L73908L21160K08544J87347L4078L47498K68157L58170J93387
$$ 21566270 21850599 22224507 22545667 22754211 22941558 22975636 23323134 23591291 23949461 24142848
4388B4142848L9791J22758P3337J28625L9869L1060K48549j4957j87953R3771
$$ 24142848 24182639 24305397 24378734 24507359 24547228 24578288 24826837 24811880 24623927 24717698
4378B4717698J49350N0195l953j26085m0617o8214J1979J25496q5643j81363r9657
$$ 24717698 24867048 24917243 24913290 24787205 24746588 24678374 24690353 24815849 24730206 24548843 24449186
4367B4449186M8410m2664p1995L6847p0131j07509J19515J09594k3698j13626
$$ 24449186 24497596 24454932 24382937 24419784 24349653 24242144 24361659 24471253 24447555 24333929
4357B4333929q527J17590l2465K1509J16358J25957n9235J03544K18850R2350
$$ 24333929 24325402 24442992 24410527 24432036 24548394 24674351 24615116 24718660 24937510 25029860
4347B5029860P6445M1878R7813J14845L35015J81892K22427J18415J93390J62687
$$ 25029860 25106305 25148183 25245996 25360841 25695856 25877748 26100175 26218590 26411980 26574667
4337B6574667J31150J36913L44096K81171J40111K60190K62545L08350K45613
$$ 26574667 26705817 26842730 27186826 27467997 27608108 27868298 28130843 28439193 28684806
4328B8684806K72007K21075M15372K67360L04870L10362L31941M28853M20665
$$ 28684806 28956813 29177888 29593260 29860620 30165490 30475852 30807793 31236646 31657311
4319C1657311L30659L50968L44556L19580M17719K38736M36701M45676M49712
$$ 31657311 31987970 32338938 32683494 33003074 33420793 33659529 34096230 34541906 34991618
4310C4991618M87268L27594K99583M21770M27547L23383M15143L23568L94291
$$ 34991618 35478886 35806480 36106063 36527833 36955380 37278763 37693906 38017474 38411765
4301C8411765J65711J86305K32480K60746J91362L9898O4788J3929m669m4389
$$ 38411765 38577476 38763781 38996261 39257007 39448369 39488267 39553055 39566984 39562315 39517926
4291C9517926m1045j22815j72470k87969k30431l43863k70272m43609l74972l49269
$$ 39517926 39476881 39354066 39181596 38893627 38663196 38319333 38049061 37605452 37230480 36881211
4281C6881211m51700m44616n26392m92043n23021o25493o29176n75958o63137
$$ 36881211 36429511 35984895 35458503 34966460 34443439 33817946 33188770 32612812 31949675
4272C1949675o40869n23725o39622n35081o80958o99588o09587n93539m45110
$$ 31949675 31308806 30785081 30145459 29610378 28929420 28229832 27620245 27026706 26581596
4263B6581596n69637o23204o00536n77098n07564m28810m93857m96876m33601
$$ 26581596 26011959 25388755 24788219 24211121 23703557 23274747 22780890 22284014 21850413
4254B1850413l34010m93590m60502k72050m30972l58122k71379k76162k59915
$$ 21850413 21516403 21022813 20562311 20290261 19859289 19501167 19229788 18953626 18693711
4245A8693711l14800l01397j89566k89485k63030k13835k83796j81756j70363
$$ 18693711 18378911 18077514 17887948 17598463 17335433 17121598 16837802 16656046 16485683
4236A6485683l3460p3682k55573j51404j35874p7078j98757k06295j23215l8587
$$ 16485683 16452223 16378541 16122968 15971564 15835690 15758612 15559855 15353560 15230345 15191758
4226A5191758j11582L1840j76129n2460j35624p3660o0242j54051o9747j24055
$$ 15191758 15080176 15112016 14935887 14883427 14747803 14674143 14613901 14459850 14390103 14266048
4216A4266048P8203j46015r4196j21397j2117j04421J21366k0267j27047l0098
$$ 14266048 14344251 14198236 14104040 13982643 13970526 13866105 13987471 13967204 13840157 13810059
4206A3810059R1697K1011k26944l4525Q8820j22371J06816J91816Q7267j05005
$$ 13810059 13901756 13922767 13695823 13661298 13750118 13627747 13734563 13926379 14013646 13908641
4196A3908641j8060o2369j6087O0092r7299n3881k6066K32820L786o4675j68573
$$ 13908641 13890581 13828212 13812125 13872217 13774918 13721037 13694971 13927791 13931577 13866902 13698329
4185A3698329J61448K69767n6369l2468L3661J60717M0267n3479J16655M0572
$$ 13698329 13859777 14129544 14073175 14040707 14074368 14235085 14275352 14221873 14338528 14379100
4175A4379100k0118J53558l6821j1832J23634J31896K2895M7753N8873Q7832l0363
$$ 14379100 14358982 14512540 14475719 14463887 14587521 14719417 14742312 14790065 14848938 14936770 14906407
4164A4906407J27905j8953O9040J83582j8140N967J35189K15469Q8007J5305K5277
$$ 14906407 15034312 15015359 15084399 15267981 15249841 15255808 15390997 15606466 15694473 15709778 15735055
4153A5735055J03634J17836J61230J10687n1484M5121J61137L4417J23598P4785
$$ 15735055 15838689 15956525 16117755 16228442 16176958 16222079 16383216 16417633 16541231 16616016
4143A6616016J09341K7771J45650J27883K47470J30358m7902L4707J28730J42424
$$ 16616016 16725357 16753128 16898778 17026661 17274131 17404489 17356587 17391294 17520024 17662448
4133A7662448L7547P8615K18637L16132J10156L0100J40014J57082K40256K43747
$$ 17662448 17699995 17778610 17997247 18313379 18423535 18453635 18593649 18750731 18990987 19234734
4123A9234734O7110K06545J18038J48655k5207O4915K45266J78064J48826J49177
$$ 19234734 19301844 19508389 19626427 19775082 19749875 19814790 20060056 20238120 20386946 20536123
4113B0536123K15860J69277K98891L4743R0783J90794j0928J61168J54496J70083
$$ 20536123 20751983 20921260 21220151 21254894 21345677 21536471 21525543 21686711 21841207 22011290
4103B2011290K36250J63707O7843L08862J50323J68786K58061L54821J44614M1201
$$ 22011290 22247540 22411247 22479090 22787952 22938275 23107061 23365122 23719943 23864557 23905758
4093B3905758L26722K72461J96515K9659J99848J55144K78579L08815K30589J85467
$$ 23905758 24232480 24504941 24701456 24731115 24930963 25086107 25364686 25673501 25904090 26089557
4083B6089557L18218J77841N1478L47338L86749L21974J39765J42185K64772K11133
$$ 26089557 26407775 26585616 26637094 26984432 27371181 27693155 27832920 27975105 28239877 28451010
4073B8451010M34707L21950K61034L61057K59556K36320L26569J14132L73162
$$ 28451010 28885717 29207667 29468701 29829758 30089314 30325634 30652203 30766335 31139497
4064C1139497M15266L07695L10588L06993L27756L79214L42161L60488L61962
$$ 31139497 31554763 31862458 32173046 32480039 32807795 33187009 33529170 33889658 34251620
4055C4251620L37450M49980K72863L28538N00035M26723L38101M62894M29536
$$ 34251620 34589070 35039050 35311913 35640451 36140486 36567209 36905310 37368204 37797740
4046C7797740M93793N62004N01943O04678N66129O37657N74184M66544O19679
$$ 37797740 38291533 38853537 39355480 39960158 40526287 41163944 41738128 42204672 42824351
4037D2824351P23114N74614O36285P01965Q15281P27397P07737J066938Q56381
$$ 42824351 43547465 44122079 44758364 45460329 46275610 47003007 47710744 48777682 49634063
4028D9634063J017935J185324J271332J016811R69922J173197J316370J391299
$$ 49634063 50651998 51837322 53108654 54125465 55095387 56268584 57584954 58976253
4020E8976253J343337J389484J334671J413219J305977J087561J232163J206444
$$ 58976253 60319590 61709074 63043745 64456964 65762941 66850502 68082665 69289109
4012F9289109J038683R21167J038224O51976N69039N29208L26520K33536p1124
$$ 69289109 70327792 71248959 72287183 72939159 73508198 74037406 74363926 74597462 74526338
4003G4526338j27353p9011n10323m46806n40631q06733q06077r94400j065040
$$ 74526338 74398985 74319974 73809651 73362845 72822214 72015481 71209404 70215004 69149964
3994F9149964j172525j204780j384341j466170j598208j435028j313680j584113
$$ 69149964 67977439 66772659 65388318 63922148 62323940 60888912 59575232 57991119
3986E7991119j475980j360085j450281j329199j373118j342263j217603j159612
$$ 57991119 56515139 55155054 53704773 52375574 51002456 49660193 48442590 47282978
3978D7282978j162329j123476j018901r92961j118251q18646p98757p37200r16814
$$ 47282978 46120649 44997173 43978272 42985311 41867060 41048414 40249657 39512457 38595643
3969C8595643p05826o75898p50586o36999o52518n76912n38228o00161l82628
$$ 38595643 37889817 37213919 36463333 35826334 35173816 34596904 34058676 33458515 33075887
3960C3075887n23129o46022m25978m20526n65354k88421l42433m73958l24960
$$ 33075887 32552758 31906736 31480758 31060232 30494878 30206457 29864024 29390066 29065106
3951B9065106k79593k44311k73326l62396k75769k77705k82200j73865k19447
$$ 29065106 28785513 28541202 28267876 27905480 27629711 27352006 27069806 26895941 26676494
3942B6676494j42316j98418r5177k15153j37254j60932j51349l937p2162j4158
$$ 26676494 26534178 26335760 26240583 26025430 25888176 25727244 25575895 25571958 25499796 25485638
3932B5485638O3546j58530j96833K6648K2386p3577N9115j7859L2275O1652O8391
$$ 25485638 25549184 25390654 25193821 25220469 25242855 25169278 25228393 25210534 25242809 25304461 25372852
3921B5372852R7317J12870n589P5012J31100M6411J17420J74687J63995L61627
$$ 25372852 25470169 25583039 25577450 25652462 25783562 25829973 25947393 26122080 26286075 26647702
3911B6647702N5580J72630K21532K56790K64038K39303L68842M07597K43463L67753
$$ 26647702 26703282 26875912 27097444 27354234 27618272 27857575 28226417 28634014 28877477 29245230
3901B9245230M78785M21704N11253M43712M69988O40368M80828M33648N34445
$$ 29245230 29724015 30145719 30656972 31100684 31570672 32211040 32691868 33125516 33659961
3892C3659961L46868M43865M35735L77366M27467L81030L85820K85893L12902
$$ 33659961 34006829 34450694 34886429 35263795 35691262 36072292 36458112 36744005 37056907
3883C7056907J89872K02282J98990J64365L11253J99012J96987L59955K96877
$$ 37056907 37246779 37449061 37648051 37812416 38123669 38322681 38519668 38879623 39176500
3874C9176500L26930M46394M53807M36929M86233O85558O46982N54092P31058
$$ 39176500 39503430 39949824 40403631 40840560 41326793 42012351 42659333 43213425 43944483
3865D3944483Q24527Q38481R72062R07892Q96612R60331J321014J477745J312704
$$ 43944483 44769010 45607491 46579553 47487445 48384057 49344388 50665402 52143147 53455851
3856E3455851J394138J399326J568108J666077J803338J742211J812765K096498
$$ 53455851 54849989 56249315 57817423 59483500 61286838 63029049 64841814 66938312
3848F6938312K145723K273389K322943K345423K449632K470455K308774K548203
$$ 66938312 69084035 71357424 73680367 76025790 78475422 80945877 83254651 85802854
3840H5802854K471352K293943K343492K400075K251761K092320J978421J897553
$$ 85802854 88274206 90568149 92911641 95311716 97563477 99655797 101634218 103531771
3832A03531771J595161J381120J111274R48917Q37712P05295L91407K02102k1177
$$ 103531771 105126932 106508052 107619326 108568243 109405955 110111250 110502657 110704759 110683582
3823A10683582k91681n14892n60500p99838p71056r11099j319910j519092j337329
$$ 110683582 110391901 109877009 109316509 108516671 107745615 106834516 105514606 103995514 102658185
3814A02658185j487218j649451j612661j753132j679532j733499j744826j911873
$$ 102658185 101170967 99521516 97908855 96155723 94476191 92742692 90997866 89085993
3806H9085993j814397j756666j672167j606970j688276j563197j540879j395275
$$ 89085993 87271596 85514930 83842763 82235793 80547517 78984320 77443441 76048166
3798G6048166j354312j265688j341837j229136j163082j175621j133934j120687
$$ 76048166 74693854 73428166 72086329 70857193 69694111 68518490 67384556 66263869
3790F6263869r52861q84715q79998r00671r88916q38648p19079q22935q46978
$$ 66263869 65311008 64426293 63546295 62645624 61656708 60818060 60098981 59276046 58429068
3781E8429068p00574o39641n51013o20290n45202n30498o50404o95007o18991
$$ 58429068 57728494 57088853 56537840 55917550 55372348 54841850 54191446 53496439 52877448
3772E2877448n14984m16133k31645o39549n18937n60809p02058n74514n74519
$$ 52877448 52362464 51946331 51714686 51075137 50556200 49995391 49293333 48718819 48144300
3763D8144300n91792o68261o66826o52425p10248p86210o42989p02247q89440
$$ 48144300 47552508 46884247 46217421 45564996 44854748 44068538 43425549 42723302 41833862
3754D1833862p19433p05194q18481p30523o81990o70755n97313o81299o24068
$$ 41833862 41114429 40409235 39590754 38860231 38178241 37507486 36910173 36228874 35604806
3745C5604806o68453o31260n30047m17088m09435m17318n69596p21466m12798
$$ 35604806 34936353 34305093 33775046 33357958 32948523 32531205 31961609 31240143 30827345
3736C0827345k63429m11204l92547l61139l89323l88850j68907l67137l18953
$$ 30827345 30563916 30152712 29760165 29399026 29009703 28620853 28451946 28084809 27765856
3727B7765856k84016l44499j95460k57824l38855j32434r6284k98295j59076j93792
$$ 27765856 27481840 27137341 26941881 26684057 26345202 26212768 26116484 25818189 25659113 25465321
3717B5465321j57606j58137k02156j85131j93822j84336n1757p7112j61194j60401
$$ 25465321 25307715 25149578 24947422 24762291 24568469 24384133 24332376 24255264 24094070 23933669
3707B3933669k30650r726m5826j84509k78025N6165J04571j40463p3149J13378
$$ 23933669 23703019 23693293 23647467 23462958 23184933 23241098 23345669 23205206 23132057 23245435
3697B3245435n4815k43284j35664j06826l01728m77165l52372j60621k75928j42713
$$ 23245435 23190620 22947336 22811672 22704846 22403118 21925953 21573581 21412960 21137032 20994319
3687B0994319j49387j50947l6254J1303j72355j01300m7828m6674Q1679o4455
$$ 20994319 20844932 20693985 20657731 20669034 20496679 20395379 20347551 20300877 20382556 20318101
3677B0318101J01756J57240k7490R2639J87717K02827R4011J6j3507p283j3977
$$ 20318101 20419857 20577097 20549607 20642246 20829963 21032790 21126801 21126817 21113310 21106027 21092050
3666B1092050q6406j71808j67227q1950j13063M5606j10617j01236p9083N3153
$$ 21092050 21005644 20833836 20666609 20584659 20471596 20517202 20406585 20305349 20226266 20279419
3656B0279419M0973l5541J00606J52107J36858J53895L6207O7282J14237J29201
$$ 20279419 20320392 20284851 20385457 20537564 20674422 20828317 20864524 20931806 21046043 21175244
3646B1175244J15851J96352K04145Q4091L42080K04527J26132K81806J41818K61446
$$ 21175244 21291095 21487447 21691592 21775683 22117763 22322290 22448422 22730228 22872046 23133492
3636B3133492L33827L16452J90350K38734L16246K18230J29331K72758M09347
$$ 23133492 23467319 23783771 23974121 24212855 24529101 24747331 24876662 25149420 25558767
3627B5558767L43604K97671L58272L37755M14056M17747L52949M52039L45646
$$ 25558767 25902371 26200042 26558314 26896069 27310125 27727872 28080821 28532860 28878506
3618B8878506L78888O77794M67910N77969M67671O79861O85937O02270O99030
$$ 28878506 29257394 29935188 30403098 30981067 31448738 32128599 32814536 33416806 34115836
3609C4115836O54262O17656P53265O68975O98800P88557O89596Q11983O74238
$$ 34115836 34770098 35387754 36141019 36809994 37508794 38297351 38986947 39798930 40473168
3600D0473168N89561P55940Q55968O39630P41690P36603O07943N27476P38611
$$ 40473168 41062729 41818669 42674637 43314267 44055957 44792560 45400503 45927979 46666590
3591D6666590P53883N79032O03423P49608O29892O67363P67352Q49755P10822
$$ 46666590 47420473 47999505 48602928 49352536 49982428 50649791 51417143 52266898 52977720
3582E2977720P80025P34249R07908J084537J061440J144951J196777J304791J404845
$$ 52977720 53757745 54491994 55399902 56484439 57545879 58690830 59887607 61192398 62597243
3573F2597243J511377J445523J664966J736363J807265J770975J825894K046415
$$ 62597243 64108620 65554143 67219109 68955472 70762737 72533712 74359606 76406021
3565G6406021J858592J972425K107185K127096K073808K222362K119000K050728
$$ 76406021 78264613 80237038 82344223 84471319 86545127 88767489 90886489 92937217
3557I2937217K083945J985070K052580J895903J672710J760305J768046J489935
$$ 92937217 95021162 97006232 99058812 100954715 102627425 104387730 106155776 107645711
3549A07645711J380731J186931R97177P26077O27595M38194K95340l7663j43546
$$ 107645711 109026442 110213373 111210550 111936627 112564222 113002416 113297756 113260093 113116547
3540A13116547k10391n25410o50684q76279r28546j005412j116627j314820j516332
$$ 113116547 112906156 112380746 111730062 110853783 109925237 108919825 107803198 106488378 104972046
3531A04972046j529640j499247j528541j538369j631366j659586j563705j630901
$$ 104972046 103442406 101943159 100414618 98876249 97244883 95585297 94021592 92390691
3523I2390691j348955j438151j348196j266004j043447q42251p60801n28667m41427
$$ 92390691 91041736 89603585 88255389 86989385 85945938 85103687 84342886 83814219 83372792
3514H3372792n19716k31162N135o107N4947J62581J66455R5398M14091L37660
$$ 83372792 82853076 82621914 82627049 82620942 82675889 82838470 83004925 83100323 83514414 83852074
3504H3852074M25852L94984K80168L86270L6242K08490K74080J36746J7505j16860
$$ 83852074 84277926 84672910 84953078 85339348 85375590 85584080 85858160 85994906 86012411 85895551
3494H5895551J48327k16275j70654j19535j98233k06100l33899n44892m18931
$$ 85895551 86043878 85827603 85656949 85537414 85339181 85133081 84799182 84254290 83835359
3485H3835359m25099o73513q40885j021645r45972r18372j217544j347166j561294
$$ 83835359 83410260 82736747 81895862 80874217 79928245 79009873 77792329 76445163 74883869
3476G4883869j620866j598971j621471j276434r72527p80115p69647o91588j92338
$$ 74883869 73263003 71664032 70042561 68766127 67793600 67013485 66243838 65552250 65359912
3467F5359912J23018J67765L54460L53853O82388P34289P82807J326280J507192
$$ 65359912 65482930 65650695 66005155 66359008 67041396 67775685 68558492 69884772 71391964
3458G1391964J406681J659678J841758J593469J673097J811703J744130J819937
$$ 71391964 72798645 74458323 76300081 77893550 79566647 81378350 83122480 84942417
3450H4942417J695615J691033J639285J576124J916514J944430K019158K446569
$$ 84942417 86638032 88329065 89968350 91544474 93460988 95405418 97424576 99871145
3442I9871145K854160L087590L346774L574322M037726M229597M589939N266343
$$ 99871145 102725305 105812895 109159669 112733991 116771717 121001314 125591253 130857596
3434A30857596N906047O559211P408499Q217334R370982J0326010J1801967J3185240
$$ 130857596 136763643 143322854 150731353 158948687 168319669 178645679 190447646 203632886
3426B03632886J4669788J6829777J8919803K1154534K3761758K6581619K9123587
$$ 203632886 218302674 235132451 254052254 275206788 298968546 325550165 354673752
3419C54673752L1721323L3715202L4708271L3342735K7590005J6550703J772184
$$ 354673752 386395075 420110277 454818548 488161283 515751288 532301991 534074175
3412E34074175j2515576k2478702k7476993k8699134k7102228k3420976j8904846
$$ 534074175 521558599 499079897 471602904 442903770 415801542 392380566 373475720
3405C73475720j4525004j0558853p137671m224640j496792Q86100K909799N454721
$$ 373475720 358950716 348391863 341254192 337029552 335532760 336418860 339328659 344783380
3397C44783380P820958J0299005J2881810J5373113J8064435K0275266K2150057
$$ 344783380 352604338 362903343 375785153 391158266 409222701 429497967 451648024
3390D51648024K3613041K3524408K0691311J3198935P79904j4183913k7107630
$$ 451648024 475261065 498785473 519476784 532675719 533455623 519271710 492164080
3383D92164080l4790247l7762551l7169769l4398203l0126078k5575249k1494575
$$ 492164080 457373833 419611282 382441513 348043310 317917232 292341983 270847408
3376B70847408j8223890j5528740j3370641j1547298j0473790r417438q448092
$$ 270847408 252623518 237094778 223724137 212176839 201703049 192285611 183837519
3369A83837519p744137o818932o394535o069412n479062n154728m936508m479925
$$ 183837519 176093382 169274450 162879915 156810503 151331441 146176713 141240205 136760280
3361A36760280m115920l929875l693147l365889l253641l133891k937098k956776
$$ 136760280 132644360 128714485 125021338 121655449 118401808 115267917 112330819 109374043
3353A09374043l076305l292639l159809l234162l010836k979296k853666l067424
$$ 109374043 106297738 103005099 99845290 96611128 93600292 90620996 87767330 84699906
3345H4699906k694261k629947k592697k333464k297285k339504k498276k551864
$$ 84699906 82005645 79375698 76783001 74449537 72152252 69812748 67314472 64762608
3337F4762608k435351k630073k396163k083884k112255j781658j670388j758289
$$ 64762608 62327257 59697184 57301021 55217137 53104882 51323224 49652836 47894547
3329D7894547j441713j284729j359290j204925j135022q91994r41980p13380p28401
$$ 47894547 46452834 45168105 43808815 42603890 41468868 40576874 39634894 38921514 38193113
3320C8193113p71902n99251m37815m29421m45624m18020l62706m20463p32149
$$ 38193113 37421211 36821960 36384145 35954724 35509100 35091080 34728374 34307911 33575762
3311C3575762p32340r16986j158397p73718q65546p68800o13305n26680m48237
$$ 33575762 32843422 31926436 30768039 29994321 29128775 28359975 27746670 27219990 26771753
3302B6771753l74470m69100m24894l02289k01543k03262l77430m22543l65266
$$ 26771753 26397283 25928183 25503289 25201000 24999457 24796195 24418765 23996222 23630956
3293B3630956l66885n32564l74495l52061n03830m39835n78780l30927k23809
$$ 23630956 23264071 22731507 22357012 22004951 21501121 21061286 20482506 20151579 19927770
3284A9927770m77408l92983l47556l29259l36471l26907k31478k07363l24274
$$ 19927770 19450362 19057379 18709823 18380564 18044093 17717186 17485708 17278345 16954071
3275A6954071k61359l29136k19052j53871j80727j60774l09845k08295k25361
$$ 16954071 16692712 16363576 16144524 15990653 15809926 15649152 15339307 15131012 14905651
3266A4905651j76158j23665j56470j01398j32610o0350j45638j28408j4975J7992
$$ 14905651 14729493 14605828 14449358 14347960 14215350 14155000 14009362 13880954 13865979 13883971
3256A3883971J20765j93584j21743q804j96291l1361p979o1273J3485j51902k4615
$$ 13883971 14004736 13811152 13689409 13680605 13484314 13452953 13444974 13383701 13397186 13245284 13220669
3245A3220669O2134L0352R2497l3148r4858J26500l4067J67906M8946J62036J60079
$$ 13220669 13282803 13313155 13405652 13372504 13277646 13404146 13370079 13537985 13586931 13748967 13909046
3234A3909046q1660l9435k7547J42546K29280J36844P9463J4289O7987J52992
$$ 13909046 13827386 13787951 13760404 13902950 14132230 14269074 14348537 14362826 14430813 14583805
3224A4583805R3602J62578J57940J91904J85847K7660J23056N1784L24395l1219
$$ 14583805 14677407 14839985 14997925 15189829 15375676 15403336 15526392 15578176 15902571 15871352
3214A5871352K18174K83329J09260L44226J00208L00621K83117K21914J82903
$$ 15871352 16089526 16372855 16482115 16826341 16926549 17227170 17510287 17732201 17915104
3205A7915104K88724K19956L44426K92260M09918K36272L00227N20379M31095
$$ 17915104 18203828 18423784 18768210 19060470 19470388 19706660 20006887 20527266 20958361
3196B0958361L40591K47591M89748N61944M80413M39322L84994N37295M85719
$$ 20958361 21298952 21546543 22036291 22598235 23078648 23517970 23902964 24440259 24925978
3187B4925978N97186Q17369O72856O58179P05229Q24620P67277R11989Q53830
$$ 24925978 25523164 26340533 27013389 27671568 28376797 29201417 29968694 30880683 31734513
3178C1734513Q72978J030577R72993J193333J292648J166947J284088J298028
$$ 31734513 32607491 33638068 34611061 35804394 37097042 38263989 39548077 40846105
3170D0846105J291363J497772J472582J556272J628034J852873J895729K033878
$$ 40846105 42137468 43635240 45107822 46664094 48292128 50145001 52040730 54074608
3162E4074608K169851K153282K402865K515365K556677K705123K655680L181002
$$ 54074608 56244459 58397741 60800606 63315971 65872648 68577771 71233451 74414453
3154G4414453L292421L449671L484104L482531L770915L813678L845748L913981
$$ 74414453 77706874 81156545 84640649 88123180 91894095 95707773 99553521 103467502
3146A03467502M014300L964658L733605L762794L677688L355440K999486K672045
$$ 103467502 107481802 111446460 115180065 118942859 122620547 125975987 128975473 131647518
3138A31647518K227936J731194J163640P76189K39680l35274q57680j332193j797032
$$ 131647518 133875454 135606648 136770288 137546477 137786157 137450883 136593203 135261010 133463978
3129A33463978k188917k451814k754745k996108l123342l115738l061340k879744
$$ 133463978 131275061 128823247 126068502 123072394 119949052 116833314 113771974 110892230
3121A10892230k782634k720960k475491k135886j981367j780126j586642j361885
$$ 110892230 108109596 105388636 102913145 100777259 98795892 97015766 95429124 94067239
3113I4067239j127127q96039o51059m87713m26542p2320Q7493K40009M79513K59463
$$ 94067239 92940112 92044073 91393014 90905301 90478759 90406439 90493932 90733941 91213454 91472917
3103I1472917M50733P13691Q10141P94901J021669J252790J456045J855770K232459
$$ 91472917 91923650 92637341 93447482 94242383 95264052 96516842 97972887 99828657 102061116
3094A02061116K667562L236025L788960M460606N135084N745869O482262P315796
$$ 102061116 104728678 107964703 111753663 116214269 121349353 127095222 133577484 140893280
3086A40893280P902264Q612421R343671R896499J0113864J0069074R736388Q807382
$$ 140893280 148795544 157407965 166751636 176648135 186761999 196831073 206567461 215374843
3078B15374843P156855M723822J615883j911818n256644q208101j0292032j1635302
$$ 215374843 222531698 227255520 228871403 226959585 221702941 213494840 203202808 191567506
3070A91567506j2135452j2139276j1733059j0816088r902925r087190q296814
$$ 191567506 179432054 167292778 155559719 144743631 134840706 125753516 117456702
3063A17456702p570923o906032o220957n713943n321819m728524m505588m137374
$$ 117456702 109885779 102979747 96758790 91044847 85723028 80994504 76488916 72351542
3055G2351542m016263l868602l646957l483323l101181l006296k856473k610365
$$ 72351542 68335279 64466677 60819720 57336397 54235216 51228920 48372447 45762082
3047D5762082k237588j988233k128993j953803j769561j638509j560214j353095
$$ 45762082 43524494 41536261 39407268 37453465 35683904 34045395 32485181 31132086
3039C1132086j286866j203803j253415j126419j073813j004650r50908p81862
$$ 31132086 29845220 28641417 27388002 26261583 25187770 24183120 23232212 22450350
3031B2450350p42747p57586o50740p26748o42492n74443o09499o27862m92901
$$ 22450350 21707603 20950017 20299277 19572529 18930037 18355594 17746095 17118233 16625332
3022A6625332l99551m19782l10209n06619m50515m36782n24651l15147l57755
$$ 16625332 16225781 15805999 15495790 14989171 14538656 14101874 13577223 13262076 12904321
3013A2904321m69057k23169k78444k81857l63264m40028m14757j92169k17127
$$ 12904321 12435264 12212095 11933651 11651794 11288530 10848502 10433745 10241576 10024449
3004A0024449l39027k10853l05779n04219j03698l27188l13118q5542j34782j10123
$$ 10024449 9685422 9474569 9168790 8664571 8560873 8233685 7920567 7835025 7700243 7590120
2994G590120k43553j24764j70465k27541o3160j01610k06197j15160j60905k83588
$$ 7590120 7346567 7221803 7051338 6823797 6760637 6659027 6452830 6337670 6176765 5893177
2984E893177j77245n5077j61875j41090k41969p2017j39787N1766o5748j25597
$$ 5893177 5715932 5660855 5498980 5357890 5115921 5043904 4904117 4955883 4890135 4764538
2974D764538j33094j4016j22023j04896j16008m5534o5827j77646p4351k02258
$$ 4764538 4631444 4617428 4495405 4390509 4274501 4228967 4163140 3985494 3911143 3708885
2964C708885o2751q9338j17080l1322o1388r4090j77038p6996j30983k7382J8173
$$ 3708885 3646134 3556796 3439716 3408394 3347006 3252916 3075878 2998882 2867899 2840517 2858690
2953B858690o5142r8408m907L3066k31566j6496O4698k37691n1652m4099j82711
$$ 2858690 2793548 2695140 2690233 2723299 2491733 2475237 2539935 2302244 2250592 2206493 2023782
2942B023782o7693L3644l2497p2190n2634j5575r4186j19824o3897l9240n4904
$$ 2023782 1956089 1989733 1957236 1885046 1832412 1816837 1722651 1602827 1538930 1499690 1444786
2931A444786j8191k2970k11435j92349K10O4860J70330n9274j34826j44120J8652
$$ 1444786 1426595 1403625 1192190 999841 1000051 1064911 1235241 1175967 1041141 897021 915673
2920I15673P6316l5398j23035o4791k0173r8672L9808l4940K7977j6044k1751
$$ 915673 991989 956591 833556 768765 748592 649920 689728 654788 682765 666721 644970
2909F44970Q7771j32508j05861j11081M4291J78971j5459q3707n3864N9214k890
$$ 644970 732741 600233 494372 383291 427582 606553 591094 507387 453523 512737 509847
2898E09847j9665P5085r0853o1793n9946M6705P7680O1413j73947o7178q0541
$$ 509847 490182 565267 474414 412621 352675 399380 477060 538473 364526 297348 216807
2887B16807n8818J28190M4669q1299k7194N1839O0807m0879p6151m8893J01670
$$ 216807 157989 286179 330848 249549 222355 274194 335001 294122 217971 169078 270748
2876B70748n1318j22756M3652j6599M5869p8599q1793J2690P5857J0325j8196
$$ 270748 219430 96674 140326 123727 169596 90997 9204 21894 97751 108076 89880
2865H9880K4607J05417j90221o5311L8706L9114l7050Q8461M070K8125n5422k3818
$$ 89880 114487 219904 29683 -35628 3078 42192 5142 93603 97673 125798 70376 46558
2853D6558L2435m118O864J29402j08970o6546O021n3813L3625j3125l6838O3691
$$ 46558 78993 74875 81739 211141 102171 35625 41646 -12167 21458 8333 -28505 35186
2841C5186k8854j8212o6899l9294K9704K8851N8452j09999J4941j0476l9594k5455
$$ 35186 6332 -11880 -78779 -118073 -88369 -59518 -1066 -111065 -96124 -106600 -146194 -171649
2829a71649q0614o9350q0063O6095R5029n0752j52266R6281Q4128m2589L0388
$$ -171649 -252263 -321613 -401676 -335581 -240552 -291304 -443570 -347289 -263161 -305750 -275362
2818b75362N0997m713r6328j7427l1456p3777J12357L8374J4119J03021M5999
$$ -275362 -224365 -229078 -325406 -342833 -374289 -448066 -335709 -297335 -283216 -180195 -134196
2807a34196N0893j9131l9022k3366R0336N6302n7907J2235M7581K3347M6202O4728
$$ -134196 -83303 -102434 -141456 -164822 -74486 -18184 -76091 -63856 -16275 7072 53274 118002
2795A18002R0162j08173M3012J57941n0283q7821J08073j16985K4253k5408k12833
$$ 118002 208164 99991 143003 300944 250661 162840 270913 153928 178181 152773 -60060
2784f0060j00456k0233P5578n9239j48316r5251n3713o2738O7878r0832j2412
$$ -60060 -160516 -180749 -105171 -164410 -312726 -407977 -461690 -524428 -456550 -547382 -559794
2773e59794l8929j31254K4488R76m2142k9589O1982O3812o8779K503J02668K0227
$$ -559794 -598723 -729977 -705489 -704513 -746655 -776244 -714262 -650450 -719229 -716726 -614058 -593831
2761e93831p8776r2193j6441q4400j06611l3931J84063L9766j8384o6958j5383
$$ -593831 -672607 -764800 -781241 -865641 -972252 -1006183 -822120 -782354 -800738 -867696 -883079
2750h83079j9784k0038J61949k26126m0926M3510o0681k9420Q9481N0804l1690
$$ -883079 -902863 -922901 -760952 -987078 -1028004 -984494 -1045175 -1074595 -985114 -934310 -966000
2739i66000k4730n2589o9696L6572Q1577k0463K6429j9632K5817n310k1929n6564
$$ -966000 -990730 -1043319 -1113015 -1076443 -994866 -1015329 -988900 -1008532 -982715 -988025 -1009954 -1066518
2727a066518j7826K3525n0286o8097n1464J85003L6440k5289j16041j74669M4899
$$ -1066518 -1084344 -1060819 -1111105 -1179202 -1230666 -1045663 -1009223 -1034512 -1150553 -1325222 -1280323
2716a280323J84009N1146j63553j5065j916o694q834k2554n9382j1442J73943
$$ -1280323 -1096314 -1045168 -1208721 -1223786 -1225702 -1232396 -1241230 -1263784 -1323166 -1334608 -1160665
2705a160665q3604M1808O3612L6598P0451j22619r7170P2865l4415k87181J15150
$$ -1160665 -1244269 -1202461 -1138849 -1102251 -1031800 -1154419 -1251589 -1178724 -1213139 -1500320 -1385170
2694a385170k272l0862J7262J6488R002L7519L1229k8488k8192R626Q7808j10422
$$ -1385170 -1387442 -1418304 -1401042 -1384554 -1375552 -1338033 -1306804 -1335292 -1363484 -1353858 -1266050 -1376472
2682a376472o6865J61299m807P1000l7115P1137R9728m5139j49949J12567Q0772
$$ -1376472 -1443337 -1282038 -1286845 -1215845 -1252960 -1181823 -1082095 -1127234 -1277183 -1164616 -1083844
2671a083844q4458q1222K3085l7808k1691o1857R5561r0153O2331o1836j27772
$$ -1083844 -1168302 -1249524 -1226439 -1264247 -1285938 -1347795 -1252234 -1342387 -1280056 -1341892 -1469664
2660a469664N3861N844o4514O9786J72472M7621o5223j35911J8683k4527m7960
$$ -1469664 -1415803 -1409959 -1474473 -1404687 -1232215 -1184594 -1249817 -1385728 -1367045 -1391572 -1439532
2649a439532q1526K39474o3912r7341Q4527M7609L0160K5441J3730l1752j4797
$$ -1439532 -1521058 -1281584 -1345496 -1442837 -1358310 -1310701 -1280541 -1255100 -1241370 -1273122 -1287919
2638a287919r0382o4678J82269J21994m3338n2188l9730q2691j3483n2494N2807
$$ -1287919 -1378301 -1442979 -1260710 -1138716 -1182054 -1234242 -1273972 -1356663 -1370146 -1422640 -1369833
2627a369833o4562r9812O6593n619J5993J11293j1723o8532Q0915J65533m9782
$$ -1369833 -1434395 -1534207 -1467614 -1473233 -1457240 -1345947 -1357670 -1426202 -1345287 -1179754 -1229536
2616a229536j74196P8806J19977j01695j9866j86374P6594Q4181n7118k488N2070
$$ -1229536 -1403732 -1324926 -1204949 -1306644 -1326510 -1512884 -1436290 -1352109 -1409227 -1411715 -1359645
2605a359645J7431p9058m0745k6273J7312J25789M8676j06639n1367J51106o1334
$$ -1359645 -1342214 -1421272 -1462017 -1488290 -1470978 -1345189 -1296513 -1403152 -1454519 -1303413 -1364747
2594a364747p842L0235j15753P2081K8467k07258Q1001P8267r1673N4865q1888
$$ -1364747 -1372589 -1342354 -1458107 -1386026 -1357559 -1564817 -1483816 -1405549 -1497222 -1442357 -1524245
2583a524245J29840o7110J2975J40675j69244P1238J2293N9913J622n6762j8905
$$ -1524245 -1394405 -1461515 -1448540 -1307865 -1477109 -1405871 -1393578 -1333665 -1332043 -1388805 -1407710
2572a407710J76368j76548m8806j3801J33485J1306J030j0813R496O1044P6975
$$ -1407710 -1231342 -1407890 -1456696 -1470497 -1337012 -1325706 -1324676 -1335489 -1325993 -1264949 -1187974
2561a187974q4202j04656J63349K3258L8837j52275k4342R1303M9196o6293l8208
$$ -1187974 -1272176 -1376832 -1213483 -1190225 -1151388 -1303663 -1328005 -1236702 -1187506 -1253799 -1292007
2550a292007M3471N5607j15016L8058M7999m7825j34128N4333J8312j03637J01989
$$ -1292007 -1248536 -1192929 -1307945 -1269887 -1221888 -1269713 -1403841 -1349508 -1331196 -1434833 -1332844
2539a332844R0399n5012m4494m2453N7955n929r523m6185J03166M9648L7344r2970
$$ -1332844 -1242445 -1297457 -1341951 -1384404 -1326449 -1332378 -1341901 -1388086 -1284920 -1235272 -1197928 -1290898
2527a290898j20502L1495K5289R1848o5156p9145P0599K1030R8101R2146q5999
$$ -1290898 -1411400 -1379905 -1354616 -1262768 -1327924 -1407069 -1336470 -1315440 -1217339 -1125193 -1211192
2516a211192j27443n3728J9528L2789r6629J02094p2759N3237k2876L798L5206
$$ -1211192 -1338635 -1392363 -1372835 -1340046 -1436675 -1334581 -1407340 -1354103 -1376979 -1373181 -1337975
2505a337975J77679j15994j33621L6366J16555j00316j47680P9631j41796J224
$$ -1337975 -1160296 -1276290 -1409911 -1373545 -1256990 -1357306 -1504986 -1425355 -1567151 -1565927
2495a565927J65939N0160k31659Q892K15000N3906q3586l672L2549J9754L3273
$$ -1565927 -1399988 -1349828 -1581487 -1572595 -1357595 -1303689 -1387275 -1390947 -1358398 -1338644 -1305371
2484a305371n4309l3Q6236L3761j03031p169n2859K6593q6816R1930j38341Q191
$$ -1305371 -1359680 -1359713 -1273477 -1239716 -1342747 -1349916 -1402775 -1376182 -1462998 -1371068 -1509409 -1501218
2472a501218K43276l91l1000L5911N7675r8273j11236P5931J45656n7813N7028
$$ -1501218 -1257942 -1258333 -1289333 -1253422 -1195747 -1294020 -1405256 -1329325 -1183669 -1241482 -1184454
2461a184454N1197j61942k24449J84134m4146k8374M3177K12140r4013j35725
$$ -1184454 -1133257 -1295199 -1519648 -1335514 -1379660 -1408034 -1364857 -1152717 -1246730 -1382455
2451a382455J39041N0656Q200j01083k9516J8272J8744Q8527n192N575p0937J93232
$$ -1382455 -1243414 -1192758 -1184558 -1285641 -1315157 -1296885 -1278141 -1189614 -1194806 -1189231 -1260168 -1066936
2439a066936m1420r2405L9738q8019Q0050M2557j13022K2852K4167P4230L5729
$$ -1066936 -1108356 -1200761 -1161023 -1249042 -1168992 -1126435 -1239457 -1216605 -1192438 -1118208 -1082479
2428a082479o6087j2813N3298k634L3472L6961k4395K6648L1968j74456o9247
$$ -1082479 -1148566 -1161379 -1108081 -1110715 -1077243 -1040282 -1064677 -1038029 -1006061 -1180517 -1249764
2417a249764N4509r4027o366O5900R7085J42379j26749j5056J2717n7385j36913
$$ -1249764 -1195255 -1289282 -1295648 -1229748 -1132663 -990284 -1117033 -1132089 -1119372 -1176757 -1313670
2406a313670J47215N768R5691m9293q8335M5634n6441K7418J3551p3142O0064
$$ -1313670 -1166455 -1160687 -1064996 -1114289 -1202624 -1156990 -1213431 -1186013 -1172462 -1245604 -1185540
2395a185540L6658J709J95186L227p0804n8989P4256j11230Q4207J20691j22350
$$ -1185540 -1148882 -1147173 -951987 -948760 -1019564 -1078553 -1004297 -1115527 -1031320 -910629 -1032979
2384a032979l7859J31465l8957K7517m7815m3821k1482K3935j15380R8180J63882
$$ -1032979 -1070838 -939373 -978330 -950813 -998628 -1042449 -1063931 -1039996 -1155376 -1057196 -893314
2373h93314K7806J1562Q2547J07501j07237m1390Q4482j37460j29124j54362J20756
$$ -893314 -865508 -853946 -771399 -663898 -771135 -812525 -728043 -865503 -994627 -1148989 -1028233
2362a028233P5732P7185l9796K00711l5192r2470l8177K4205O0936k9014L5031
$$ -1028233 -952501 -875316 -915112 -714401 -749593 -842063 -880240 -856035 -795099 -824113 -789082
2351g89082M3984L4210o7861K308K3389J42704R1649l2240O1275q5731j63799
$$ -789082 -745098 -710888 -778749 -776441 -753052 -610348 -518699 -550939 -489664 -575395 -739194
2340g39194K10619k7167Q4726J01163J15431O5753o8584p8258O5582L0898J46057
$$ -739194 -528575 -555742 -471016 -369853 -254422 -188669 -257253 -335511 -269929 -239031 -92974
2329i2974J14836R0864M8876l1344J62033J28644Q6600p696Q0054n7944Q8745
$$ -92974 21862 112726 161602 130258 292291 420935 507535 499839 579893 521949 610694
2318F10694K33877J48577K05062J02952K12865J32986J24570M2396L56570L00161
$$ 610694 844571 993148 1198210 1301162 1514027 1647013 1771583 1813979 2170549 2470710
2308B470710L9967K68647L18711M65268L74585L99753P04189N82915N99168P08729
$$ 2470710 2510677 2779324 3098035 3563303 3937888 4337641 5041830 5624745 6223913 6932642
2298F932642P11674P70603J109831J320700J515732J802576J895482K295850K630624
$$ 6932642 7644316 8414919 9524750 10845450 12361182 14163758 16059240 18355090 20985714
2289B0985714K830094L519694L861099K684550M31781l161531m190502l627616
$$ 20985714 23815808 27335502 31196601 33881151 34312932 31151401 26960899 23333283
2281B3333283l874340l404463k770676j970020j457715j029554r11169p13492
$$ 23333283 19458943 16054480 13283804 11313784 9856069 8826515 7915346 7201854
2273G201854p58590n97993l71354m64308m71396l75434m10098l30153n24279m55730
$$ 7201854 6443264 5845271 5473917 5009609 4538213 4162779 3752681 3422528 2898249 2442519
2263B442519l47991l52680k66802L5767j71079k74453k1021k63432j45262j6921
$$ 2442519 2094528 1741848 1475046 1510813 1339734 1065281 1044260 780828 635566 618645
2253F18645j43162k39552J392K7395j21875q1160j23055K470n6237r7971j6510
$$ 618645 475483 235931 237323 264718 142843 61683 -61372 -58902 -115139 -213110 -229620
2242b29620k3047J0123J2465r7073k12512o5536J17621J36346J5018j21972j79172
$$ -229620 -252667 -242544 -230079 -327152 -539664 -605200 -487579 -351233 -336215 -458187 -637359
2231f37359r718n383o585j24840q5301L6235J15460j8577L2041k0954j8029j23725
$$ -637359 -647077 -652460 -659045 -783885 -869186 -832951 -717491 -736068 -704027 -724981 -743010 -866735
2219h66735p3360M1399k3490q807O1185M7032m7902O1595m8523n4343o9635K8799
$$ -866735 -940095 -898696 -922186 -930993 -869808 -822776 -870678 -809083 -857606 -911949 -981584 -952785
2207i52785n7961n4535K7770k7432P5485P6470o0252N745j4690j46130l6272J3028
$$ -952785 -1010746 -1065281 -1037511 -1064943 -989458 -912988 -973240 -967495 -982185 -1128315 -1164587 -1151559
2195a151559J07784P1818L8707j89233l3881Q4648j16178J101O4914k5353J4225
$$ -1151559 -1043775 -971957 -933250 -1122483 -1156364 -1071716 -1187894 -1186793 -1121879 -1147232 -1133007
2184a133007m4058R112R6731r3265J28950J18487k62860m9647P3590j7674k3838
$$ -1133007 -1177065 -1167953 -1071222 -1164487 -1035537 -917050 -1179910 -1229557 -1155967 -1173641 -1197479
2173a197479m4553l073M5162j00403l1624o6016J26417J8557j06681J74919j389
$$ -1197479 -1242032 -1245105 -1199943 -1300346 -1331970 -1397986 -1271569 -1253012 -1359693 -1184774 -1186163
2162a186163q8207J1183l6897R1880L7957J5412j8534p6857k02202M5625P8250
$$ -1186163 -1274370 -1263187 -1300084 -1208204 -1170247 -1154835 -1173369 -1250226 -1452428 -1406803 -1328553
2151a328553j11189K3252j0642Q8030O0590O155j0315L6213j54262l9687J97613
$$ -1328553 -1439742 -1416490 -1427132 -1339102 -1278512 -1272357 -1282672 -1246459 -1400721 -1440408 -1242795
2140a242795K4642n6942j1771p1730K1411R7042l7267p2648m3001M5197l3379
$$ -1242795 -1218153 -1275095 -1286866 -1358596 -1337185 -1240143 -1277410 -1350058 -1393059 -1347862 -1381241
2129a381241N9940J6265k7321K1447n6929M2102J1238n6837N171l7907L7928K0779
$$ -1381241 -1321301 -1305036 -1332357 -1310910 -1367839 -1325737 -1314499 -1371336 -1366165 -1404072 -1366144 -1345365
2117a345365K2064J58605j27954K7964R1918l3570j5313N2302j50896L3258J21885
$$ -1345365 -1323301 -1164696 -1292650 -1264686 -1172768 -1206338 -1221651 -1169349 -1320245 -1286987 -1165102
2106a165102j58613R482J7992j35248k8756J69911m2767k1114J41118k0947R7650
$$ -1165102 -1323715 -1314233 -1296241 -1431489 -1460245 -1290334 -1333101 -1354215 -1213097 -1234044 -1136394
2095a136394j33165J1662l604L0561l1980l4879j00861R168J9315L6760O1487
$$ -1136394 -1269559 -1257897 -1261501 -1230940 -1262920 -1297799 -1398660 -1389492 -1370177 -1333417 -1271930
2084a271930m0449p2905j09876Q9692J23390O1658J02910q8227L1149p8100j7058
$$ -1271930 -1312379 -1385284 -1495160 -1405468 -1282078 -1220420 -1117510 -1205737 -1174588 -1252688 -1269746
2073a269746O8326l5602J5307j8496J6736l1632q4851r0106K9025J60215p4506
$$ -1269746 -1201420 -1237022 -1221715 -1240211 -1223475 -1255107 -1339958 -1430064 -1401039 -1240824 -1315330
2062a315330q0662J12249P6330j44538K325J53950J07209l808j44784n0430N3419
$$ -1315330 -1395992 -1283743 -1207413 -1351951 -1349626 -1195676 -1088467 -1092275 -1237059 -1287489 -1234070
2051a234070O9201j25380O4343P2082Q9670j31781j37206K31823l5310j66282
$$ -1234070 -1164869 -1290249 -1225906 -1153824 -1064154 -1195935 -1333141 -1101318 -1136628 -1302910
2041a302910N7540p1157J2358M4642J40157n8820j78680j47139j6594K2870K11392
$$ -1302910 -1245370 -1316527 -1304169 -1259527 -1119370 -1178190 -1356870 -1504009 -1520603 -1497733 -1286341
2030a286341J15404j6263L1626j05540J2253n6378J7278J30474O9103p8647k3140
$$ -1286341 -1170937 -1187200 -1155574 -1261114 -1248861 -1305239 -1287961 -1157487 -1088384 -1167031 -1190171
2019a190171R9605p7816P0133J0254k8425k2252K7514p7540L4052O8725L8178
$$ -1190171 -1090566 -1168382 -1098249 -1087995 -1116420 -1138672 -1111158 -1188698 -1154646 -1085921 -1047743
2008a047743p4818j19751j45698p3241p9395J79757R8897Q8655J50313o2987p2169
$$ -1047743 -1122561 -1242312 -1388010 -1461251 -1540646 -1360889 -1261992 -1173337 -1023024 -1086011 -1158180
1997a158180J7026j26508j25767O6159R919l3687m3884q5259Q8200q0176r2189
$$ -1158180 -1141154 -1267662 -1393429 -1327270 -1317351 -1351038 -1394922 -1480181 -1391981 -1472157 -1564346
1986a564346J53329J27232j1029p2025O9391o8330n983R2199j9948Q713N6302
$$ -1564346 -1411017 -1283785 -1294814 -1366839 -1297448 -1365778 -1371761 -1279562 -1299510 -1290797 -1234495
1975a234495l7425n6017l2630j0486L2788m8177P3194L5089j9860q2597K0122
$$ -1234495 -1271920 -1327937 -1360567 -1371053 -1338265 -1386442 -1313248 -1278159 -1298019 -1380616 -1360494
1964a360494P5520o0999J9238j04517j27375M3769J99640j22338L4142J55050
$$ -1360494 -1284974 -1345973 -1326735 -1431252 -1558627 -1514858 -1315218 -1437556 -1403414 -1248364
1954a248364k1563M571P0468k8229J03840J5690j13151l7933J2118l3873Q6237
$$ -1248364 -1269927 -1265356 -1194888 -1223117 -1119277 -1103587 -1216738 -1254671 -1242553 -1276426 -1190189
1943a190189J0108k0222k956j5839j57440n4924J34901O0362o8356m8892N5763
$$ -1190189 -1180081 -1200303 -1203259 -1219098 -1376538 -1431462 -1296561 -1236199 -1304555 -1353447 -1297684
1932a297684O9000J1776o2984l0602N4713m5620K256j592J28007p2700o1246J39367
$$ -1297684 -1228684 -1216908 -1279892 -1310494 -1255781 -1301401 -1299145 -1300737 -1172730 -1245430 -1306676 -1167309
1920a167309l6853j24418J17118K3436l4018r6667r7886R4868P6541N6762k4964
$$ -1167309 -1204162 -1328580 -1211462 -1188026 -1222044 -1318711 -1416597 -1321729 -1245188 -1188426 -1213390
1909a213390j36263j32455J02642L4935N7349k1549j3236L0730J20140j05956
$$ -1213390 -1349653 -1482108 -1379466 -1344531 -1287182 -1308731 -1321967 -1291237 -1171097 -1277053
1899a277053J1935k0191k0287M6098j1518J6089l7116J27634m3977K7983N0526
$$ -1277053 -1265118 -1285309 -1305596 -1259498 -1271016 -1254927 -1292043 -1164409 -1208386 -1180403 -1129877
1888a129877M0276j09570o8083n7395J28888O5529j61539k1924l9819P861N0194
$$ -1129877 -1089601 -1199171 -1267254 -1324649 -1195761 -1130232 -1291771 -1313695 -1353514 -1345653 -1295459
1877a295459k0094j05576k0855m6495O6875J13561J05716O3657j25057q7901j2478
$$ -1295459 -1315553 -1421129 -1441984 -1488479 -1421604 -1308043 -1202327 -1138670 -1263727 -1351628 -1364106
1866a364106J9109J7418J76680m764q8953j9900l0746O0989L1593o7609Q9446
$$ -1364106 -1344997 -1327579 -1150899 -1155663 -1244616 -1264516 -1295262 -1234273 -1202680 -1270289 -1180843
1855a180843O2332k264j37240r0235Q6544k7921K8938l7071M0322j74287R7924
$$ -1180843 -1118511 -1120775 -1258015 -1348250 -1261706 -1289627 -1260689 -1297760 -1257438 -1431725 -1333801
1844a333801Q6614l1613j0834Q9537J41919j48177o1463L3150J6165K9779N2497
$$ -1333801 -1247187 -1278800 -1289634 -1200097 -1058178 -1206355 -1267818 -1234668 -1218503 -1188724 -1136227
1833a136227q4279K88J29129o6612K7416n517n6446k0036l2982j6664Q4302n0316
$$ -1136227 -1220506 -1220218 -1091089 -1157701 -1130285 -1135802 -1192248 -1212284 -1245266 -1261930 -1177628 -1227944
1821a227944M7527L6961P0131j18731j01247J7588J3967j383p2419l4312L1414
$$ -1227944 -1180417 -1143456 -1073325 -1192056 -1293303 -1275715 -1261748 -1263131 -1335550 -1369862 -1338448
1810a338448J7614p9374m9649J54815P7160L688M2060o1164n0821n3449J12372
$$ -1338448 -1320834 -1400208 -1449857 -1295042 -1217882 -1214194 -1172134 -1233298 -1284119 -1337568 -1225196
1799a225196J2743P5575K7686J2117j59828J8549K6332q600M3064n2239N1476
$$ -1225196 -1212453 -1136878 -1109192 -1097075 -1256903 -1238354 -1212022 -1220622 -1177558 -1229797 -1178321
1788a178321O6302n6518p5976k02193O9466J9577K9254k5444J15961J18143k5032
$$ -1178321 -1112019 -1168537 -1244513 -1446706 -1377240 -1357663 -1328409 -1353853 -1237892 -1119749 -1144781
1777a144781N2648p7640k3438j44728N1371k6318l8146L5055J8243m1777J92093
$$ -1144781 -1092133 -1169773 -1193211 -1337939 -1286568 -1312886 -1351032 -1315977 -1297734 -1339511 -1147418
1766a147418j03109q9031n6948K6585o518J32136J12174m9961k4285J3264R7174
$$ -1147418 -1250527 -1339558 -1396506 -1369921 -1376439 -1244303 -1132129 -1182090 -1206375 -1193111 -1095937
1755a095937o6386j8388j47467p9540O2154J26885j33008k05774K59325J06049
$$ -1095937 -1162323 -1180711 -1328178 -1407718 -1345564 -1218679 -1351687 -1557461 -1298136 -1192087
1745a192087n5854O2997p5241m43n1495Q2813P4351O4350L2602k86431j09022
$$ -1192087 -1247941 -1184944 -1260185 -1260628 -1312123 -1229310 -1154959 -1090609 -1058007 -1344438 -1453460
1734a453460J90569Q9932M7407k51523Q3916R3165n8214M4246J69724R0522k11979
$$ -1453460 -1262891 -1172959 -1125552 -1377075 -1293159 -1199994 -1258208 -1213962 -1044238 -953716 -1165695
1723a165695n7638L9070R9333K5805q9257P850o1372j14389P9872Q4207n6990
$$ -1165695 -1223333 -1184263 -1084930 -1059125 -1148382 -1140532 -1201904 -1316293 -1236421 -1152214 -1209204
1712a209204p1084J8661Q7151n1236j20742N0616P6996K4239k8169M5278L7422
$$ -1209204 -1280288 -1261627 -1174476 -1225712 -1346454 -1295838 -1218842 -1194603 -1222772 -1177494 -1140072
1701a140072o6169k2173N3379j57070J66263n8260P1230L6838n4277K9343j68367
$$ -1140072 -1206241 -1228414 -1175035 -1332105 -1165842 -1224102 -1152872 -1116034 -1170311 -1140968 -1309335
1690a309335l8279k9522Q1101J27311L8516r2577l6075P7692Q8391o6237j64137
$$ -1309335 -1347614 -1377136 -1296035 -1168724 -1130208 -1222785 -1258860 -1181168 -1092777 -1159014 -1323151
1679a323151J07087k7779Q3093N0101j87632M0987p7356N2512J8982q4997r6329
$$ -1323151 -1216064 -1243843 -1160750 -1110649 -1298281 -1257294 -1334650 -1282138 -1263156 -1348153 -1444482
1668a444482J07388r2451J15670J15437M7395J6445j17152l7915J80352m1695
$$ -1444482 -1337094 -1429545 -1313875 -1198438 -1151043 -1134598 -1251750 -1289665 -1109313 -1151008
1658a151008j01982K3049O0696J31776m736j42360k700j2556j42591R7342J26625
$$ -1151008 -1252990 -1229941 -1169245 -1037469 -1042205 -1184565 -1187265 -1199821 -1342412 -1245070 -1118445
1647a118445P7702o3325L1048P098j9978l398j17111K9596L2120L1204o3724p5540
$$ -1118445 -1040743 -1104068 -1073020 -1065922 -1085900 -1089298 -1206409 -1176813 -1144693 -1113489 -1177213 -1252753
1635a252753J62541K6835l2344m6437m8288R3273O914j48582M256r5132r321R5543
$$ -1252753 -1090212 -1063377 -1095721 -1142158 -1190446 -1097173 -1090259 -1238841 -1234585 -1329717 -1339038 -1243495
1623a243495L6000J09246j38227j7801o7236Q377J03233k7611o6957p690J23974
$$ -1243495 -1207495 -1098249 -1236476 -1254277 -1321513 -1313136 -1209903 -1237514 -1304471 -1312161 -1188187
1612a188187M7159m7196R643J02059l1285l8029j8669j28222k3056P0826J12716
$$ -1188187 -1141028 -1188224 -1178581 -1076522 -1107807 -1145836 -1164505 -1292727 -1315783 -1244957 -1132241
1601a132241m6317j81123J07726k8910O266o7519J8330J1924J6019J03267o4584
$$ -1132241 -1178558 -1359681 -1251955 -1280865 -1274599 -1342118 -1323788 -1311864 -1295845 -1192578 -1257162
1590a257162O5299K4359k04144J14522J17058k6958j8473P349n5226j27151p4818
$$ -1257162 -1191863 -1167504 -1371648 -1257126 -1140068 -1167026 -1185499 -1178150 -1233376 -1360527 -1435345
1579a435345J10491N4254j1925L3294j05587j6025K37762R6459o0701k7960o5182
$$ -1435345 -1324854 -1270600 -1282525 -1249231 -1354818 -1370843 -1133081 -1036622 -1097323 -1125283 -1190465
1568a190465K2018J40311N7340j42182m3117N5803j72103Q0148L8753o3318j4757
$$ -1190465 -1168447 -1028136 -970796 -1112978 -1156095 -1100292 -1272395 -1192247 -1153494 -1216812 -1231569
1557a231569q8148J57289l6024m2826J0952J06640J04728j88802q3000J81901
$$ -1231569 -1319717 -1162428 -1198452 -1241278 -1230326 -1123686 -1018958 -1207760 -1290760 -1108859
1547a108859Q4028P9036l7749j61113J2039l8461j90905K4284l9588M4456J66413
$$ -1108859 -1024831 -945795 -983544 -1144657 -1132618 -1171079 -1361984 -1337700 -1377288 -1332832 -1166419
1536a166419K6348l2847j3296N972K27187J947j04937p4934K6438J09789K182
$$ -1166419 -1140071 -1172918 -1186214 -1180242 -953055 -951108 -1056045 -1130979 -1104541 -994752 -992570
1525i92570j21102m6396N5223N314k02750n5288K05147n7267M624l8082J59029
$$ -992570 -1113672 -1160068 -1104845 -1099531 -1302281 -1357569 -1152422 -1209689 -1205065 -1243147 -1084118
1514a084118o5008n7314R5580l0335o4233R0103q7221m9349O7118l5680J86873
$$ -1084118 -1149126 -1206440 -1110860 -1141195 -1205428 -1115325 -1202546 -1251895 -1184777 -1220457 -1033584
1503a033584J8753j70593n5893Q6294m6472r929J28301k6451K199P4765J81966
$$ -1033584 -1014831 -1185424 -1241317 -1155023 -1201495 -1211424 -1083123 -1109574 -1107375 -1032610 -850644
1492h50644o3534j97529j37002R5702M1339n8603J20853m137J8929l0246j69017
$$ -850644 -914178 -1111707 -1248709 -1153007 -1111668 -1170271 -1049418 -1053555 -1034626 -1064872 -1233889
1481a233889o3087J20417L4134K1883k2634J02806j01122j09925J23644N347j23422
$$ -1233889 -1296976 -1176559 -1142425 -1120542 -1143176 -1040370 -1141492 -1251417 -1127773 -1122426 -1245848
1470a245848P0349j5728O2989J56073l2673q6185j8613K1945j8513m0775k2312
$$ -1245848 -1175499 -1191227 -1128238 -972165 -1004838 -1091023 -1109636 -1087691 -1106204 -1146979 -1169291
1459a169291m9408J3591N9767K3032n8326p2140J08305M38O1733l0149P4565j10271
$$ -1169291 -1218699 -1205108 -1145341 -1122309 -1180635 -1252775 -1144470 -1144032 -1082299 -1112448 -1037883 -1148154
1447a148154M8112Q9932k8541m250p1679L9643m8935l5552k370J24233p3103O338
$$ -1148154 -1100042 -1010110 -1038651 -1042901 -1114580 -1074937 -1123872 -1159424 -1161794 -1037561 -1110664 -1104326
1435a104326Q2435j60842L9824l0541j39783L0491N4457J4404l2522M1161M6338
$$ -1104326 -1021891 -1182733 -1142909 -1173450 -1313233 -1282742 -1228285 -1213881 -1246403 -1205242 -1158904
1424a158904L5157J21039J9791j54205N8103J03006k1024j0616j37602q4006J12681
$$ -1158904 -1123747 -1002708 -982917 -1137122 -1079019 -976013 -997037 -1007653 -1145255 -1229261 -1116580
1413a116580J0682L8708j21378P2883p7509n3452J60344j1071M0533j5352j0192
$$ -1116580 -1105898 -1067190 -1188568 -1115685 -1193194 -1246646 -1086302 -1097373 -1056840 -1072192 -1082384
1402a082384j19136j5776K27178q9081j03782m7091k8450j3591J18522L7267n4981
$$ -1082384 -1201520 -1217296 -990118 -1079199 -1182981 -1230072 -1258522 -1272113 -1153591 -1116324 -1171305
1391a171305M337N545j0537R368N8357l5144M109O513j4986K1981M1133j402q5592
$$ -1171305 -1166968 -1161423 -1171960 -1162592 -1104235 -1139379 -1135270 -1128757 -1143743 -1121762 -1080629 -1082031 -1167623
1378a167623j6665J7049l3332P531K7670J33518m91J2304m4258j20404l7415J9708
$$ -1167623 -1184288 -1167239 -1200571 -1193040 -1165370 -1031852 -1032343 -1020039 -1064297 -1184701 -1222116 -1202408
1366a202408R2045l8846j39388Q4830M9343K7672m6556R8259P1918j16983J6947
$$ -1202408 -1110363 -1149209 -1288597 -1203767 -1154424 -1126752 -1173308 -1075049 -1003131 -1120114 -1103167
1355a103167K4711j2218M7570o4470J4248l8003l2806j0327L6993l7847o2696
$$ -1103167 -1078456 -1090674 -1043104 -1107574 -1093326 -1131329 -1164135 -1174462 -1137469 -1175316 -1238012
1344a238012r3113J56676J8139M1328K9798P6722K0021j20349j59535q2639J71958
$$ -1238012 -1331125 -1174449 -1156310 -1114982 -1085184 -1008462 -988441 -1108790 -1268325 -1350964 -1179006
1333a179006Q3735k4155q026K055j8537O931k2453J29896j75653p8558o2405q1369
$$ -1179006 -1095271 -1119426 -1127452 -1125397 -1143934 -1137003 -1159456 -1029560 -1205213 -1283771 -1346176 -1427545
1321a427545P3490J81095N838p0180J00221J17092N1468j55440J8162n1960j24985
$$ -1427545 -1354055 -1172960 -1167122 -1237302 -1137081 -1019989 -968521 -1123961 -1105799 -1157759 -1282744
1310a282744J52803L8458m1796L384K8260L4026m975J07907j11467j69195j25521
$$ -1282744 -1129941 -1091483 -1133279 -1129895 -1101635 -1067609 -1072584 -964677 -1076144 -1245339 -1370860
1299a370860R8226J47447K2094J63570L6261k1475k5669j13279j39817Q9506R553
$$ -1370860 -1272634 -1125187 -1103093 -939523 -903262 -924737 -950406 -1063685 -1203502 -1113996 -1104443
1288a104443m8440M0188N1518J1258o1924o5757J65287j06579j09910m9855P0931
$$ -1104443 -1152883 -1112695 -1061177 -1049919 -1111843 -1177600 -1012313 -1118892 -1228802 -1278657 -1207726
1277a207726p4033J24368J4863o5611J02869O1818k4656j18680O457R755j37569
$$ -1207726 -1281759 -1157391 -1142528 -1208139 -1105270 -1043452 -1068108 -1186788 -1180331 -1170576 -1308145
1266a308145J05358J51352n0693k1702j17851N1585M8212l3899P893L7222N7648
$$ -1308145 -1202787 -1051435 -1102128 -1123830 -1241681 -1190096 -1141884 -1175783 -1167890 -1130668 -1073020
1255a073020q4658j59966K07261k9370L4922N8872j37831L2122R1341l0688l9138
$$ -1073020 -1157678 -1317644 -1110383 -1139753 -1104831 -1045959 -1183790 -1151668 -1060327 -1091015 -1130153
1244a130153L9096J9507O3511j24758j37158Q7140L4740p6925J24699K6937m3143
$$ -1130153 -1091057 -1071550 -1008039 -1132797 -1269955 -1182815 -1148075 -1225000 -1100301 -1073364 -1116507
1233a116507L1890M6764m2644J850o4995j18617Q381n9152K5704M8840O5676p7077
$$ -1116507 -1084617 -1037853 -1080497 -1078647 -1143642 -1262259 -1253878 -1313030 -1287326 -1238486 -1172810 -1249887
1221a249887k3550J5914J17930M9518q0987l102P2934q1666J6114J31018N6376
$$ -1249887 -1273437 -1257523 -1139593 -1090075 -1171062 -1174164 -1101230 -1182896 -1166782 -1035764 -979388
1210i79388n7372M6450M1842k7733p3444J10386K4977j15836o2683K6648L4843
$$ -979388 -1036760 -990310 -948468 -976201 -1049645 -939259 -914282 -1030118 -1092801 -1066153 -1031310
1199a031310j08847n4884J55622R2668l3625k09277O8854K7104j01317m0436O6291
$$ -1031310 -1140157 -1195041 -1039419 -946751 -980376 -1189653 -1120799 -1093695 -1195012 -1235448 -1169157
1188a169157m6369o2869Q3584m4237j3219j6089J13452K172N290J17382m6255
$$ -1169157 -1215526 -1278395 -1194811 -1239048 -1252267 -1268356 -1154904 -1152732 -1147442 -1030060 -1076315
1177a076315q5087q4172R4361q85j00003K5745J13101R2795j52101J09723N5631
$$ -1076315 -1161402 -1245574 -1151213 -1152098 -1252101 -1226356 -1113255 -1020460 -1172561 -1062838 -1007207
1166a007207L493p2488J0401J8055j3134J18028k1176q9404n4338m0382l4066
$$ -1007207 -1003714 -1076202 -1065801 -1047746 -1060880 -942852 -964028 -1053432 -1107770 -1148152 -1182218
1155a182218J6913K19138j64524n8401M5908K2974Q491M8870p1629l8153K5057
$$ -1182218 -1165305 -946167 -1110691 -1169092 -1123184 -1100210 -1091719 -1042849 -1114478 -1152631 -1127574
1144a127574o3852j0262J89781q4815j15996r554L0384L5335J14466m9005j31090
$$ -1127574 -1191426 -1201688 -1011907 -1096722 -1212718 -1222272 -1191888 -1156553 -1042087 -1091092 -1222182
1133a222182Q1693J33928p5218j12186Q5932K5435j4476k4524J47516K0324N3293
$$ -1222182 -1140489 -1006561 -1081779 -1193965 -1108033 -1082598 -1097074 -1121598 -974082 -953758 -900465
1122i00465r9259k07215R2997J8039j0149O9831K0921o1899q6180l591J9427J25338
$$ -900465 -999724 -1206939 -1113942 -1095903 -1106052 -1036221 -1015300 -1077199 -1163379 -1166970 -1147543 -1022205
1110a022205j46364P2885O1880r1609P8650m330k9430J01307m7048r8524q938
$$ -1022205 -1168569 -1095684 -1033804 -1125413 -1046763 -1051093 -1080523 -979216 -1026264 -1124788 -1133726
1099a133726N6777N1540P744r8221K4132Q1754j54542O7267J3222n6549k2247
$$ -1133726 -1076949 -1025409 -1017665 -1115886 -1091754 -1010000 -1164542 -1097275 -1084053 -1140602 -1162849
1088a162849M7407J35760j39827k07863J02387J26030K5738j3890n6064J47216
$$ -1162849 -1115442 -979682 -1119509 -1327372 -1224985 -1098955 -1073217 -1087107 -1143171 -995955
1078i95955O9027o3704J1896R656j03407k2479M4907l4162q0958N1764q8975o1434
$$ -995955 -926928 -990632 -978736 -969080 -1072487 -1094966 -1050059 -1084221 -1165179 -1113415 -1202390 -1263824
1066a263824J87020L8901j0354K2487j55341O7867n6971m7172J73435K9416j13230
$$ -1263824 -1076804 -1037903 -1048257 -1025770 -1181111 -1113244 -1170215 -1217387 -1043952 -1014536 -1127766
1055a127766J8606q9125j8031L7661J5002N5075J8856N5040M82N3982j02694N5127
$$ -1127766 -1109160 -1198285 -1216316 -1178655 -1163653 -1108578 -1089722 -1034682 -1034200 -980218 -1082912 -1027785
1043a027785N0139j19586N2561K2641n5606N4049l275K7083j02138j25501Q9183
$$ -1027785 -977646 -1097232 -1044671 -1022030 -1077636 -1023587 -1026862 -999779 -1101917 -1227418 -1138235
1032a138235L0727O056K2577P0330j3995n9816J6370k6556j1729M7086P0537l2060
$$ -1138235 -1107508 -1101452 -1078875 -1008545 -1022540 -1082356 -1065986 -1092542 -1104271 -1057185 -986648 -1018708
1020a018708j09615K5624J05661j9202q708m7686p3499R8854O7370J7035J72868
$$ -1018708 -1128323 -1102699 -997038 -1016240 -1024948 -1072634 -1146133 -1047279 -979909 -962874 -790006
1009g90006M532k09854O5237q4375o9701L4383L61L5147N1844j53o904j47082
$$ -790006 -785474 -995328 -930091 -1014466 -1084167 -1049784 -1049423 -1014276 -962432 -962585 -969489 -1116571
997a116571M8261q351p629m01j28674R4623J3412N7218J06661N4183n6124p8674
$$ -1116571 -1068310 -1076661 -1084290 -1084691 -1213365 -1118742 -1105330 -1048112 -941451 -887268 -943392 -1022066
985a022066j56640R3435k6009j51538O1128P7096P7181o6701P0964l9332p5196
$$ -1022066 -1178706 -1085271 -1111280 -1262818 -1201690 -1124594 -1047413 -1114114 -1043150 -1082482 -1157678
974a157678Q0341k2105L1955M7264K9824k1656K1174r0692k2957Q6455p2803N4180
$$ -1157678 -1077337 -1099442 -1067487 -1020223 -990399 -1012055 -990881 -1081573 -1104530 -1018075 -1090878 -1036698
962a036698M268j06166J12406o7344J37226n8745P9577J6980p1760p4029l8816
$$ -1036698 -1032430 -1138596 -1026190 -1093534 -956308 -1015053 -935476 -918496 -990256 -1064285 -1103101
951a103101J12808K7334o1900n7287O0783k1634q1666J42840k31489N9006J04950
$$ -1103101 -990293 -962959 -1024859 -1082146 -1021363 -1042997 -1124663 -981823 -1213312 -1154306 -1049356
940a049356l3043J38773l9195M7631L6919L7697j22901p7203j9391O3470Q4901
$$ -1049356 -1082399 -943626 -982821 -935190 -898271 -860574 -983475 -1060678 -1080069 -1016599 -931698
929i31698L0901l7051j22414R7389p3566P844Q6012j4267j26109k7029Q2785M5072
$$ -931698 -900797 -937848 -1060262 -962873 -1036439 -1028595 -942583 -956850 -1082959 -1109988 -1027203 -982131
917i82131L8430j13209J06211L4399q881r193Q9741j2416j13863o3523Q982j1320
$$ -982131 -943701 -1056910 -950699 -916300 -925181 -934374 -844633 -857049 -970912 -1034435 -1025453 -1036773
905a036773q1297O5456R1927k0377J15706j01139r7074p546L596p955J5800j5354
$$ -1036773 -1118070 -1052614 -960687 -981064 -865358 -966497 -1063571 -1071117 -1067521 -1075476 -1059676 -1075030
893a075030O9420o4636M7769J2818j19026m6025J30491M4010J495n9607l2467
$$ -1075030 -1005610 -1070246 -1022477 -1009659 -1128685 -1174710 -1044219 -1000209 -998714 -1058321 -1090788
882a090788k6132P1202M9369P612M9815J2922j10346K321J7542q931k8049j35728
$$ -1090788 -1116920 -1045718 -996349 -988737 -938922 -926000 -1036346 -1034025 -1016483 -1025414 -1053463 -1189191
870a189191M1411J15802L3201r989r575m7445k7230J0897j7948L920J23005m278
$$ -1189191 -1147780 -1031978 -998777 -1008766 -1018341 -1065786 -1093016 -1082119 -1100067 -1096147 -973142 -977420
858i77420q3672m3609m2140N8007N5454j04704k574Q5269J08209q0130n9127R4675
$$ -977420 -1061092 -1104701 -1146841 -1088834 -1033380 -1138084 -1140658 -1055389 -947180 -1027310 -1086437 -991762
846i91762O2357n2131j685p4311R6925k3752q7528j31296k1830l6477K9225K04127
$$ -991762 -929405 -981536 -983221 -1057532 -960607 -984359 -1071887 -1203183 -1225013 -1261490 -1232265 -1028138
834a028138K0356o0372p3565N5455J37537L2303j32670j59555N7610J11204j52946
$$ -1028138 -1007782 -1068154 -1141719 -1086264 -948727 -916424 -1049094 -1208649 -1151039 -1039835 -1192781
823a192781j2888K22329Q8024q2967J60083p6615j34708k4528J31034M5959j38622
$$ -1192781 -1205669 -983340 -895316 -978283 -818200 -894815 -1029523 -1054051 -923017 -877058 -1015680
812a015680L410j52641O1124J47536O0088m9931j17112J37471k0340l2198P6004
$$ -1015680 -1012270 -1164911 -1103787 -956251 -896163 -946094 -1063206 -925735 -946075 -978273 -902269
801i02269j2340J1802R457J10632l1508j34297k6160l7369l2931R5884m4846N4152
$$ -902269 -914609 -902807 -893350 -782718 -814226 -948523 -974683 -1012052 -1044983 -949099 -993945 -939793
789i39793J09451p8118r9161p8490N1484P9998n0218l7393J9625J9577K9617j22693
$$ -939793 -830342 -908460 -1007621 -1086111 -1034627 -954629 -1004847 -1042240 -1022615 -1003038 -973421 -1096114
777a096114j22088J12564L7569m581O0313k8739j3997n2243M778J8617m2755o0736
$$ -1096114 -1218202 -1105638 -1068069 -1072650 -1012337 -1041076 -1055073 -1107316 -1102538 -1083921 -1126676 -1187412
765a187412Q1329J50278p878q4155n4756P4661p2585J7151J9156l5909j8526N1308
$$ -1187412 -1106083 -955805 -963683 -1047838 -1102594 -1027933 -1100518 -1083367 -1064211 -1100120 -1118646 -1067338
753a067338P5050J1529n8451Q0451M3457j29136k8918m2990j6123J64266J23091
$$ -1067338 -992288 -980759 -1039210 -958759 -915302 -1044438 -1073356 -1116346 -1132469 -968203 -845112
742h45112j20606k25628R1884R8811j64970O4883M2547N9889K7089k8312r9320
$$ -845112 -965718 -1191346 -1099462 -1000651 -1165621 -1100738 -1058191 -998302 -971213 -999525 -1098845
731a098845o7163R3151j9379K30302Q6610j66547j57625p2573L0483R392J08920
$$ -1098845 -1166008 -1072857 -1092236 -861934 -775324 -941871 -1099496 -1172069 -1141586 -1132194 -1023274
720a023274J72621J5055j5374j51223p8998J00925J4296o1204r670O1038J43139
$$ -1023274 -850653 -835598 -850972 -1002195 -1081193 -980268 -965972 -1027176 -1036846 -975808 -832669
709h32669k4289o5870j05549o1768J07608Q937L0436N9043j5727j41552N1486
$$ -832669 -856958 -922828 -1028377 -1090145 -982537 -973600 -943164 -884121 -899848 -1041400 -989914
698i89914k4335L5544R037K3547J683M1410N7583p3339K0483j5897k9408J5265
$$ -989914 -1014249 -978705 -969668 -946121 -944438 -903028 -845445 -918784 -898301 -914198 -943606 -928341
686i28341j44933o6223J0873L578Q8269L1232j8392K5252L0466L8622k4304M9271
$$ -928341 -1073274 -1139497 -1128624 -1125046 -1036777 -1005545 -1023937 -998685 -968219 -929597 -953901 -904630
674i04630j87580P6555k3903J58853p0138j84051m4716l0176J545J32283P2772
$$ -904630 -1092210 -1015655 -1039558 -880705 -950843 -1134894 -1179610 -1209786 -1208241 -1075958 -1003186
663a003186j08238P1131L9070R0012o4178L9364R3387K8240n0379l0154K1700
$$ -1003186 -1111424 -1040293 -1001223 -911211 -975389 -936025 -842638 -814398 -864777 -894931 -873231
652h73231K9926r0154l9204L7090j2584K3719R185o2950N4388q7915J45992k3792
$$ -873231 -843305 -933459 -972663 -935573 -948157 -924438 -915253 -978203 -923815 -1011730 -865738 -889530
640h89530j13132n161j02j03123N5722O5476M9526k6258j76773P3783q8700J1684
$$ -889530 -1002662 -1007823 -1007925 -1111048 -1055326 -989850 -940324 -966582 -1143355 -1069572 -1158272 -1146588
628a146588J05995J6985R8801n6960k2946O5298M3392q9294N2722n4754r8215
$$ -1146588 -1040593 -1023608 -924807 -981767 -1004713 -939415 -896023 -985317 -932595 -987349 -1085564
617a085564O9729J4600L0099p4377L5140j5250K9964P9932m0984j13780O8056
$$ -1085564 -1015835 -1001235 -971136 -1045513 -1010373 -1025623 -995659 -915727 -956711 -1070491 -1002435
606a002435J07082p4834q8201m1248P4890N8804Q8391k7050j24117j28784P7396
$$ -1002435 -895353 -970187 -1058388 -1099636 -1024746 -965942 -877551 -904601 -1028718 -1157502 -1080106
595a080106l3106J16944m0434l5486J33795K552n7146j37343J26442J08298k1609
$$ -1080106 -1113212 -996268 -1036702 -1072188 -938393 -935841 -992987 -1130330 -1003888 -895590 -917199
584i17199J8966q8512j66146m9672J69282l735m0849L7934J65502k0029k9666
$$ -917199 -898233 -986745 -1152891 -1202563 -1033281 -1037016 -1077865 -1039931 -874429 -894458 -924124
573i24124N6924j23845K110p1534L2358M1536q5330J18593l0925k1419N9501n9595
$$ -924124 -867200 -991045 -988935 -1060469 -1028111 -986575 -1071905 -953312 -984237 -1005656 -946155 -1005750
561a005750L3992j11576k64k8224K8527Q2397J02228n6946l3347k5141J37806
$$ -1005750 -971758 -1083334 -1083598 -1111822 -1083295 -1000898 -898670 -955616 -988963 -1014104 -876298
550h76298l2546q8567j46884J28160o7368j12358K3224M9448L0063n0369J19519
$$ -876298 -908844 -997411 -1144295 -1016135 -1083503 -1195861 -1172637 -1123189 -1093126 -1143495 -1023976
539a023976N0583O4141o1078j5828m3799l2086N4191Q2375n4185L3580J26824
$$ -1023976 -973393 -909252 -970330 -986158 -1029957 -1062043 -1007852 -925477 -979662 -946082 -819258
528h19258k89591l1890J04453J56153j38934p4844J1836n372R8949o1931K557
$$ -819258 -1108849 -1140739 -1036286 -880133 -1019067 -1093911 -1082075 -1087447 -988498 -1050429 -1047872
517a047872M4752M8025P294o9763n6264J14504l212L7528o6481q3643J06232J8644
$$ -1047872 -1003120 -955095 -947801 -1017564 -1073828 -959324 -962536 -925008 -991489 -1075132 -968900 -950256
$$ [...]
##END NTUPLES=NMR SPECTRUM
##END=
