##TITLE=1H_DE-80H_X3
 200.13MHz, d2o
 8 sc
 
 19ns.26.2.2025
##JCAMPDX= 6.0         $$ Bruker NMR JCAMP-DX V2.0
##DATA TYPE= NMR SPECTRUM
##DATA CLASS= NTUPLES
##ORIGIN= UXNMR, Bruker Analytische Messtechnik GmbH
##OWNER= pz
$$ XWIN-NMR		Version 3.5
$$ Thu Jul 10 10:16:15 2025 Russian Standard Time (UT+4h)  Yarkov@DPX200
##.OBSERVE FREQUENCY= 200.1313
##.OBSERVE NUCLEUS= ^1H
##.ACQUISITION MODE= SIMULTANEOUS
##.ACQUISITION SCHEME= undefined
##.AVERAGES= 8
##.DIGITISER RES= 18
##SPECTROMETER/DATA SYSTEM= spect
##.PULSE SEQUENCE= zg30
##.SOLVENT NAME= CDCl3
##.SHIFT REFERENCE= (INTERNAL, CDCl3, 0, 15.5045)
##AUDIT TRAIL= $$ (NUMBER, WHEN, WHO, WHERE, WHAT)
$$ ##TITLE= Audit trail, XWIN-NMR		Version 3.5
$$ ##JCAMPDX= 5.01
$$ ##ORIGIN= Bruker BioSpin GmbH
$$ ##OWNER= Yarkov
$$ C:/Bruker/XWIN-NMR/data/yarkov2/nmr/H-C/1/pdata/1/auditp.txt
$$ ##AUDIT TRAIL=  $$ (NUMBER, WHEN, WHO, WHERE, WHAT)
(   1,<2025-07-10 10:14:58.01 +0400>,<Yarkov>,<DPX200>,
      <created by zg, POWCHK disabled, PULCHK disabled
       configuration hash MD5:
       00 E9 B6 7A A2 85 ED C7 34 08 36 98 17 FE 4E 26
       data hash MD5: 16K
       D0 51 0A 60 E3 C6 B2 A9 2B 81 80 DA 17 6D 83 8B>)
(   2,<2025-07-10 10:15:15.26 +0400>,<Yarkov>,<DPX200>,
      <Start of raw data processing
       efp BC_mod = 2 LB = 0.25 FT_mod = 6 PKNL = 1 PHC0 = -1356.506 PHC1 = 5.990923 SI = 16K 
       data hash MD5: 16K
       7A 5C 26 72 39 5C C2 12 3C 5C 0D 16 1F FD 89 64>)
(   3,<2025-07-10 10:15:19.45 +0400>,<Yarkov>,<DPX200>,
      <abs ABSG = 5 
       data hash MD5: 16K
       E6 B8 2B 0C 53 05 83 9A 43 9A C4 5C 49 3C 40 D3>)
$$ ##END=
$$ 
$$ hash MD5
$$ 0D 88 CB C4 17 91 37 2F E1 65 A7 FC 08 C5 8E E8
##$RELAX= 
##$RELAX= 
##$RELAX= 
##$RELAX= 
##$RELAX= 
##$RELAX= 
$$ Bruker specific parameters
$$ --------------------------
##$DU= <C:/Bruker/XWIN-NMR>
##$EXPNO= 1
##$NAME= <H-C>
##$PROCNO= 1
##$TYPE= <nmr>
##$USER= <yarkov2>
##$AMP= (0..31)
100 100 100 100 100 100 100 100 100 100 100 100 100 100 100 100 100 100 
100 100 100 100 100 100 100 100 100 100 100 100 100 100 
##$AQSEQ= 0
##$AQ_mod= 1
##$AUNM= <au_zg>
##$AUTOPOS= <>
##$BF1= 200.13
##$BF2= 200.13
##$BF3= 200.13
##$BF4= 200.13
##$BF5= 200.13
##$BF6= 200.13
##$BF7= 200.13
##$BF8= 200.13
##$BYTORDA= 1
##$CFDGTYP= 0
##$CFRGTYP= 5
##$CHEMSTR= <none>
##$CNST= (0..31)
1 1 145 1 1 1 1 1 1 1 1 1 1 1 1 1 1 1 1 1 1 1 1 1 1 1 1 1 1 1 1 1 
##$CPDPRG= <>
##$CPDPRG1= <>
##$CPDPRG2= <>
##$CPDPRG3= <>
##$CPDPRG4= <mlev>
##$CPDPRG5= <mlev>
##$CPDPRG6= <mlev>
##$CPDPRG7= <mlev>
##$CPDPRG8= <mlev>
##$CPDPRGB= <>
##$CPDPRGT= <>
##$D= (0..31)
0 0.7 0 0 0 0 0 0 0 0 0 0.03 0 0 0 0 0 0 0 0 0 0 0 0 0 0 0 0 0 0 0 0 
##$DATE= 1752128097
##$DBL= (0..7)
120 120 120 120 120 120 120 120 
##$DBP= (0..7)
150 150 150 150 150 150 150 150 
##$DBP07= 0
##$DBPNAM0= <>
##$DBPNAM1= <>
##$DBPNAM2= <>
##$DBPNAM3= <>
##$DBPNAM4= <>
##$DBPNAM5= <>
##$DBPNAM6= <>
##$DBPNAM7= <>
##$DBPOAL= (0..7)
0.5 0.5 0.5 0.5 0.5 0.5 0.5 0.5 
##$DBPOFFS= (0..7)
0 0 0 0 0 0 0 0 
##$DE= 6
$$ [...]
##$SUBNAM3= <"">
##$SUBNAM4= <"">
##$SUBNAM5= <"">
##$SUBNAM6= <"">
##$SUBNAM7= <"">
##$SUBNAM8= <"">
##$SUBNAM9= <"">
##$SW= 18.0517328524113
##$SWIBOX= (0..15)
0 0 2 0 0 0 0 0 0 0 0 0 0 0 0 0 
##$SW_h= 3612.71676300578
##$TD= 16384
##$TD0= 1
##$TE= 0
##$TE2= 300
##$TE3= 300
##$TEG= 300
##$TL= (0..7)
0 120 120 120 120 120 120 120 
##$TP= (0..7)
150 150 150 150 150 150 150 150 
##$TP07= 0
##$TPNAME0= <>
##$TPNAME1= <>
##$TPNAME2= <>
##$TPNAME3= <>
##$TPNAME4= <>
##$TPNAME5= <>
##$TPNAME6= <>
##$TPNAME7= <>
##$TPOAL= (0..7)
0.5 0.5 0.5 0.5 0.5 0.5 0.5 0.5 
##$TPOFFS= (0..7)
0 0 0 0 0 0 0 0 
##$TUNHIN= 0
##$TUNHOUT= 0
##$TUNXOUT= 0
##$USERA1= <user>
##$USERA2= <user>
##$USERA3= <user>
##$USERA4= <user>
##$USERA5= <user>
##$V9= 5
##$VALIST= <valist>
##$VCLIST= <CCCCCCCCCCCCCCC>
##$VD= 0
##$VDLIST= <DDDDDDDDDDDDDDD>
##$VPLIST= <PPPPPPPPPPPPPPP>
##$VTLIST= <TTTTTTTTTTTTTTT>
##$WBST= 1024
##$WBSW= 4
##$XGAIN= (0..3)
0 0 0 0 
##$XL= 0
##$YL= 0
##$YMAX_a= 132230
##$YMIN_a= -104866
##$ZGOPTNS= <>
##$ZL1= 120
##$ZL2= 120
##$ZL3= 120
##$ZL4= 120
##$ABSF1= 15.5045
##$ABSF2= -2.547349
##$ABSG= 5
##$ABSL= 3
##$ALPHA= 0
##$AQORDER= 0
##$ASSFAC= 0
##$ASSFACI= 0
##$ASSFACX= 0
##$ASSWID= 0
##$AUNMP= <proc_1d>
##$AZFE= 0.1
##$AZFW= 0.1
##$BCFW= 0
##$BC_mod= 2
##$BYTORDP= 0
##$COROFFS= 0
##$CY= -3
##$DATMOD= 1
##$DC= 0
##$DFILT= <>
##$DTYPP= 0
##$F1P= 0
##$F2P= 0
##$FCOR= 1
##$FTSIZE= 16384
##$FT_mod= 6
##$GAMMA= 0
##$GB= 0
##$INTBC= 1
##$INTSCL= 3.241238e-09
##$ISEN= 128
##$LB= 0.25
##$LEV0= 0
##$LPBIN= 0
##$MAXI= 10000
##$MC2= 0
##$MEAN= 0
##$ME_mod= 0
##$MI= 1.114404
##$NCOEF= 0
##$NC_proc= -7
##$NLEV= 6
##$NOISF1= 3.799351
##$NOISF2= 2.8
##$NSP= 0
##$NTH_PI= 0
##$NZP= 0
##$OFFSET= 15.5045
##$PC= 1
##$PHC0= -1356.506
##$PHC1= 5.990923
##$PH_mod= 1
##$PKNL= yes
##$PPARMOD= 0
##$PSCAL= 0
##$PSIGN= 0
##$REVERSE= no
##$SF= 200.130003442974
##$SI= 16384
##$SIGF1= 3
##$SIGF2= 2
##$SINO= 0.751879
##$SIOLD= 32768
##$SREGLST= <19F.Aceton>
##$SSB= 0
##$STSI= 16384
##$STSR= 0
##$SW_p= 3612.71676300578
##$SYMM= 0
##$S_DEV= 0
##$TDeff= 16384
##$TDoff= 0
##$TI= <>
##$TILT= no
##$TM1= 0
##$TM2= 0
##$TOPLEV= 0
##$USERP1= <user>
##$USERP2= <user>
##$USERP3= <user>
##$USERP4= <user>
##$USERP5= <user>
##$WDW= 1
##$XDIM= 16384
##$YMAX_p= 293152589
##$YMIN_p= -398833
$$ End of Bruker specific parameters
$$ ---------------------------------
##NTUPLES= NMR SPECTRUM
##VAR_NAME=  FREQUENCY,     SPECTRUM/REAL,   SPECTRUM/IMAG
##SYMBOL=    X,             R,               I
##VAR_TYPE=  INDEPENDENT,   DEPENDENT,       DEPENDENT
##VAR_FORM=  AFFN,          ASDF,            ASDF
##VAR_DIM=   16384,         16384,           16384
##UNITS=     HZ,            ARBITRARY UNITS, ARBITRARY UNITS
##FACTOR=    0.220516191357247, 1,           1
##FIRST=     3102.915716252, 0,              0
##LAST=      -509.801046753782, 0,           0
##MIN=       -509.801046753782, -398833,     0
##MAX=       3102.915716252, 293152589,      0
$$ Real data points
##PAGE= N=1
##DATA TABLE= (X++(R..R)), XYDATA
$$ [...]
$$ plain form
6601 800611 872559 926388 955605 979995 1065376 1111970 1093286 1171597 1096485 1001651 1168568
6590 1168568 1280826 1345515 1306069 1192731 1176415 1368873 1297797 1364653 1460491 1435204 1504481
6579 1504481 1628541 1691317 1676674 1815223 1807876 2017258 1909677 1935075 2187739 2271830 2404163
6568 2404163 2407470 2376546 2422660 2546474 2655661 2751028 2811012 2801587 2871451 2950974 3137387
6557 3137387 3404178 3605850 3819326 3936538 4200563 4407614 4714070 4826433 5095532 5310714
6547 5310714 5528318 6024249 6315476 6694496 7194381 7655979 8030166 8647726 9139781 9706279
6537 9706279 10528232 11367026 12238262 13435656 14520865 15856934 17072814 18828738 20927551
6528 20927551 23060433 25821221 29274382 33378133 37925061 42412313 46037332 48180153
$$ packed form
6601H00611P1948N3829K9217K4390Q5381M6594j8684P8311p5112r4834J66917
6590A168568J12258O4689l9446j13338j6316J92458p1076O6856R5838k5287O9277
6579A504481J24060O2776j4643J38549p347K09382j07581K5398K52664Q4091J32333
6568B404163L307l0924M6114J23814J09187R5367N9984r425O9864P9523J86413
6557C137387K66791K01672K13476J17212K64025K07051L06456J12363K69099K15182
6547E310714K17604M95931K91227L79020M99885M61598L74187O17560M92055N66498
6537I706279Q21953Q38794Q71236J197394J085209J336069J215880J755924K098813
6528B0927551K132882K760788L453161M103751M546928M487252L625019K142821
$$ plain form
6520 48180153 49298443 50866660 53620296 57895027 62824261 66791738 67938218 65912003
6512 65912003 62279556 59075553 57332012 57196871 58085509 58751982 58298267 57015917 55892462
6503 55892462 55887299 56975332 58375138 59111499 58689598 57819084 57730788 59037187 61758400
6494 61758400 65125480 67177104 66169553 61978316 56714601 52399402 49448791 48068056
6486 48068056 47119792 45315804 42033446 37784723 33459993 29790816 26682914 24230251
6478 24230251 22194956 20405443 18731789 17424353 16297476 15262635 14334607 13382084
6470 13382084 12599491 11982236 11236046 10598812 10142691 9585513 9296063 8946869 8689707
6461 8689707 8344845 7991912 7664514 7370465 6936921 6474112 6268452 6106924 5876638 5823529
$$ packed form
6520D8180153J118290J568217K753636M274731M929234L967477J146480k026215
6512F5912003l632447l204003j743541j35141Q88638O66473m53715j282350j123455
6503E5892462n163J088033J399806P36361m21901q70514q8296J306399K721213
6494F1758400L367080K051624j007551m191237n263715m315199k950611j380735
6486D8068056r48264j803988l282358m248723m324730l669177l107902k452663
6478B4230251k035295j789513j673654j307436j126877j034841r28028r52523
6470A3382084p82593o17255p46190o37234m56121n57178k89450l49194k57162
6461H689707l44862l52933l27398k94049m33544m62809k05660j61528k30286n3109
$$ plain form
6451 5823529 5606582 5448879 5342855 5130787 4936571 4834477 4753266 4780351 4726211 4781179
6441 4781179 4604227 4479368 4519252 4456770 4409423 4341655 4237179 4249731 4360553 4355698 4320217
6430 4320217 4238856 4198208 4035052 3958355 3854078 3734820 3528181 3431610 3386181 3250165
6420 3250165 3163928 3249711 3302199 3018156 3056729 3062552 3002680 3041325 3065389 3094729 3169750
6409 3169750 3164886 3061317 3007297 2832104 2748701 2643439 2590976 2616801 2762858 2746966 2682639
6398 2682639 2679301 2629706 2539672 2384031 2544182 2466616 2368182 2282704 2286289 2304643 2248431
6387 2248431 2120067 1983156 2070762 2097012 2026730 1983586 2020755 1984889 1835076 1711241 1728252
6376 1728252 1610957 1506367 1403849 1557444 1509758 1407006 1342766 1403887 1517520 1521174
$$ packed form
6451E823529k16947j57703j06024k12068j94216j02094q1211K7085n4140N4968
6441D781179j76952j24859L9884o2482m7347o7768j04476J2552J10822m855l5481
6430D320217q1361m0648j63156p6697j04277j19258k06639r6571m5429j36016
6420C250165q6237Q5783N2488k84043L8573N823n9872L8645K4064K9340P5021
6409C169750m864j03569n4020j75193q3403j05262n2463K5825J46057j5892o4327
6398B682639l338m9595r0034j55641J60151p7566r8434q5478L585J8354n6212
6387B248431j28364j36911Q7606K6250p0282m3144L7169l5866j49813j23835J7011
6376A728252j17295j04590j02518J53595m7686j02752o4240O1121J13633L654
$$ plain form
6366 1521174 1447268 1383741 1398853 1478628 1505704 1528193 1486503 1341263 1110012 1199074 1300470
6355 1300470 1253110 1222019 1289271 1226052 1209078 1161445 1107946 1068386 1107051 1109878 1120875 1168188
6343 1168188 1095129 932460 709113 817312 947878 880951 758487 812995 858997 786643
6333 786643 748643 769065 816323 1060217 994160 920221 789568 877911 954526 856769 928349
6322 928349 833203 788830 869303 834908 854215 846275 903387 909614 803905 755691 906859 934190
6310 934190 789453 747763 647246 723289 637181 557848 761423 799620 851955 686269 634762
6299 634762 768104 853771 937228 886294 742852 674529 625002 692615 661820 602204 664119
6288 664119 728097 714384 780425 783831 871753 888650 962447 908185 904538 928542 880196 852459
$$ packed form
6366A521174p3906o3527J5112P9775K7076K2489m1690j45240k31251Q9062J01396
6355A300470m7360l1091O7252o3219j6974m7633n3499l9560L8665K827J0997M7313
6343A168188p3059j62669k23347J08199J30566o6927j22464N4508M6002p2354
6333G86643l8000K0422M7258K43894o6057p3939j30653Q8343P6615r7757P1580
6322I28349r5146m4373Q0473l4395J9307p940N7112O227j05709m8214J51168K7331
6310I34190j44737m1690j00517P6043q6108p9333K03575L8197N2335j65686n1507
6299F34762J33342Q5667Q3457n0934j43442o8323m9527O7613l0795n9616O1915
6288F64119O3978j3713O6041L406Q7922J6897P3797n4262l647K4004m8346k7737
$$ plain form
6276 852459 873600 765746 679753 771702 668082 828278 816986 782490 736105 641761 674352
6265 674352 819427 879168 928834 890523 1078082 1026467 904769 852813 957049 1059503 1101689
6254 1101689 1019405 951429 864225 881129 886210 885263 998414 1036906 1151779 1134280 1181139 1107316
6242 1107316 1008676 1072822 1169653 1245632 1245022 1170832 1193295 1287051 1417641 1504582 1307871
6231 1307871 1376542 1571575 1626821 1639614 1707645 1800169 1818901 1806925 1847565 1793017 1654815
6220 1654815 1861237 1960698 2045160 2176458 2393140 2424096 2717203 2977668 3157315 3512887
6210 3512887 3811146 4050146 4070262 3897801 3692586 3403001 3372935 3272418 3179854 3247579
6200 3247579 3361544 3412181 3271357 3313433 3583865 3713946 3976810 4237533 4161711 4252256
$$ packed form
6276H52459K1141j07854q5993R1949j03620J60196j1292l4496m6385r4344L2591
6265F74352J45075N9741M9666l8311J87559n1615j21698n1956J04236J02454M2186
6254A101689q2284o7976q7204J6904N081r47J13151L8492J14873j7499M6859p3823
6242A107316r8640O4146R6831P5979o10p4190K2463R3756J30590Q6941j96711
6231A307871O8671J95033N5246J2793O8031R2524J8732j1976M0640n4548j38202
6220A654815K06422R9461Q4462J31298K16682L0956K93107K60465J79647L55572
6210C512887K98259K39000K0116j72461k05215k89585l0066j00517r2564O7725
6200C247579J13965N0637j40824M2076K70432J30081K62864K60723p5822R0545
$$ plain form
6190 4252256 4431219 4820846 4936952 5066538 5433178 5832391 6363924 6946310 7478765 8192398
6180 8192398 9269319 10470970 11690235 13043710 13664601 13390675 12819098 12052699 11387467
6171 11387467 10878934 10922749 10968349 11115001 11746504 12532139 13573623 14892269 15864717
6162 15864717 15843416 14854468 13717868 13011617 12557925 12280949 12199265 12255694 12462163 12724366
6152 12724366 13268512 14086992 14911768 15994016 17309479 18989372 20939935 23232601 25078764
6143 25078764 26019061 26584505 26615614 25997551 25672171 25902302 26867866 28500860 30964086
6134 30964086 34333903 38647036 43741419 49027201 51156068 48835633 44387425 39414130
6126 39414130 35090292 31615340 28973310 26950266 25558693 24614181 24104255 23994164 24204500
$$ packed form
6190D252256J78963L89627J16106J29586L66640L99213N31533N82386N32455P13633
6180H192398J076921J201651J219265J353475O20891k73926n71577p66399o65232
6171A1387467n08533M3815M5600J46652O31503P85635J041484J318646R72448
6162A5864717k1301r88948j136600p06251m53692k76976q1684N6429K06469K62203
6152A2724366N44146Q18480Q24776J082248J315463J679893J950563K292666J846163
6143B5078764R40297N65444L1109o18063l25380K30131R65564J632994K463226
6134C0964086L369817M313133N094383N285782K128867k320435m448208m973295
6126C9414130m323838l474952k642030k023044j391573r44512n09926j10091K10336
$$ plain form
6117 24204500 24700303 25351358 26307526 27641935 29213997 31034317 32822821 34603795 36075452
6108 36075452 36793007 37527418 38855370 41033449 44001916 48372964 54184606 61454835
6100 61454835 70349922 80330573 87836526 88451897 84241531 77234711 68948841 61487883
6092 61487883 54886111 49042044 44167648 40482075 37754235 35800192 34584005 33994933
6084 33994933 33511042 32800453 32283347 31998043 32208318 32535161 33241615 34305857 35048706
6075 35048706 36068648 37591036 39701404 42505540 45842343 50514376 56497830 63706610
6067 63706610 72304397 80093089 83997491 84905649 82969233 79135802 74485990 67846413
6059 67846413 59895216 52700561 47212717 43288282 40565486 38772292 37677262 36660975
$$ packed form
6117B4204500M95803O51055R56168J334409J572062J820320J788504J780974J471657
6108C6075452P17555P34411J327952K178079K968467M371048N811642P270229
6100F1454835Q895087R980651P505953O15371m210366p006820q285870p460958
6092F1487883o601772n844067m874396l685573k727840j954043j216187n89072
6084C3994933m83891p10589n17106k85304K10275L26843P06454J064242P42849
6075C5048706J019942J522388K110368K804136L336803M672033N983454P208780
6067F3706610Q597787P788692L904402R08158j936416l833431m649812o639577
6059F7846413p951197p194655n487844l924435k722796j793194j095030j016287
$$ plain form
6051 36660975 35271814 33440547 31776514 30504744 29603094 28710019 27922613 27144019 26733685
6042 26733685 26845121 27244422 27950116 28947680 30387038 32555272 35274412 38403927 41622090
6033 41622090 44497792 47032977 49149666 50892645 51296346 48266970 43058703 37926088
6025 37926088 34120712 31713077 30153330 29226238 28927077 28629896 27856324 26644667 25516205
6016 25516205 24959510 24528980 23185230 21359062 19767426 18297166 17109902 16296032 15733479
6007 15733479 15249658 14964505 14831304 14934976 15191895 15416189 15971542 16668194 17634811
5998 17634811 18842849 19299445 18606983 17166346 15801347 14662700 14036272 13843511 13698677
5989 13698677 13818471 13954805 13999193 14203777 14340517 14889598 15064755 14282067 12765253
$$ packed form
6051C6660975j389161j831267j664033j271770r01650q93075p87406p78594m10334
6042B6733685J11436L99301P05694R97564J439358K168234K719140L129515L218163
6033D1622090K875702K535185K116689J742979M03701l029376n208267n132615
6025C7926088l805376k407635j559747r27092k99161k97181p73572j211657j128462
6016B5516205n56695m30530j343750j826168j591636j470260j187264q13870n62553
6007A5733479m83821k85153j33201J03672K56919K24294N55353O96652R66617
5998A7634811J208038M56596o92462j440637j364999j138647o26428j92761j44834
5989A3698677J19794J36334M4388K04584J36740N49081J75157p82688j516814
$$ plain form
5980 12765253 11417051 10245978 9274199 8598856 8176321 7735990 7337649 7073090 6764576
5971 6764576 6577774 6277118 6054265 5771837 5636275 5453251 5300346 5162319 5034169 4994329
5961 4994329 4924143 4802481 4786418 4820963 4920986 4966559 5066562 5126119 5446224 5726921
5951 5726921 5700897 5389010 4909894 4484844 4182541 3963344 3795463 3643747 3261571 3062178
5941 3062178 3009102 2972273 2928339 2954721 2796210 2788833 2646677 2523722 2338716 2229096 2340970
5930 2340970 2151125 2025211 2068713 1982729 2014596 1970709 1900949 1963796 1847147 1771160 1801932
5919 1801932 1709898 1711593 1643979 1523734 1513549 1427481 1535248 1588563 1459596 1347589 1375761
5908 1375761 1334214 1385548 1317282 1179884 1114992 1086823 1237048 1275435 1140568 1017404 1005373
$$ packed form
5980A2765253j348202j171073r71779o75343m22535m40331l98341k64559l08514
5971F764576j86802l00656k22853k82428j35562j83024j52905j38027j28150l9840
5961D994329p0186j21662j6063L4545J00023M5573J00003N9557L20105K80697
5951E726921k6024l11887m79116m25050l02303k19197j67881j51716l82176j99393
5941C062178n3076l6829m3934K6382j58511p377j42156j22955j85006j09620J11874
5930B340970j89845j25914M3502q5984L1867m3887o9760O2847j16649p5987L0772
5919A801932r2034J695o7614j20245j0185q6068J07767N3315j28967j12007K8172
5908A375761m1547N1334o8266j37398o4892k8169J50225L8387j34867j23164j2031
$$ plain form
5897 1005373 1103797 1038964 919080 998832 1058081 1077945 824050 783198 838614 825213 857564
5886 857564 865159 903014 819226 811610 817178 843106 742831 598051 500932 399402 400279 453603
5874 453603 613237 697818 572630 523982 534698 536588 662335 675999 642344 620348 624415
5863 624415 614908 591023 594106 423821 426416 409912 398964 370133 367978 380296 344445 445574
5851 445574 537896 418857 421660 299455 204098 243680 314895 436715 401355 354273 400144
5840 400144 450544 443383 361258 311298 376644 361783 425360 539715 411433 316511 342971
5829 342971 314829 221216 228574 183461 146035 141291 92193 152891 259935 192217 136951 188479
5817 188479 107222 132582 49807 11837 132040 141676 187088 244703 358823 426731 394713
$$ packed form
5897A005373R8424o4833j19884P9752N9249J9864k53895m0852N5416j3401L2351
5886H57564P595L7855q3788p616N568K5928j00275j44780r7119j01530Q77N3324
5874D53603J59634Q4581j25188m8648J0716J890J25747J3664l3655k1996M067
5863F24415r507k3885L083j70285K595j6504j0948k8831k155J2318l5851J01129
5851D45574R2322j19039K803j22205r5357L9582P1215J21820l5360m7082M5871
5840D00144N0400p161q2125m9960O5346j4861O3577J14355j28282r4922K6460
5829C42971k8142r3613P358m5113l7426m744m9098O0698J07044o7718n5266N1528
5817A88479q1257K5360q2775l7970J20203R636M5412N7615J14120O7908l2018
$$ plain form
5806 394713 550910 503012 396181 339855 361162 515990 489757 340145 209177 209572 304294
5795 304294 341612 434077 345318 345388 421484 358950 375532 367433 117956 144803 274975 286183
5783 286183 197668 283892 260059 227818 97014 1477 215200 395918 414156 229664 263400
5772 263400 262908 234490 233074 261193 243274 258937 329546 443078 521496 660397 517108 586048
5760 586048 636951 555496 468506 291263 331921 311442 240593 314102 265967 151127 188299
5749 188299 146326 251010 314444 246950 277282 320265 206486 122833 273687 247319 297476
5738 297476 348325 332935 361790 288253 370291 312209 430864 443193 436698 534998 653805
5727 653805 599942 549465 467218 360801 180786 168702 256883 266968 236951 290613 314591
$$ packed form
5806C94713J56197m7898j06831n6326K1307J54828k6233j49612j30968L95R4722
5795C04294L7318R2465q8759P0P6096o2534J6582q099k49477K6847J30172J1208
5783B86183q8515Q6224k3833l2241j30804r5537K13723J80718J8238j84492L3736
5772B63400m92k8418j416K8119j7919J5663P0609J13532P8418J38901j43289O8940
5760E86048N0903q1455q6990j77243M0658k0479p0849P3509m8135j14840L7172
5749A88299m1973J04684O3434o7494L0332M2983j13779q3653J50854k6368N0157
5738B97476N0849j5390K8855p3537Q2038n8082J18655J2329o495R8300J18807
5727F53805n3863n0477q2247j06417j80015j2084Q8181J0085l0017N3662K3978
$$ plain form
5716 314591 272612 210735 248792 377638 375095 312055 171287 55259 -91187 -20490 10601
5705 10601 146243 296462 161139 113858 156083 263008 435310 467707 281972 197947 227947
5694 227947 234885 280035 327750 364093 247367 241665 278183 266890 260427 211051 157672 182837
5682 182837 59914 113121 91180 174830 264871 258494 99297 31148 -53191 -15073 53834
5671 53834 153047 298609 266598 146535 124325 115072 129366 -6786 -63567 -153706 2595
5660 2595 86292 163868 113617 162440 142674 194094 276446 165724 109117 18831 14894 138407
5648 138407 239176 232754 192163 63826 126579 151884 173337 131688 147007 204453 109626
5637 109626 106606 254580 146052 276981 211901 249168 188667 227092 193320 163783 193085
$$ packed form
5716C14591m1979o1877L8057J28846k543o3040j40768j16028j46446P0697L1091
5705A0601J35642J50219j35323m7281M2225J06925J72302L2397j85735q4025L0000
5694B27947O938M5150M7715L6343j16726n702L6518j1293o463m9376n3379K5165
5682A82837j22923N3207k1941Q3650R0041o377j59197o8149q4339L8118O8907
5671E3834R9213J45562l2011j20063k2210r253J4294j36152n6781r0139J56301
5660B595Q3697P7576n0251M8823j9766N1420Q2352j10722n6607r0286l937J23513
5648A38407J00769o422m0591j28337O2753K5305K1453m1649J5319N7446r4827
5637A09626l020J47974j08528J30929o5080L7267o0501L8425l3772k9537K9302
$$ plain form
5626 193085 233798 134973 58649 5275 58759 43585 77293 3682 -6514 140033 116570
5615 116570 81019 29533 120498 116708 87994 9196 -104909 -24926 -10680 -42006 59153
5604 59153 161834 190714 110813 127094 215226 304494 217168 151896 170952 162705 228850 40774
5592 40774 72345 88496 62458 107722 148987 90051 167120 217271 231934 254515 207853 259772
5580 259772 357595 241875 19384 -65147 -45587 -37545 144309 179134 138267 71014 158694
5569 158694 259307 317578 258206 156650 81253 4737 108411 -64666 29149 113717 69831
5558 69831 140227 94659 16560 48862 128038 217049 191594 106632 -37929 -122924 -48410 72295
5546 72295 88228 239235 88306 30901 42848 25494 -9921 116051 45464 19158 61345
$$ packed form
5626A93085M0713r8825p6324n3374N3484j5174L3708p3611j0196J46547k3463
5615A16570l5551n1486R0965l790k8714p8798j14105P9983J4246l1326J01159
5604E9153J02681K8880p9901J6281Q8132Q9268q7326o5272J9056q247O6145j88076
5592D0774L1571J6151k6038M5264M1265n8936P7069N0151J4663K2581m6662N1919
5580B59772R7823j15720k22491q4531J9560Q042J81854L4825m0867o7253Q7680
5569A58694J00613N8271n9372j01556p5397p6516J03674j73077R3815Q4568m3886
5558F9831P0396m5568p8099L2302P9176Q9011k5455q4962j44561q4995P4514J20705
5546G2295J5933J51007j50929n7405J1947j7354l5415J25972p0587k6306M2187
$$ plain form
5535 61345 133959 113584 117973 92072 193232 167678 209889 173397 175852 178741 111305 171240
5523 171240 68475 47210 69863 106006 90633 -27712 44597 114510 69354 34385 142493
5512 142493 167787 87088 64045 -54542 -34384 46213 68899 60308 135488 107415 -26414
5501 -26414 -58452 47043 144103 116494 155857 81514 105669 117884 -33728 48700 122687
5490 122687 2105 -73226 25686 71480 105761 -34571 10608 13081 28292 117526 113906 7262
5478 7262 45463 42008 27206 73806 14613 -16593 79817 95930 109740 170836 147723 117602
5466 117602 35852 90256 81841 77342 140758 -4816 -9228 83279 169039 8532 -24380 -49085
5454 -49085 -21784 3156 149577 144854 99656 192117 272067 283005 185135 127919 177734 228815
$$ packed form
5535F1345P2614k0375M389k5901J01160k5554M2211l6492K455K889o7436N9935
5523A71240j02765k1265K2653L6143j5373j18345P2309O9913m5156l4969J08108
5512A42493K5294q0699k3043j18587K0158Q0597K2686q591P5180k8073j33829
5501b6414l2038J05495R7060k7609L9363p4343K4155J2215j51612Q2428P3987
5490A22687j20582p5331R8912M5794L4281j40332M5179K473J5211Q9234l620j06644
5478G262L8201l455j4802M6600n9193l1206R6410J6113J3810O1096k3113l0121
5466A17602q1750N4404q415m499O3416j45574m412R2507Q5760j60507l2912k4705
5454d9085K7301K4940J46421m723m5198R2461P9950J0938r7870n7216M9815N1081
$$ plain form
5442 228815 284384 374737 142833 193291 214377 250254 252221 251294 245518 235457 304116 292498
5430 292498 376140 357912 184196 271846 156694 187149 377218 349730 496104 511297 682801
5419 682801 654981 566282 541326 447034 494311 453557 315047 318036 363922 396778 310854 407274
5407 407274 487562 446737 274079 297265 367043 389330 404472 245031 154172 202565 180280
5396 180280 235936 198009 166873 275874 214396 308921 160591 188099 232770 192565 174082
5385 174082 310001 242814 233211 104158 57473 55229 97308 65584 18930 24241 -51884 1
5373 1 58255 103439 83621 -7835 -68882 10280 19968 10400 17236 93643 102749 1766 -148136
5360 -148136 -266556 -273702 -104470 55870 1991 -98211 -79293 -127203 -42738 84314 79566
$$ packed form
5442B28815N5569R0353k31904N0458K1086L5877J967r27n776j0061O8659j1618
5430B92498Q3642j8228j73716Q7650j15152L0455J90069k7488J46374J5193J71504
5419F82801k7820q8699k4956r4292M7277m0754j38510K989M5886L2856q5924R6420
5407D07274Q0288m0825j72658K3186O9778K2287J5142j59441r0859M8393k2285
5396A80280N5656l7927l1136J09001o1478R4525j48330K7508M4671m0205j8483
5385A74082J35919o7187r603j29053m6685k244M2079l1724m6654N311p6125N1885
5373AN8254M5184j9818r1456o1047P9162R688r568O836P6407R106j00983j49902
5360a48136j18420p146J69232J60340n3879j00202J8918m7910Q4465J27052m748
$$ plain form
5349 79566 -82896 -131574 -123448 -24242 4799 -55825 -71696 -53655 -69652 -121516 -97356 -150316
5337 -150316 -215536 -168371 -141927 -106217 15247 10419 -59840 56187 41802 107275 33396
5326 33396 16244 -88000 -36404 60874 5662 33232 118707 145950 -25513 -59209 6430
5315 6430 -47712 -108230 -96133 8489 18813 -61231 37198 -42548 -116128 -184303 -200444 -174882
5303 -174882 -133239 -297510 -297219 -165965 -94691 -56206 -3717 3840 79701 93174 196835 132635
5291 132635 73761 -11932 -56459 36192 -40789 -100657 14077 6497 -86030 -81700 -79382 -99559
5279 -99559 -140872 -180336 -130331 -97726 -83300 -71665 -58014 -113502 -130152 3169 41207 114337
5267 114337 17940 -47263 100180 113806 65527 -33605 -80117 -85386 -79586 -103194 -169503 -115103
$$ packed form
5349G9566j62462m8678Q126R9206K9041o0624j5871J8041j5997n1864K4160n2960
5337a50316o5220M7165K6444L5710J21464m828p0259J16027j4385O5473p3879
5326C3396j7152j04244N1596R7278n5212K7570Q5475K7243j71463l3696O5639
5315F430n4142o0518J2097J04622J0324q0044R8429p9746p3580o8175j6141K5562
5303a74882M1643j64271K91J31254P1274L8485N2489P557P5861J3473J03661o4200
5291A32635n8874q5693m4527R2651p6981n9868J14734p580r2527M330K318k0177
5279i9559m1313l9464N0005L2605J4426J1635J3651n5488j6650J33321L8038P3130
5267A14337r6397o5203J47443J3626m8279r9132m6512n269N800k3608o6309N4400
$$ plain form
5255 -115103 76965 125802 87272 35241 -28846 -119632 -40694 -6951 -12180 5746 -76604 -40718
5243 -40718 -53183 51909 97359 17371 -85665 -273429 -254784 -244813 -289141 -71457 -25124
5232 -25124 -140336 -67104 58961 13792 -24466 22514 -130684 -68293 -54619 -105811 -69833
5221 -69833 31019 52739 -140506 -18575 -93789 -104713 1344 -39669 -140004 -80362 -186563
5210 -186563 -322456 -174974 -46858 -133923 -57102 -62567 -140976 -92415 10632 -53067 -40558
5199 -40558 -120415 4171 -61638 -24927 -16478 -48261 60483 69690 -150917 -124654 14569
5188 14569 24981 -11619 -96767 -23917 1483 -92053 -39820 96134 105279 58454 -38053 141434
5176 141434 196961 -28345 -38897 78986 -37816 -98033 24745 5597 -39577 -12119 -61026
$$ packed form
5255a15103J92068M8837l8530n2031o4087r0786P8938L3743n229J7926q2350L5886
5243d0718j2465J05092M5450p9988j03036j87764J8645R971m4328K17684M6333
5232b5124j15212P3232J26065m5169l8258M6980j53198O2391J3674n1192L5978
5221f9833J00852K1720j93245J21931p5214j0924J06057m1013j00335N9642j06201
5210a86563j35893J47482J28116q7065P6821n465p8409M8561J03047o3699J2509
5199d0558p9857J24586o5809L6711Q449l1783J08744R207k20607K6263J39223
5188A4569J0412l6600q5148P2850K5400r3536N2233J35954R145m6825r6507J79487
5176A41434N5527k25306j0552J17883j16802o0217J22778j9148m5174K7458m8907
$$ plain form
5165 -61026 -218185 -69502 54566 -174290 -207061 -243164 -209970 -32413 63359 43121 79408
5154 79408 -21602 68400 -137511 -160539 -28202 -9723 -40786 -74522 16803 126875 176974
5143 176974 -34759 19075 185987 -4106 -79928 -75055 -83966 40498 68061 35608 142956
5132 142956 -46131 -48085 35786 139629 84820 -29054 -194996 -79519 -10757 -80419 -151912
5121 -151912 -141865 -19082 19365 133873 22577 -5894 10121 105691 -5275 -153763 -14204
5110 -14204 79105 38714 -57260 23593 36961 111029 109254 -15575 59410 37915 -161924 -98129
5098 -98129 -79442 -22094 1909 -7853 27243 151051 152678 74229 16474 22340 -105850 -166431
5086 -166431 -172892 -129957 62000 -27528 38665 67372 158391 24817 26863 -32837 65431 103353
$$ packed form
5165f1026j57159J48683J24068k28856l2771l6103L3194J77557R5772k0238L6287
5154G9408j01010R0002k05911k3028J32337J8479l1063l3736R1325J10072N0099
5143A76974k11733N3834J66912j90093p5822M873q911J24464K7563l2453J07348
5132A42956j89087j954Q3871J03843n4809j13874j65942J15477O8762o9662p1493
5121a51912J0047J22783L8447J14508j11296k8471J6015R5570j10966j48488J39559
5110a4204R3309m0391r5974Q0853J3368P4068j775j24829P4985k1495j99839O3795
5098i8129J8687N7348K4003r762L5096J23808J627p8449n7755N866j28190o0581
5086a66431o461M2935J91957q9528O6193K8707R1019j33574K046n9700R8268L7922
$$ plain form
5074 103353 77562 48835 122972 146187 -72195 -66761 20431 -6564 63875 46634 39059 127562
5062 127562 161630 38333 21719 55854 69978 -19657 -2045 -44575 -168026 -39308 119771
5051 119771 80645 15014 27381 24623 -37713 107307 157847 3751 -12321 -31459 46760
5040 46760 150057 117203 83432 151255 60622 -115394 -125319 23998 201601 149173 88099
5029 88099 132637 201270 236101 32067 29571 97233 282376 388213 299103 95182 120312
5018 120312 142790 32850 27244 88900 114967 218244 110866 145121 267643 213266 117334
5007 117334 214308 144925 136076 239872 276361 350775 325984 372891 297959 394750 494865
4996 494865 582452 385510 357995 436679 537661 523961 438705 315335 318113 358213 327157
$$ packed form
5074A03353k5791k8727P4137K3215k18382N434Q7192k6995P0439j7241p575Q8503
5062A27562L4068j23297j6614L4135J4124q9635J7612m2530j23451J28718J59079
5051A19771l9126o5631J2367k758o2336J45020N0540j54096j6072j9138P8219
5040D6760J03297l2854l3771O7823r0633j76016r925J49317J77603n2428o1074
5029H8099M4538O8633L4831k04034k496O7662J85143J05837q9110k03921K5130
5018A20312K2478j09940n606O1656K6067J03277j07378L4255J22522n4377r5932
5007A17334R6974o9383q849J03796L6489P4414k4791M6907p4932R6791J00115
4996D94865Q7587j96942k7515P8684J00982j3700q5256j23370K778M0100l1056
$$ plain form
4985 327157 435312 348087 249880 304724 400448 282749 269799 314429 217472 176878 324038
4974 324038 258590 224112 229913 264862 382776 350537 313167 266563 343324 383166 431564 476599
4962 476599 479501 389521 429481 505788 545703 502946 387573 492179 591838 579943 642528
4951 642528 536361 496539 458426 438180 510707 431374 356987 296581 298679 318871 311409 352314
4939 352314 211288 298145 385201 410709 327403 282002 274576 242269 185323 278095 352824 332117
4927 332117 415596 341428 407003 545350 634766 498518 535184 449536 486440 404229 362832
4916 362832 310501 324158 495742 488554 582301 573165 500314 537972 426267 440378 470188 542403
4904 542403 518007 471798 423977 343763 303844 254231 323773 233199 200829 334092 421123
$$ packed form
4985C27157J08155q7225r8207N4844R5724j17699j2950M4630r6957m0594J47160
4974C24038o5448l4478N801L4949J17914l2239l7370m6604P6761L9842M8398M5035
4962D76599K902q9980L9960P6307L9915m2757j15373J04606R9659j1895O2585
4951F42528j06167l9822l8113k0246P2527p9333p4387o0406K098K0192p462M0905
4939C52314j41026Q6857Q7056K5508q3306m5401p426l2307n6946R2772P4729k0707
4927C32117Q3479p4168O5575J38347Q9416j36248L6666q5648L6904q2211m1397
4916C62832n2331J3657J71584p188R3747r136p2851L7658j11705J4111K9810P2215
4904E42403k4396m6209m7821q0214l9919m9613O9542r0574l2370J33263Q7031
$$ plain form
4893 421123 433506 439323 401745 411000 391662 377167 439761 406137 491682 484981 453271 457587
4881 457587 385578 409294 343131 318393 375378 358174 307073 290449 355674 365023 444089 514747
4869 514747 460564 357527 477327 506595 504485 609643 648626 648091 571864 504330 496414 551486
4857 551486 457748 361778 432327 435322 435746 338060 417168 526077 423911 293548 300547 333596
4845 333596 348428 512332 561477 587331 517584 462267 483706 506440 518239 491157 467080
4834 467080 661672 656913 651062 544550 595208 626123 656762 665708 567555 653529 703352 676366
4822 676366 653648 627435 572195 658743 806612 754025 687642 754696 848619 799644 856818
4811 856818 882971 845489 870036 860945 940355 968322 1021271 1099360 1064445 1142677 1118145 1081765
$$ packed form
4893D21123J2383N817l7578R255j9338j4495O2594l3624Q5545o701l1710M316
4881D57587p2009K3716o6163k4738N6985j7204n1101j6624O5225R349P9066P0658
4869E14747n4183j03037J19800K9268k110J05158L8983n35p6227o7534p916N5072
4857E51486r3738r5970P0549K995M24r7686P9108J08909j02166j30363O999L3049
4845C33596J4832J63904M9145K5854o9747n5317K1439K2734J1799k7082k4077
4834D67080J94592m759n851j06512N0658L0915L0639Q946r8153Q5974M9823k6986
4822F76366k2718k6213n5240Q6548J47869n2587o6383O7054R3923m8975N7174
4811H56818K6153l7482K4547r091P9410K7967N2949P8089l4915P8232k4532l6380
$$ plain form
4799 1081765 1044923 963544 989548 1102884 1171608 1269861 1415208 1351698 1226979 1310795 1299503
4788 1299503 1433184 1499790 1462126 1459885 1394385 1461528 1590196 1691727 1709547 1807932 1712309
4777 1712309 1897679 2104794 2043860 2192194 2326466 2323216 2311481 2339719 2370860 2535564 2767158
4766 2767158 2956583 3120108 3302963 3514437 3653061 3757667 4082483 4311532 4573809 4844436
4756 4844436 5165970 5601046 5930592 6448282 6997012 7509767 8083689 8823638 9612786 10635572
4746 10635572 11867263 13295281 14719955 16169549 17595153 18965719 19735066 19935390
4738 19935390 19509652 18794773 17887172 16729489 15643300 14691437 13708507 13080930 12718081
4729 12718081 12714986 12608884 12619461 12894856 13310170 13605208 14109899 14748702 15355917 16314909
$$ packed form
4799A081765l6842q1379K6004J13336O8724R8253J45347o3510j24719Q3816j1292
4788A299503J33681O6606l7664k241o5500O7143J28668J01531J7820R8385r5623
4777A712309J85370K07115o0934J48334J34272l250j1735K8238L1141J64704K31594
4766B767158J89425J63525J82855K11474J38624J04606L24816K29049K62277K70627
4756D844436L21534M35076L29546N17690N48730N12755N73922P39949P89148J022786
4746A0635572J231691J428018J424674J449594J425604J370566P69347K00324
4738A9935390m25738p14879r07601j157683j086189r51863r82930o27577l62849
4729A2718081l095j06102J0577K75395M15314K95038N04691O38803O07215R58992
$$ plain form
4719 16314909 17402322 18609172 19767796 21254985 23076324 25316355 27875280 31061171
4711 31061171 34906773 39262831 43765306 48210366 52086969 54799248 55808219 54973944
4703 54973944 52788441 49383139 45162389 40773357 36716579 33242629 30183180 27986272
4695 27986272 26280133 24962560 24093747 23399449 22977228 22767069 22500536 22430597 22618821
4686 22618821 22861507 23221809 23710540 24498685 25743856 27160850 28919225 31101970 33741764
4677 33741764 37190276 41348863 45886622 50550949 54653514 57744083 59315367 59195701
4669 59195701 57337888 53788067 49220524 44344088 39557045 35324013 31620592 28653493
4661 28653493 26625407 24843969 23477760 22404320 21313409 20359916 19582310 18746546 17932757
$$ packed form
4719A6314909J087413J206850J158624J487189J821339K240031K558925L185891
4711C1061171L845602M356058M502475M445060L876603K712279J008971q34275
4703E4973944k185503l405302m220750m389032m056778l473950l059449k196908
4695B7986272j706139j317573q68813o94298m22221k10159k66533o9939J88224
4686B2618821K42686L60302M88731P88145J245171J416994J758375K182745K639794
4677C3741764L448512M158587M537759M664327M102565L090569J571284j19666
4669E9195701j857813l549821m567543m876436m787043m233032l703421k967099
4661B8653493k028086j781438j366209j073440j090911r53493p77606q35764q13789
$$ plain form
4652 17932757 17212474 16705895 16225395 16020888 15908733 16129078 16364486 16582824 17142299
4643 17142299 17966027 19049228 20241296 21629401 22845208 24019356 24582337 24494724 23957648
4634 23957648 22772919 21170485 19384994 17677269 16091845 14636566 13551838 12597580
4626 12597580 11873191 11297463 10953480 10534738 10030868 9505728 8943026 8288370 7798458
4617 7798458 7231820 6775556 6445660 6049319 5741905 5373905 5166404 4973909 4762652 4657817
4607 4657817 4510676 4139707 3892582 3810306 3800449 3604787 3424629 3468038 3472220 3205375 3153003
4596 3153003 3263572 3017389 3083047 3226082 3172276 3139994 3024382 3035724 3021069 2893050
4586 2893050 2763015 2563357 2339144 2373281 2372951 2331150 2236981 2112683 2024271 1917182 1897385
$$ packed form
4652A7932757p20283n06579m80500k04507j12155K20345K35408K18338N59475
4643A7142299Q23728J083201J192068J388105J215807J174148N62981q7613n37076
4634B3957648j184729j602434j785491j707725j585424j455279j084728r54258
4626A2597580p24389n75728l43983m18742n03870n25140n62702o54656m89912
4617G798458n66638m56264l29896l96341l07414l68000k07501j92495k11257j04835
4607D657817j47141l70969k47125q2276r857j95662j80158M3409M182k66845n2372
4596C153003J10569k46183O5658J43035n3806l2282j15612J1342j4655j28019
4586B893050j30035j99658k24213L4137l30m1801r4169j24298q8412j07089j9797
$$ plain form
4575 1897385 1914784 1889700 1754011 1731190 1797542 1773133 1779256 1668863 1629457 1600179 1653215
4564 1653215 1513077 1443577 1542169 1539625 1512881 1424855 1380740 1393612 1270429 1140466 1087261
4553 1087261 1307174 1298273 1168058 1177452 1181262 1213744 1177114 1138048 1126869 887686 915846
4542 915846 999244 1054182 1004380 923922 997411 956358 1105991 1111887 964978 785816 900095
4531 900095 1036825 974499 829600 960946 1126190 1016177 921790 784489 799771 711937
4521 711937 669750 661755 698765 798472 636976 573595 678198 629304 609653 602068 486297
4510 486297 458829 596687 781585 697836 578077 520230 511182 469372 483206 485735 541556
4499 541556 561484 634368 775934 815827 728722 739316 571531 550698 567110 644984 536167
$$ packed form
4575A897385J7399k5084j35689k2821O6352k4409O123j10393l9406k9278N3036
4564A653215j40138o9500R8592k544k6744q8026m4115J2872j23183j29963n3205
4553A087261K19913q901j30215R394L810L2482l6630l9066j1179k39183K8160
4542I15846Q3398N4938m9802q0458P3489m1053J49633N896j46909j79162J14279
4531I00095J36730o2326j44899J31346J65244j10013r4387j37301J5282q7834
4521G11937m2187p995L7010R9707j61496o3381J04603m8894j9651p585j15771
4510D86297k7468J37858J84898q3749j19759n7847r048m1810J3834K529N5821
4499E41556J9928P2884J41566L9893q7105J0594j67785k0833J6412P7874j08817
$$ plain form
4488 536167 525541 576131 510475 386381 478209 523039 363830 408332 530553 583617 448329
4477 448329 440423 523127 507388 418417 440799 516994 501879 383132 363361 564562 522865
4466 522865 403341 399545 429435 463358 478864 399698 486532 462240 353876 530176 528074
4455 528074 506220 492409 588046 556287 462534 576980 469880 402001 500759 470729 479297
4444 479297 329794 282369 425028 350354 324319 424957 382518 305468 331024 443916 374186
4433 374186 306483 374152 437919 424329 412704 501550 491667 519042 457423 323692 499027
4422 499027 551940 562753 587098 710292 720735 656967 746672 728061 747570 796971 727176
4411 727176 685215 722997 810710 732417 718754 647027 604884 601847 600665 384731 599419 587999
$$ packed form
4488E36167j0626N0590o5656j24094R1828M4830j59209M4502J22221N3064j35288
4477D48329p906Q2704j5739q8971K2382P6195j5115j18747j9771K01201m1697
4466E22865j19524l796K9890L3923J5506p9166Q6834k4292j08364J76300k102
4455E28074k1854j3811R5637l1759r3753J14446j07100o7879R8758l0030Q568
4444D79297j49503m7425J42659p4674k6035J00638m2439p7050K5556J12892o9730
4433C74186o7703O7669O3767j3590j1625Q8846r883K7375o1619j33731J75335
4422D99027N2913J0813K4345J23194J0443o3768Q9705j8611J9509M9401o9795
4411G27176m1961L7782Q7713p8293j3663p1727m2143l037j182k15934K14688j1420
$$ plain form
4399 587999 615164 677126 597255 573970 481836 464198 467763 469807 452182 566120 584819 623863
4387 623863 687904 663280 695668 709254 729526 713566 686541 648159 641011 617339 520099 561635
4375 561635 472777 565444 595097 605663 480022 501027 391256 445002 500563 502495 583275
4364 583275 526875 553308 573615 400074 512299 557362 588858 660387 564486 484792 497151
4353 497151 522696 451165 511593 542685 611847 587783 554430 631216 657322 610385 533774 665576
4341 665576 617490 474295 556630 618943 652774 594522 593613 550642 453413 397257 458178 523615
4329 523615 495120 478663 542419 550168 392755 390434 491640 410068 516995 549204 632870
4318 632870 572889 420553 462816 474986 468220 518552 568888 600196 640087 634241 618778 437703
$$ packed form
4399E87999K7165O1962p9871k3285r2134j7638L565K044j7625J13938J8699L9044
4387F23863O4041k4624L2388J3586K0272j5960k7025l8382p148k3672r7240M1536
4375E61635q8858R2667K9653J0566j25641K1005j09771N3746N5561J932Q0780
4364E83275n6400K6433K0307j73541J12225M5063L1496P1529r5901p9694J2359
4353D97151K5545p1531O0428L1092O9162k4064l3353P6786K6106m6937p6611J31802
4341F65576m8086j43195Q2335O2313L3831n8252r09m2971r7229n6156O0921O5437
4329E23615k8495j6457O3756P749j57413k321J01206q1572J06927L2209Q3666
4318F32870n9981j52336M2263J2170o766N0332N0336L1308L9891n846j5463j81075
$$ plain form
4306 437703 481416 385955 361587 304858 380641 523947 457072 456629 512213 428643 404405 416011
4294 416011 345019 380486 541595 458474 315733 494414 609193 573374 462210 492443 410498
4283 410498 429061 440440 324320 288569 374648 479754 567688 623073 475305 460117 450940
4272 450940 421087 559154 649528 582803 551172 487890 404282 445878 441450 485571 586805
4261 586805 720000 588131 447391 427292 493358 555148 618593 588894 567044 622523 539937
4250 539937 549828 668145 612159 493507 452175 575520 693552 749761 691399 841375 745227
4239 745227 627269 557429 570041 613191 649015 679853 596905 741742 737348 684027 736932
4228 736932 773118 789659 788727 776612 765668 695841 731525 707300 722067 885671 957649 825854
$$ packed form
4306D37703M3713r5461k4368n6729P5783J43306o6875m43N5584q3570k4238J1606
4294D16011p0992L5467J61109q3121j42741J78681J14779l5819j11164L0233q1945
4283D10498J8563J1379j16120l5751Q6079J05106Q7934N5385j47768j5188r177
4272D50940k9853J38067R0374o6725l1631o3282q3608M1596m428M4121J01234
4261E86805J33195j31869j40740k0099O6066O1790O3445k9699k1850N5479q2586
4250E39937R891J18317n5986j18652m1332J23345J18032N6209n8362J49976r6148
4239G45227j17958o9840J2612M3150L5824L0838q2948J44837m394n3321N2905
4228G36932L6186J6541r32j2115j0944o9827L5684k4225J4767J63604P1978j31795
$$ plain form
4216 825854 919345 922690 957811 995206 899518 910658 974162 893751 1155748 1168059 1121001 1227551
4204 1227551 1154258 1138962 1222783 1179254 1180048 1228941 1203079 1124539 1098756 1199706 1247065 1330113
4192 1330113 1504020 1555019 1511386 1475559 1428149 1573684 1524656 1540234 1708440 1673902 1650256
4181 1650256 1871531 2042960 2119495 2139787 2121297 2190640 2237901 2317052 2387524 2475910 2593198
4170 2593198 2663817 2666688 2685116 2786202 3039833 3174885 3117137 3472391 3750066 3894699
4160 3894699 4034812 4126793 4313167 4473792 4667552 5036039 5361864 5734415 5953058 6175853
4150 6175853 6587369 6999161 7380492 7931836 8618941 9339898 10008367 10806342 11696924 12728337
4140 12728337 13797836 14980107 16348151 17944031 19787804 21825493 24444837 27254012
$$ packed form
4216H25854R3491L345L5121L7395r5688J1140O3504q0411K61997J2311m7058J06550
4204A227551p3293j5296Q3821m3529P94M8893k5862p8540k5783J00950M7359Q3048
4192A330113J73907N0999m3633l5827m7410J45535m9028J5578J68206l4538k3646
4181A650256K21275J71429P6535K0292j8490O9343M7261P9151P0472Q8386J17288
4170B593198P0619K871J8428J01086K53631J35052n7748L55254K77675J44633
4160C894699J40113R1981J86374J60625J93760L68487L25825L72551K18643K22795
4150F175853M11516M11792L81331N51344O87105P20957O68469P97975Q90582J031413
4140A2728337J069499J182271J368044J595880J843773K037689K619344K809175
$$ plain form
4132 27254012 30312524 34274676 39264567 45456770 52988007 61582064 70540421 77535955
4124 77535955 78853372 73294570 64196613 54933494 46934206 40394406 35147468 31033163
4116 31033163 27530695 24566637 22244623 20521209 18833452 17308049 16116018 15030991
4108 15030991 13955311 12900031 12001937 11125809 10341675 9880658 9298858 8689696 8315634
4099 8315634 7754724 7281471 6970769 6628359 6190240 5789148 5571081 5509573 5248108 5063603
4089 5063603 4891895 4846760 4595858 4298308 4173330 4014285 3785335 3598073 3501261 3390605
4079 3390605 3326915 3277348 3175597 3118067 3057893 3063764 3033823 2808405 2570553 2517662 2521176
4068 2521176 2408600 2421243 2474185 2291596 2194807 2198373 2057374 2095414 2089125 2046699 2026178
$$ packed form
4132B7254012L058512L962152M989891O192203P531237Q594057Q958357O995534
4124G7535955J317417n558802r097957r263119p999288o539800n246938m114305
4116C1033163l502468k964058k322014j723414j687757j525403j192031j085027
4108A5030991j075680j055280q98094q76128p84134m61017n81800o09162l74062
4099H315634n60910m73253l10702l42410m38119m01092k18067o1508k61465j84505
4089E063603j71708m5135k50902k97550j24978j59045k28950j87262r6812j10656
4079C390605o3690m9567j01751n7530o0174N871k9941k25418k37852n2891L514
4068B521176j12576J2643N2942j82589r6789L566j40999L8040o289m2426k0521
$$ plain form
4057 2026178 2006503 1842726 1710020 1696714 1788426 1704515 1775211 1861687 1790184 1637390 1582159
4046 1582159 1610838 1487928 1519702 1555273 1558324 1469167 1416645 1499102 1483690 1477864 1532008 1572847
4034 1572847 1567026 1467346 1366361 1298984 1363455 1346230 1351890 1346880 1446296 1504531 1464006 1515865
4022 1515865 1482995 1453005 1324206 1301296 1337133 1205177 1290136 1358113 1143298 1088415 1168502
4011 1168502 1283859 1220762 1204672 1208985 1088173 1085955 1132770 1243646 1157453 1079325 1126247
4000 1126247 1047748 1102473 1058024 1064412 1029543 1039107 1086811 1006416 940862 812928 911090 1014766
3988 1014766 1044931 950291 914013 974024 987394 972372 1110940 1001920 987094 1013673 963606
3977 963606 991972 991509 987237 1077662 1043538 1076656 1124200 1058594 1079982 1095648 1021747 948944
$$ packed form
4057B026178j9675j63777j32706j3306R1712q3911P0696Q6476p1503j52794n5231
4046A582159K8679j22910L1774L5571L051q9157n2522Q2457j5412n826N4144M0839
4034A572847n821r9680j00985o7377O4471j7225N660n010R9416N8235m0525N1859
4022A515865l2870k9990j28799k2910L5837j31956Q4959O7977k14815n4883Q0087
4011A168502J15357o3097j6090M313j20812k218M6815J10876q6193p8128M6922
4000A126247p8499N4725m4449O388l4869R564M7704q0395o5554j27934R8162J03676
3988A014766L0165r4640l6278O0011J3370j5022J38568j09020j4826K6579n0067
3977I63606K8366m63m272R0425l4124L3118M7544o5606K1388J5666p3901p2803
$$ plain form
3965 948944 845700 833025 882561 922782 952303 997608 1105327 937899 907133 937636 907627
3954 907627 811716 762232 808322 827790 791468 882880 946428 917299 908415 885218 928879 915322
3942 915322 890678 884300 876410 746549 725526 870869 766717 802210 932255 999389 845635
3931 845635 803058 876016 916900 996083 969026 817772 952067 959053 822566 899548 918115
3920 918115 774573 749134 816124 905807 1055276 970657 897975 979904 980765 1002106 1050039 933820
3908 933820 857821 937533 823693 840456 856194 843472 1008416 993361 944337 985968 934975
3897 934975 895448 893669 905679 862966 974282 1097208 1073917 1058698 1057169 1219945 1266153
3886 1266153 1207528 1165235 1216852 1121137 1017639 1028582 1105931 1163589 1225694 1372486 1387853
$$ packed form
3965I48944j03244j2675M9536M0221K9521M5305J07719j67428l0766L0503l0009
3954I07627r5911m9484M6090J9468l6322R1412O3548k9129q884k3197M3661j3557
3942I15322k4644o378p890j29861k1023J45343j04152L5493J30045O7134j53754
3931H45635m2577P2958M0884P9183k7057j51254J34295O986j36487P6982J8567
3920I18115j43542k5439O6990Q9683J49469q4619p2682Q1929Q61K1341M7933j16219
3908I33820p5999P9712j13840J6763J5738j2722J64944j5055m9024M1631n0993
3897I34975l9527j779J2010m2713J11316J22926k3291j5219j529J62776M6208
3886A266153n8625m2293N1617r5715j03498J0943P7349N7658O2105J46792J5367
$$ plain form
3875 1387853 1211879 1151932 1199535 1456641 1296407 1109467 1213436 1160435 1126478 1184342
3865 1184342 1394847 1350877 1260565 1176585 1242081 1370181 1361869 1549945 1571370 1574903 1603965
3854 1603965 1555785 1606598 1724206 1617492 1538549 1696362 1768768 1842819 1851605 1999854 1923620
3843 1923620 1933337 2144281 2294744 2438004 2410231 2286001 2076072 1943973 1854192 1981431
3833 1981431 1968683 1889199 1825078 1924217 1889823 1866291 1960913 1996758 1956348 1982151 2109187
3822 2109187 2266967 2374596 2328575 2371891 2374901 2272194 2215250 2272483 2300249 2559224 2837034
3811 2837034 2923638 3146926 3132181 3160686 3239753 3173210 3169170 2994663 2798874 2582253 2477024
3800 2477024 2391114 2252529 2185507 2326067 2316729 2374837 2422305 2453006 2393861 2483535 2665244
$$ packed form
3875A387853j75974n9947M7603K57106j60234j86940J03969n3001l3957N7864
3865A184342K10505m3970r0312q3980O5496J28100q312J88076K1425L533K9062
3854A603965m8180N0813J17608j06714p8943J57813P2406P4051Q786J48249p6234
3843A923620R717K10944J50463J43260k7773j24230k09929j32099q9781J27239
3833A981431j2748p9484o4121R9139l4394k3532R4622L5845m0410K5803J27036
3822B109187J57780J07629m6021M3316L010j02707n6944N7233K7766K58975K77810
3811B837034Q6604K23288j4745K8505P9067o6543m040j74507j95789k16621j05229
3800B477024q5910j38585o7022J40560r338N8108M7468L0701n9145Q9674J81709
$$ plain form
3789 2665244 2670828 2623640 2643163 2657340 2610067 2611606 2603158 2784169 2701438 2569391 2796079
3778 2796079 2874480 3074716 3162155 3085336 3002133 2954246 3015257 2956916 2797921 2808038 2920194
3767 2920194 2954193 2766181 2636312 2603159 2561679 2792136 2686410 2693095 2745076 2846859 2925996
3756 2925996 2978617 3003858 2987157 3089028 3104662 3175166 3187979 2962653 2944836 3011108 2870954
3745 2870954 2934394 3096487 3146945 3190899 3170061 3286380 3358927 3438458 3376766 3190722 3222451
3734 3222451 3314798 3317764 3253853 3213987 3230519 3268681 3356448 3221426 3178203 3325095 3375078
3723 3375078 3237021 3244464 3306058 3314286 3384114 3385127 3391639 3474672 3579361 3683702 3577490
3712 3577490 3689928 3764221 3801354 3876087 3927096 4029241 4064626 4169281 4162334 4210477 4125358
$$ packed form
3789B665244N584m7188J9523J4177m7273J539q448J81011q2731j32047K26688
3778B796079P8401K00236Q7439p6819q3203m7887O1011n8341j58995J0117J12156
3767B920194L3999j88012j29869l3153m1480K30457j05726O685N1981J01783P9137
3756B925996N2621K5241j6701J01871J5634P0504J2813k25326j7817O6272j40154
3745B870954O3440J62093N0458M3954k0838J16319P2547P9531o1692j86044L1729
3734C222451R2347K966o3911l9866J6532L8162Q7767j35022m3223J46892M9983
3723C375078j38057P443O1594Q228O9828J013O512Q3033J04689J04341j06212
3712C577490J12438P4293L7133P4733N1009J02145L5385J04655o947M8143q5119
$$ plain form
3701 4125358 4076344 4099531 3916207 3828460 3786546 3779343 3947671 3871402 3796705 3701382 3863876
3690 3863876 3896658 3853143 3889321 3919881 3767255 3674567 3582301 3845534 3962718 3908261 3991362
3679 3991362 4061445 3922127 3964890 3965910 4011179 4100580 4278735 4351626 4312843 4346998 4433318
3668 4433318 4462246 4535119 4584355 4686321 4846830 4863033 5002736 5110446 5151511 5119092 5156605
3657 5156605 5055789 4954253 4966546 5078404 4991498 4925686 5066485 5121995 5055865 5027489 5115431
3646 5115431 5232730 5193957 5327883 5449229 5508506 5565304 5560502 5679115 5786959 5789760 5971871
3635 5971871 6158001 6498688 6786371 6934137 7267846 7660382 8135495 8262507 7869567 7551935
3625 7551935 7423709 7295989 7222636 7260189 7300565 7328471 7360751 7363854 7444261 7587730 7693027
$$ packed form
3701D125358m9014K3187j83324q7747m1914p203J68328p6269p4697r5323J62494
3690C863876L2782m3515L6178L0560j52626r2688r2266K63233J17184n4457Q3101
3679C991362P0083j39318M2763J020M5269Q9401J78155P2891l8783L4155Q6320
3668D433318K8928P2873M9236J01966J60509J6203J39703J07710M1065l2419L7513
3657E156605j00816j01536J2293J11858q6906o5812J40799N5510o6130k8376Q7942
3646E115431J17299l8773J33926J21346N9277N6798m802J18613J07844K801J82111
3635E971871J86130L40687K87683J47766L33709L92536M75113J27012l92940l17632
3625G551935j28226j27720p3353L7553M0376K7906L2280L103Q0407J43469J05297
$$ plain form
3614 7693027 7857262 7895242 8031708 8030487 8088149 8249603 8314424 8537031 8778040 8713483 8865345
3603 8865345 9051861 9318417 9475896 9767785 10054499 10355088 10711103 11041520 11261104 11476630
3593 11476630 11744601 11935815 12235430 12485373 12773709 13189940 13656518 14260545 14823413
3584 14823413 15482708 16084617 16678971 17369296 18085131 18793757 19455656 20176384 20961116
3575 20961116 22019581 23237995 24570920 26074765 27650569 29371797 31499435 33815722
3567 33815722 36403729 39251617 42379305 46113510 49963229 54477813 60101637 66910917
3559 66910917 75744103 86875687 100627699 117471850 134756503 144332893 146024232 141999401
3551 141999401 129703467 113261610 98561661 87438235 79484668 73798756 69748169
$$ packed form
3614G693027J64235L7980J36466j221N7662J61454O4821K22607K41009o4557J51862
3603H865345J86516K66556J57479K91889K86714L00589L56015L30417K19584K15526
3593A1476630K67971J91214K99615K49943K88336M16231M66578O04027N62868
3584A4823413O59295O01909N94354O90325P15835P08626O61899P20728P84732
3575B0961116J058465J218414J332925J503845J575804J721228K127638K316287
3567C3815722K588007K847888L127688L734205L849719M514584N623824O809280
3559F6910917Q833186J1131584J3752012J6844151J7284653R576390J691339m024831
3551A41999401j2295934j6441857j4699949j1123426p953567n685912m050587
$$ plain form
3544 69748169 67042261 65510621 64706499 64645224 65257079 66590105 68247072 70176470 72610116
3535 72610116 75587475 79176736 83629628 88895992 95049224 102338872 111431955 122941966
3527 122941966 138360136 158407563 183646684 214825507 248490877 266679296 268372684
3520 268372684 259956904 234196775 198916448 166875295 142826717 125274708 112307976
3513 112307976 102270827 94645170 88794610 84375855 80858863 78096117 76080142 74350822
3505 74350822 72868600 71619436 70672190 70281493 70529453 71311350 72856664 75152078 78483257
3496 78483257 82965114 89353453 97929064 109078413 123077860 138087792 146690901 147415217
3488 147415217 142953740 130677363 113592623 97560703 85147604 75896518 69071930
$$ packed form
3544F9748169k705908j531640q04122o1275O11855J333026J656967J929398K433646
3535G2610116K977359L589261M452892N266364O153232P289648R093083J1510011
3527A22941966J5418170K0047427K5239121L1178823L3665370J8188419J693388
3520B68372684q415780k5760129l5280327l2041153k4048578j7552009j2966732
3513A12307976j0037149p625657n850560m418755l516992k762746k015975j729320
3505G4350822j482222j249164r47246l90697K47960P81897J545314K295414L331179
3496G8483257M481857O388339Q575611J1149349J3999447J5009932Q603109P24316
3488A47415217m461477j2276377j7084740j6031920j2413099r251086o824588
$$ plain form
3481 69071930 63700127 59559696 56212906 53525012 51500131 49797184 48386355 47272314
3473 47272314 46330444 45266859 44434354 43948347 43614205 43685261 43911973 44464838 45035572
3464 45035572 46010188 47159780 48391792 50194455 51983920 54153307 56933370 60771748
3456 60771748 65835237 72475280 80424006 89065005 95219560 94712295 87361586 77410108
3448 77410108 68630873 61809415 56496811 52503418 49403351 47087173 45303479 43857256
3440 43857256 42865135 42375394 42130140 42169290 42367126 42761860 43387139 44174148 45089975 46241043
3430 46241043 47730669 49642534 52290585 55335449 58573183 62807380 68159439 75113407
3422 75113407 84632920 97197967 112509452 130878657 149281788 155235609 143658041
$$ packed form
3481F9071930n371803m140431l346790k687894k024881j702947j410829j114041
3473D7272314r41870j063585q32505m86007l34142P1056K26712N52865N70734
3464D5035572R74616J149592J232012J802663J789465K169387K780063L838378
3456F0771748N063489O640043P948726Q640999O154555n07265p350709r951478
3448G7410108q779235o821458n312604l993393l100067k316178j783694j446223
3440D3857256r92121m89741k45254L9150J97836L94734O25279P87009R15827J151068
3430D6241043J489626J911865K648051L044864L237734M234197N352059O953968
3422G5113407R519513J2565047J5311485J8369205J8403131N953821j1577568
$$ plain form
3415 143658041 123422127 104333654 89409066 77930498 69211789 62532452 57266669
3408 57266669 53216804 50109852 47511915 45295952 43475715 42167222 41043079 40309361
3400 40309361 39923536 39194730 38276014 37491150 36815634 36559374 36725949 37219468 38053976
3391 38053976 39260700 40897017 43095763 46474487 51103098 57178875 64220649 71723616
3383 71723616 76649772 75168363 67658148 58133374 49626243 43218229 38267540 34448601
3375 34448601 31315725 28694297 26982440 25490616 23904909 22735553 21679137 20584142
3367 20584142 19790771 18964169 18282573 17331653 16258886 15259859 14524312 13739974 13067494
3358 13067494 12491630 12092001 11462083 10986479 10558757 10143985 9820834 9631456 9399700
$$ packed form
3415A43658041k0235914j9088473j4924588j1478568q718709o679337n265783
3408E7266669m049865l106952k597937k215963j820237j308493j124143p33718
3400D0309361l85825p28806r18716p84864o75516k56260J66575M93519Q34508
3391C8053976J206724J636317K198746L378724M628611O075777P041774P502967
3383G1723616M926156j481409p510215r524774q507131o408014m950689l818939
3375C4448601l132876k621428j711857j491824j585707j169356j056416j094995
3367B0584142p93371q26602o81596r50920j072767r99027p35547p84338o72480
3358A3067494n75864l99629o29918m75604m27722m14772l23151j89378k31756
$$ plain form
3349 9399700 9132929 8889877 8670461 8338187 8104118 7981677 7736633 7418045 7126717 7004266
3339 7004266 6836989 6764797 6579529 6400773 6326386 6104599 5928385 5828397 5745792 5689922
3329 5689922 5581323 5452088 5335681 5049328 4846219 4955689 4859919 4803479 4725024 4719818
3319 4719818 4607181 4505646 4447487 4488681 4391281 4312001 4182604 3996782 3898323 3944606 3862604
3308 3862604 3826325 3856011 3856767 3806610 3671298 3579349 3535963 3410970 3376718 3319050 3307690
3297 3307690 3312466 3267939 3299731 3269940 3250229 3227663 3071218 3088035 2994775 3078211 3215932
3286 3215932 3145223 3078525 3023853 2822410 2694065 2712318 2738001 2722751 2715845 2823868 2788090
3275 2788090 2706938 2624022 2575610 2529953 2536067 2650908 2637899 2541735 2701649 2777001 2921720
$$ packed form
3349I399700k66771k43052k19416l32274k34069j22441k45044l18588k91328j22451
3339G004266j67277p2192j85268j78756p4387k21787j76214r9988q2605n5870
3329E689922j08599j29235j16407k86353k03109J09470r5770n6440p8455n206
3319D719818j12637j01535n8159M1194r7400p9280j29397j85822r8459M6283q2002
3308C862604l6279K9686P56n0157j35312r1949m3386j24993l4252n7668j1360
3297C307690M776m4527L1792k9791j9711k2566j56445J6817r3260Q3436J37721
3286C215932p0709o6698n4672k01443j28345J8253K5683j5250o906J08023l5778
3275B788090q1152q2916m8412m5657O114J14841j3009r6164J59914P5352J44719
$$ plain form
3264 2921720 2787462 2850246 2765540 2661101 2546272 2465990 2374194 2242740 2196003 2191902 2063973
3253 2063973 2124831 2240496 2150423 2217847 2103206 2060043 2188833 2110608 2058845 2151583 2191932
3242 2191932 2053446 1988726 2123395 2422939 2450314 2394653 2496085 2700789 2761508 2917844
3232 2917844 2818002 2876517 2867723 2596750 2374578 2263194 2149303 2064098 2027024 1988464 2069489
3221 2069489 2034206 2000747 1972743 2167576 2107790 1835791 1787464 1844084 1993792 2018188 1801241
3210 1801241 1981245 1992712 1962939 1987292 2224402 2288054 2297193 2497811 2695105 2768305 2897251
3199 2897251 2882775 2825211 2708775 2667682 2622217 2452646 2404964 2571637 2604793 2441038 2390518
3188 2390518 2489389 2583845 2651766 2657584 2670021 2836485 2871839 3021716 3247813 3301668 3413004
$$ packed form
3264B921720j34258O2784q4706j04439j14829q0282r1796j31454m6737m101j27929
3253B063973O0858J15665r0073O7424j14641m3163J28790p8225n1763R2738M0349
3242B191932j38486o4720J34669K99544K7375n5661J01432K04704O0719J56336
3232B917844r9842N8515q794k70973k22172j11384j13891q5205l7074l8560Q1025
3221B069489l5283l3459k8004J94833n9786k71999m8327N6620J49708K4396k16947
3210A801241J80004J1467k9773K4353K37110O3652R139K00618J97294P3200J28946
3199B897251j4476n7564j16436m1093m5465j69571m7682J66673L3156j63755n0520
3188B390518R8871R4456O7921N818J2437J66464L5354J49877K26097N3855J11336
$$ plain form
3177 3413004 3540921 3664780 3691258 3757904 3831101 3849047 3968538 4057225 4294963 4611865
3167 4611865 4904014 4865767 5107330 5328097 5202874 5116346 5117238 4963970 4816882 4883342 4885247
3156 4885247 4774413 4776553 4801549 4807844 4854416 4965077 5093409 5282269 5581443 5808690 5862721
3145 5862721 5947627 5949481 6009348 6021177 6044215 6101041 6096994 6129938 6128564 6361008 6682261 7035378
3133 7035378 7295245 7487025 7587042 7558172 7685454 7500910 7163843 7064402 6945589 6777384
3123 6777384 6623958 6788175 6684648 6503220 6419217 6204553 6019158 5993525 5862046 5775516
3113 5775516 5721846 5528847 5342404 5301683 5337643 5240260 5209391 5202747 5091720 4953472 4997528
3102 4997528 5225650 5391023 5504724 5463208 5419440 5260960 5225319 5421816 5421937 5226065 5128283
$$ packed form
3177C413004J27917J23859K6478O6646P3197J7946J19491Q8687K37738L16902
3167D611865K92149l8247K41563K20767j25223q6528Q92j53268j47088O6460J905
3156D885247j10834K140K4996O295M6572J10661J28332J88860K99174K27247N4031
3145E862721Q4906J854N9867J1829K3038N6826m047L2944j374K32444L21253L53117
3133G035378K59867J91780J00017k8870J27282j84544l37067r9441j18813j68205
3123F777384j53426J64217j03527j81428q4003k14664j85395k5633j31479q6530
3113E775516n3670j92999j86443m0721L5960r7383l0869o644j11027j38248M4056
3102D997528K28122J65373J13701m1516m3768j58480l5641J96497J21j95872r7782
$$ plain form
3091 5128283 5026253 4630331 4356702 4270382 4215311 4088313 3860915 3690500 3641651 3581967
3081 3581967 3458833 3307915 3071375 3171353 3089617 2964515 2860595 2764246 2675059 2688986
3071 2688986 2640923 2736698 2717272 2667799 2652031 2468515 2468318 2390253 2347309 2314755 2174091
3060 2174091 2055896 2114672 1964595 1853415 1719364 1651531 1424417 1479089 1540709 1497463
3050 1497463 1363379 1346180 1281035 1326230 1371583 1323726 1299037 1232837 1107237 1090711 1010770
3039 1010770 1128320 1077889 968341 1021795 930329 982950 913262 980833 1051358 1175306 945066
3028 945066 767881 777194 820125 724944 686877 656549 555186 685801 519813 397272 430368
3017 430368 477230 574838 400907 448124 616053 555432 405669 567372 615923 553720 385751
$$ packed form
3091E128283j02030l95922k73629q6320n5071j26998k27398j70415m8849n9684
3081C581967j23134j50918k36540R9978q1736j25102j03920r6349q9187J3927
3071B688986m8063R5775j9426m9473j5768j83516j97p8065m2944l2554j40664
3060B174091j18195N8776j50077j11180j34051o7833k27114N4672O1620m3246
3050A497463j34084j7199o5145M5195M5353m7857k4689o6200j25600j6526p9941
3039A010770J17550n0431j09548N3454r1466N2621o9688O7571P0525J23948k30240
3028I45066j77185R313M2931r5181l8067l0328j01363J30615j65988j22541L3096
3017D30368M6862R7608j73931M7217J67929o0621j49763J61703M8551o2203j67969
$$ plain form
3006 385751 405267 547220 488134 493972 479265 476072 426418 459048 516462 546098 467045 454943
2994 454943 404586 547612 521437 426565 376016 333881 337405 298866 281588 364269 365192 337604
2982 337604 266023 200412 363040 407941 439120 299475 220285 371584 484756 473098 310293
2971 310293 307510 338748 303261 204426 258350 299917 272356 141652 176805 325037 443169
2960 443169 322026 309219 253896 161563 147048 124551 89951 40923 181648 260713 207324
2949 207324 76610 80983 -107256 -54305 94061 -104618 2270 214384 47642 40237 -39223
2938 -39223 -152 144075 135133 84818 -833 135535 116015 109805 -12282 -104629 25703
2927 25703 90381 166312 -11843 -96555 -105362 -84993 -117623 17873 149852 156167 85918 85700
$$ packed form
3006C85751J9516J41953n9086N838j4707l193m9654L2630N7414K9636p9053j2102
2994D54943n0357J43026k6175r4872n0549m2135L524l8539j7278Q2681R23k7588
2982C37604p1581o5611J62628M4901L1179j39645p9190J51299J13172j1658j62805
2971C10293k783L1238l5487r8835N3924M1567k7561j30704L5153J48232J18132
2960D43169j21143j2807n5323r2333j4515k2497l4600m9028J40725P9065n3389
2949B07324j30714M373j88239N2951J48366j98679J06888K12114j66742p405p9460
2938c9223L9071J44227q942n0315q5651J36368j9520o210j22087r2347J30332
2927B5703O4678P5931j78155q4712q807K0369l2630J35496J31979O315p0249k18
$$ plain form
2915 85700 -45368 -12649 -20634 16264 -5221 9169 29920 15848 24320 -61877 106858 84830
2903 84830 -21660 -98299 -180152 -44187 106503 22059 -91888 1262 19260 -6988 98392
2892 98392 116622 137386 82062 -175462 -83128 22962 -1768 70168 97904 118940 -21002
2881 -21002 25107 -110653 -129595 -64575 -30447 100623 -33700 -55967 883 37166 -20814
2870 -20814 -39013 -13636 -57521 -80951 -133240 12023 47796 -48825 -11 -40265 27462 141699
2858 141699 -35188 -154967 -130332 -50062 -62735 -87937 32106 6399 -53800 -202665 -215556
2847 -215556 -195146 -78053 -118777 9058 16150 9109 -20157 -232235 -72397 86878 95804
2836 95804 194929 214413 113067 131765 117815 127152 -34278 -110515 -31511 -48141 -85348 26405
$$ packed form
2915H5700j31068L2719p985L6898k1485J4390K0751j4072Q472q6197J68735k2028
2903H4830j06490p6639q1853J35965J50690q4444j13947R3150J7998k6248J05380
2892I8392J8230K0764n5324k57524R2334J06090k4730P1936K7736K1036j39942
2881b1002M6109j35760j8942O5020L4128J31070j34323k2267N6850L6283n7980
2870b0814j8199K5377m3885k3430n2289J45263L5773r6621M8814m0254O7727J14237
2858A41699j76887j19779K4635Q0270j2673k5202J20043k5707o0199j48865j2891
2847b15556K0410J17093m0724J27835P092p041k9266k12078J59838J59275Q926
2836I5804R9125J9484j01346J8698j3950R337j61430p6237P9004j6630l7207J11753
$$ plain form
2824 26405 -75068 65165 81104 9139 -18236 -54979 -98954 138828 95884 54105 113186
2813 113186 187165 220846 74692 112234 33565 -100846 -79313 -22750 -10826 37587 -11567
2802 -11567 4456 -32545 -80731 -3683 6894 100677 126499 -39133 -19291 -148891 -216812
2791 -216812 -155561 -170690 -65353 -12096 -94563 -150989 -170631 -266885 -252345 -106906 -73676
2780 -73676 -111678 -36581 -121493 -63496 32453 -49825 116205 84905 -15922 -3968 51955
2769 51955 -100651 -108000 -31427 -49557 -10290 -104037 -189076 -215994 -40049 -10482 82585 -4410
2757 -4410 -109961 -9010 -8353 -94877 -22764 184181 73820 50066 77530 73861 32248 -134783
2745 -134783 -77076 -133260 -87368 -37075 -102121 -40213 31166 -75342 -111921 -76432 -193671
$$ packed form
2824B6405j01473J40233J5939p1965k7375l6743m3975K37782m2944m1779N9081
2813A13186P3979L3681j46154L7542p8669j34411K1533N6563J1924M8413m9154
2802a1567J6023l7001m8186P7048J0577R3783K5822j65632J9842j29600o7921
2791b16812O1251j5129J05337N3257q2467n6426j9642r6254J4540J45439L3230
2780g3676l8002P5097q4912N7997R5949q2278J66030l1300j00827J1954N5923
2769E1955j52606p349P6573j8130L9267r3747q5039k6918J75945K9567R3067q6995
2757d410j05551J00951O57q6524P2113K06945j10361k3754K7464l669m1613j67031
2745a34783N7707n6184M5892N0293o5046O1908P1379j06508l6579L5489j17239
$$ plain form
2734 -193671 -154396 -142868 -82747 -23699 79665 31218 -19521 -53775 -105713 -137119 -88183
2723 -88183 13806 9828 -11004 -13232 21263 -71715 -92932 -78517 -60229 -22670 -293 30831
2711 30831 -74725 -78141 -32514 2111 37884 -26784 338 -13183 -12754 -24641 -74663 -25037
2699 -25037 105725 193618 29816 -144478 -157623 -95229 -117096 -148998 -97320 -38835 -163583
2688 -163583 -144577 -152725 -153955 -78202 29143 -30067 -109282 56082 97765 29801 -102338
2677 -102338 -129890 -25806 58149 5418 47415 19281 -56773 -23589 75781 144066 15643
2666 15643 115878 166536 23001 -38057 41560 10235 -29547 9083 62028 36593 63626
2655 63626 148980 201510 134177 29803 22070 -8155 -36499 6740 51495 29240 -121539 -83801
$$ packed form
2734a93671L9275J1528O0121N9048J03364m8447n0739l4254n1938l1406M8936
2723h8183J01989l978k0832k228L4495r2978k1217J4415J8288L7559K2377L1124
2711C0831j05556l416M5627L4625L5773o4668K7122j3521M29j1887n0022M9626
2699b5037J30762Q7893j63802j74294j3145O2394k1867l1902N1678N8485j24748
2688a63583J9006q148j230P5753J07345n9210p9215J65364M1683o7964j32139
2677a02338k7552J04084Q3955n2731M1997k8134p6054L3184R9370O8285j28423
2666A5643J00235N0658j43535o1058P9617l1325l9782L8630N2945k5435K7033
2655F3626Q5354N2530o7333j04374p733l0225k8344M3239M4755k2255j50779L7738
$$ plain form
2643 -83801 -105838 -234326 -35109 72745 62829 60756 104252 121309 83081 123607 134693 36308
2631 36308 -7706 -22614 13796 199190 203113 67316 -13185 -3437 73653 113443 86191 200269
2619 200269 169765 -5509 58217 102978 179595 168172 114820 26484 56226 249822 324248
2608 324248 225257 210799 191278 211557 254770 321827 283639 309143 419117 434863 501939
2597 501939 579685 623730 619323 698890 792999 873530 898570 1217630 1330358 1417429 1402291
2586 1402291 1407363 1382083 1295256 1218023 859026 729548 647660 623687 528066 444938 417337
2575 417337 418369 458439 526903 575109 571188 452864 386488 483039 632511 433852 451009
2564 451009 430520 387562 463325 346259 347314 386580 302072 316720 409098 391262 349746 410333
$$ packed form
2643h3801k2037j28488J99217J07854r916k073M3496J7057l8228M0526J1086r8385
2631C6308m4014j4908L6410J85394L923j35797q0501R748P7090L9790k7252J14078
2619B00269l0504j75274O3726M4761P6617j1423n3352q8336K9742J93596P4426
2608C24248r8991j4458j9521K0279M3213O7057l8188K5504J09974J5746O7076
2597E01939P7746M4045m407P9567R4109Q0531K5040L19060J12728Q7071j5138
2586A402291N072k5280q6827p7233l58997j29478q1888k3973r5621q3128k7601
2575D17337J032M0070O8464M8206l921j18324o6376R6551J49472j98659J7157
2564D51009k0489m2958P5763j17066J055L9266q4508J4648R2378j7836m1516O0587
$$ plain form
2552 410333 419098 179868 223773 236747 392231 435987 367961 430558 498020 411244 371739
2541 371739 507198 490254 453473 460180 460095 391956 292713 315806 426613 502999 490416 386394
2529 386394 537581 410458 340785 394901 327554 452326 582703 429055 301024 397741
2519 397741 500425 487752 490123 401763 361138 424575 473666 531317 512419 661122 888717
2508 888717 748459 582034 570154 546765 626885 766424 811793 607690 499717 638949
2498 638949 487180 673597 592952 549304 580079 652430 748558 747132 800143 713243 706502 632636
2486 632636 615733 665603 546930 516155 615422 626786 552413 619312 525247 606410 630730
2475 630730 533407 498542 465689 486490 375832 459541 625651 657769 545014 590383 709603
$$ packed form
2552D10333Q765k39230M3905J2974J55484M3756o8026O2597O7462q6776l9505
2541C71739J35459j6944l6781O707q5o8139r9243K3093J10807P6386j2583j04022
2529C86394J51187j27123o9673N4116o7347J24772J30377j53648j28031R6717
2519C97741J02684j2673K371q8360m0625O3437M9091N7651j8898J48703K27595
2508H88717j40258j66425j1880k3389Q0120J39539M5369k04103j07973J39232
2498F38949j51769J86417q0645m3648L0775P2351R6128j426N3011q6900o741p3866
2486F32636j6903M9870j18673l0775R9267J1364p4373O6899r4065Q1163K4320
2475F30730r7323l4865l2853K0801j10658Q3709J66110L2118j12755M5369J19220
$$ plain form
2464 709603 706087 582376 530155 608802 566654 580446 684151 812202 899227 759855 783052
2453 783052 894067 813031 746925 740501 762339 867878 864643 912012 910294 917804 854363 888120
2441 888120 896393 992274 881338 879118 938450 968057 1058039 1128850 916438 960548 1096396
2430 1096396 1220478 1050271 1227900 1346127 1255972 1158560 1273695 1206426 1255101 1383506
2420 1383506 1469715 1410358 1508010 1623383 1512451 1529936 1647870 1667866 1668674 1707414 1771369
2409 1771369 1675583 1885849 1785262 1750523 1891023 2013696 2074941 2058533 1982467 2112693
2399 2112693 2184593 2130721 2284103 2464091 2596286 2662604 2580380 2617365 2781191 2904700
2389 2904700 3018420 3075474 3136892 3158159 3242021 3438776 3428826 3403374 3576128 3696238 3755473
$$ packed form
2464G09603l516j23711n2221P8647m2148J3792J03705J28051Q7025j39372K3197
2453G83052J11015q1036o6106o424K1838J05539l235M7369j718P510o3441L3757
2441H88120Q273R5881j10936k220N9332K9607Q9982P0811k12412M4110J35848
2430A096396J24082j70207J77629J18227r0155r7412J15135o7269M8675J28405
2420A383506Q6209n9357R7652J15373j10932J7485J17934J9996Q08L8740O3955
2409A771369r5786K10266j00587l4739J40500J22673O1245j6408p6066J30226
2399B112693P1900n3872J53382J79988J32195O6318q2224L6985J63826J23509
2389B904700J13720N7054O1418K1267Q3862J96755r950k5452J72754J20110N9235
$$ plain form
2378 3755473 3811306 3985114 4192569 4383129 4483280 4712583 4846814 5024954 5037423 5130476
2368 5130476 5314528 5620334 5793049 6029118 6316286 6798222 7220623 7616679 7900128 8380133
2358 8380133 8641871 9036783 9556404 10107793 10757806 11519389 12255000 13107433 14021931 14993439
2348 14993439 15744726 16631647 17514145 18566561 19800335 21571129 23208316 25529320 28120893
2339 28120893 31117990 34124579 37669637 41610459 45387878 48084911 50861822 54458567
2331 54458567 59810864 65856364 73543366 82394988 93800930 107854479 127341147 152520655
2323 152520655 184886761 222559579 271381424 293152589 257785412 203899788 159767180
2316 159767180 131001999 110375928 95663521 83249162 73416322 65524533 59738433
$$ packed form
2378C755473N5833J73808K07455J90560J00151K29303J34231J78140J2469R3053
2368E130476J84052L05806J72715K36069K87168M81936M22401L96056K83449M80005
2358H380133K61738L94912N19621N51389O50013P61583P35611Q52433R14498R71508
2348A4993439P51287Q86921Q82498J052416J233774J770794J637187K321004K591573
2339B8120893K997097L006589L545058L940822L777419K697033K776911L596745
2331E4458567N352297O045500P687002Q851622J1405942J4053549J9486668K5179508
2323A52520655L2366106L7672818M8821845K1771165l5367177n3885624m4132608
2316A59767180k8765181k0626071j4712407j2414359r832840p891789n786100
$$ plain form
2309 59738433 55374203 52411509 49657853 47520847 44864162 41310278 37108048 33388809
2301 33388809 30447598 28390041 26452339 24766146 23155599 21779361 20292469 18864152
2293 18864152 17597828 16569717 15695389 14860565 14161603 13667562 13181302 12752618 12329417
2284 12329417 11851602 11360210 10731802 9939764 9387815 8913402 8558011 8257321 8076176
2275 8076176 7759124 7546588 7206060 6928599 6629133 6396589 6132045 5788988 5497391 5355188
2265 5355188 5054806 4919964 4892971 4775399 4615168 4397661 4347548 4410777 4278691 4098860
2255 4098860 4022490 3781131 3649357 3500392 3464752 3417078 3386450 3349074 3297445 3021369 3041015
2244 3041015 3176260 3262438 2991785 2800518 2854295 2903854 2731103 2633201 2516133 2541235
$$ packed form
2309E9738433m364230k962694k753656k137006k656685l553884m202230l719239
2301C3388809k941211k057557j937702j686193j610547j376238j486892j428317
2293A8864152j266324j028111q74328q34824o98962m94041m86260m28684m23201
2284A2329417m77815m91392o28408p92038n51949m74413l55391l00690j81145
2275H076176l17052k12536l40528k77461k99466k32544k64544l43057k91597j42203
2265E355188l00382j34842k6993j17572j60231k17507n0113O3229j32086j79831
2255D098860p6370k41359j31774j48965l5640m7674l0628l7376n1629k76076J9646
2244C041015J35245Q6178k70653j91267N3777M9559j72751r7902j17068K5102
$$ plain form
2234 2541235 2565252 2531676 2355438 2202517 2134427 2082610 1967716 2043615 2056636 2136853 2190068
2223 2190068 2045083 1996355 1975520 1952689 1976629 1792957 1733404 1816708 1801697 1840758 1764345
2212 1764345 1843516 1960787 1822851 1747799 1724900 1537490 1478631 1480873 1398538 1460681 1377059
2201 1377059 1276239 1317004 1406175 1398498 1184759 1092523 1223858 1221385 1190633 1295081 1300982
2190 1300982 1184447 1088836 1145471 1073999 1020231 1030445 1073189 952512 899333 1085923 1116817
2179 1116817 1168628 1061736 1047396 1038685 960970 860947 818311 837080 765009 709847 772300
2168 772300 886217 977750 738113 818506 730107 715975 719257 766938 569391 629621 579466
2157 579466 486275 461849 396014 357826 428732 509254 483786 485139 373625 330705 349498 277703
$$ packed form
2234B541235K4017l3576j76238j52921o8090n1817j14894P5899J3021Q0217N3215
2223B190068j44985m8728k0835k2831K3940j83672n9553Q3304j5011L9061p6413
2212A764345P9171J17271j37936p5052k2899j87410n8859K242q2335O2143q3622
2201A377059j00820M0765Q9171p677k13739r2236J31335k473l0752J04448N901
2190A300982j16535r5611N6635p1472n3768J0214M2744j20677n3179J86590L0894
2179A116817N1811j06892j4340q711p7715j00023m2636J8769p2071n5162O2453
2168G72300J13917R1533k39637Q0393q8399j4132L282M7681j97547O0230n0155
2157E79466r3191k4426o5835l8188P0906Q0522k5468J353j11514m2920J8793p1795
$$ plain form
2145 277703 178135 159739 260844 264722 293825 347342 326212 148541 255375 260815 148132
2134 148132 117715 176862 237935 289241 213948 118934 187548 88450 185265 255468 277170 202283
2122 202283 85523 103787 53738 44918 176999 64480 174996 311981 400697 246424 250567
2111 250567 270050 173520 242543 222409 323294 406267 176562 118801 127314 173745 230953
2100 230953 178158 22344 140818 108269 98577 41556 16065 12477 108081 227274 268652
2089 268652 222122 65785 70613 97828 96659 139414 56306 109790 76456 62220 -434 26420
2077 26420 -78998 -100166 10170 76820 63266 47882 131157 154864 268946 185299 152798
2066 152798 283668 322867 338768 234777 285746 257346 220688 323416 502554 457490 438431
$$ packed form
2145B77703r9568j8396J01105L878K9103N3517k1130j77671J06834N440j12683
2134A48132l0417N9147O1073N1306p5293r5014O8614r9098R6815P0203K1702p4887
2122B02283j16760J8264n0049q820J32081j12519J10516J36985Q8716j54273M143
2111B50567J9483r6530O9023k0134J00885Q2973k29705n7761Q513M6431N7208
2100B30953n2795j55814J18474l2549r692n7021k5491l588R5604J19193M1378
2089B68652m6530j56337M828K7215j169M2755q3108N3484l3334j4236o2654K6854
2077B6420j05418k1168J10336O6650j3554j5384Q3275K3707J14082q3647l2501
2066A52798J30870L9199J5901j03991N0969k8400l6658J02728J79138m5064j9059
$$ plain form
2055 438431 602128 826389 1033790 1322117 1331224 1308798 1228410 993715 801126 725746 588172
2044 588172 480193 384910 417659 373021 228634 333949 274644 192317 317674 276318 68398
2033 68398 -69826 138308 105029 11398 101701 108549 199592 321890 468217 169059 30127
2022 30127 16611 60018 -9523 -69285 -56670 130762 221516 119630 -9686 123748 125265
2011 125265 68339 -55670 -90085 -31460 -23143 -193850 -222635 -58299 -2926 -133207 -108818
2000 -108818 -13581 61528 -50869 -90423 5466 -10528 -44092 -66774 -56644 -232285 -290356
1989 -290356 -66493 -129598 -35495 140015 129843 18958 -131716 -178268 32 74375 18412
1978 18412 -11750 -91209 -94722 -39460 5014 -54816 -141957 -108921 -87196 -51096 -166493 -165918
$$ packed form
2055D38431J63697K24261K07401K88327R107k2426q0388k34695j92589p5380j37574
2044E88172j07979r5283L2749m4638j44387J05315n9305q2327J25357m1356k07920
2033F8398j38224K08134l3279r3631R0303O848R1043J22298J46327k99158j38932
2022C0127j3516M3407o9541n9762J2615J87432R0754j01886j29316J33434J517
2011A25265n6926j24009l4415N8625Q317j70707k8785J64336N5373j30281K4389
2000a08818R5237P5109j12397l9554R5889j5994l3564k2682J0130j75641n8071
1989b90356K23863o3105R4103J75510j0172j10885j50674m6552J78300P4343n5963
1978A8412l0162p9459l513N5262M4474n9830q7141L3036K1725L6100j15397N75
$$ plain form
1966 -165918 -6424 -40259 -133714 -59054 -226347 -296465 -172219 -22366 -9762 19240 -164826
1955 -164826 -343461 -250267 -271147 -133118 -218438 -235219 -233566 -174753 -28453 48040 -21165
1944 -21165 -210473 -123859 -58796 -167718 -68769 -125964 -131797 -150635 -187009 -110820 -135719 -79206
1932 -79206 -55947 -142898 -168082 -267798 -25073 30557 -65628 -313179 -292137 -158117 -79560
1921 -79560 -8694 -86858 -97490 25887 16837 -75655 29639 -50838 -104685 -49782 -4693 79217
1909 79217 -29323 -146900 -154335 -75985 4975 -166792 -148078 -58171 -143505 -142184 -249613
1898 -249613 -264550 -126050 -116548 -273672 -265536 -178276 -253786 -56756 -37500 -8504 -127877
1887 -127877 -152130 -201557 -143567 12156 68077 38147 -85072 -134897 -150812 -123993 -130383
$$ packed form
1966a65918J59494l3835r3455P4660j67293p0118J24246J49853J2604K9002j84066
1955a64826j78635R3194k0880J38029q5320j6781J653N8813J46300P6493o9205
1944b1165j89308Q6614O5063j08922R8949n7195n833j8838l6374P6189k4899N6513
1932g9206K3259q6951k5184r9716K42725N5630r6185k47551K1042J34020P8557
1921g9560P0866p8164j0632J23377r050r2492J05294q0477n3847N4903M5089Q3910
1909G9217j08540j17577p435P8350Q0960j71767J8714Q9907q5334J321j07429
1898b49613j4937J38500R502j57124Q136Q7260p5510J97030J9256K8996j19373
1887a27877k4253m9427N7990J55723N5921k9930j23219m9825j5915K6819o390
$$ plain form
1876 -130383 -222691 -55746 25754 -20630 -53666 -132171 -200316 -137881 -123819 -24786 -45003
1865 -45003 -93535 -34351 -96263 -10822 -65119 13228 3334 24266 -42165 -6549 -63407 -151620
1853 -151620 -115619 -20052 -226152 -180820 -185133 -215774 -129929 -84467 -146330 -336721 -190767
1842 -190767 8763 -55957 -55310 -107602 -125504 -185084 -302384 -234677 -104823 -91647 -140013
1831 -140013 -155217 -83597 -99027 -149020 -135537 -93144 -30346 -87053 -118424 -95031 13806
1820 13806 26138 43587 168934 101644 -144944 -174168 -134695 -132869 -226731 1689 39364
1809 39364 -82328 -124161 -129415 -3292 -87672 -212068 -93247 51082 -158185 -199509 -241852
1798 -241852 -320678 -292655 -229197 -198119 -110399 -41944 -134938 -30506 165141 -66357 -133787
$$ packed form
1876a30383r2308J66945Q1500m6384l3036p8505o8145O2435J4062R9033k0217
1865d5003m8532N9184o1912Q5441n4297P8347r894K0932o6431L5616n6858q8213
1853a51620L6001R5567k06100M5332m313l0641Q5845M5462o1863j90391J45954
1842a90767J99530o4720O47n2292j7902n9580j17300O7707J29854J3176m8366
1831a40013j5204P1620j5430m9993J3483M2393O2798n6707l1371K3393J08837
1820A3806J2332J7449J25347o7290k46588k9224L9473J826r3862K28420L7675
1809C9364j21692m1833n254J26123q4380j24396J18821J44329k09267m1324m2343
1798b41852p8826K8023O3458L1078Q7720O8455r2994J04432J95647k31498o7430
$$ plain form
1787 -133787 -110431 -150832 -22620 -70614 -95115 -167399 -128176 -122612 -76857 -255872 -206332
1776 -206332 -217517 -292462 -271988 -47367 -23928 -109186 -182680 -222414 -189452 -116387 -28543
1765 -28543 -125896 -87798 -145893 -143313 -117033 -191995 -257580 -304482 -222561 -162010 -146520 -40797
1753 -40797 -30288 -132818 -81599 -196827 -46504 64780 -39890 -69485 -188644 -41408
1743 -41408 25720 -21154 -14660 55942 -90145 -134588 -102589 -30371 -54801 -53089 -80148 -156537
1731 -156537 -158720 -224745 -32861 52163 -17159 87260 36686 -5151 -25710 -115741 -36994
1720 -36994 -20481 -20689 73148 3840 -99315 -88402 -38317 -122907 -196116 -231058 -44586 127720
1708 127720 42604 -126385 -135474 -14901 -26948 25564 -53064 -113713 -14874 92290 35366
$$ packed form
1787a33787K3356m0401J28212m7994k4501p2284L9223N564M5755j79015M9540
1776b06332j1185p4945K0474K24621K3439q5258p3494l9734L2962P3065Q7844
1765b8543r7353L8098n8095K580K6280p4962o5585m6902Q1921O0551J5490J05723
1753d0797J0509j02530N1219j15228J50323J11284j04670k9595j19159J47236
1743d1408O7128m6874O494P0602j46087m4443L1999P2218k4430J712k7059p6389
1731a56537k183o6025J91884Q5024o9322J04419n0574m1837k0559r0031P8747
1720c6994J6513k08R3837o9308j03155J0913N0085q4590p3209l4942J86472J72306
1708A27720q5116j68989r089J20573j2047N2512p8628o0649R8839J07164n6924
$$ plain form
1697 35366 -9520 58078 80210 11148 -60084 -92890 -48877 -8665 -55713 2971 67726 120773
1685 120773 72919 -36266 -54794 -101638 -112542 -85454 -21738 8579 -79282 -93119 -187617
1674 -187617 -145477 -41677 -136330 -140246 -33799 -21128 -74478 -1035 -59858 -136289 -190097
1663 -190097 -233533 -79477 -9041 -131345 -126109 -134623 -251921 -100999 -76336 -88850 -16241
1652 -16241 -8216 -77494 -116941 -140783 -92375 71778 -14922 -19648 -149838 -90520 -88986 -142172
1640 -142172 -116818 -110783 -125250 -168466 -125071 -126723 -262386 -153283 11181 -193831 -242365
1629 -242365 -100902 -26668 -57606 -87614 -120137 -51308 -62590 4117 -16268 11614 -68528
1618 -68528 -158519 -175852 71299 188557 111150 -3944 -74697 -9496 55945 -49608 -118777
$$ packed form
1697C5366m4886O7598K2132o9062p1232l2806M4013M0212m7048N8684O4755N3047
1685A20773m7854j09185j8528m6844j0904K7088O3716L0317q7861j3837r4498
1674a87617M2140J03800r4653l916J06447J2671n3350P3443n8823p6431n3808
1663a90097m3436J54056P0436j22304N236q514j17298J50922K4663j2514P2609
1652a6241Q025o9278l9447k3842M8408J64153q6700m726j30190N9318J534n3186
1640a42172K5354O035j4467m3216M3395j652j35663J09103J64464k05012m8534
1629b42365J41463P4234l0938l0008l2523O8829j1282O6707k0385K7882q0142
1618f8528q9991j7333K47151J17258p7407j15094p0753O5201O5441j05553o9169
$$ plain form
1607 -118777 -37213 14790 -45948 43777 47106 -87377 -50293 -23178 99210 3672 -213481
1596 -213481 -248026 -104286 -194021 -107870 -68268 -100685 -105214 -101318 -131803 -206899 -247993 -204305
1584 -204305 -79114 -29080 24397 -14179 -113421 -131847 -54297 -59630 -18463 35421 -55476 16198
1572 16198 2321 -82259 37513 39105 -41408 -190164 -106582 81000 45433 144863 -71208
1561 -71208 -17654 53096 104147 4409 -54685 -18636 -131922 23235 -76969 -71973 -53051
1550 -53051 -1313 -2560 -109883 -53688 -18431 -58679 49949 -138114 -270696 -145182 -88154
1539 -88154 -154735 -212845 -125500 -41698 -89160 -47835 -61616 -22511 -32333 -28743 -74934 -92069
1527 -92069 -161739 -187489 -201658 -247192 -148307 -104317 -11298 -105990 -153806 -18986 -43818 -111445
$$ packed form
1607a18777Q1564N2003o0738Q9725L329j34483L7084K7115J22388r5538k17153
1596b13481l4545J43740q9735Q6151L9602l2417m529L896l0485p5096m1094M3688
1584b04305J25191N0034N3477l8576r9242j8426P7550n333M1167N3884r0897P1674
1572A6198j3877q4580J19772J592q0513j48756Q3582J87582l5567R9430k16071
1561g1208N3554P0750N1051r9738n9094L6049j13286J55157j00204M996J8922
1550e3051N1738j247j07323N6195L5257m0248J08628j88063j32582J25514N7028
1539h8154o6581n8110Q7345Q3802m7462M1325j3781L9105r822L590m6191j7135
1527i2069o9670k5750j4169m5534R8885M3990R3019r4692m7816J34820k4832o7627
$$ plain form
1515 -111445 76898 79171 50096 72478 31570 -35367 41827 -122191 -197093 -70628 -23790
1504 -23790 46527 -58855 -142514 -89420 -97324 -133083 -180120 -144758 -157132 -126846 -128713 -116423
1492 -116423 -175161 -209036 -42498 -40450 -68192 -19152 -97689 -132006 -140189 -131377 -15404 -4122
1480 -4122 -45907 136887 213139 29533 10381 -32509 12702 15539 15768 3242 -78687 22531
1468 22531 16744 -16170 -75927 35573 64867 -104070 -172146 -183369 33303 36761 -102265
1457 -102265 -89776 -104322 -93010 -36212 -68858 -13105 -71555 -50899 -31911 -15953 86560
1446 86560 -22431 16872 26881 -10930 -28836 44522 74059 -13937 -16047 38992 77253 14992
1434 14992 20269 46778 4463 -5377 -92639 -170463 -24703 -37630 -38389 23240 49760 38313
$$ packed form
1515a11445J88343K273k9075K2382m0908o6937P7194j64018p4902J26465M6838
1504b3790P0317j05382q3659N3094p904l5759m7037L5362j2374L0286j867J2290
1492a16423n8738l3875J66538K048k7742M9040p8537l4317q183Q812J15973J1282
1480d122m1785J82794P6252j83606j9152m2890M5211K837K29j2526q1929J01218
1468B2531n787l2914n9757J11500K9294j68937o8076j1223K16672L458j39026
1457a02265J2489j4546J1312N6798l2646N5753n8450K0656J8988J5958J02513
1446H6560j08991L9303J0009l7811j7906P3358K9537q7996k110N5039L8261o2261
1434A4992N277K6509m2315r840q7262p7824J45760j2927p59O1629K6520j1447
$$ plain form
1422 38313 -155905 -99734 -56576 -64207 113900 69478 -70921 -66530 -36605 33124 -2860 -177418
1410 -177418 -156732 -55738 -86671 -135232 -43059 29986 62100 -226103 -237664 -22441 -19571
1399 -19571 -46849 -110228 -137893 -149072 -29886 -59631 -86180 -130400 -64122 7833 -130742
1388 -130742 -15479 76873 1455 -90820 -141624 -57330 -31878 -32257 66565 -67997 -132801 -228358
1376 -228358 -203649 -10849 105039 164759 130463 94574 131306 76822 -59146 15493 -61003
1365 -61003 -44109 -35851 -202865 -257771 -149413 -84819 -90010 627 -67594 -58231 -62804 -104721
1353 -104721 -39599 -21272 32362 33736 -11738 -37788 -32734 -119806 -145033 -145404 -157886 -86394
1341 -86394 -149065 -137448 23782 -43749 -125405 -89467 -46340 -178593 -67276 21697 -91205
$$ packed form
1422C8313j94218N6171M3158p631J78107m4422j40399M391K9925O9729l5984j74558
1410a77418K0686J00994l0933m8561R2173P3045L2114k88203j1561K15223K870
1399a9571k7278o3379k7665j1179J19186k9745k6549m4220O6278P1955j38575
1388a30742J15263R2352p5418r2275n0804Q4294K5452l79R8822j34562o4804r5557
1376b28358K4709J92800J15888N9720l4296l5889L6732n4484j35968P4639p6496
1365f1003J6894Q258j67014n4906J08358O4594n191R0637o8221R363m573m1917
1353a04721O5122J8327N3634J374m5474k6050N054q7072k5227l71j2482P1492
1341h6394o2671J1617J61230o7531q1656L5938M3127j32253J11317Q8973j12902
$$ plain form
1330 -91205 -168543 -81200 31265 140359 191731 6461 -24095 -132254 -135679 -74947 5065
1319 5065 68184 -43857 -81074 -69791 -69655 -15907 10805 -37919 -86402 -88670 20194 32756
1307 32756 99145 193152 122351 75796 82356 20744 -44753 73556 -44863 15830 69560 -129415
1295 -129415 -102788 -79926 -180814 -138059 -51324 -189881 -110026 37712 -15091 -128498 -188490
1284 -188490 -116528 2261 -37848 -93820 -129754 -148028 -112094 -3503 -73793 9274 1106
1273 1106 128170 44856 -128530 -112078 -109700 -23826 11459 -59642 -115080 -12947 40638 39265
1261 39265 25873 -120681 -160384 -1696 63117 -12329 -40528 38260 67827 86363 35516
1250 35516 76279 121981 -35078 -28796 8459 -62145 -21334 23438 86857 15965 44337 -87951
$$ packed form
1330i1205p7338Q7343J12465J09094N1372j85270l0556j08159l425O0732Q0012
1319E065O3119j12041l7217J1283J36N3748K6712m8724m8483k268J08864J2562
1307C2756O6389R4007p0801m6555O560o1612o5497J18309j18419O0693N3730j98975
1295a29415K6627K2862j00888M2755Q6735j38557P9855J47738n2803j13407n9992
1284a88490P1962J18789m0109n5972l5934j8274L5934J08591p0290Q3067q168
1273A106J27064q3314j73386J6452K378Q5874L5285p1101n5438J02133N3585j373
1261C9265j3392j46554l9703J58688O4813p5446k8199P8788K9567J8536n0847
1250C5516M0763M5702j57059O282L7255p0604M0811M4772O3419p0892K8372j32288
$$ plain form
1238 -87951 24548 221152 266709 80026 58550 -28837 -188407 -233452 -116394 6605 93212
1227 93212 143608 100306 12989 -158632 -95198 53253 42076 115129 113404 69417 102025 -18537
1215 -18537 -34961 -67845 -114061 -82291 -80024 14635 -52818 -37595 43078 -30235 -28978 -10202
1203 -10202 -44627 -129712 -132729 -47371 52093 153622 91602 -101545 -127883 -36171 -59211 -28737
1191 -28737 -37889 -104642 -147004 -116492 -29857 20034 -38185 -168465 -33341 -17930 -74783 -81625
1179 -81625 -22769 6516 -23412 -26889 40858 70949 141990 105191 105928 103905 41774 124276 30093
1166 30093 -117984 -75585 -46497 -50380 -212658 -184675 -31904 -32791 -14155 -156195 -104277 170945
1154 170945 220007 38860 33729 -52683 -48201 50980 99437 85900 6868 150361 131063 73309
$$ packed form
1238h7951J12499J96604M5557j86683k1476q7387j59570m5045J17058J22999Q6607
1227I3212N0396m3302q7317j71621O3434J48451j1177P3053j725m3987L2608j20562
1215a8537j6424l2884m6216L1770K267R4659o7453J5223Q0673p3313J257J8776
1203a0202l4425q5085l017Q5358R9464J01529o2020j93147k6338R1712k3040L0474
1191b8737r152o6753m2362L0512Q6635M9891n8219j30280J35124J5411n6853o842
1179h1625N8856K9285k9928l477O7747L0091P1041l6799P37k023o2131Q2502r4183
1166C0093j48077M2399K9088l883j62278K7983J52771q87J8636j42040N1918K75222
1154A70945M9062j81147n131q6412M482R9181M8457j3537p9032J43493j9298n7754
$$ plain form
1142 73309 32663 14006 -25932 63752 99220 51166 130393 150622 102862 115269 187645 160708
1130 160708 -7521 -5465 178315 142277 47032 48921 93329 23808 -59948 -25421 -44255 2472
1118 2472 41220 -6782 -42034 233125 141200 -68522 -6113 37695 91312 131692 139693 122887
1106 122887 34752 -132775 -175583 -140514 -12597 44226 36147 58774 -53924 -63478 -104463
1095 -104463 -20262 -6402 24503 72684 143660 107435 47241 -22977 -24679 710 28709 154547
1083 154547 139627 42663 -78414 -73622 -63933 -16691 -126833 -92159 -34068 24389 82621 13581
1071 13581 -31885 84226 4522 -25116 -22266 115107 131950 -60787 -40817 -10086 -64869
1060 -64869 -56365 -111087 -72081 104489 74770 7624 -23614 -68592 -18376 -62235 -121060 -217493
$$ packed form
1142G3309m0646j8657l9938Q9684L5468m8054P9227K0229m7760J2407P2376k6937
1130A60708j68229K056J83780l6038r5245J889M4408o9521q3756L4527j8834M6727
1118B472L8748m8002l5252K75159r1925k09722O2409M3808N3617M0380Q001j6806
1106A22887q8135j67527m2808L5069J27917N6823q079K2627j12698r554m0985
1095a04463Q4201J3860L0905M8181P0976l6225o0194p0218j702K5389K7999J25838
1083A54547j4920r6964j21077M792R689M7242j10142L4674N8091N8457N8232o9040
1071A3581m5466J16111p9704k9638K850J37373J6843j92737J9970L0731n4783
1060f4869Q504n4722L9006J76570k9719o7146l1238m4978N0216m3859n8825r6433
$$ plain form
1048 -217493 -169499 -99878 26286 22224 -16024 58121 -51174 33828 8365 36371 24547
1037 24547 -8121 -54487 -118527 3466 -75017 26903 128667 95071 -25796 -75003 -20854
1026 -20854 113529 109285 41797 -18149 146876 101340 95061 22304 -38185 21175 5414 42840
1014 42840 51044 37947 208 14547 -103435 -23934 16239 86334 101978 142034 16619 -43604
1002 -43604 46196 -52933 -43379 47891 35551 104061 107938 195551 152835 42912 -33812 -8994
990 -8994 11485 -14954 31922 -70218 -88905 -145823 -172769 -72136 3922 -674 21239 -17212
978 -17212 -140359 -218001 -139805 45278 71812 -73145 -150201 -55124 29283 80353 13415
967 13415 -25053 63416 205177 159404 34423 15221 65993 205242 139423 42964 31502
$$ packed form
1048b17493M7994O9621J26164m062l8248P4145j09295Q5002k5463K8006j1824
1037B4547l2668m6366o4040J21993p8483J01920J01764l3596j20867m9207N4149
1026b0854J34383m244o7488n9946J65025m5536o279p2757o0489N9360j5761L7426
1014D2840Q204j3097l7739J4339j17982P9501M0173P0095J5644M0056j25415o0223
1002d3604Q9800r9129R554R1270j2340O8510L877Q7613m2716j09923p6724K4818
990h994K0479k6439M6876j02140j8687n6918k6946J00633P6058m596K1913l8451
978a7212j23147p7642P8196J85083K6534j44957p7056R5077Q4407N1070o6938
967A3415l8468Q8469J41761m5773j24981j9202N0772J39249o5819r6459j1462
$$ plain form
956 31502 91175 -15993 -58410 -3495 -32371 29854 -27011 -87010 -52827 15799 -40282 -175495
944 -175495 -122593 -9967 156162 109126 -7042 88472 124441 129139 50394 -194 -2021 -63169
932 -63169 -61014 35854 756 94823 147532 74420 -21397 69270 -65590 -181190 -125849 -37862
920 -37862 20525 72096 -34187 15360 -124321 -258556 18609 67585 111442 88014 127888
909 127888 101830 49895 272999 228317 179002 120417 145145 57167 -32088 -14746 -24611 -39084
897 -39084 -169453 -125341 5063 108629 44304 -27172 -43548 -48562 118830 91185 37035
886 37035 52421 76432 170715 140812 122582 23972 39118 -38288 28103 -79704 97713 79060
874 79060 128295 53404 -27944 85272 -4217 1900 54231 112330 204141 121461 -38805 37531
$$ packed form
956C1502N9673j07168m2417N4915k8876O2225n6865n9999L4183O8626n6081j35213
944a75495N2902J12626J66129m7036j16168R5514L5969M698p8745n0588j827o1148
932f3169K155R6868l5098R4067N2709p3112r5817R0667j34860j15600N5341Q7987
920c7862N8387N1571j06283M9547j39681j34235K77165M8976M3857k3428L9874
909A27888k6058n1935K23104m4682m9315n8585K4728q7978q9255J7342r865j4473
897c9084j30369M4112J30404J03566o4325p1476j6376n014J67392k7645n4150
886C7035J5386K4011R4283k9903j8230r8610J5146p7406O6391j07807J77417j8653
874G9060M9235p4891q1348J13216q9489O117N2331N8099R1811q2680j60266P6336
$$ plain form
862 37531 176377 35740 4965 87552 64603 91853 173662 328961 265017 125249 -10942
851 -10942 161144 132083 77874 52355 -127979 -48864 77832 101263 227618 164575 212046
840 212046 173907 158538 67620 37127 147267 157036 35501 96132 118453 63879 38479 -22112
828 -22112 -2583 -159545 -92881 -47019 -103028 -54071 142045 167909 61482 12661 50296
817 50296 118300 226570 130566 30629 146386 211682 128714 100792 128677 235608 235279 337104
805 337104 108029 -25648 20284 23931 79756 172076 105952 69248 11760 44240 95318 130536
793 130536 -30299 -146695 -93763 -59711 -117354 -112751 -81992 7149 -10215 -78340 23512
782 23512 23343 25265 36224 48245 42578 121513 -57002 -44137 72928 100183 80230 108742
$$ packed form
862C7531J38846j40637l0775Q2587k2949K7250Q1809J55299o3944j39768j36191
851a0942J72086k9061n4209k5519j80334P9115J26696K3431J26355o3043M7471
840B12046l8139j5369r0918l0493J10140R769j21535O0631K2321n4574k5400o0591
828b2112J9529j56962O6664M5862n6009M8957J96116K5864j06427m8821L7635
817E0296O8004J08270r6004r9937J15757O5296q2968k7922K7885J06931l29J01825
805C37104k29075j33677M5932L647N5825R2320o6124l6704n7488L2480N1078L5218
793A30536j60835j16396N2932L4052n7643M603L0759Q9141j7364o8125J01852
782B3512j69J922J0959J2021n667P8935j78515J2865J17065K7255j9953K8512
$$ plain form
770 108742 158397 202948 191650 256831 117599 278998 233647 97981 123429 103731 -1734
759 -1734 -108506 -69612 -9493 74908 139985 -27374 106564 300817 211992 17738 39692
748 39692 63209 5119 68062 -33514 -127618 -80977 57897 92219 -17083 -56329 -9116
737 -9116 128524 176555 11639 -11292 15194 12501 77682 121273 104424 74588 -60828 -111746
725 -111746 -91016 5094 7920 -42115 202487 238909 162667 113994 -42608 -21929 17727 -144691
713 -144691 -169274 29813 -88951 -50988 39746 56580 40815 -57830 -57967 90852 40808 -15705
701 -15705 7656 72404 120904 53419 76457 130914 126042 -28060 -155252 13224 -9898 -102081
689 -102081 50489 -111064 -122339 -106270 -5932 44006 148048 -13835 8680 242986 114447
$$ packed form
770A08742M9655M4551j1298O5181j39232J61399m5351j35666K5448j9698j05465
759a734j06772L8894O0119Q4401O5077j67359J33938J94253q8825j94254K1954
748C9692K3517n8090O2943j01576r4104M6641J38874L4322j09302l9246M7213
737i116J37640M8031j64916k2931K6486k693O5181M3591j6849k9836j35416n0918
725a11746K0730R6110K826n0035K44602L6422p6242m8673j56602K0679L9656j62418
713a44691k4583J99087j18764L7963R0734J6834j5765r8645j37J48819n0044n6513
701a5705K3361O4748M8500o7485K3038N4457m872j54102j27192J68476k3122r2183
689a02081J52570j61553j1275J6069J00338M9938J04042j61883K2515K34306j28539
$$ plain form
678 114447 23369 42099 68473 42788 116219 90562 132796 94349 158734 7274 64253 141017
666 141017 130195 188723 228437 200979 33048 109951 80263 105472 -37875 -90143 1318
655 1318 9625 -66769 59705 32842 -52386 53526 39145 73040 101883 217845 17773 -61004
643 -61004 -84181 25601 163331 83766 -110058 -201653 -64318 -76805 57582 -86715 -99462
632 -99462 -47792 81561 -10536 46558 73238 150853 100550 94632 72456 33087 40959 -148599
620 -148599 42352 39171 22918 3791 11732 -8572 -5034 34833 -2495 -216555 -4406 -74084
608 -74084 -74085 -92762 -93899 10782 7067 1787 -73627 45476 117649 53321 67840 52692 150644
595 150644 140381 13123 77494 119805 129305 96962 89713 74730 -24497 -33251 -63444 70460
$$ packed form
678A14447r1078J8730K6374k5685P3431k5657M2234l8447O4385j51460N6979P6764
666A41017j0822N8528L9714k7458j67931P6903k9688K5209j43347n2268R1461
655A318Q307p6394J26474k6863q5228J05912j4381L3895K8843J15962k00072p8777
643f1004k3177J09782J37730p9565j93824r1595J37335j2487J34387j44297j2747
632i9462N1670J29353r2097N7094K6680P7615n0303n918k2176l9369P872j89558
620a48599J90951l181j6253j9127P941k0304L538L9867l7328k14060K12149o9678
608g4084jj8677j137J04681l715n280p5414J19103P2173o4328J4519j5148R7952
595A50644j0263j27258O4371M2311R500l2343p249j4983r9227q754l0193J33904
$$ plain form
583 70460 79429 110289 73041 -67623 30065 41088 23910 -12469 -373 104382 93002 2623
571 2623 -11571 48041 24295 -14659 -23137 -79636 -152149 -95874 68314 186171 37407 87935
559 87935 125082 37373 75610 -42237 114365 146202 35445 18594 143749 108697 67268
548 67268 44064 71870 304269 166111 132388 83204 -19735 78401 36112 -42719 -57401
537 -57401 -10301 11483 38119 11007 101654 141012 69312 204267 117724 -3959 103219
526 103219 60193 74507 256802 123906 -37330 62842 -48623 32925 177459 40510
516 40510 -33398 49377 79142 79149 98596 184406 93049 30753 -2146 37191 -15757 56914 104592
503 104592 -74587 -84663 2401 -21131 11374 143052 235310 203981 -8892 -150964 -203154
$$ packed form
583G0460Q969L0860l7248j40664R7688J1023j7178l6379J2096J04755j1380r0379
571B623j4194N9612k3746l8954q478n6499p2513N6275J64188J17857j48764N0528
559H7935L7147q7709L8237j17847J56602L1837j10757j6851J25155l5052m1429
548F7268k3204K7806K32399j38158l3723m9184j02939R8136m2289p8831j4682
537e7401M7100K1784K6636k7112R0647L9358p1700J34955q6543j21683J07178
526A03219m3026J4314J82295j32896j61236J00172j11465Q1548J44534j36949
516D0510p3908Q2775K9765PJ9447Q5810r1357o2296l2899L9337n2948P2671M7678
503A04592j79179j0076Q7064k3532L2505J31678R2258l1329k12873j42072n2190
$$ plain form
492 -203154 -224108 -95616 -47782 17094 -32304 50007 287095 173252 172208 126023 117547 165492
480 165492 185421 151452 127687 203821 151591 100196 39023 56985 96696 120651 124191 156265
468 156265 43982 -2139 61915 195212 209211 153022 66506 72551 46833 53188 -8159 46185
456 46185 99553 56565 65195 -102228 -156614 -37420 143473 126447 202537 170140 39471
445 39471 177532 158264 83125 -47164 -22651 39945 19579 10577 128481 183562 158432 56156
433 56156 -56393 -63872 8671 24908 11183 112084 24734 421 -86038 -31052 -31935 -19053
421 -19053 80544 199106 -13201 -104145 -141846 -157068 -100788 -348 109231 -8917 147704
410 147704 152201 100832 52744 105609 108245 149113 229578 144549 84227 -13142 108478 -7631
$$ packed form
492b03154k0954J28492M7834O4876m9398Q2311K37088j13843j044m6185q476M7945
480A65492J9929l3969k3765P6134n2230n1395o1173J7962L9711K3955L540L2074
468A56265j12283m6121O4054J33297J3999n6189q6516O045k5718O355o1347N4344
456D6185N3368m2988Q630j67423n4386J19194J80893j7026P6090l2397j30669
445C9471J38061j9268p5139j30289K4513O2596k0366r002J17904N5081k5130j02276
433E6156j12549p479P2543J6237j3725J00901q7350k4313q6459N4986q83J2882
421a9053R9597J18562k12307r0944l7701j5222N6280J00440J09579j18148J56621
410A47704M497n1369m8088N2865K636M0868Q0465q5029o0322r7369J21620j16109
$$ plain form
398 -7631 27578 -78406 39140 97857 -51972 -58526 40034 -16972 68359 83044 99316 45968
386 45968 66068 95392 157487 221158 231922 166193 171781 87932 -71513 -181110 -143106 -27567
374 -27567 78161 139190 82841 33100 150066 127846 -19003 4999 -184689 -70994 35563
363 35563 39763 138979 92465 48800 58975 70245 62404 -32838 67057 34490 146504 247825
351 247825 288967 144574 89318 130244 23086 -123197 -18507 103038 81209 -418 -45098
340 -45098 -29949 -3310 1038 107190 122913 40142 41985 134387 -25433 -32296 103960 55938
328 55938 -5869 -28685 -54544 -57900 54037 169778 255249 244014 111566 67010 42562 134717
$$ packed form
398g631L5209j05984J17546N8717j49829o554R8560n7006Q5331J4685J6272n3348
386D5968K0100K9324O2095O3671J0764o5729N588q3849j59445j09597L8004J15539
374b7567J05728O1029n6349m9741J16966k2220j46849K4002j89688J13695J06557
363C5563M200R9216m6514m3665J0175J1270p841r5242R9895l2567J12014J01321
351B47825M1142j44393n5256M0926j07158j46283J04690J21545k1829q1627m4680
340d5098J5149K6639M348J06152J5723q2771J843R2402j59820o863J36256m8022
328E5938o1807k2816k5859l356J11937J15741Q5471j1235j32448m4556k4448R2155
$$ [...]
##END NTUPLES=NMR SPECTRUM
##END=
