##TITLE=1H_DE-80H_X3
 200.13MHz, d2o
 8 sc
 
 19ns.26.2.2025
##JCAMPDX= 6.0         $$ Bruker NMR JCAMP-DX V2.0
##DATA TYPE= NMR SPECTRUM
##DATA CLASS= NTUPLES
##ORIGIN= UXNMR, Bruker Analytische Messtechnik GmbH
##OWNER= pz
$$ XWIN-NMR		Version 3.5
$$ Fri Jul 11 10:22:05 2025 Russian Standard Time (UT+4h)  Yarkov@DPX200
##.OBSERVE FREQUENCY= 200.1313
##.OBSERVE NUCLEUS= ^1H
##.ACQUISITION MODE= SIMULTANEOUS
##.ACQUISITION SCHEME= undefined
##.AVERAGES= 8
##.DIGITISER RES= 18
##SPECTROMETER/DATA SYSTEM= spect
##.PULSE SEQUENCE= zg30
##.SOLVENT NAME= CDCl3
##.SHIFT REFERENCE= (INTERNAL, CDCl3, 0, 15.5122)
##AUDIT TRAIL= $$ (NUMBER, WHEN, WHO, WHERE, WHAT)
$$ ##TITLE= Audit trail, XWIN-NMR		Version 3.5
$$ ##JCAMPDX= 5.01
$$ ##ORIGIN= Bruker BioSpin GmbH
$$ ##OWNER= Yarkov
$$ C:/Bruker/XWIN-NMR/data/yarkov2/nmr/H-C/1/pdata/1/auditp.txt
$$ ##AUDIT TRAIL=  $$ (NUMBER, WHEN, WHO, WHERE, WHAT)
(   1,<2025-07-11 10:21:14.15 +0400>,<Yarkov>,<DPX200>,
      <created by zg, POWCHK disabled, PULCHK disabled
       configuration hash MD5:
       00 E9 B6 7A A2 85 ED C7 34 08 36 98 17 FE 4E 26
       data hash MD5: 16K
       FA 33 FF 5E D7 A4 72 14 BC A5 7F 25 CD C0 6B 64>)
(   2,<2025-07-11 10:21:19.23 +0400>,<Yarkov>,<DPX200>,
      <Start of raw data processing
       efp BC_mod = 2 LB = 0.25 FT_mod = 6 PKNL = 1 PHC0 = -1356.506 PHC1 = 5.990923 SI = 16K 
       data hash MD5: 16K
       F6 2C E2 35 E9 60 2C B3 20 67 1F 7B 54 C5 59 DC>)
(   3,<2025-07-11 10:21:24.59 +0400>,<Yarkov>,<DPX200>,
      <abs ABSG = 5 
       data hash MD5: 16K
       0B 3B 54 F7 B1 66 E6 12 0D 52 7A 70 1E E1 FF 5B>)
$$ ##END=
$$ 
$$ hash MD5
$$ DA 09 0A 3D 2F 14 38 26 92 B5 32 34 B6 01 BA 00
##$RELAX= 
##$RELAX= 
##$RELAX= 
##$RELAX= 
##$RELAX= 
##$RELAX= 
$$ Bruker specific parameters
$$ --------------------------
##$DU= <C:/Bruker/XWIN-NMR>
##$EXPNO= 1
##$NAME= <H-C>
##$PROCNO= 1
##$TYPE= <nmr>
##$USER= <yarkov2>
##$AMP= (0..31)
100 100 100 100 100 100 100 100 100 100 100 100 100 100 100 100 100 100 
100 100 100 100 100 100 100 100 100 100 100 100 100 100 
##$AQSEQ= 0
##$AQ_mod= 1
##$AUNM= <au_zg>
##$AUTOPOS= <>
##$BF1= 200.13
##$BF2= 200.13
##$BF3= 200.13
##$BF4= 200.13
##$BF5= 200.13
##$BF6= 200.13
##$BF7= 200.13
##$BF8= 200.13
##$BYTORDA= 1
##$CFDGTYP= 0
##$CFRGTYP= 5
##$CHEMSTR= <none>
##$CNST= (0..31)
1 1 145 1 1 1 1 1 1 1 1 1 1 1 1 1 1 1 1 1 1 1 1 1 1 1 1 1 1 1 1 1 
##$CPDPRG= <>
##$CPDPRG1= <>
##$CPDPRG2= <>
##$CPDPRG3= <>
##$CPDPRG4= <mlev>
##$CPDPRG5= <mlev>
##$CPDPRG6= <mlev>
##$CPDPRG7= <mlev>
##$CPDPRG8= <mlev>
##$CPDPRGB= <>
##$CPDPRGT= <>
##$D= (0..31)
0 0.7 0 0 0 0 0 0 0 0 0 0.03 0 0 0 0 0 0 0 0 0 0 0 0 0 0 0 0 0 0 0 0 
##$DATE= 1752214873
##$DBL= (0..7)
120 120 120 120 120 120 120 120 
##$DBP= (0..7)
150 150 150 150 150 150 150 150 
##$DBP07= 0
##$DBPNAM0= <>
##$DBPNAM1= <>
##$DBPNAM2= <>
##$DBPNAM3= <>
##$DBPNAM4= <>
##$DBPNAM5= <>
##$DBPNAM6= <>
##$DBPNAM7= <>
##$DBPOAL= (0..7)
0.5 0.5 0.5 0.5 0.5 0.5 0.5 0.5 
##$DBPOFFS= (0..7)
0 0 0 0 0 0 0 0 
##$DE= 6
$$ [...]
##$SUBNAM3= <"">
##$SUBNAM4= <"">
##$SUBNAM5= <"">
##$SUBNAM6= <"">
##$SUBNAM7= <"">
##$SUBNAM8= <"">
##$SUBNAM9= <"">
##$SW= 18.0517328524113
##$SWIBOX= (0..15)
0 0 2 0 0 0 0 0 0 0 0 0 0 0 0 0 
##$SW_h= 3612.71676300578
##$TD= 16384
##$TD0= 1
##$TE= 0
##$TE2= 300
##$TE3= 300
##$TEG= 300
##$TL= (0..7)
0 120 120 120 120 120 120 120 
##$TP= (0..7)
150 150 150 150 150 150 150 150 
##$TP07= 0
##$TPNAME0= <>
##$TPNAME1= <>
##$TPNAME2= <>
##$TPNAME3= <>
##$TPNAME4= <>
##$TPNAME5= <>
##$TPNAME6= <>
##$TPNAME7= <>
##$TPOAL= (0..7)
0.5 0.5 0.5 0.5 0.5 0.5 0.5 0.5 
##$TPOFFS= (0..7)
0 0 0 0 0 0 0 0 
##$TUNHIN= 0
##$TUNHOUT= 0
##$TUNXOUT= 0
##$USERA1= <user>
##$USERA2= <user>
##$USERA3= <user>
##$USERA4= <user>
##$USERA5= <user>
##$V9= 5
##$VALIST= <valist>
##$VCLIST= <CCCCCCCCCCCCCCC>
##$VD= 0
##$VDLIST= <DDDDDDDDDDDDDDD>
##$VPLIST= <PPPPPPPPPPPPPPP>
##$VTLIST= <TTTTTTTTTTTTTTT>
##$WBST= 1024
##$WBSW= 4
##$XGAIN= (0..3)
0 0 0 0 
##$XL= 0
##$YL= 0
##$YMAX_a= 176733
##$YMIN_a= -181215
##$ZGOPTNS= <>
##$ZL1= 120
##$ZL2= 120
##$ZL3= 120
##$ZL4= 120
##$ABSF1= 15.5078
##$ABSF2= -2.544049
##$ABSG= 5
##$ABSL= 3
##$ALPHA= 0
##$AQORDER= 0
##$ASSFAC= 0
##$ASSFACI= 0
##$ASSFACX= 0
##$ASSWID= 0
##$AUNMP= <proc_1d>
##$AZFE= 0.1
##$AZFW= 0.1
##$BCFW= 0
##$BC_mod= 2
##$BYTORDP= 0
##$COROFFS= 0
##$CY= -3
##$DATMOD= 1
##$DC= 0
##$DFILT= <>
##$DTYPP= 0
##$F1P= 0
##$F2P= 0
##$FCOR= 1
##$FTSIZE= 16384
##$FT_mod= 6
##$GAMMA= 0
##$GB= 0
##$INTBC= 1
##$INTSCL= 3.241238e-09
##$ISEN= 128
##$LB= 0.25
##$LEV0= 0
##$LPBIN= 0
##$MAXI= 10000
##$MC2= 0
##$MEAN= 0
##$ME_mod= 0
##$MI= 1.114404
##$NCOEF= 0
##$NC_proc= -8
##$NLEV= 6
##$NOISF1= 3.799351
##$NOISF2= 2.8
##$NSP= 0
##$NTH_PI= 0
##$NZP= 0
##$OFFSET= 15.51221
##$PC= 1
##$PHC0= -1356.506
##$PHC1= 5.990923
##$PH_mod= 1
##$PKNL= yes
##$PPARMOD= 0
##$PSCAL= 0
##$PSIGN= 0
##$REVERSE= no
##$SF= 200.130001899792
##$SI= 16384
##$SIGF1= 3
##$SIGF2= 2
##$SINO= 0.751879
##$SIOLD= 32768
##$SREGLST= <19F.Aceton>
##$SSB= 0
##$STSI= 16384
##$STSR= 0
##$SW_p= 3612.71676300578
##$SYMM= 0
##$S_DEV= 0
##$TDeff= 16384
##$TDoff= 0
##$TI= <>
##$TILT= no
##$TM1= 0
##$TM2= 0
##$TOPLEV= 0
##$USERP1= <user>
##$USERP2= <user>
##$USERP3= <user>
##$USERP4= <user>
##$USERP5= <user>
##$WDW= 1
##$XDIM= 16384
##$YMAX_p= 484222023
##$YMIN_p= -2711685
$$ End of Bruker specific parameters
$$ ---------------------------------
##NTUPLES= NMR SPECTRUM
##VAR_NAME=  FREQUENCY,     SPECTRUM/REAL,   SPECTRUM/IMAG
##SYMBOL=    X,             R,               I
##VAR_TYPE=  INDEPENDENT,   DEPENDENT,       DEPENDENT
##VAR_FORM=  AFFN,          ASDF,            ASDF
##VAR_DIM=   16384,         16384,           16384
##UNITS=     HZ,            ARBITRARY UNITS, ARBITRARY UNITS
##FACTOR=    0.220516191357247, 1,           1
##FIRST=     3104.45859521056, 0,            0
##LAST=      -508.258167795223, 0,           0
##MIN=       -508.258167795223, -2711685,    0
##MAX=       3104.45859521056, 484222023,    0
$$ Real data points
##PAGE= N=1
##DATA TABLE= (X++(R..R)), XYDATA
$$ [...]
5913A434158J5476j88871J08362R6310L7959J56507j40025j31093J06278j99310
5903A295751l44262j26440N3344j00073L49015J03600j05077l09236l4626K17820
5893I99816R6724J92608k61891j26786j1528K3349j54550l1409R5198R2000M3450
5882I56981j28637q9090J74718k58584M5479K95461N239m1228M5036k11459j734
5871G92182N8915J70139K50803k86336K70135K1319R9172k09103l78525j48956
5861F39745o7400J93341P3021J56131K18457Q4122j7957k69924M4807j94727o0544
5850G99072R8070P399R6812K46493j21137l57199J3276J14664L0094m9462J97379
5839A075461M9194l0630k6287R5457R1692J3496j03279j26526j50829J82711P7195
$$ y = [1434158, 1449634, 1260763, 1369125, 1465435, 1503394, 1659901, 1519876, 1388783, 1495061, 1295751, 951489, 825049, 878393, 778320, 1127335, 1230935, 1125858, 816622, 781996, 999816, 1096540, 1289148, 1027257, 900471, 888943, 912292, 757742, 726333, 821531, 913531, 956981, 828344, 739254, 913972, 655388, 700867, 996328, 1001567, 960339, 1005375, 793916, 792182, 851097, 1021236, 1272039, 985703, 1255838, 1277157, 1376329, 1167226, 788701, 639745, 572345, 765686, 838707, 994838, 1213295, 1297417, 1279460, 1009536, 1054343, 859616, 799072, 897142, 904541, 1001353, 1247846, 1126709, 769510, 782786, 897450, 927544, 878082, 1075461, 1124655, 1094025, 1067738, 1163195, 1254887, 1268383, 1165104, 1038578, 887749, 1070460, 1147655]
5828A147655m1902k11525K02447Q9027O2962r8922k47917p1243J39362K88059
5818A258003l5835j81998r4604L2998J06874J0746j31242J955K35354k53842r6017
5807H52392r8401J68209K42126k63143O007m7784L6138j56543K66115O9200J69839
5796A244155n2829k74885L35580O2842j10170q4927L30855L01705m01707k77998
5786A072621J70185J13837j29270j09374J7941p7078Q9482k1147n3438m0394p0606
5775I62759j56729j11736K48149K64874k6785n3936K43738L0135l54920j19337
5765I26212K0312j2129J26111J37456J36953M9383M0524O2524J73565k10819q2057
5754A368035K8530J55821J16473j26635O3854K45591L0383k59387K7160J81728
$$ y = [1147655, 1105753, 894228, 1096675, 1185702, 1248664, 1149742, 901825, 830582, 969944, 1258003, 1222168, 1040170, 945566, 978564, 1085438, 1096184, 964942, 966897, 1202251, 948409, 852392, 753991, 922200, 1164326, 901183, 907190, 859406, 895544, 739001, 1005116, 1074316, 1244155, 1191326, 916441, 1252021, 1314863, 1204693, 1119766, 1450621, 1752326, 1350619, 1072621, 1242806, 1356643, 1227373, 1117999, 1135940, 1058862, 1148344, 1127197, 1073759, 1033365, 962759, 806030, 694294, 942443, 1207317, 1180532, 1126596, 1370334, 1400469, 1045549, 926212, 946524, 934395, 1060506, 1197962, 1334915, 1384298, 1424822, 1487346, 1660911, 1450092, 1368035, 1396565, 1552386, 1668859, 1542224, 1606078, 1851669, 1882052, 1622665, 1649825, 1831553]
5744A831553j54132k3314J09423k24598J19582o535J45207L895l1889j84100J74492
5733A759584q2741P0920K51133j9999J80533j21954L755J63673j20821j13751
5723A970332J75744K03700K80935J8532L24835J34857k5681k58954k15215l25484
5713B283601o723N9170K81097n4988l20848r5033L29080r6482l39123R5862K37183
5702B372796k6284K21639J9499l33104o3294K33759j7350J74595p634k40605K63364
5691B597381K80379K04512R6866J80435r5332L86615R0028l93057j46109k99883
5681B901835l62579J7001J65987n0287J97416l5104k99044K53080K3899O1444
5671B873648J44594K20999J5322o8898j75121O5048l8661o0439J70927J29831
$$ y = [1831553, 1677421, 1654107, 1763530, 1538932, 1658514, 1651979, 1797186, 1801081, 1769192, 1585092, 1759584, 1676843, 1747763, 1998896, 1978897, 2159430, 2037476, 2041231, 2204904, 2084083, 1970332, 2146076, 2349776, 2630711, 2649243, 2974078, 3108935, 3083254, 2824300, 2609085, 2283601, 2276878, 2336048, 2617145, 2562157, 2241309, 2146276, 2475356, 2378874, 2039751, 2135613, 2372796, 2346512, 2568151, 2587650, 2254546, 2191252, 2425011, 2407661, 2582256, 2574622, 2334017, 2597381, 2877760, 3082272, 3179138, 3359573, 3264241, 3650856, 3740884, 3347827, 3201718, 2901835, 2539256, 2556257, 2722244, 2671957, 2869373, 2834269, 2535225, 2788305, 2812204, 2873648, 3018242, 3239241, 3254563, 3185665, 3010544, 3075592, 3036931, 2976492, 3147419, 3277250]
5661C277250K21601j0575o4957K13824l41693j40200J76940K10696L08515p1633
5651C779768L17621k61548p8934J60400M0963j35515k51079K45672j15605J00050
5641C801793L5492q9708Q0894K81922j77342j12765L72064o2779K77821J29617
5631D537009k5316J27675k04730O14547J72915p7935O908R4938J51458K8095K6838
5620E452402o0077L11176L31322L3185P3640L06895J91467k7908L46882J34809
5610G093793l0919J72680N73214P8264P6956p7383K43700O26926L59813J61467
5600I278511J72571M33865M64148N67592K66698N43706P2637L31748M97192L70421
5590A2999089L11836L25313L96643M92700N28855O91227M83377N08605O99455
$$ y = [3277250, 3498851, 3488276, 3423319, 3637143, 3295450, 3155250, 3332190, 3542886, 3851401, 3779768, 4097389, 3835841, 3756907, 3917307, 3958270, 3822755, 3571676, 3817348, 3701743, 3801793, 3837285, 3747577, 3828471, 4110393, 3933051, 3820286, 4192350, 4129571, 4407392, 4537009, 4511693, 4639368, 4434638, 5049185, 5222100, 5144165, 5151073, 5246011, 5397469, 5425564, 5452402, 5392325, 5703501, 6034823, 6068008, 6141648, 6448543, 6640010, 6612102, 6958984, 7093793, 7062874, 7235554, 7808768, 7887032, 7963988, 7886605, 8130305, 8757231, 9117044, 9278511, 9451082, 9884947, 10349095, 10916687, 11183385, 11727091, 11799728, 12131476, 12628668, 12999089, 13310925, 13636238, 14032881, 14525581, 15054436, 15745663, 16229040, 16737645, 17437100]
5581A7437100R68688P84847P97814N70515Q44026O69457R40490J080549O88540
5572B4782026O94350O69725J101091R81409N79346J168780P88928O51763Q95022
5563C2312440Q59624J088925J145863R77875J009681J360110J330984J407748
5555D1493250J153186Q97490J086733J319873R01701J062327R04271O35396J272290
5546E0726517Q54047O71077O22813N90647R56395O67614O81381L51655L33187
5537E6455333J55394m9291k89056k69479j16144P8313J02050j83198k75424j91949
5527E5416549M7964k25648l76065n18780k35280l84204o29454m93859r33056m11572
5517E1256595m00701n94212n96751p91183m73048k86461j38368m04510m07416
$$ y = [17437100, 18405788, 19190635, 19988449, 20558964, 21402990, 22072447, 23012937, 24093486, 24782026, 25476376, 26146101, 27247192, 28228601, 28807947, 29976727, 30765655, 31417418, 32312440, 33172064, 34260989, 35406852, 36384727, 37394408, 38754518, 40085502, 41493250, 42646436, 43543926, 44630659, 45950532, 46852233, 47914560, 48818831, 49454227, 50726517, 51580564, 52251641, 52874454, 53465101, 54421496, 55089110, 55770491, 56122146, 56455333, 56610727, 56561436, 56272380, 56002901, 55886757, 55965070, 56067120, 55883922, 55608498, 55416549, 55464513, 55238865, 54862800, 54344020, 54108740, 53724536, 53095082, 52601223, 51668167, 51256595, 50855894, 50261682, 49664931, 48873748, 48400700, 48114239, 47975871, 47571361, 47163945]
5508D7163945l36380n21537J07684l13905l77926p0449m8489k50821R606j90424
5498D5171304j36743k35319j94380j89327l29220l90450n76564l28639k98615
5489D2492047m96402m42137m22798m66580o77263k92982n54868n19380q6590m63576
5479C8069471n31478j40176m03767m57739j58984k93946k45023k92392m11989
5470C5133977p13562j04169n77475o05506n59002p58805m90192k78220n58382
5461C0488664n15760r97549o24493o84369m12159o84570q73735n23988l39800
5452B4832241m93689n96155m07749l58748l80360m47275l23193l96773n26381
5443B0901918n15402m95827n83166n92811k18831l52947o90611p36022m33217
$$ y = [47163945, 46827565, 46306028, 46413712, 46099807, 45721881, 45651432, 45602943, 45352122, 45361728, 45171304, 45034561, 44799242, 44604862, 44415535, 44086315, 43695865, 43119301, 42790662, 42492047, 41995645, 41553508, 41130710, 40664130, 39986867, 39693885, 39139017, 38619637, 38533047, 38069471, 37537993, 37397817, 36994050, 36536311, 36377327, 36083381, 35838358, 35545966, 35133977, 34420415, 34316246, 33738771, 33133265, 32574263, 31815458, 31325266, 31047046, 30488664, 29972904, 28975355, 28350862, 27666493, 27254334, 26569764, 25696029, 25172041, 24832241, 24338552, 23742397, 23334648, 22975900, 22595540, 22148265, 21825072, 21428299, 20901918, 20386516, 19890689, 19307523, 18714712, 18495881, 18142934, 17452323, 16716301, 16283084]
5434A6283084n30463m57472m65092n78366l39212n25127l87827n03213k66229
5425A2230083j33990k39863j22697k48977j73516k10756nJ18128j82890m87452
5415A0548065l42262k97287l62666m47749k11326j35609m53600l55497k09874
5406G732195L733m06014r0474l39912n531j06927l11917q4714J10215J40529J03931
5395F745114j62216j81623j89832p8748K4815J59009j86643j73444k26325k85656
5385E444451k32269j40693K405n6898l24850P7958j42789k79945J9572J08891
5375D475833N1254k43698j38339r4371j50312L9319N0544k32225K1104J29658
5365C908767m4799k37642J88326k63060j04407M7481j77854k40734K8177M3665
$$ y = [16283084, 15752621, 15295149, 14830057, 14251691, 13912479, 13387352, 12999525, 12496312, 12230083, 12096093, 11856230, 11733533, 11484556, 11311040, 11100284, 11100279, 11218407, 11035517, 10548065, 10205803, 9908516, 9545850, 9098101, 8886775, 8751166, 8297566, 7942069, 7732195, 7735928, 7329914, 7239440, 6899528, 6893997, 6787070, 6475153, 6390439, 6500654, 6641183, 6745114, 6582898, 6401275, 6211443, 6132695, 6157510, 6316519, 6129876, 5956432, 5730107, 5444451, 5212182, 5071489, 5073894, 5016996, 4692146, 4770104, 4627315, 4347370, 4366942, 4475833, 4527087, 4283389, 4145050, 4050679, 3900367, 3939686, 3990230, 3758005, 3779109, 3908767, 3863968, 3626326, 3814652, 3551592, 3447185, 3494666, 3316812, 3076078, 3104255, 3147920]
5355C147920j92971j0338j8640j53718Q9889Q0193k65989N0887q5339j45513L78116
5344B874497j30714l29732K46715p7943p5334J46572p1632l0388R5685j47640
5334B500086j43282K31008r5676l12480J62611J18782J39846j83927j82232J25047
5324B359783O0434r4473j38087j11181r8772J12121Q9640k21324J13131Q6167
5314B157439J09555j34830m20096J50235J8332n1452j33677l6132L28463K19807
5304B207644p1213O360j24672J89171o5335p2330j18436q0994K1897L8863j52184
5293A778771P7424j66713j89606J77988N3619j3253J60427r467o8822J34169R9564
5282B034101j62731j59941k88018K23955O9620O4941K6282o1546J58707p0650
$$ y = [3147920, 2954949, 2944611, 2925971, 2772253, 2862142, 2942335, 2676346, 2727233, 2641894, 2496381, 2874497, 2743783, 2414051, 2660766, 2582823, 2507489, 2654061, 2582429, 2552041, 2647726, 2500086, 2356804, 2587812, 2492136, 2179656, 2342267, 2461049, 2600895, 2416968, 2234736, 2359783, 2420217, 2325744, 2187657, 2076476, 1977704, 2089825, 2179465, 1958141, 2071272, 2157439, 2266994, 2132164, 1712068, 1862303, 1880635, 1829183, 1695506, 1659374, 1987837, 2207644, 2136431, 2142791, 2018119, 2207290, 2141955, 2069625, 1951189, 1870195, 1892092, 1930955, 1778771, 1856195, 1689482, 1499876, 1677864, 1731483, 1718230, 1878657, 1869190, 1800368, 1934537, 2034101, 1871370, 1711429, 1423411, 1647366, 1716986, 1781927, 1808209, 1746663, 1905370, 1834720]
5272A834720k76977J42551M18236j2050J33591n89395n1900L94744o5057j53447
5262A775016r1802k62976R5277L91571j8676j22791J76842j76139M4343j89216
5252A621449L5017m0835k05334P5229J63572Q3585J05559j29209M0748M3243n2687
5241A740337J52491o5273l2156r6334N8425j38904o5275K28170q8380Q0959n3137
5230A720923j42346M2480J57422j07138p3552J75724j62997m9484R0986m1631
5220A610387Q4326K26409m3259j31143J15146j50237p0948K08258j26665k4737
5210A697537L2586R2258n8976L16694j17598M8320K9293k78916o2285M50154Q0800
5199B229867n6281j64185R9753L0356K07666K65629l51246K10361K19291k68902
$$ y = [1834720, 1557743, 1700294, 2118530, 2106480, 2240071, 1650676, 1598776, 1993520, 1928463, 1775016, 1683214, 1420238, 1515515, 1907086, 1888410, 1765619, 1942461, 1766322, 1810665, 1621449, 1656466, 1615631, 1410297, 1485526, 1649098, 1732683, 1838242, 1709033, 1749781, 1793024, 1740337, 1892828, 1827555, 1795399, 1699065, 1757490, 1618586, 1553311, 1781481, 1693101, 1774060, 1720923, 1578577, 1621057, 1778479, 1671341, 1597789, 1773513, 1610516, 1561032, 1652018, 1610387, 1694713, 1921122, 1877863, 1746720, 1861866, 1711629, 1640681, 1848939, 1722274, 1697537, 1730123, 1822381, 1763405, 2080099, 1962501, 2010821, 2040114, 1761198, 1698913, 2149067, 2229867, 2173586, 2009401, 2109154, 2139510, 2347176, 2612805, 2261559, 2471920, 2691211, 2422309]
5189B422309R1598j1921M2989k23241J46920M6078J41684m4655j05393L66201
5179B872569j31098q549j88841R8625J0644J63447Q6949R1328N1801K60341j14331
5168C192885M280q7356L09402K14647K7347o0502J58651J1031J68639L71296R9995
5157D410315m2095n3745j9571L68060N11921P4781J9179P0990m9144K3932M19686
5146E734309M71843K59040J60815j2575L06780L93347M30592L74701K99959N65409
5136H984220j35260K35623M30680K79415M56834K98727K97338K56762J86825K82436
5126A1573600K07152K18317L14330L14013M32659J12030J46199M38629K59083
5117A4016012K04417L22427L44940J20108L82551O04730N94392O84459L72689
$$ y = [2422309, 2513907, 2501986, 2544975, 2321734, 2468654, 2514732, 2656416, 2611761, 2506368, 2872569, 2741471, 2732922, 2544081, 2642706, 2653350, 2816797, 2903746, 2995074, 3046875, 3307216, 3192885, 3197165, 3109809, 3419211, 3633858, 3661205, 3600703, 3759354, 3770385, 3939024, 4310320, 4410315, 4368220, 4314475, 4294904, 4662964, 5174885, 5249666, 5268845, 5339835, 5290691, 5314623, 5734309, 6206152, 6465192, 6626007, 6613432, 6920212, 7313559, 7744151, 8118852, 8418811, 8984220, 8848960, 9084583, 9515263, 9794678, 10251512, 10550239, 10847577, 11104339, 11291164, 11573600, 11780752, 11999069, 12313399, 12627412, 13060071, 13172101, 13318300, 13756929, 14016012, 14220429, 14542856, 14887796, 15007904, 15390455, 15995185, 16589577, 17274036, 17646725]
5108A7646725N81377P20934M56860O83662N91089M30658M68038M32934N67411
5099B2579688O58609P44303M08750L89047J20702L21172J26902M2265L25318K97111
5089B6013867O13944J36835J01043K5012M97020M99503J00901o4941L94398L95867
5079B8713449J76384L80405N03865M65912N60493L97043O25336O91122M70262
5070C2984271N22921Q42499M39545O90637P48759P57536Q76516O19705P02762
5061C9185151J75460k14018j91224k1263j74529M9838L04482J03238m66832j108471
5051C7641832q68313p04261n48890n72461n28858j75510n40188n44695r7030o28750
5041C2432876o42484k89525j95622l82445l74200l67258j93380k92568k54339
$$ y = [17646725, 18228102, 18949036, 19405896, 20089558, 20680647, 21111305, 21579343, 22012277, 22579688, 23238297, 23982600, 24391350, 24780397, 24901099, 25222271, 25349173, 25391438, 25716756, 26013867, 26627811, 26764646, 26865689, 26890701, 27387721, 27887224, 27988125, 27923184, 28317582, 28713449, 28889833, 29270238, 29774103, 30240015, 30800508, 31197551, 31822887, 32514009, 32984271, 33507192, 34349691, 34789236, 35479873, 36228632, 36986168, 37862684, 38482389, 39185151, 39360611, 39146593, 38955369, 38934106, 38759577, 38809415, 39113897, 39217135, 38750303, 37641832, 36773519, 36069258, 35520368, 34947907, 34419049, 34243539, 33703351, 33158656, 33061626, 32432876, 31790392, 31500867, 31305245, 30922800, 30548600, 30181342, 29987962, 29695394, 29441055]
5032B9441055j59365m55352R5291l76131k81929m77067m8656j54478l69878k19346
5022B6994144j13992o35079n01145K7752p0295j4658l28745n31061l38578n48286
5012B3940057n57804p84023n76210l09111l72605n98088n69465l35327k04711
5003A9632713o0296q06150l94830j54115q3149k96919m81419k44624l81958n73342
4993A6155911l33626J01482m009m18833o22340m03383J85584k7327j36078j31793
4983A4365588n51515l26753k9194l22142k0660k70355m43851l25984k15039l5327
4973A1824768k91167j37461l36787k00925O91j06300k18848j10830K38106J66129
4963A0827376L36229J81711m8990K00177L18454K71380M45644L67302P98400P43797
$$ y = [29441055, 29281690, 28826338, 28921629, 28545498, 28263569, 27786502, 27737846, 27583368, 27213490, 26994144, 26880152, 26245073, 25743928, 25771680, 25701385, 25686727, 25357982, 24826921, 24488343, 23940057, 23382253, 22598230, 22022020, 21712909, 21340304, 20742216, 20172751, 19837424, 19632713, 19572417, 18766267, 18371437, 18217322, 18134173, 17837254, 17355835, 17111211, 16729253, 16155911, 15822285, 15923767, 15919758, 15500925, 14878585, 14475202, 14660786, 14633459, 14497381, 14365588, 13814073, 13487320, 13458126, 13135984, 13115324, 12844969, 12401118, 12075134, 11860095, 11824768, 11533601, 11396140, 11059353, 10858428, 10859119, 10752819, 10533971, 10423141, 10661247, 10827376, 11163605, 11345316, 11296326, 11496503, 11814957, 12086337, 12531981, 12899283, 13697683, 14441480]
4953A4441480J049188J371868J478113J680564J840330J874512Q17579l98943
4945B4154691j695567j829730k127850j859147j801360j168465j051928r86572
4937A1634072p43369p61852n29685o65755l64671j64842l41420o46811k58249
4928G157418j86359l5775k63702l76558m22338k00682K8513J06598r6307l22097
4918E388711l23001q7300k5834k26846o8658j16436l53915J33575m3707k66571
4908D010018J20967k71173j26890j40440J63151k25490n6467j3702k06740K0627
4898C273861K42844m72917j41524M3982K1502k16587k0598L8905l03270K70169
4888B736367M5288r5356l1773j32446m6789J36363k28119N994l8147n7679M9169
$$ y = [14441480, 15490668, 16862536, 18340649, 20021213, 21861543, 23736055, 24553634, 24154691, 22459124, 20629394, 18501544, 16642397, 14841037, 13672572, 12620644, 11634072, 10890703, 10128851, 9599166, 8933411, 8568740, 8403898, 8062478, 7415667, 7157418, 6971059, 6935284, 6671582, 6295024, 5872686, 5672004, 5700517, 5807115, 5710808, 5388711, 5065710, 4978410, 4952576, 4725730, 4657072, 4540636, 4186721, 4320296, 4276589, 4010018, 4130985, 3859812, 3732922, 3592482, 3755633, 3530143, 3473676, 3459974, 3253234, 3273861, 3516705, 3043788, 2902264, 2946246, 2967748, 2751161, 2730563, 2769468, 2466198, 2736367, 2781655, 2686299, 2654526, 2522080, 2475291, 2611654, 2383535, 2389529, 2351382, 2293703, 2342872]
4877B342872p0009j97191j21645K04291q0451r9560N6168J15388M4047j14519
4867B079391R2121l55620j66617J22294j2261j86299J5395J10680P6940r9412
4857A676612Q6180J017J3689P0870m3882q9892k36608j70938J28316l8080R4241
4846A491525k5271R6430J7360j88773O4358K95709l53481j12525J9621j78509
4836A126444K63401r1440j90802J60365J15620k12724N931Q5729J43892J02955
4826A509371n1942o0642j19980N5822j41074q7443O4053o0608j20230o015J79047
4815A160359R2535p5128o4292K8344K05121J62419P7620M3014l24956K9034L2274
4804A366344R4834j58864l22102k25855J78538J27214p5224L1042J51824k24402
$$ y = [2342872, 2272863, 2075672, 1954027, 2158318, 2077867, 1978307, 2034475, 2149863, 2193910, 2079391, 2171512, 1815892, 1649275, 1771569, 1759308, 1573009, 1588404, 1699084, 1776024, 1676612, 1762792, 1763809, 1777498, 1848368, 1804486, 1714594, 1477986, 1307048, 1435364, 1397284, 1491525, 1466254, 1562684, 1580044, 1391271, 1455629, 1751338, 1397857, 1285332, 1304953, 1126444, 1389845, 1298405, 1107603, 1267968, 1383588, 1170864, 1176795, 1262524, 1406416, 1509371, 1457429, 1396787, 1276807, 1332629, 1191555, 1104112, 1168165, 1107557, 987327, 981312, 1160359, 1252894, 1177766, 1113474, 1141818, 1346939, 1509358, 1586978, 1629992, 1305036, 1334070, 1366344, 1461178, 1302314, 980212, 754357, 932895, 1060109, 984885, 1015927, 1167751, 943349]
4794I43349J73832K46646m8002j64322j3022j90392M8853M0056J23186J44465
4784A304649j35238j86418J6893L38242J6419m9205q1014j89458m79K21643L40207
4773A596241O1443m90560j55441J44884O8427M27J28481K2687N3708k0826r9592
4762A309879j79285N0577Q0010m3561r238n9932j73779J38756J1775k94645K06513
4751A037070J83072j86661J77677O2980n1108J74108k51750j71840L04290j39515
4741A138323M4144K56635j90353k03096L4154p1116K09300Q2122l89960P5575
4731I85728J14424O837R8791K65993j08383k80931K2907m9761J26107P1886k251
4720A251347J8477Q2620m9538r2677j4729M177J203J48438R2601j5960l07499
$$ y = [943349, 1117181, 1363827, 1315825, 1151503, 1138481, 948089, 996942, 1036998, 1160184, 1304649, 1169411, 982993, 999886, 1338128, 1354547, 1305342, 1224328, 1034870, 1034391, 1256034, 1596241, 1657684, 1167124, 1011683, 1156567, 1224994, 1225421, 1353902, 1376589, 1430297, 1409471, 1309879, 1130594, 1181171, 1261181, 1217620, 1208382, 1148450, 974671, 1113427, 1125202, 830557, 1037070, 1220142, 1033481, 1211158, 1274138, 1223030, 1397138, 1145388, 973548, 1277838, 1138323, 1182467, 1439102, 1248749, 1045653, 1079807, 1008691, 1217991, 1300113, 910153, 985728, 1100152, 1106989, 1205780, 1471773, 1363390, 1082459, 1105366, 1055605, 1181712, 1253598, 1251347, 1269824, 1352444, 1302906, 1210229, 1195500, 1199677, 1200880, 1349318, 1441919, 1425959, 1118460]
4709A118460L32395L5984k00576O5952r4611k1560l9209j29452K2839P8211J40214
4698A308647j08414J09812L9950o2600j27886q380L81058k19627l80529J75102
4688A107133K41400K9467J18123o7138J23149J25k36932J11723R8608k56578M9549
4677A318629K05790J40678m00694k9112M0090J46028q1966l03528p3241L94406
4667A357080j58314k3116p5806n813J06223J88491k3698L6177j39023J9977L3250
4656A315428k86550M9943L21821K7934l70495L55642K02659m5718J39674j58760
4646A551578k94209Q7710J2466l8842j89778J34990K31687j45177P9898N7031
4636A487354M6383n8313J90793n5128n8251N4417j72712j3605R233K0343R1567
$$ y = [1118460, 1450855, 1486839, 1286263, 1352215, 1257604, 1236044, 1196835, 1067383, 1090222, 1168433, 1308647, 1200233, 1310045, 1349995, 1287395, 1159509, 1151129, 1532187, 1312560, 932031, 1107133, 1348533, 1378000, 1496123, 1428985, 1552134, 1552259, 1315327, 1427050, 1525658, 1269080, 1318629, 1524419, 1665097, 1264403, 1235291, 1275381, 1421409, 1339443, 1035915, 962674, 1357080, 1198766, 1175650, 1099844, 1094031, 1200254, 1388745, 1365047, 1401224, 1262201, 1282178, 1315428, 1028878, 1078821, 1400642, 1428576, 1058081, 1413723, 1616382, 1570664, 1710338, 1551578, 1257369, 1345079, 1357545, 1318703, 1128925, 1263915, 1495602, 1350425, 1430323, 1487354, 1533737, 1475424, 1666217, 1611089, 1552838, 1607255, 1434543, 1420938, 1430171, 1450514, 1542081]
4625A542081j09948q8640O6998J78980R4418l47636R652L6136M12175k14542j20661
4614A459013J54734p6903O569J48501k45584p9877J15934k2316N5078J1033J60398
4603A686580K06780l58434K00999m2963j14744J25684k32068Q1463j35201J37983
4593A556079j82818J49611j63701m030M11011p1920k42601q4685R7189q7943M59
4582A376651J5052M57J251j02105J37997P3467j17588j0445n3778J3548K30767
4571A565274q5812j9669r6509n1070K59336P5726q5428k5621r2908j60483K4622
4560A307458j36336J54578o0729L26962l46406k79376M90753L78245k73877j86199
4550A375073l51794L21749K17849N5150l3219J66253P8462m92074Q6875K02628
$$ y = [1542081, 1432133, 1343493, 1410491, 1589471, 1683889, 1336253, 1345905, 1382041, 1794216, 1579674, 1459013, 1613747, 1536844, 1543413, 1691914, 1446330, 1366453, 1482387, 1460071, 1515149, 1526182, 1686580, 1893360, 1534926, 1735925, 1692962, 1578218, 1703902, 1471834, 1553297, 1418096, 1556079, 1373261, 1522872, 1359171, 1355141, 1766152, 1694232, 1451631, 1366946, 1464135, 1376192, 1376651, 1391703, 1392160, 1393411, 1291306, 1429303, 1502770, 1385182, 1374737, 1320959, 1334507, 1565274, 1479462, 1459793, 1363284, 1312214, 1571550, 1647276, 1561848, 1536227, 1443319, 1282836, 1307458, 1171122, 1325700, 1264971, 1591933, 1245527, 966151, 1456904, 1835149, 1561272, 1375073, 1023279, 1345028, 1562877, 1618027, 1584808, 1751061, 1829523, 1337449, 1424324, 1626952]
4540A626952j1757j9231n9673J64708l7990j55745m9698P1823j855j42397J10489
4529A495626k0469p721R2539J37301k44251j15159K95619R3028j01074J10903
4519A736342k849j1793j32134m3760j74333L16549N2652P8813K8339K03969O9956
4508B121751r0084k10806q0081Q7174J95854J49082J13181P2163k01133k78432
4498A878669K10734J54081J9598K6109o9198N7608J32383k31550j37501j1892
4488B029041j42647J915K36815K74122m5312j11262J61946R2957k54547p7629
4478B165399J71283j3774k8337J20938R4667K68761P6522J62229j52118l28919
4468B536651J71683Q4406R4693K62980j31000j07526R1985L78684M6657k726K52588
$$ y = [1626952, 1615195, 1595964, 1536291, 1700999, 1663009, 1507264, 1457566, 1529389, 1527534, 1385137, 1495626, 1475157, 1467436, 1559975, 1697276, 1453025, 1337866, 1633485, 1726513, 1625439, 1736342, 1733493, 1721700, 1589566, 1545806, 1371473, 1688022, 1740674, 1819487, 1847826, 2051795, 2121751, 2031667, 1820861, 1740780, 1827954, 2023808, 2172890, 2286071, 2358234, 2157101, 1878669, 2089403, 2243484, 2263082, 2289191, 2219993, 2277601, 2409984, 2178434, 2040933, 2029041, 1886394, 1888309, 2125124, 2399246, 2353934, 2242672, 2404618, 2497575, 2243028, 2165399, 2336682, 2322908, 2294571, 2415509, 2510176, 2778937, 2855459, 3017688, 2865570, 2536651, 2708334, 2792740, 2887433, 3150413, 3019413, 2911887, 3003872, 3382556, 3429213, 3426487, 3679075]
4457C679075J64606K07565m4850L4293R3724J61034l86628M85951M58276r6468
4447D756578K22612J28908j63828L88383L69019N1758J75244k1044L74430J03246
4437F385306J20523j4906N58039Q59192K14522L04839M97997M69355J29430N72285
4427A0096582Q81847M95285M22131O42865Q79303O12833Q16208J182817P20946
4418A6750817O31971Q09416N69601P75106O62282R08113J026930P59646J012975
4409B3906857Q70626Q21560J499913J182623J360271J155289J009283R50810P78113
4400C3535345M82553M46443O87166N12813P68711P98014R41326Q33292R08263
4391C9913926P75516R40597P19505K66211N03999N9500j28110L2912j27539k27436
$$ y = [3679075, 3843681, 4051246, 4006396, 4040689, 4134413, 4295447, 3908819, 4394770, 4853046, 4756578, 4979190, 5108098, 4944270, 5332653, 5701672, 5753430, 5928674, 5907630, 6282060, 6385306, 6505829, 6490923, 7048962, 7908154, 8122676, 8427515, 8925512, 9394867, 9524297, 10096582, 10978429, 11473714, 11895845, 12538710, 13418013, 14030846, 14847054, 16029871, 16750817, 17382788, 18192204, 18761805, 19536911, 20199193, 21107306, 22134236, 22893882, 23906857, 24777483, 25599043, 27098956, 28281579, 29641850, 30797139, 31806422, 32757232, 33535345, 34017898, 34464341, 35151507, 35664320, 36433031, 37231045, 38172371, 39005663, 39913926, 40689442, 41630039, 42349544, 42615755, 43119754, 43179254, 43051144, 43084056, 42956517, 42729081]
4381D2729081K3990K7058J39841L88008J38386K35183K646Q3096O7796l27058
4371D3508027K264n06159o85223l75435j74323J60106k41852j10040R0375j71114
4361D1496626o5013k58608j00497M9699L89205P738l72666k82248m2322L91068
4351D1212982K85596J80944K94941M36694M27274N25942P23215O81080O39903
4342D5408571L80881P23023O94447P47715Q61411N94775L58541M91721O84340
4333E0945425M25171N61681M66997N27076O81774O15384P84422R40718P22424
4324E6671072O18694O25453N72166M56932Q72158N36599O21076O62996J39081
4315F1776227M43052L05175J85951K90809J64114n4434j30346m22764O6833j36734
$$ y = [42729081, 42753071, 42780129, 42919970, 43307978, 43446364, 43681547, 43684193, 43767289, 43835085, 43508027, 43510291, 43004132, 42318909, 41943474, 41769151, 41929257, 41687405, 41577365, 41667740, 41496626, 41431613, 41173005, 41072508, 41122207, 41511412, 41519150, 41146484, 40864236, 40821914, 41212982, 41498578, 41679522, 41974463, 42411157, 42838431, 43364373, 44087588, 44768668, 45408571, 45789452, 46512475, 47206922, 47954637, 48816048, 49410823, 49769364, 50261085, 50945425, 51370596, 51932277, 52399274, 52926350, 53608124, 54223508, 55007930, 55948648, 56671072, 57289766, 57915219, 58487385, 58944317, 59816475, 60353074, 60974150, 61637146, 61776227, 62219279, 62524454, 62710405, 63001214, 63165328, 63110894, 62980548, 62557784, 62624617, 62487883]
4305F2487883q10282r93181o40236p58209n94575p87531q00392m79737o87906
4296E5935834r73606o37081m02718q00696q95923r26058o37255q70961j286287
4287D8505249j049354r63131j235126j087591r83936j135796j157743p29369r75727
4278C9187476j398365j124108j026837j085710j101896j303221q10347q46802
4270C0490190n33016j071042j029531q42496p45823p70770o36265m38005p17687
4261B3705555q31352n78641l85222n92327k06918m26922o51010j84697o26553
4252A9221913m32917j44253j91025j42506l10589m37338l88199o5591n5789o06311
4242A6447395k40588j99015l40683l66059j09657j33431k32981j37234k1759l49604
$$ y = [62487883, 61677601, 60684420, 60044184, 59285975, 58691400, 57903869, 57103477, 56623740, 55935834, 54962228, 54325147, 53922429, 53121733, 52225810, 51299752, 50662497, 49791536, 48505249, 47455895, 46492764, 45257638, 44170047, 43186111, 42050315, 40892572, 40163203, 39187476, 37789111, 36665003, 35638166, 34552456, 33450560, 32147339, 31336992, 30490190, 29957174, 28886132, 27856601, 27014105, 26268282, 25497512, 24861247, 24423242, 23705555, 22874203, 22295562, 21910340, 21318013, 21111095, 20684173, 20033163, 19848466, 19221913, 18788996, 18644743, 18453718, 18311212, 18000623, 17563285, 17175086, 17109495, 17053706, 16447395, 16206807, 16007792, 15667109, 15301050, 15191393, 15057962, 14824981, 14687747, 14665988, 14316384]
4232A4316384j45230j76728o12018m93755K7549k23163m27398m64453k79575k1322
4222A1500291j01668K6242m21142n76098k33438k92201k2452q202k16962P1655
4212I726025j42382j43912O3789k7442j36184J31373j29831P1556j33556j0881
4202I268555l5627j48384M4846Q5322l6151J42580K36045j27140l36508j34086
4192H959452j24059O0779p3883J39505K61090j83968j33874j44876J60083J63588
4182I083837m7214J56695Q6907k73721j48421J13784l519J83218m7913Q6059J97520
4171I387232K11433j99655j11908K19539j25225L61522J16772l89808O3669O1234
4161I594805K06421j50952J56238q724J64310L7298k4190J71366J14870j36591
$$ y = [14316384, 14171154, 13994426, 13382408, 12888653, 12916202, 12693039, 12265641, 11801188, 11521613, 11500291, 11398623, 11424865, 11003723, 10427625, 10194187, 9901986, 9879534, 9871332, 9654370, 9726025, 9583643, 9439731, 9503520, 9476078, 9339894, 9471267, 9341436, 9412992, 9279436, 9268555, 9232928, 9084544, 9129390, 9214712, 9178561, 9321141, 9557186, 9430046, 9093538, 8959452, 8835393, 8896172, 8822289, 8961794, 9222884, 9038916, 8905042, 8760166, 8920249, 9083837, 9036623, 9193318, 9280225, 9006504, 8858083, 8971867, 8968348, 9151566, 9103653, 9189712, 9387232, 9598665, 9399010, 9287102, 9506641, 9381416, 9742938, 9859710, 9469902, 9533571, 9594805, 9801226, 9650274, 9806512, 9797788, 9962098, 9999396, 9975206, 10146572, 10261442, 10124851]
4151A0124851L24599J00920J0366j311J45899J76861N1436J80057J85126L78075
4141A1676879K98165L41016P9778K58082L27823N0458J03568J9406M84084N69149
4131A4208408K79414M19537K03373J12798K25476L9169J93727N79798M28720J63578
4121A6853998J66082K40792Q2958O3148M21385M57418J29231M19228M12746M76806
4111A9723792M75493K74517L45198L24805K67997M41171L21283N15319N79729
4102B3269304M95712M68022L37735M21641N51532L78357Q78251N07888P87914
4093B8096356Q71024O55091O37788R18572O89413Q45854R02946O92678P98708
4084C5108430J113434R60074J006436Q46187Q66138Q27567Q07430M48032M56911
$$ y = [10124851, 10449450, 10550370, 10560736, 10559425, 10705324, 10882185, 10933621, 11113678, 11298804, 11676879, 11975044, 12316060, 12395838, 12653920, 12981743, 13032201, 13135769, 13155175, 13639259, 14208408, 14487822, 14907359, 15110732, 15223530, 15449006, 15488175, 15681902, 16261700, 16690420, 16853998, 17020080, 17260872, 17343830, 17406978, 17828363, 18285781, 18415012, 18834240, 19246986, 19723792, 20199285, 20473802, 20819000, 21143805, 21411802, 21852973, 22174256, 22689575, 23269304, 23765016, 24233038, 24570773, 24992414, 25543946, 25922303, 26800554, 27308442, 28096356, 28967380, 29622471, 30260259, 31178831, 31868244, 32714098, 33617044, 34309722, 35108430, 36221864, 37181938, 38188374, 39034561, 39900699, 40728266, 41535696, 41983728, 42440639]
4075D2440639J012928M80535O34320Q31490O63556P19537J023488O58392O03448
4066D9068333O81668O43395R74526J123998O95098N90408P79421R84206R16344
4057E6457397J113108Q80989R75520J643384J144387J180115J106604J302461
4049F5803965J421812J427084J329528J252937J609865J847096K022674K048487
4041G8763448K085429K489359K515208K842420L185064L360822L526403M121470
4033A02889623M247358M457853M403405M282308M856393M631984M546645M390643
4025A38706212M179765M245048L993674L660336L147669K969941K118597J635738
4017A64656980J480073O84313K38536m15812j052160j768244j986192k187519
$$ y = [42440639, 43453567, 43934102, 44568422, 45399912, 46063468, 46783005, 47806493, 48464885, 49068333, 49750001, 50393396, 51367922, 52491920, 53187018, 53777426, 54556847, 55541053, 56457397, 57570505, 58451494, 59427014, 61070398, 62214785, 63394900, 64501504, 65803965, 67225777, 68652861, 69982389, 71235326, 72845191, 74692287, 76714961, 78763448, 80848877, 83338236, 85853444, 88695864, 91880928, 95241750, 98768153, 102889623, 107136981, 111594834, 115998239, 120280547, 125136940, 129768924, 134315569, 138706212, 142885977, 147131025, 151124699, 154785035, 157932704, 160902645, 163021242, 164656980, 166137053, 166821366, 167059902, 166644090, 165591930, 163823686, 161837494, 159649975]
4009A59649975k222198k741967k877963l056458l141123l589521m086420m072793
4001A33861532m442637m794655n485373n218553n350252n395829n202615n168830
3993I2802788m793948m582251m149498m088744l471068l360019k938133k659401
3985F2759726k582806k576220k382473j955482j990441k000386j109139j789667
3977D6373112j561043j464452j710697q57453q78452r75558r81009q90497r13403
3968C6140548r76561r52951o69608m98532r38729q05097o39193n77601n33952
3959B9548324m96300o12010j016127m62293l00751n16563k99502p83010n54159
3950B4507609k44285j54048p6329j68081k22489l12257k02105n05060k99461l7223
$$ y = [159649975, 157427777, 154685810, 151807847, 148751389, 145610266, 142020745, 137934325, 133861532, 129418895, 124624240, 119138867, 113920314, 108570062, 103174233, 97971618, 92802788, 88008840, 83426589, 79277091, 75188347, 71717279, 68357260, 65419127, 62759726, 60176920, 57600700, 55218227, 53262745, 51272304, 49271918, 48162779, 46373112, 44812069, 43347617, 41636920, 40779467, 39901015, 38925457, 37944448, 37053951, 36140548, 35163987, 34211036, 33541428, 33042896, 32104167, 31299070, 30659877, 30082276, 29548324, 29052024, 28440014, 27423887, 26961594, 26660843, 26144280, 25844778, 25061768, 24507609, 24263324, 24109276, 24032947, 23864866, 23642377, 23330120, 23128015, 22622955, 22323494, 22286271]
3940B2286271k51644k9451j37733q9081L8695O2948K78231j7554j52524q3493
3930B1904665J60775j3053R6424L41355J69411K44208N75209K92336O91252M82317
3920B4944899O06279N91980N91139Q85214O54981O36734N47031O13712N58776
3911C0630745O76723P32168L58652j673L29158n8574p3123k54019j71713j55494
3901C2012850l59319j76555k45439m28702o6919L92199K07097q467K32581M41407
3891C2000733J92520M71188R44374P48723P35838P94170Q07027R25563J105159
3882C8725295J449617J238969J576146J786487K025535K053577K374105K761206
3874E3990937K664825K980809L499490L510272L570458L895642M125618M496021
$$ y = [22286271, 22034627, 22005176, 21867443, 21778362, 21817057, 21880005, 22158236, 22140682, 21988158, 21904665, 22065440, 22052387, 22148811, 22490166, 22659577, 22903785, 23478994, 23771330, 24462582, 24944899, 25551178, 26143158, 26734297, 27619511, 28274492, 28911226, 29458257, 30071969, 30630745, 31307468, 32039636, 32398288, 32396615, 32725773, 32667199, 32594076, 32340057, 32168344, 32012850, 31653531, 31476976, 31231537, 30802835, 30735916, 31128115, 31335212, 31326745, 31559326, 32000733, 32193253, 32664441, 33608815, 34357538, 35093376, 35887546, 36694573, 37620136, 38725295, 40174912, 41413881, 42990027, 44776514, 46802049, 48855626, 51229731, 53990937, 56655762, 59636571, 63136061, 66646333, 70216791, 74112433, 78238051, 82734072]
3866H2734072M681085M696781M509088M338085M110666M253833L975860L531321
3858A16830791L161885K387717K176331J617449J448084O14043L70046L44066
3850A28950412K14534k59759K64639l8262m16932j42723k77397q9537m5143n30611
3840A27629221l25757o80068o29922j096425j260047j312941j563666j221660
3832A19538735j387663j352799j719479j008445q34045l23202o9239O14594J108844
3823A14567301J519162J925505K788952L402468L895372M668177M954319N078436
3815A42799692N314762N051641M867555M208471L925690L546642K718690J985241
3807A74418384J253702N49988p4420p68105j211599j469832k319403k672753k894935
$$ y = [82734072, 87415157, 92111938, 96621026, 100959111, 105069777, 109323610, 113299470, 116830791, 119992676, 122380393, 124556724, 126174173, 127622257, 128236300, 128606346, 128950412, 129164946, 128905187, 129169826, 129131564, 128714632, 128571909, 128294512, 128204975, 128159832, 127629221, 127303464, 126623396, 125993474, 124897049, 123637002, 122324061, 120760395, 119538735, 118151072, 116798273, 115078794, 114070349, 113236304, 112913102, 112843863, 113458457, 114567301, 116086463, 118011968, 120800920, 124203388, 128098760, 132766937, 137721256, 142799692, 148114454, 153166095, 158033650, 162242121, 166167811, 169714453, 172433143, 174418384, 175672086, 176222074, 176147654, 175379549, 174167950, 172698118, 170378715, 167705962, 164811027]
3798A64811027l478014l715813l860171m305080m566827m784248m930575n282880
3790A29887419n161404n297091n028557n260548m995303n103505n017374m836023
3782H9187614m635785l964270m120805l865863l470050k968536l225654k884312
3774F0052339k695318k449629k557532k052270k189408j914266j737692j814212
3766D2642012j533989j149236r07168r91394j055599q46653m77697m54364n21721
3757C4704191p43564m49929l75016j3753j43716M3229k24922K13533j0876J25233
3747C3124410K4710k63483K64938k35641k39165n1834k6321m54012p31119l80518
3737C1031965p21131p36370o78957r11197q02318p35380n39006q33465p18443
$$ y = [164811027, 161333013, 157617200, 153757029, 149451949, 144885122, 140100874, 135170299, 129887419, 124726015, 119428924, 114400367, 109139819, 104144516, 99041011, 94023637, 89187614, 84551829, 80587559, 76466754, 72600891, 69130841, 66162305, 62936651, 60052339, 57357021, 54907392, 52349860, 50297590, 48108182, 46193916, 44456224, 42642012, 41108023, 39958787, 39051619, 38060225, 37004626, 36157973, 35680276, 35225912, 34704191, 33960627, 33510698, 33135682, 33121929, 32978213, 33021442, 32796520, 33010053, 32999177, 33124410, 33149120, 32885637, 33150575, 32914934, 32675769, 32623935, 32597614, 32143602, 31412483, 31031965, 30310834, 29574464, 28895507, 27984310, 27181992, 26446612, 25907606, 25074141, 24355698]
3728B4355698o05075n86246p11898p63934o12615m77863o50479m83176p95412
3719A8669000m80118k65986j70080n92777j79707l60967p32662j34705k04254
3710A5547744l93095k69726j03808k93266l8412k18065k0511l98243j50670L03538
3700A3965486M3350j71520j90017j84368j14899o5737K02421m90698j54616r4809
3690A2744593j7751Q5213k40328j71635k86146K25847j4784k49068j23946l00234
3680A1651761J09471o5716k24736q8613K6823j15880O5522J38723K32570M4869
3670A1774794k76569K88314k7398n9966k0841J61434J4625j17919L05392K38543
3660A2280409k05025j91740Q9245K67168Q8629K43887R377o2431J88075L34965
$$ y = [24355698, 23750623, 23164377, 22452479, 21688545, 21075930, 20598067, 19947588, 19464412, 18669000, 18188882, 17922896, 17752816, 17160039, 16980332, 16619365, 15886703, 15751998, 15547744, 15154649, 14884923, 14781115, 14487849, 14449437, 14231372, 14210861, 13812618, 13661948, 13965486, 14008836, 13837316, 13647299, 13462931, 13348032, 13282295, 13484716, 12994018, 12839402, 12744593, 12726842, 12812055, 12571727, 12400092, 12113946, 12339793, 12325009, 12075941, 11951995, 11651761, 11761232, 11695516, 11470780, 11382167, 11408990, 11293110, 11358632, 11497355, 11729925, 11774794, 11498225, 11786539, 11759141, 11699175, 11678334, 11839768, 11854393, 11736474, 12041866, 12280409, 12075384, 11883644, 11972889, 12240057, 12328686, 12572573, 12581950, 12519519, 12707594, 13042559]
3650A3042559L89272J64837K38067M51563L16225K83508K82540N87559N78896
3641A6335026N04226O97133P49509P44694O44106P76972P30797J017457Q66008
3632B3065928N53868O90454R79832Q97060R77740P67454P91518P29709N86078
3623C0039641Q96903Q18379J061107R05374P44904O45938N33745K50363K71189
3614C6167543L25756M66658j21714J1286L66294L1896L11409L16950J56680j85737
3604C7847021J98305N47022L49877K43450K65152M77811O39997Q27843O97467
3595D2093945R27935J036482J452777J747439J623220K070641K495072K940054
3587E6387565L004274L333727M053281M701074N044738N568877O127086O288386
$$ y = [13042559, 13431831, 13596668, 13834735, 14286298, 14602523, 14886031, 15168571, 15756130, 16335026, 16839252, 17536385, 18285894, 19030588, 19674694, 20451666, 21182463, 22199920, 23065928, 23619796, 24310250, 25290082, 26187142, 27164882, 27932336, 28723854, 29453563, 30039641, 30936544, 31754923, 32816030, 33721404, 34466308, 35112246, 35645991, 35896354, 36167543, 36493299, 36959957, 36838243, 36849529, 37215823, 37247719, 37559128, 37876078, 38032758, 37847021, 38045326, 38592348, 38942225, 39185675, 39450827, 39928638, 40568635, 41396478, 42093945, 43021880, 44058362, 45511139, 47258578, 48881798, 50952439, 53447511, 56387565, 59391839, 62725566, 66778847, 71479921, 76524659, 82093536, 88220622, 94509008]
3579I4509008P315265Q054478P996203Q160440Q186679Q524157Q381468Q353028
3571A59480726P924224P664668P065699P007265O211833N697504N264967M659200
3563B10976086L993514K861272K264182J754810N42832n81050j656910k229487
3555B17925249k433828l309959l891930m537126n627566n958808o278626o604619
3547A79282787p028462p373202p160088p179317o942473o943165o341204n792579
3539A24522297n640911n027079m431787m024643l348358k786630k399890j846221
3531I5016778j580508j535849o19976m05039r391p3054K91317M53627N4350J24332
3521I1716587O2670M15054Q22377K07918k91586J83524J88189L01178J34010J20228
$$ y = [94509008, 101824273, 109878751, 117874954, 126035394, 134222073, 142746230, 151127698, 159480726, 167404950, 175069618, 182135317, 189142582, 195354415, 201051919, 206316886, 210976086, 214969600, 217830872, 220095054, 221849864, 222392696, 221811646, 220154736, 217925249, 215491421, 212181462, 208289532, 203752406, 198124840, 192166032, 185887406, 179282787, 172254325, 164881123, 157721035, 150541718, 143599245, 136656080, 130314876, 124522297, 118881386, 113854307, 109422520, 105397877, 102049519, 99262889, 96862999, 95016778, 93436270, 91900421, 91280445, 90875406, 90866015, 90792961, 91084278, 91537905, 91592255, 91716587, 91779257, 92194311, 93016688, 93224606, 92933020, 93116544, 93304733, 93605911, 93739921, 93860149]
3511I3860149L63855J04530k5120J11328M93361O81423O17136j56704q56170j723970
3501I3469818j764772j856044j745781k227117l094150l733102m413979l816763
3493G0818110l334921k964540k234102k148240j766881j422038j684496j429817
3485E3833075j036382q73916m70709r3415Q6026K91538J148009J417749J484133
3476E5786108J575044J085310Q00102J08184K81230J005090N10761o54088j074171
3467E9423570j603232j829633q65121l35551n83758l68204j54286m6128j97891
3458E3439766M6553M65474K32849J13358K44702O51907L09560L89920Q43247P57280
3448E7494616N42997J043863J259765R74897J063615M06960R20913J251948J827558
$$ y = [93860149, 94224004, 94328534, 94303414, 94414742, 94908103, 95589526, 96206662, 96049958, 95193788, 93469818, 91705046, 89849002, 88103221, 85876104, 82781954, 79048852, 74634873, 70818110, 67483189, 64518649, 62284547, 60136307, 58369426, 56947388, 55262892, 53833075, 52796693, 51922777, 51452068, 51358653, 51444679, 51736217, 52884226, 54301975, 55786108, 57361152, 58446462, 59246564, 59354748, 59635978, 60641068, 61151829, 60497741, 59423570, 57820338, 55990705, 55125584, 54790033, 54206275, 53838071, 53683785, 53637657, 53439766, 53486319, 53951793, 54184642, 54298000, 54542702, 55194609, 55504169, 55894089, 56737336, 57494616, 58037613, 59081476, 60341241, 61316138, 62379753, 62786713, 63707626, 64959574, 66787132]
3439F6787132K816865L543920N211387P011579P367889M937347J821150m324397
3431I5172872q336699o186099l574473k152426q28990J94460R99588J721546K097538
3422G9107317K768245L572686M190858N120317O148969O585783P478044Q116615
3414A23088834R052449Q707810R090423R384302R006266R249371R131084P502309
3406A94212848L437083k163711j0368917j3654775j1510324j0357580r280951
3399A40313673p574072o010326n390697m658413l938209k743079k431846k401569
3391A05165462j601314j062374q65034o16928o24154n58671n68618j97011q28378
3382I8242980j258943j510582j864385j661733j509289j339358p40824n27792
$$ y = [66787132, 69603997, 73147917, 78359304, 85370883, 92738772, 97676119, 99497269, 95172872, 86836173, 80650074, 77075601, 74923175, 74094185, 74288645, 75288233, 77009779, 79107317, 81875562, 85448248, 89639106, 94759423, 100908392, 107494175, 114972219, 123088834, 132141283, 140849093, 149939516, 159323818, 168330084, 177579455, 186710539, 194212848, 197649931, 195486220, 185117303, 171462528, 159952204, 149594624, 140313673, 132739601, 126729275, 121338578, 116680165, 112741956, 109998877, 107567031, 105165462, 103564148, 102501774, 101636740, 101019812, 100395658, 99836987, 99268369, 99071358, 98242980, 96984037, 95473455, 93609070, 91947337, 90438048, 89098690, 88357866, 87830074]
3374H7830074j462078q97977o30328j036732j256932j840234j471028j412826
3366G7821939k054197j812793j643157j947362j644760j368836j552073j410182
3358F4388579j532899k481588k920019k448756k832788l361324k877446k051563
3350D3882196k108172j779331j583523j360910j107599j117971p92121j045843
3342C2986726o41493p24935o47368n72661o67546m31649j39847J22437J17076
3333B9400740K36690k215l53249p12862j206306j445098j549947j123719m63362
3324B2780672p16502o81586l46232J0199j35433m08457j41954j51033k56774J63835
3314B0116735j05686l13789l18554k38731m11925j86346n09754k98719m02084
$$ y = [87830074, 86367996, 85470019, 84839691, 83802959, 82546027, 80705793, 79234765, 77821939, 75767742, 73954949, 72311792, 70364430, 68719670, 67350834, 65798761, 64388579, 62855680, 60374092, 57454073, 55005317, 52172529, 48811205, 45933759, 43882196, 41774024, 39994693, 38411170, 37050260, 35942661, 34824690, 34032569, 32986726, 32345233, 31620298, 30972930, 30400269, 29732723, 29301074, 29161227, 29283664, 29400740, 29637430, 29635215, 29281966, 28569104, 27362798, 25917700, 24367753, 23244034, 22780672, 22064170, 21382584, 21036352, 21046551, 20911118, 20502661, 20360707, 20209674, 19952900, 20116735, 20011049, 19697260, 19378706, 19139975, 18728050, 18541704, 18031950, 17733231, 17331147]
3305A7331147o53746n29756o98704k77565k00772n03812m21447j25043j23803
3296A3796499k39997l44865j84352j97490N553l04355l3312l34636j57426j29343
3286A1876276l4219J67070k12270j08556k74209l149K0619j96306j13103K19503
3276A1341656r9187j24965o1399k4581k13139n6627J17743J4419j73393J40298
3266A0860825k2549j38776k19530m8403O9681j85869j67433J15355P626l57333
3256I913594L5330k30956K91972P1302k60908J06038q4521L13064r3196l20806
3246I740913N685J00450J57158k72982M05271K83839k63139j07840l10619N37870
3236A0276606L00887O0396l9598j98520K05632K04891J10832M6316q7162J24924
$$ y = [17331147, 16677401, 16147645, 15448941, 15171376, 14970604, 14466792, 14045345, 13920302, 13796499, 13556502, 13211637, 13027285, 12829795, 12835348, 12530993, 12497681, 12163045, 12005619, 11876276, 11842057, 12009127, 11796857, 11688301, 11414092, 11410943, 11431562, 11235256, 11122153, 11341656, 11242469, 11117504, 11056105, 11031524, 10818385, 10761758, 10879501, 10893920, 10720527, 10860825, 10838276, 10699500, 10479970, 10431567, 10501248, 10315379, 10147946, 10263301, 10270927, 9913594, 9948924, 9717968, 10009940, 10081242, 9820334, 9926372, 9841851, 10154915, 10061719, 9740913, 9746598, 9847048, 10004206, 9731224, 10136495, 10420334, 10157195, 10049355, 9738736, 10276606, 10577493, 10637889, 10598291, 10399771, 10605403, 10810294, 10921126, 10967442, 10880280, 11005204]
3226A1005204L03471J85855l5162o1155M24165J18628j4700J23597K19912n9630
3216A2210185K34289r6926J56841L96447J20762L03815K57324Q1000L47090M21853
3206A4432680J61981L82076P1934J61114M34651M67171N55938M12048M58175L82841
3196A7920609L09403J49322O43566N42413O75543P71786P76042R22914P85670
3187B3497268O59021P80562J128064J196026R49332P60086J214491J014630J297619
3178C2497099J074638J235054J910403J964140J908872J744323K459493K324796
3170D7118818K721268L130807L156634L300646M056818M377662M632819N417104
3162G7912576N703637O727698P611139Q654522R331804J0910230J2102717J3203895
$$ y = [11005204, 11308675, 11494530, 11459368, 11398213, 11822378, 11941006, 11926306, 12049903, 12269815, 12210185, 12444474, 12347548, 12504389, 12900836, 13021598, 13325413, 13582737, 13663737, 14010827, 14432680, 14594661, 14976737, 15048671, 15209785, 15644436, 16111607, 16667545, 17079593, 17537768, 17920609, 18230012, 18379334, 19022900, 19565313, 20240856, 21012642, 21788684, 22711598, 23497268, 24156289, 24936851, 26064915, 27260941, 28210273, 28970359, 30184850, 31199480, 32497099, 33571737, 34806791, 36717194, 38681334, 40590206, 42334529, 44794022, 47118818, 49840086, 52970893, 56127527, 59428173, 63484991, 67862653, 72495472, 77912576, 83616213, 90343911, 97955050, 106609572, 115941376, 126851606, 138954323, 152158218]
3154A52158218J4711858J6556903J9241227K2158603K6095100L0691021L5919705
3147C17532635M0581661M3551758M1225267L0080652J1250050j2446906l3015275
3140D38759842m3335845m3337846l8699278l2428538k6626360k1613423j7628599
3133B15089953j4797597j2154893j0975568r929358q593252p582750o106225n278540
3125A39671770m430544l380196l120495k330210j923723j636898j668901r50529
3117A20230274r13675j236940q83199q51051l79683L47220Q99078J449483K006909
3108A20668416K717971L554787L915526N037966N758537O458515P605522Q899127
3100A64616367R857005J1089183J3162783J5012606J6532954J8140782J9195947
$$ y = [152158218, 166870076, 183426979, 202668206, 224826809, 250921909, 281612930, 317532635, 358114296, 401666054, 442891321, 472971973, 484222023, 471775117, 438759842, 395423997, 352086151, 313386873, 280958335, 254331975, 232718552, 215089953, 200292356, 188137463, 177161895, 167232537, 158639285, 151056535, 144950310, 139671770, 135241226, 131861030, 128740535, 126410325, 124486602, 122849704, 121180803, 120230274, 119316599, 118079659, 117196460, 116345409, 115965726, 116312946, 117212024, 118661507, 120668416, 123386387, 126941174, 130856700, 135894666, 141653203, 148111718, 155717240, 164616367, 174473372, 185562555, 198725338, 213737944, 230270898, 248411680, 267607627]
3093B67607627J8786196J7373493J3782292P762067n2679p952050j4392682j8636473
3085B84277791k0204887j9878227j8544813j7219750j5537618j3164389j1803398
3078A67924709j1036933r562122q846620q592688p730243p429520p012701o367375
3070A01346507o263212n771017n104450m934291l751553l895604l732758l161478
3062F4732144l134446k764441k836234k507049k208853j939356j913892j936791
3054D5491082j801387j337223j321378j473662j686269j369549j234307j201002
3046C4066305j138719j203864r87525q50593q69039j096314o90438o06016j147871
3037B5475926p28383q52252n97999m67271l65654p81354p12438l78340n50232
$$ y = [267607627, 286393823, 303767316, 317549608, 325311675, 325258996, 317306946, 302914264, 284277791, 264072904, 244194677, 225649864, 208430114, 192892496, 179728107, 167924709, 156887776, 147325654, 138479034, 129886346, 122156103, 114726583, 107713882, 101346507, 95083295, 89312278, 84207828, 79273537, 75521984, 71626380, 67893622, 64732144, 61597698, 58833257, 55997023, 53489974, 51281121, 49341765, 47427873, 45491082, 43689695, 42352472, 41031094, 39557432, 37871163, 36501614, 35267307, 34066305, 32927586, 31723722, 30736197, 29885604, 29016565, 27920251, 27229813, 26623797, 25475926, 24747543, 23895291, 23297292, 22830021, 22464367, 21683013, 20970575, 20592235, 20042003]
3028B0042003k84651n33308n67389l66256m82327n80006k65507k72038k86106
3019A6404415n32056n23935n20290l19000K3240j30643k06131m1907k79934p24145
3009A3149614l14557k85398j29325j68884k42322k31737l05648n31090l47191
3000A0593462j97923j25981J3585p1243l35560n36237J59495j25434j62364q5380
2990I126420k64575M8181K9272k51509j93819j95969p1069Q9961k31160j27714
2980G958019l67856k43049k2821j04069k09437j35085K02679l27893l55240J51752
2970F547000P5865k85896l34380L8511q0865q9975M29521J95595k85555j92237
2960F017584q8700l38948j04562k20258l1870j486n6949j95677j9683j55854l9908
$$ y = [20042003, 19757352, 19224044, 18656655, 18290399, 17808072, 17228066, 16962559, 16690521, 16404415, 15872359, 15348424, 14828134, 14509134, 14532374, 14401731, 14195600, 14153693, 13873759, 13149614, 12835057, 12549659, 12420334, 12251450, 12009128, 11777391, 11471743, 10940653, 10593462, 10395539, 10269558, 10283143, 10211900, 9876340, 9340103, 9499598, 9374164, 9211800, 9126420, 8861845, 8910026, 8939298, 8687789, 8493970, 8298001, 8226932, 8316893, 8085733, 7958019, 7590163, 7347114, 7324293, 7220224, 7010787, 6875702, 7078381, 6750488, 6395248, 6547000, 6622865, 6336969, 6002589, 6041100, 5960235, 5870260, 6299781, 6495376, 6209821, 6017584, 5928884, 5589936, 5485374, 5265116, 5233246, 5231760, 5174811, 4979134, 4959451, 4803597, 4763689]
2949D763689k33056k04472o5535K90816J46781j23933j77960J37163J07969j83783
2939D457679j98923j63152j98571q427k4086k07370j73946j61127J79015o0266
2929C440826O645j24025k16285L3004M5360k5273j83192J32929K14499k3540o3381
2918C237567j67229J10349l1327P298Q6618R4374j56355l78734P6865K28140N3012
2907C160578q8838n788J76571l56017J26788J70725k62125j15207q8111m2948
2897B675628J28033J0143k22520j20697m908J26583J56351j74485j87472J01295
2887B487951K7601J91269j48511l75051N3067j50134K37159L6365j08012n1736
2877B199968J38579J65354M2902o0622J4167J18378P2215n4153J07377J13998
$$ y = [4763689, 4530633, 4326161, 4260626, 4551442, 4698223, 4574290, 4396330, 4533493, 4641462, 4457679, 4258756, 4095604, 3897033, 3888606, 3864520, 3657150, 3483204, 3322077, 3501092, 3440826, 3447471, 3323446, 3107161, 3140165, 3185525, 3160252, 2977060, 3109989, 3324488, 3300948, 3237567, 3070338, 3180687, 3149360, 3156658, 3243276, 3337650, 3181295, 2802561, 2879426, 3107566, 3160578, 3071740, 3065952, 3242523, 2886506, 3013294, 3184019, 2921894, 2806687, 2718576, 2675628, 2803661, 2813804, 2591284, 2470587, 2465679, 2592262, 2748613, 2574128, 2386656, 2487951, 2515552, 2706821, 2558310, 2183259, 2236326, 2086192, 2323351, 2359716, 2251704, 2199968, 2338547, 2503901, 2546803, 2486181, 2500348, 2618726, 2690941, 2636788, 2744165, 2858163]
2867B858163J2626L1708J74633J50925K29834K13472j56855J71187L22264J81089
2857D189046r5497l81229J4807m54521k02480M2491q3898N2571k36109k48048
2847B597133k28930R1638j57927J94463j7862k20693o4366p6161J72316k47882
2837B041729R6676l7245q7703p2836k86930J45444O0132L3430J1746j155K5177
2826A928465n736l9244K01843p3484k32359m5283J05915J35181j18828N773J69856
2815B032099J6650M7427Q6746J48467k8765R2395j40067J37834K08301J02741
2805B703828k14210l06516l3322J73756Q7952m7715J7314k83915l21880k2300
2795A752992J33356j93985P4950j31731k0260k7311p2662k7451J13268J16992
$$ y = [2858163, 2870789, 2902497, 3077130, 3228055, 3457889, 3671361, 3514506, 3685693, 4007957, 4189046, 4093549, 3712320, 3727127, 3272606, 3070126, 3112617, 3028719, 3081290, 2845181, 2597133, 2368203, 2459841, 2301914, 2496377, 2478515, 2257822, 2193456, 2117295, 2289611, 2041729, 2138405, 2101160, 2013457, 1940621, 1653691, 1799135, 1859267, 1892697, 1904443, 1903288, 1928465, 1922729, 1883485, 2085328, 2011844, 1779485, 1734202, 1840117, 1975298, 1856470, 1862243, 2032099, 2048749, 2096176, 2182922, 2331389, 2302624, 2395019, 2254952, 2392786, 2601087, 2703828, 2489618, 2183102, 2149780, 2323536, 2411488, 2363773, 2381087, 2097172, 1775292, 1752992, 1886348, 1692363, 1767313, 1635582, 1615322, 1588011, 1515349, 1487898, 1601166, 1718158]
2785A718158j52198n2480l2369L531k46426K2576q106J11054k11306k19501o0696
2774H72237n040m3668m6036J25113K46495J06702l44260L9701J22522l67311L9755
2763G46210K8073j44410J56410J28974j57720J35574j86953l75717o9611j33735
2753A27095L52584J86934P6449J4479j61443J71462n6622k53792Q8005j55853
2743C89298j45002p1520K98210J45628j50209L8105K27736j81497p439Q7933J3309
2732F44552r565j02569K9835l5777j4997r9306j32211R4278K38591j23177P2458
2721E62112j06348N0856l5635J8152j09776J08734j26716J00312J04721l67481
2711A98931J91393l8718r497J6333M0170J9797J19712j98617K9496o1547J25292
$$ y = [1718158, 1565960, 1513480, 1481111, 1484642, 1238216, 1260792, 1252686, 1363740, 1152434, 932933, 872237, 867197, 823529, 777493, 902606, 1149101, 1255803, 911543, 951244, 1073766, 706455, 746210, 774283, 629873, 786283, 915257, 757537, 893111, 706158, 330441, 260830, 127095, 479679, 666613, 743062, 757541, 596098, 767560, 710938, 457146, 545151, 389298, 244296, 172776, 470986, 616614, 466405, 504510, 732246, 550749, 543310, 631243, 644552, 634987, 532418, 562253, 526476, 511479, 412173, 279962, 374240, 612831, 489654, 562112, 455764, 506620, 470985, 489137, 379361, 488095, 361379, 461691, 566412, 198931, 390324, 351606, 342109, 358442, 398612, 418409, 538121, 339504, 369000, 307453, 432745]
2700D32745J37236j68595K6606k8260J55727l67937k25268K97364J32449J16853
2690E08920k12486L5280j97243J68788K48041k25054j74884n1763K69855j52904
2680B16550Q3983P3782k8745R781m00630j30426K48493J33877J33646K55264j92035
2669D03540Q9019N3522j04447j32877M5146k2497j28278K71523M4233k92899r6121
2658A29864n0334K03241L7839J4604j2311J72041l65930J31755J16986k40169
2648A37586n543J22351Q7627j87423n558k05601K53888Q8786J066k12218J46993
2637B21954k23945K77695K21236k92173k35177J94245j13888N2201J13722l8543
2627A77327j09913j33350K09862m1992J18787j00391j7346K77719j21202o9012
$$ y = [432745, 569981, 401386, 427992, 399732, 555459, 187522, -37746, 259618, 392067, 508920, 296434, 331714, 134471, 303259, 551300, 326246, 151362, 99599, 369454, 216550, 300533, 374315, 345570, 355351, -45279, -175705, 72788, 206665, 340311, 595575, 403540, 492559, 546081, 441634, 308757, 353903, 331406, 203128, 474651, 518884, 225985, 129864, 79530, 282771, 320610, 335214, 322903, 494944, 129014, 260769, 377755, 137586, 132043, 254394, 342021, 154598, 149040, -56561, 197327, 286113, 287179, 74961, 221954, -1991, 275704, 496940, 204767, -30410, 163835, 49947, 102148, 215870, 177327, 67414, -65936, 143926, 101934, 220721, 120330, 102984, 380703, 259501, 190489]
2617A90489m2625r5349m986J28720r224k00300m3604J18407K32666N3920r4250
2606B33864k17657J54516J18516n6830o6649j27903J0780M9849n2821m3161j05375
2595a02871M98638j96856k45181J63487J8471l5451j49266P5500N3477O3944l27442
2584a83550O7142L34274l7184Q744j09338Q7815K51713j38262j31049J27732J73814
2573D51851j06812L9321K63466j12810n2814k30625k44677k4871J60000n2348
2563H9681q8280P7306J07266K16753j23239j29896l7905J71187k80285o4082O0398
2552a096m6769k70784K35209O1927q4950j61236K88401m5710j64751J94540K7748
2541C2529o2283k1966N7401J33636J260l5040J38282j76967j50833L63202R1309
$$ y = [190489, 147864, 52515, 47529, 176249, 167025, -33275, -76879, 41528, 274194, 328114, 233864, 16207, 170723, 289239, 232409, 165760, 37857, 48637, 98486, 45665, 2504, -102871, 395767, 198911, -46270, 117217, 135688, 100237, -49029, 26471, 79948, 143892, -183550, -116408, 217866, 180682, 189426, 80088, 167903, 419616, 281354, 150305, 278037, 451851, 345039, 384360, 647826, 535016, 482202, 251577, 6900, -17971, 142029, 89681, 1401, 78707, 185973, 402726, 279487, 149591, 111686, 282873, 2588, -61494, -1096, -47865, -318649, -83440, -21513, -106463, -267699, 20702, -25008, -189759, 4781, 32529, -29754, -51720, 5681, 139317, 140577, 105537, 243819, 66852, -83981, 279221, 370530]
2530C70530k52136J11311P4061O1556j50651Q6992j74390j7909j3065J09668N7149
2519B63116K45030J70741k98008J24668K01949m69273k08540k1698K02378j42719
2509F7644K1766K49330j62226J09367L37414k99348j37185O9980K5354J220J41579
2498D24895m9144l23962K8347J56215m1026p5131N3843L9730k2650J02367J91801
2487D85285j8192r197k03954k44393Q7641J91190M5382n3853L9095k7371J3218
2476C04851k3070j38708K40549q7227j13725J72290R2973j62360l28439p3286
2466a16152J86616J09899j01584J50004k61991j76283L866j04573K75672J23240
2456H8714K45981j882l6714K21257l19607p5496k3038J20158r4636j85618K35430
$$ y = [370530, 118394, 229705, 303766, 365322, 214671, 301663, 127273, 109364, 96299, 205967, 263116, 508146, 678887, 380879, 505547, 707496, 238223, 29683, 7985, 210363, 67644, 89410, 338740, 176514, 285881, 623295, 323947, 186762, 256742, 282096, 283316, 424895, 375751, 51789, 80136, 236351, 195325, 120194, 174037, 213767, 191117, 293484, 485285, 467093, 457896, 253942, 9549, 97190, 288380, 333762, 279909, 319004, 291633, 304851, 281781, 143073, 383622, 296395, 182670, 354960, 447933, 285573, -42866, -116152, 70464, 180363, 78779, 228783, -33208, -209491, -205625, -310198, -34526, 88714, 334695, 332813, 296099, 517356, 197749, 122253, 99215, 219373, 124737, -60881, 174549]
2445A74549J70874m6852k65024p0084K97556N9659q1196n9816L594l234k06286
2434b6260N24777N446k24423J94772K204q5338n9630l28455K46204J06716l72727
2423a6714J83206l07333J59355N8667J23801K12078j87569j48946j37249K88517
2413B27813J78505j10280J58439O5929l05092k68662J50560K12491k5467J45680
2403D29916j05428J84165R434p5305N2890j36993j47281J72749j62746j35635
2393H5766J48167J90786O8387j09090j28432J45993m5584J68469j13644L51000
2383G61818J55568k77864k2710j007L03679o2105j6849J24929p1793J11829J86729
2372A192224m4003j75369J33389K6294P7762J66997j88696j63695L0278j26557
$$ y = [174549, 345423, 298571, 33547, -36537, 261019, 320678, 239482, 179666, 183260, 180026, -26260, 498517, 503963, 279540, 474312, 476516, 391178, 331548, 3093, 249297, 356013, -16714, 166492, -140841, 18514, 77181, 200982, 413060, 225491, 76545, -60704, 227813, 406318, 296038, 454477, 520406, 215314, -53348, 97212, 309703, 284236, 429916, 324488, 508653, 518087, 442782, 495672, 358679, 211398, 384147, 221401, 85766, 233933, 424719, 493106, 384016, 255584, 401577, 355993, 524462, 410818, 761818, 917386, 639522, 616812, 615805, 919484, 857379, 840530, 965459, 893666, 1005495, 1192224, 1148221, 972852, 1106241, 1132535, 1210297, 1377294, 1188598, 1024903, 1055181, 928624]
2362I28624K60197q7072o0145J50367K70604P1084J6326j2830l8190J27587K55692
2351A882244P6346J29152K8954j97176L5700P6598K06635K82057J31482K73497
2341B925489R0012Q3023L40963j87924K86268J55520K67528M43901M19928L58217
2331E182925M37401N40208M47812M38785O14346P73127Q76141P05197J180299
2322A1196241J460247J375452J214270J308589J289861J562106J814587K590411
2314B3811764K627514L555291M658943N700646O757740R445787J2570002J3311408
2306H2439095Q772902L907302r493184j8235971j2813426r251358o653242n017519
2298C3654599l852365l189122k514250k018252j276929r19784j106270j194631
$$ y = [928624, 1188821, 1101749, 1041604, 1191971, 1462575, 1533659, 1549985, 1537155, 1498965, 1626552, 1882244, 1958590, 2087742, 2116696, 1919520, 1955220, 2031818, 2238453, 2520510, 2651992, 2925489, 3015501, 3098524, 3439487, 3251563, 3537831, 3693351, 3960879, 4404780, 4824708, 5182925, 5620326, 6160534, 6608346, 7047131, 7661477, 8434604, 9310745, 10015942, 11196241, 12656488, 14031940, 15246210, 16554799, 17844660, 19406766, 21221353, 23811764, 26439278, 29994569, 34653512, 40354158, 47111898, 56557685, 69127687, 82439095, 91211997, 95119299, 85626115, 67390144, 54576718, 45325360, 38672118, 33654599, 29802234, 26613112, 24098862, 22080610, 20803681, 19883897, 18777627, 17582996]
2290A7582996q86431j297278j713391j189375p69655q24069q80589p19661o90347
2281H612200k99842n35956l42415m56506o57675l88249l30800j03710n19691J00907
2271E078263k1148l77747l09314k1627m13157j1011q7565l11589l18305j30535
2261C076265j00739j7889K5060j87142j55731o3279j60579l63758J30731P1126
2251B254065p4721p9071l59501O3198M5517o1611J65536n0230o4669l09342J04520
2240A633691o2150j21163n45338N6859J39839L4162j54827q3456L41989P195n6567
2229A190234k0317k7369j61153l0061k51436J81364K22259j41615p6889k517r9985
2218G82515L8101k30133m8863J6705L416J43417k7635L2820J27547k4536j46327
$$ y = [17582996, 16696565, 15399287, 13685896, 12496521, 11726866, 10902797, 10022208, 9302547, 8612200, 8312358, 7776402, 7433987, 6977481, 6319806, 5931557, 5600757, 5497047, 4977356, 5078263, 5057115, 4679368, 4370054, 4348427, 3935270, 3924259, 3836694, 3525105, 3206800, 3076265, 2975526, 2957637, 2982697, 2795555, 2639824, 2576545, 2415966, 2052208, 2182939, 2254065, 2179344, 2100273, 1740772, 1803970, 1849487, 1787876, 1953412, 1903182, 1838513, 1529171, 1633691, 1571541, 1450378, 905040, 961899, 1101738, 1135900, 981073, 897617, 1239606, 1246801, 1190234, 1169917, 1142548, 981395, 951334, 699898, 881262, 1103521, 961906, 885017, 882500, 782515, 820616, 590483, 541620, 558325, 561741, 705158, 677523, 710343, 837890, 813354, 667027]
2207F67027J9345K56140Q8403j9243m14684L0527J53671m31011k96876M229K55806
2196C13334M45163j36439j07398Q218N6275j12087K11806l4389j789l19567j46414
2185A76713R3604L92855j99344k31361K9410O9313J51122k80996P9917N1320Q5752
2174D18305J35009p6684J23246j07393j97020L24287o8493m92309O4541K56894
2164C80383J48509N3495j81378K6531J10375r4414M2379m0416k09121k69718N7949
2153B4574J74177n3431K15611k0460J2172k85708k00725o3524q293K53187r9770
2142e2190J05898k41881j11181L61103j10550K16504Q4867j01760Q2673J5083
2132B48566k44134K47450p1446k3462o6139M5441r0501m1186l033J42701p9964
$$ y = [667027, 686372, 942512, 1030915, 1011672, 596988, 627515, 781186, 350175, 53299, 57528, 313334, 758497, 622058, 514660, 522878, 579153, 467066, 678872, 644483, 642694, 323127, 176713, 270317, 663172, 463828, 232467, 261877, 331190, 482312, 201316, 281233, 332553, 418305, 553314, 476630, 599876, 492483, 295463, 619750, 551257, 58948, 123489, 380383, 528892, 582387, 401009, 427540, 537915, 443501, 485880, 445464, 236343, -33375, 24574, 198751, 145320, 360931, 340471, 352643, 66935, -133790, -197314, -205607, 47580, -52190, 53708, -188173, -299354, 61749, -48801, 167703, 252570, 150810, 233483, 248566, 4432, 251882, 180436, 156974, 90835, 136276, 45775, 4589, 1556, 144257, 64293]
2121F4293M0476j48464J25634j45756J41726j16031L9109j41287P380J01326J42181
2110A10587o0243k93372J20863K86965o6972l51412J66036J47260R2049J48719
2100C00480K06447j51288j13642J3202j80548o5136J43339j59145L0040j25946
2090a02197N747Q2261K79843j23344o4681J22683M8493L5230k88760J28632L963
2079A27870J96034j25423p9266k65920j22493L75333q3274j68234m7534O1368
2069a31539r3987P1585J1647L22773n9788m8463j40257j40056R3509j69172J5291
2058b68457R0981l3633K63033j12039L5199l1910l53427J94266J09526k44558
2048c51019J45058L42805K6860j74403J42568L19J35162j17301j00163J46535
$$ y = [64293, 104769, -43695, 81939, -63817, 77909, -38122, 987, -140300, -132920, -31594, 110587, 50344, -243028, -122165, 164800, 97828, -253584, -87548, 59712, 151761, 300480, 506927, 355639, 241997, 255199, 74651, 9515, 152854, -6291, 23749, -102197, -96450, -14189, 265654, 142310, 77629, 200312, 248805, 284035, -4725, 123907, 127870, 323904, 198481, 119215, -146705, -269198, 106135, 22861, -145373, -192907, -131539, -225526, -153941, -142294, 180479, 120691, 72228, -68029, -208085, -114576, -283748, -268457, -177476, -211109, 51924, -60115, -24916, -56826, -410253, -215987, -106461, -351019, -205961, 136844, 163704, -10699, 131869, 132188, 267350, 150049, 49886, 196421]
2038A96421J46399Q5010K4418J65213j61237j96260j33747J0459L95728J75143
2028G07547k22993l03366J69291j23214n40501P8883M39454O9393L45437M3555
2018F63486k81565j51352k36019j19827n9043q5392j10772n1657J13519K38682
2008g9940k1780J26809m8007k92106J2327L03930M0070k3159O9967k36876j22550
1997b71315J13308J55972m2045K5006r8678j69052j83246L6739o8165J06897K75344
1986a19235Q4160r0205k44547j35558L19352J35317m2892n30r5692j20873n7966
1975c68669Q3960K6706K37212o1955m5536R1321o3338k33702J94353R134J03733
1964b6781l71422J00995K62688L9106L54584j43393q1190k113j44185J07466L8190
$$ y = [196421, 342820, 427830, 452248, 617461, 456224, 259964, 126217, 136676, 532404, 707547, 484554, 181188, 350479, 227265, -313236, -234353, 205101, 274494, 619931, 663486, 381921, 230569, -5450, -125277, -184320, -269712, -380484, -432141, -318622, -79940, -101720, 25089, -22918, -315024, -302697, 1233, 41303, 18144, 88111, -148765, -271315, -158007, -2035, -44080, -19074, -117752, -286804, -470050, -433311, -501476, -394579, -119235, -35075, -125280, -369827, -505385, -186033, -50716, -93608, -94138, -189830, -310703, -368669, -284709, -258003, -20791, -82746, -128282, -36961, -100299, -334001, -139648, -130514, -26781, -398203, -297208, -34520, 4586, 359170, 215777, 134587, 132474, -11711, 95755, 133945]
1953A33945k50861K82393k28554j68200K25000L6149o976J88886k62245n2633
1943a03096N111r9708L4589K34698K23774l90828J1464Q7793k4124j44949K7424
1932a37852N3831n6718j63675K6606J60837J20886r1929o3090N8994p187j831
1921a01128j3113j43512J08584K58554k43443J02547l1043q8459k4576J32000
1911d3589J17389k94779Q1273K0223J43180Q2494J32831j33572k9762n5380j54113
1900a33805K64858r1693j15434J15897q7271J18523J31544j84170j67408R7686
1890e1273k8744J9237K18252j04880j51743J95867o8532j1916k8429k8933j07429
1879a48523P4080J53423J9775m1876O8077P548K9381j13150k77178J28485J72759
$$ y = [133945, -116916, 165477, -63077, -231277, -6277, 29872, 22896, 211782, -50463, -103096, -97985, -197693, -163104, 71594, 295368, -95460, -83996, 3797, -20327, -165276, -137852, -84021, -140739, -304414, -277808, -116971, 3915, -88014, -151104, -92110, -99297, -101128, -114241, -257753, -149169, 109385, -134058, -31511, -62554, -151013, -175589, -43589, 73800, -220979, -139706, -119483, 23697, 106191, 239022, 105450, 75688, 20308, -133805, 131053, 39360, -76074, 39823, -47448, 71075, 202619, 18449, -148959, -51273, -80017, -60780, 157472, 52592, -99151, 96716, 28184, 16268, -12161, -41094, -148523, -74443, 78980, 98755, 56879, 124956, 132504, 161885, 48735, -228443, -99958, 72801]
1868G2801k98420Q0335j11496J30960j9293q4515P9680J61213K20055k20476j47554
1857a36710j00179J13962J99571O8225k3614J51393m6786l09213j80015J88433
1847g4933K34139k79416J38344O5639l81984K67586j36156K0197r6261j78976
1837d21821J96478J24910q9679J1198J13165j19828k95351n6453Q8968K44123
1827b04290j51495J43458k8316L31991k76236k42994O0960Q3232J93751J15401
1817B5462O5992k26277O4461K40886J72751j96820j65904r3526j7834J46009k7024
1806a1824l2512p7032q59J64335J3629n1466j8279J33569k35812k37172Q2836
1795b70587m7769K48168P5951K18215J7169k29535k02735m4488K28934R278K3666
$$ y = [72801, -225619, -145284, -256780, -125820, -145113, -229628, -149948, 11265, 231320, 10844, -136710, -236889, -122927, 76644, 144869, 121255, 272648, 225862, -83351, -263366, -74933, 159206, -120210, 18134, 83773, -298211, -30625, -166781, -146584, -242845, -421821, -225343, -100433, -190112, -178914, -65749, -185577, -480928, -537381, -448413, -204290, -355785, -212327, -240643, 91348, -184888, -427882, -366922, -283690, -89939, 25462, 91454, -134823, -70362, 170524, 343275, 146455, -19449, -112975, -130809, 15200, -11824, -44336, -121368, -122227, 42108, 55737, 4271, -14008, 119561, -116251, -353423, -270587, -318356, -70188, 5763, 223978, 241147, 11612, -191123, -235611, -6677, 2601, 26267]
1784B6267K15543k55847Q8386M8043l33533k4745j33737m8620j1386K68375P6451
1773h4803k5704K10043K40440m47958j6590J00347R366j01218k8727j00853r2371
1762c38028j3344O6731J39351o3867o3590J70931j49158K9592J19121P3171q6170
1751a15260k08112L30146J90728l0147j10850k40936l41287J28270J6016Q6893
1741b94539K91152L9538N8311k3109k82988j45905k7745J69520J49576K28383
1731A62194j08152j20575j83326N1843m2497K6501L8427r6204J5043k9747R8302
1720a88191Q9854N7426k0858m7422j54239Q4340j58378p7045J39254n6461N6973
1709b74747J52646J06408J87870l91232K20340M8817P704j35070m0941J71751
$$ y = [26267, 241810, -14037, 74349, 122392, -211141, -235886, -369623, -418243, -429629, -161254, -84803, -110507, 99536, 339976, -107982, -124572, -24225, -14859, -116077, -144804, -245657, -338028, -351372, -284641, -145290, -209157, -272747, -101816, -250974, -221382, -102261, -29090, -115260, -323372, 6774, 197502, 167355, 56505, -184431, -525718, -397448, -381432, -294539, -3387, 36151, 94462, 71353, -211635, -357540, -385285, -215765, -66189, 162194, 54042, -66533, -249859, -198016, -240513, -214012, -175585, -271789, -256746, -286493, -188191, -98337, -40911, -61769, -109191, -263430, -179090, -337468, -414513, -275259, -331720, -274747, -122101, -15693, 172177, -219055, 1285, 50102, 57806, -77264, -118205, 53546]
1699E3546j71128O9236J07282L04967j65186j24930m14626J58945J20983L2573
1689b8338J95996r5746k7648K1481j48604j31L48090j64673q213J17899l38807
1678a28694j33958J57823n2501J54675O2262J14587K9301j14578m67209L63411
1668a4881M13397k37595j77394l5535o6806N6054k1478j64954P6392Q5299k9627
1657a17128j96757k71150R2195K23610K30540q414j89146Q9895q6541q9215q294
1646c30405j75405J69951K12473n3299J03j24180O8494M3823j52854p0725J55287
1635b56737K48571m7215J53903k20351J3598o2705R9031o7745k19956J8477k5936
1624c67065J64611K88477J54131q1466k60840r9524Q8545Q8016l4970k50913K69194
$$ y = [53546, -117582, -48346, 58936, 363903, 198717, 73787, -340839, -181894, -60911, -28338, 167658, 71912, 44264, 65745, -82859, -82990, 265100, 100427, 92214, 210113, -128694, -262652, -104829, -157330, -2655, 59607, 174194, 203495, 88917, -378292, -14881, 398516, 160921, -16473, -52008, -118814, -62760, -84238, -249192, -172800, -87501, -117128, -313885, -585035, -492840, -269230, -38690, -47104, -236250, -146355, -232896, -322111, -330405, -505810, -335859, -123386, -176685, -176582, -300762, -232268, -188445, -341299, -412024, -256737, -8166, -55381, 98522, -121829, -108231, -170936, -71905, -139650, -359606, -341129, -367065, -202454, 86023, 240154, 158688, -102152, -201676, -113131, -25115, -60085, -310998, -41804]
1613d1804M682J75312l33319P5016P4308q2023r9532m7938K18079P177J8085p1251
1601a03208M0491O6249l24918J84183l7335Q0697P9981j53774k01510M3687R7354
1590b28103o6046R2700M7256J01044K648o3030K72560j82921M3681k02442j26124
1579c08777M44921k11561j14392j22112R9658J06345Q0368n2516j38999k0680
1569b37745o4601J78951J61384j55483J60693K02444J6585j81410J31296l00808
1559h8694j65597L00318J03604j44983p3755J22538j09031J29215j43492J51037
1549H1160N210R370l49340k26341P0352J75576J90155O8006q036n7084Q5321L8415
1537H2764j7888p3774J38650k97271k2206L29801j93040m72079r5594K03797J11792
$$ y = [-41804, -37122, 138190, -195129, -120113, -45805, -127828, -227360, -275298, -57219, -50042, -31957, -103208, -62717, 3532, -321386, -137203, -174538, -93841, -13860, -167634, -369144, -325457, -228103, -294149, -201449, -154193, -53149, -50501, -113531, 159029, -23892, 19789, -182653, -308777, 136144, -75417, -189809, -311921, -212263, -105918, -25550, -78066, -217065, -237745, -302346, -123395, 37989, -117494, 43199, 245643, 262228, 80818, 212114, -88694, -254291, 46027, 149631, 4648, -69107, 53431, -55600, 73615, -69877, 81160, 86370, 95740, -253600, -479941, -409589, -234013, -43858, 24148, 16112, -40972, 44349, 82764, 64876, -8898, 129752, -167519, -189725, 140076, -52964, -525043, -620637, -416840, -305048]
1526c05048M6389K7173j10229J47926L6891k0186J89154J17942j29162k6102j15449
1515a40701J59641n3789j13496j6719J00320k52568M8541J39012j21660J93636
1505e7783K55569m5241Q5744o8805m09046J3073Q4088J46406k052M3934j69572
1494a23685N1262K54066M4796j29159N0153j06413M3352J9256k15674j17177L09823
1483H0600O7651m6039j07489r4706J80630J28750n7292j4406k81177m210J55668
1472G980m0960k30079p2045K12278J5931k0499j26989K9030m723O5361J9104K35811
1460I0200k88054m9778K2231K04937J07643o9526P7941K35790k18707r8276j84126
1449a69725L2861O3913r9033n1979K17343J84642p1093j92931J03029K79440J5184
$$ y = [-305048, -258659, -231486, -341715, -193789, -156898, -177084, 12070, 130012, 850, -25252, -140701, 18940, -34849, -148345, -165064, -64744, -317312, -268771, -129759, -251419, -57783, 197786, 152545, 238289, 169484, -239562, -226489, -142401, 4005, 1953, 45887, -123685, -72423, 181643, 226439, 97280, 147433, 41020, 84372, 103628, -112046, -229223, 80600, 148251, 102212, -5277, -99983, 80647, 209397, 152105, 137699, -143478, -147688, 7980, -32980, -263059, -335104, -122826, -106895, -127394, -254383, -225353, -230076, -164715, -145611, 90200, -197854, -247632, -225401, -20464, 87179, 17653, 95594, 331384, 112677, 14401, -169725, -136864, -72951, -171984, -223963, -6620, 178022, 106929, -86002, 17027, 296467, 311651]
1438C11651p8628k77538k3689J40725J1184O4971J14357k92120k03702J34342
1428i8447O8770K2462K26233k29186n3417M2497k19765j82274K86881K71192k27669
1417i2723K81515P244m06513K14177k20443J8669J21433O1731l36944N8218K06856
1406h6780l3121O4617j04410P2174J77955J5715o2399k3646j15674m4836J7682
1395a22723J05169O465k0945q0125K0581M44083k25412l34671K32865j73367k00335
1384c48415K65159R1454J4883N880K11589L0644k78596m3311j07344k9192j00990
1373b88239K93069j25658R0055M7745j96046O3346L34332j01364j41856p2288
1363i6904j56399R8579L06677j16367j04712J1503p7050J85797j32443O9847j93518
$$ y = [311651, 233023, -44515, -68204, 72521, 83705, 148676, 263033, -29087, -232789, -98447, -29677, -7215, 219018, -10168, -63585, -21088, -240853, -423127, -136246, 134946, -92723, 188792, 196036, -210477, 3700, -216743, -198074, -76641, -14910, -351854, -293636, -86780, -119901, -55284, -159694, -87520, 90435, 106150, 43751, 20105, -95569, -140405, -122723, -17554, -11089, -32034, -112159, -91578, 352505, 127093, -207578, 25287, -148080, -348415, -83256, 8198, 23081, 28961, 240550, 271194, -7402, -50713, -158057, -187249, -288239, 4830, -120828, -30773, 16972, -179074, -115728, 218604, 117240, -24616, -96904, -253303, -154724, 151953, 35586, -69126, -57623, -134673, 51124, -81319, -11472, -204990]
1352b04990r6309R2957P1048j38730L7278r676o8998K80027q900k17994J42248
1341a22039P7646j14087p5304j27880j58876K51329q7348J24951K95859k57785
1331a93534j09136M99045j07910q4545r7736q7466p0392M3384r3819p5295K16091
1320a61313J30203J82279j2778n5252J20698M1246N4752j15228l29869l5596J42564
1309c8294J76872j13327k23574K2295O7831J2439j71968J70268j2720R5206J96717
1298A81745j82255l30077q0845O6994J43098K74391j16175J16000j36162J98792
1288A35506O9203l51294L9560j06j81373J84660J350J4940j33498O4570K30095
1277G3613J7601j85108j50243K11178N4628m3381j95310N4041J25243k12962J01420
$$ y = [-204990, -301299, -208342, -137294, -276024, -238746, -248422, -317420, -37393, -46293, -264287, -122039, -44393, -158480, -233784, -361664, -520540, -269211, -356559, -231608, 64251, -193534, -302670, 196375, 88465, 3920, -93816, -181282, -251674, -208290, -302109, -377404, -161313, -31110, 151169, 138391, 83139, 203837, 245083, 299835, 184607, -145262, -180858, -38294, 138578, 25251, -198323, -176028, -108197, -95758, -267726, -97458, -110178, -14972, 181745, -510, -330587, -411432, -344438, -201340, 73051, -43124, 72876, -63286, 135506, 204709, -146585, -107025, -107131, -288504, -103844, -102494, -87554, -221052, -156482, 73613, 91214, -93894, -244137, -32959, 21669, -21712, -217022, -162981, -37738, -250700, -149280]
1266a49280l5584K81982j65205j7591k7600J59038J60772j79715k12710j62669
1256c48562Q3089n0075J91916P316q1088n8179J84161K14599p0988O8103K22255
1245C62547q4556l55958P6797J6785L15136k66633j84041J53109j12941k01265
1235b81020o4806L85286Q9410j48128r0658r0625K75689J63049j54331J38008
1225B21874k01470k33492J17898J94739k93736l9771j7847p6774K23569j69728
1215b74738o389O9095o4445K46477l6293j94929K74975J46565j41686m15664l1989
1204d29021J98743K15006J45092m0652m5498J22738j99650p8348J72397r8359
1194c7552k76282k24574J33740L33040J55559J05492j42201k39020p8769k3154
$$ y = [-149280, -184864, 97118, -68087, -85678, -113278, 45760, 206532, 26817, -185893, -348562, -265473, -315548, -123632, -116316, -197404, -255583, -71422, 143177, 72189, 140292, 362547, 277991, -77967, -1170, 15615, 330751, 64118, -119923, 33186, -79755, -281020, -345826, 39460, 128870, -19258, -109916, -200541, 75148, 238197, 83866, 221874, 20404, -213088, -95190, 99549, -194187, -233958, -251805, -328579, -105010, -274738, -281127, -212032, -276477, -30000, -66293, -261222, 13753, 160318, 18632, -397032, -429021, -230278, -15272, 129820, 89168, 43670, 166408, -33242, -111590, 60807, -37552, -313834, -538408, -404668, -71628, 83931, 189423, 47222, -191798, -270567, -293721]
1184b93721L12777o038j01833K4934r1834M4425K32807r444k43792l2045J56883
1173f881L46138J9024k60978L3615k17037J2887q6954L37345K1793j34739m00234
1162c36021q7875o2004K14135n999J38622P9070L71769l3017l25118N4979j57706
1151a49165O4719K16115Q5933J75374j51358l83738J1224j30803J74857j16060
1141b02902k0091K3832l0564J54653J7699J08393k9144K00092L3176l21537j26805
1130a93198j39149L66041L3056J5947J23046p8351m0321j34545L8452J83538q5058
1119H9458p1068J02701R0511K3481p7756l9341q2802j39255J25411N5888j27071
1108d9843j64006K0743j13154O6255L8035J52621M0682J81043j41425k55254L46770
$$ y = [-293721, 19056, 13018, -88815, -63881, -155715, -111290, 121517, 112073, -131719, -163764, -6881, 339257, 358281, 97303, 130918, -86119, -73232, -160186, 177159, 198952, 64213, -336021, -423896, -485900, -271765, -277764, -139142, -60072, 311697, 278680, -46438, 8541, -149165, -84446, 131669, 217602, 392976, 241618, -142120, -130896, -261699, -86842, -202902, -222993, -199161, -229725, -75072, -57373, 51020, 21876, 221968, 255144, -66393, -193198, -332347, 33694, 66750, 82697, 205743, 127392, 87071, -47474, -9022, 174516, 89458, 18390, 121091, 211602, 235083, 157327, 117986, 35184, -104071, 21340, 77228, -49843, -213849, -193106, -306260, -240005, -201970, -49349, -8667, 172376, 30951, -224303, 122467]
1097A22467k5411q2410k22472K95719r9363J1479J39536p0904o418j61870J28153
1086B8506p4833J52083Q5492r7179K8051l60215K58579K16616l51132P7248J95965
1075A59181p5446p6085q8017k8368J79598Q4711R5326k18429q1927k41708J47497
1064a43667K47305q589n0353q0753k24465P5666K76039k4045n0924P1816k13436
1053a25406J33213K24117k1526r5643M3445L79187j74758k38461M8153j506q7736
1042H3079o5955P5886m1851O3185j5971J26193n4755P4073L1271o9789m1038l01768
1030a37440k61730J93991K25148m731J02262k04093m7162K16183J40656J73396
1020C96480j07364q1814j38237r3938J8006j39582n89K09157N7419m2750j11911
$$ y = [122467, 97056, 14646, -207826, 87893, -11470, 9, 139545, 68641, 62223, -99647, 28506, -46327, 105756, 191248, 94069, 122120, -238095, 20484, 237100, -114032, -36784, 159181, 83735, 7650, -80367, -108735, 70863, 155574, 250900, 32471, -49456, -291164, -143667, 103638, 95049, 44696, -36057, -260522, -184856, 91183, 67138, 16214, 88030, -125406, 7807, 231924, 210398, 114755, 158200, 537387, 362629, 124168, 172321, 170815, 83079, 17124, 93010, 51159, 114344, 98373, 224566, 169811, 243884, 275155, 205366, 164328, -137440, -399170, -205179, 19969, 15238, 117500, -86593, -133755, 82428, 223084, 396480, 289116, 207302, 69065, -24873, -6867, -146449, -147038, 62119, 119538, 76788, -35123]
1009c5123k46513p8816l4206K18464J10568j29366J08942J8265j86259q4996J39595
998a99445O6137l05332J4102K87031P5561k23341p6740K47316J38379k56648o1420
987b94400k2277P8531j76237J06793K63529J57369l6965L2835L5838M664m3014
976A06666l64679N6365J97358k60811k5043J43586J41972K43511N8813k52652
966D5086j40244j4085k7222N5971J4224Q929J9072M1553J13462j402J4085l44524
954b15095Q8478R4927k9940R7855l09587J54888k7831J05258n7295J89297J81695
943B72650l27869l8397J9128k8562j07441K50561N0326k66255K37756J2045r9409
932b5467k9760k7150K0289O5300k39176j35324J26848J70584l769K01009j28045
$$ y = [-35123, -281636, -360452, -394658, -176194, -65626, -194992, -86050, -67785, -254044, -339040, -199445, -133308, -438640, -424538, -137507, -61946, -285287, -362027, -114711, 23668, -232980, -294400, -316677, -238146, -414383, -307590, -44061, 113308, 76343, 109178, 145016, 149680, 106666, -258013, -201648, -4290, -265101, -290144, -146558, -4586, 238925, 297738, 45086, -95158, -109243, -136465, -80494, -66270, -57341, -38269, 3284, 116746, 115344, 129429, -215095, -126617, -31690, -61630, 36225, -273362, -118474, -146305, -41047, -98342, 90955, 272650, -55219, -93616, -74488, -103050, -210491, 40070, 90396, -175859, 61897, 73942, -25467, -55227, -82377, -62088, 3212, -235964, -371288, -244440, -73856, -77625, 123384, -4661]
921d661m956K01396j95967J71632q6077j05083l92507J56303R4560R3539Q1688
910I867P56j4303k19883J62955P9785k3275M3128j98994K9654J72888n8037k32198
898b47657o1277M2635J21026K74252P0925k99382j39977L00171n9035k23754m1981
887b64054K08477J35866j69885j44074J87432j34140O0906K69955J63766j17654
877A96595O101j19891j52652J2385K1703J4040j668L44539r351k59766r0462J66971
865A28544J61443n90090N813L37297K79085k5863l91066J85355q4466J74417j02987
854G7482Q791j47233p9982O1438O9821K49898o6776N8865J18667j73826m5146
843A31999j074r7064o7472Q7016M1307q4838K00536J02543k22454p998J83620
$$ y = [-4661, -9617, 191779, -4188, 167444, 81367, -23716, -416223, -259920, -165360, -71821, 9867, 10623, -3680, -223563, -60608, 19177, -4098, 39030, -159964, -130310, 42578, -15459, -247657, -308934, -266299, -145273, 128979, 199904, -99478, -239455, 60716, 1681, -222073, -264054, -55577, 80289, -89596, -233670, -46238, -180378, -119472, 150483, 314249, 196595, 202696, 82805, -69847, -57462, -35759, -21719, -23387, 321152, 311801, 52035, -38427, 128544, 289987, -300103, -294290, 43007, 322092, 296229, -94837, 90518, 6052, 180469, 77482, 86273, -60960, -140942, -79504, -9683, 240215, 173439, 232304, 350971, 177145, 131999, 130925, 33861, -33611, 53405, 94712, 9874, 210410, 312953, 90499, 82501, 266121]
832B66121P215k44209l16367r583J98207L30580J145k98034j7926P8728J45361
821A41238j19537j11668K19533P592L5110l2738o3154j89627Q3311n4494r3403
810a77837j86665L69700J01176j43116K6682M7794n1481o6484M3038j79782n6683
799b73658K38877J67481l3317k36538K56750k1192J86332l64946r4971K85430
789A10248l11060K5313R9678J10749J96897j24243j50134J63947l8744k42308
779a59657j5327P2529j8321j51682K4655J93529m4986j45532j9776J68597L6015
768e9956J88890k3009k59249M2587K12137j5034Q9545J17682k7748P1569J95080
757E32494n3788p7544m48227L8278j9036K48490j05211l4526j09958k87261J13617
$$ y = [266121, 273336, 29127, -287240, -296823, -98616, 231964, 233109, -64925, -82851, -4123, 141238, 21701, -89967, 129566, 137158, 172268, 139530, 76376, -113251, -29940, -84434, -177837, -364502, 5198, 106374, -36742, -10060, 37734, -13747, -80231, -37193, -216975, -273658, -34781, 132700, 99383, -137155, 119595, 98403, 284735, -80211, -175182, 110248, -200812, -175499, -75821, 34928, 231825, 107582, -42552, 121395, 82651, -159657, -174984, -102455, -120776, -272458, -247803, -54274, -99260, -244792, -264568, -95971, -59956, 128934, 105925, -153324, -110737, 101400, 86366, 175911, 293593, 265845, 337414, 532494, 478706, 401162, -47065, -8787, -27823, 220667, 115456, 80930, -29028, -316289, -202672]
746b02672J45710J45252j13859j12123K05864N5275N4566k05571J50183O7216
736A89841M0631o7327J54637p0754r1444L0833l30460j36536p51J89476K80270
725A88416J6240j75636J40003q9605n6199K73686L7936j70493O4614l1647j60546
714C6769K66865j8605j76558M1787r7049L2827L04258r672q4108j74904k02075
703h0465J83760J11192K87394q4835p4600l7516O5739j27443M6778L611j043j17998
691A74574k13084k16175J50293K18318r2316L0205k50841K23109M11585k7131
681D08537j77821j21962J9055k8123L7212K9687J03574k82820j90069r4457l5349
670c32536J41071J47730n9226N2358N0333O065J904k52263l1824K99430k71150
$$ y = [-202672, -56962, 88290, -25569, -137692, 68172, 123447, 178013, -27558, 122625, 189841, 230472, 163145, 317782, 247028, 155584, 186417, -144043, -280579, -281330, -91854, 188416, 204656, 29020, 169023, 79418, 23219, 296905, 334841, 164348, 228962, 197315, 36769, 303634, 285029, 108471, 150258, 53209, 86036, 390294, 380622, 296514, 121610, -80465, 103295, 214487, 501881, 417046, 342446, 304930, 370669, 243226, 290004, 293615, 292572, 174574, -38510, -254685, -104392, 113926, 21610, 51815, -199026, 24083, 435668, 408537, 230716, 108754, 127809, 99686, 136898, 166585, 270159, -12661, -202730, -297187, -332536, -191465, -43735, -102961, -50603, -270, 5795, 7699, -244564, -276388, 23042, -248108]
659b48108j76651L75692k39631K01435q072l9721q1628K8265R4045J77121L0721
648A13468p8763K64455k13783o0093o4798m3018K66221K30172j17841k11947q4250
637a77m8214q4013K1569j25945J46122J01152l520M6110j15292k74682K58181
626g8709J95736m2808q3788o2131o135J16014m1190j95928P8452K26256J12559
615B18328o4046l8431p3878j77806R9208L52600j31430j70452R0695j00347J16650
604A21091K75850k51441J4794j18012m16407K08467L28683P3621m7520j13788
594G5338K28580j26487J2409j68993J15198P0794p0044L954l2927J58715j18940
583A47597k06544l12959K35402N8182J36259O6924m5152J53952K07004J0513j29501
$$ y = [-248108, -424759, -49067, -288698, -87263, -95335, -135056, -216684, -188419, -94374, 82747, 113468, 34705, 299160, 85377, 25284, -39514, -82532, 183689, 413861, 296020, 84073, -177, -48391, -132404, -110835, -236780, -90658, 10494, 6974, 53084, -62208, -336890, -78709, 117027, 74219, -9569, -71700, -77835, 38179, -3011, -198939, -120487, 105769, 218328, 154282, 115851, 41973, -135833, -36625, 315975, 184545, 14093, 104788, 4441, 121091, 396941, 145500, 160294, 42282, -374125, -165658, 163025, 236646, 189126, 75338, 303918, 177431, 189840, 20847, 136045, 206839, 136795, 140749, 107822, 266537, 147597, -58947, -371906, -136504, -78322, 57937, 124861, 79709, 233661, 440665, 451178, 321677]
572C21677k5980j73115r5761J03220j13475l8153k46658L07405M8928j89002J79291
561G8377n8896K06854n2614m20283k4429L91571j87748N3968J2469p5786K1192
550e5325J863q1873k1938Q5400K31184j1472p0762K42602m7737k33069J1864J13098
538A63835j13644j7155j5154j996O7232j62463P4558p9115J41123K1857k11515
527a32437R0597J02907l3329q4164J70169q5740l35364k1602J46506l6207P2709
516a45955J76976o156J3831n1659K13888j86364j09107l2786L7833J29743L4306
505G4550P1526k67436o3550K74727J54728j17861j09500J61746j68333n4423K55041
494B11215K8972j63248k54977J36467L47544m0959k98977l14606K02411R4426
$$ y = [321677, 295697, 122582, 26821, 130041, 16566, -21587, -268245, 39160, 88088, -100914, 78377, 19481, 226335, 173721, -246562, -270991, 120580, -67168, -13200, -731, -76517, -55325, -53462, -135335, -157273, -71873, 159311, 147839, 77077, 319679, 271942, 38873, 50737, 163835, 50191, 33036, 17882, 15886, 83118, -79345, -4787, -83902, 57221, 79078, -132437, -41840, 61067, 27738, -56426, 113743, 28003, -307361, -328963, -182457, -218664, -145955, 31021, 24865, 38696, -12963, 200925, 14561, -94546, -127332, -89499, 40244, 74550, 146076, -121360, -184910, 89817, 244545, 126684, 17184, 178930, 10597, -43826, 211215, 240187, 76939, -178038, -41571, 305973, 265014, -33963, -348569, -146158, -51732]
484e1732j19567L13071J233P0861P0686k9078l205P1585j42797l0773k05148k162
472e7026L7355J83850L18873l23155j54197K03577p4566j14025l5920p312n0067
461g2613J6129j37046M8056N0734N9269n0244J5821K91681O7706l31183j31122
450a72812M3011Q4159J24296j76951J88496o5256P6412O7474k82415j61788m0080
439c15454R6771P1547L57105R761Q5681j5264j28918J39453j1924k63302j6426
428I030P3027N2506j02598j55906Q4826K09435J10305k32757M14466P446k13734
417B56046j75448j31744m1600L0819J61507J20080p9688n0923K38419j59338k87673
406a19543m1876p6422J37276J69451J73516p1382k9650n0286j75836K17938n0917
$$ y = [-51732, -171299, 141772, 143005, 213866, 284552, 255474, 252269, 323854, 181057, 150284, -54864, -57026, -19671, 164179, 483052, 159897, 5700, 209277, 134711, 20686, -15234, -22546, -72613, -56484, -193530, -145474, -94740, -35471, -85715, -69894, 221787, 289493, -41690, -172812, -129801, -45642, 78654, -98297, 90199, 24943, 101355, 168829, -113586, -275374, -315454, -218683, -147136, 209969, 219730, 305411, 290147, 161229, 300682, 288758, 25456, 9030, 82057, 134563, 31965, -123941, -39115, 170320, 280625, 47868, 462334, 469780, 256046, 80598, -51146, -92746, -61927, 99580, 219660, 139972, 89049, 327468, 168130, -119543, -161419, -237841, -100565, 68886, 242402, 171020, 141370, 91084, -84752, 133186, 82269]
395H2269q3066j56739L0958l08376N2093K06289o7049J62509K589j24580n1636
384b54739J35246l0692N0181p2205J68926M9597J39707J05412l02828j49863l56967
373e18225J28955J94869J47749j60504J4358j7960j3661J15640P5444n9510n8114
362a50959J05214L4801M4371J07782p6474k81470J59592q608O8748j01201N9433
351c8771K8089J68810o9077K14491l05133K9889o1492k11196O6293J29959j39071
340a87209K33025J26515n37725Q6180J18753j2302Q0749l365j81979L31770J20487
329A74899P939J53551J43320k30053j30275l16007J37109J07425j21039k43230
319c16361L8283J98753K88542j86053r6089J39433j46519j55104R3003J024J86379
$$ y = [82269, -797, -157536, -126578, -434954, -382861, -176572, -243621, -81112, -78523, -203103, -254739, -119493, -150185, -100004, -172209, -3283, 46314, 186021, 291433, -11395, -161258, -518225, -389270, -194401, -46652, -207156, -192798, -210758, -224419, -108779, -33335, -92845, -150959, -45745, -10944, 33427, 141209, 64735, -216735, -57143, -65751, 2997, -98204, -38771, -10682, 158128, 89051, 303542, -1591, 28298, -33194, -244390, -178097, -48138, -187209, 45816, 172331, -365394, -279214, -160461, -172763, -92014, -95379, -277358, 54412, 174899, 182838, 336389, 479709, 249656, 119381, -196626, -59517, 47908, -73131, -316361, -278078, -79325, 209217, 23164, -72925, 66508, -80011, -235115, -142112, -141088, 45291]
308D5291M9177j75761k16968Q0169K90768J3609J76157Q1829r1298l57745N9560
297d5212j06456q9822k3995L17770J22804k29192J26436k46001R1634O2684J86023
286A66673m4001K5650J83037l26853j40568j2193J47782j5238P4912q0182j17358
275a38339J35478O6141p3433J6015j29213J42958j91215J50073p2910J15343j05264
264h4366j10496j48494J01365J05825j29664O6636L24261l1413l51756k8668J01478
253a85292Q7308K34680j11414j15293K19570p2599j21325K809J2332J27162l01664
242b23726Q7276J26848j43380K68326Q097J21679q8397R3156m69454J00416j17221
231b36380l040R6620J08556j98628K3563J90700K6412j62726j28434K08491J13116
$$ y = [45291, 94468, -81293, -298261, -218092, 72676, 86285, 262442, 344271, 252973, -104772, -45212, -151668, -241490, -265485, 52285, 175089, -54103, 72333, -173668, -82034, -19350, 166673, 122672, 148322, 331359, 4506, -136062, -148255, -473, -15711, 59201, -20981, -138339, -2861, 63280, -10153, 5862, -123351, 19607, -171608, -21535, -94445, 20898, -84366, -194862, -343356, -241991, -136166, -265830, -199194, 125067, 93654, -258102, -286770, -185292, -97984, 136696, 25282, -90011, 129559, 56960, -64365, -61556, -49224, 77938, -223726, -136450, -9602, -152982, 115344, 123441, 245120, 156723, 249879, -219575, -119159, -236380, -239420, -142800, -34244, -232872, -209309, -18609, 7803, -154923, -283357, -74866, 38250]
220C8250J75196k02645j14970j08907K26735K47581l02092p9136P4738j93183
210b38433K32189J40597k29211K72403k75661k8165N1377O4240m8499k15282r2939
199c67384R8729j24850J08007M62254j2815j39500P8616P1980j53366j33293J51999
188D0377j83554r009J37179j19867J51469M4994p6763J41676J13100k09863O1673
177I1412J01924O3042j92062N1651N3053k06474p1643p5240J65831R3806p7828
166b528J7604j0495j84546n6178j5622j89304L5189J76714P5087R1864k0330j62096
154b44641r284j69766L14997K216k80066J07647L77029K3200n4572j55114j96303
143b84657N9325J58781K43396M0623j22551n7289j29263j58694J2611J12201j63715
$$ y = [38250, 213446, 10801, -104169, -213076, 13659, 261240, -40852, -119988, -45250, -238433, -6244, 134353, -94858, 177545, -98116, -126281, -74904, -10664, -59163, -274445, -367384, -268655, -393505, -285498, 176756, 163941, 24441, 103057, 175037, 21671, -111622, 40377, -143177, -152186, -15007, -134874, 16595, 61589, -15174, 126502, 239602, 29739, 91412, 193336, 256378, 64316, 115967, 169020, -37454, -109097, -184337, -18506, 75300, -2528, 15076, 4581, -179965, -236143, -251765, -441069, -405880, -229166, -154079, -62215, -82545, -244641, -253925, -423691, -108694, -106478, -386544, -278897, 98132, 121332, 66760, -88354, -284657, -225332, -66551, 176845, 217468, 94917, 37628, -91635, -250329, -237718, -125517, -289232]
132b89232J85511p572K49221J40540k6593l9454r2136K814n0498R2159J89322
121C54082k36513j40890l8113j47796j14244K21288J74674L09248O4806k09970
111B36572L5403j02198l20219M9943O1561j62171M27681j41986j28257k6102n1303
100a21076Q3490J47632j50220J76810L2101k37935j6099J44248j29798N0688m768
89b4927q5326P7691J38262p9447j21440K2387K23139j01648p5016q4823l4541
$$ y = [-289232, -103721, -111293, 137928, 278468, 251875, 212421, 120285, 123099, 72601, 164760, 354082, 117569, -23321, -61434, -209230, -323474, -102186, 72488, 381736, 446542, 236572, 271975, 169777, -150442, -100499, -38938, -201109, 226572, 84586, -43671, -69773, -121076, -37586, 110046, -40174, 136636, 168737, -69198, -85297, 58951, -70847, -20159, -24927, -110253, -32562, 105700, 26253, -95187, -72800, 150339, 48691, -26325, -111148, -145689]
$$ [...]
##END NTUPLES=NMR SPECTRUM
##END=
