##TITLE=1H_DE-80H_X3
 200.13MHz, d2o
 8 sc
 
 19ns.26.2.2025
##JCAMPDX= 6.0         $$ Bruker NMR JCAMP-DX V2.0
##DATA TYPE= NMR SPECTRUM
##DATA CLASS= NTUPLES
##ORIGIN= UXNMR, Bruker Analytische Messtechnik GmbH
##OWNER= pz
$$ XWIN-NMR		Version 3.5
$$ Thu Jul 10 10:22:53 2025 Russian Standard Time (UT+4h)  Yarkov@DPX200
##.OBSERVE FREQUENCY= 200.1313
##.OBSERVE NUCLEUS= ^1H
##.ACQUISITION MODE= SIMULTANEOUS
##.ACQUISITION SCHEME= undefined
##.AVERAGES= 8
##.DIGITISER RES= 18
##SPECTROMETER/DATA SYSTEM= spect
##.PULSE SEQUENCE= zg30
##.SOLVENT NAME= CDCl3
##.SHIFT REFERENCE= (INTERNAL, CDCl3, 0, 15.5276)
##AUDIT TRAIL= $$ (NUMBER, WHEN, WHO, WHERE, WHAT)
$$ ##TITLE= Audit trail, XWIN-NMR		Version 3.5
$$ ##JCAMPDX= 5.01
$$ ##ORIGIN= Bruker BioSpin GmbH
$$ ##OWNER= Yarkov
$$ C:/Bruker/XWIN-NMR/data/yarkov2/nmr/H-C/1/pdata/1/auditp.txt
$$ ##AUDIT TRAIL=  $$ (NUMBER, WHEN, WHO, WHERE, WHAT)
(   1,<2025-07-10 10:21:59.25 +0400>,<Yarkov>,<DPX200>,
      <created by zg, POWCHK disabled, PULCHK disabled
       configuration hash MD5:
       00 E9 B6 7A A2 85 ED C7 34 08 36 98 17 FE 4E 26
       data hash MD5: 16K
       CC DA 1D FC D6 1F 37 D6 23 AA 9A 07 00 2D EC CB>)
(   2,<2025-07-10 10:22:02.75 +0400>,<Yarkov>,<DPX200>,
      <Start of raw data processing
       efp BC_mod = 2 LB = 0.25 FT_mod = 6 PKNL = 1 PHC0 = -1356.506 PHC1 = 5.990923 SI = 16K 
       data hash MD5: 16K
       93 7C 7D 6D CB 80 69 E2 03 40 3D 8E DC AA 63 D1>)
(   3,<2025-07-10 10:22:09.79 +0400>,<Yarkov>,<DPX200>,
      <abs ABSG = 5 
       data hash MD5: 16K
       D2 63 73 6C 8E 72 C5 5C 50 A0 28 ED 01 0D 5E 42>)
$$ ##END=
$$ 
$$ hash MD5
$$ AC D7 57 F5 31 6D 15 8D D8 5F 6E 6F 2E 74 44 CC
##$RELAX= 
##$RELAX= 
##$RELAX= 
##$RELAX= 
##$RELAX= 
##$RELAX= 
$$ Bruker specific parameters
$$ --------------------------
##$DU= <C:/Bruker/XWIN-NMR>
##$EXPNO= 1
##$NAME= <H-C>
##$PROCNO= 1
##$TYPE= <nmr>
##$USER= <yarkov2>
##$AMP= (0..31)
100 100 100 100 100 100 100 100 100 100 100 100 100 100 100 100 100 100 
100 100 100 100 100 100 100 100 100 100 100 100 100 100 
##$AQSEQ= 0
##$AQ_mod= 1
##$AUNM= <au_zg>
##$AUTOPOS= <>
##$BF1= 200.13
##$BF2= 200.13
##$BF3= 200.13
##$BF4= 200.13
##$BF5= 200.13
##$BF6= 200.13
##$BF7= 200.13
##$BF8= 200.13
##$BYTORDA= 1
##$CFDGTYP= 0
##$CFRGTYP= 5
##$CHEMSTR= <none>
##$CNST= (0..31)
1 1 145 1 1 1 1 1 1 1 1 1 1 1 1 1 1 1 1 1 1 1 1 1 1 1 1 1 1 1 1 1 
##$CPDPRG= <>
##$CPDPRG1= <>
##$CPDPRG2= <>
##$CPDPRG3= <>
##$CPDPRG4= <mlev>
##$CPDPRG5= <mlev>
##$CPDPRG6= <mlev>
##$CPDPRG7= <mlev>
##$CPDPRG8= <mlev>
##$CPDPRGB= <>
##$CPDPRGT= <>
##$D= (0..31)
0 0.7 0 0 0 0 0 0 0 0 0 0.03 0 0 0 0 0 0 0 0 0 0 0 0 0 0 0 0 0 0 0 0 
##$DATE= 1752128518
##$DBL= (0..7)
120 120 120 120 120 120 120 120 
##$DBP= (0..7)
150 150 150 150 150 150 150 150 
##$DBP07= 0
##$DBPNAM0= <>
##$DBPNAM1= <>
##$DBPNAM2= <>
##$DBPNAM3= <>
##$DBPNAM4= <>
##$DBPNAM5= <>
##$DBPNAM6= <>
##$DBPNAM7= <>
##$DBPOAL= (0..7)
0.5 0.5 0.5 0.5 0.5 0.5 0.5 0.5 
##$DBPOFFS= (0..7)
0 0 0 0 0 0 0 0 
##$DE= 6
$$ [...]
##$SUBNAM3= <"">
##$SUBNAM4= <"">
##$SUBNAM5= <"">
##$SUBNAM6= <"">
##$SUBNAM7= <"">
##$SUBNAM8= <"">
##$SUBNAM9= <"">
##$SW= 18.0517328524113
##$SWIBOX= (0..15)
0 0 2 0 0 0 0 0 0 0 0 0 0 0 0 0 
##$SW_h= 3612.71676300578
##$TD= 16384
##$TD0= 1
##$TE= 0
##$TE2= 300
##$TE3= 300
##$TEG= 300
##$TL= (0..7)
0 120 120 120 120 120 120 120 
##$TP= (0..7)
150 150 150 150 150 150 150 150 
##$TP07= 0
##$TPNAME0= <>
##$TPNAME1= <>
##$TPNAME2= <>
##$TPNAME3= <>
##$TPNAME4= <>
##$TPNAME5= <>
##$TPNAME6= <>
##$TPNAME7= <>
##$TPOAL= (0..7)
0.5 0.5 0.5 0.5 0.5 0.5 0.5 0.5 
##$TPOFFS= (0..7)
0 0 0 0 0 0 0 0 
##$TUNHIN= 0
##$TUNHOUT= 0
##$TUNXOUT= 0
##$USERA1= <user>
##$USERA2= <user>
##$USERA3= <user>
##$USERA4= <user>
##$USERA5= <user>
##$V9= 5
##$VALIST= <valist>
##$VCLIST= <CCCCCCCCCCCCCCC>
##$VD= 0
##$VDLIST= <DDDDDDDDDDDDDDD>
##$VPLIST= <PPPPPPPPPPPPPPP>
##$VTLIST= <TTTTTTTTTTTTTTT>
##$WBST= 1024
##$WBSW= 4
##$XGAIN= (0..3)
0 0 0 0 
##$XL= 0
##$YL= 0
##$YMAX_a= 278092
##$YMIN_a= -259566
##$ZGOPTNS= <>
##$ZL1= 120
##$ZL2= 120
##$ZL3= 120
##$ZL4= 120
##$ABSF1= 15.5045
##$ABSF2= -2.547349
##$ABSG= 5
##$ABSL= 3
##$ALPHA= 0
##$AQORDER= 0
##$ASSFAC= 0
##$ASSFACI= 0
##$ASSFACX= 0
##$ASSWID= 0
##$AUNMP= <proc_1d>
##$AZFE= 0.1
##$AZFW= 0.1
##$BCFW= 0
##$BC_mod= 2
##$BYTORDP= 0
##$COROFFS= 0
##$CY= -3
##$DATMOD= 1
##$DC= 0
##$DFILT= <>
##$DTYPP= 0
##$F1P= 0
##$F2P= 0
##$FCOR= 1
##$FTSIZE= 16384
##$FT_mod= 6
##$GAMMA= 0
##$GB= 0
##$INTBC= 1
##$INTSCL= 3.241238e-09
##$ISEN= 128
##$LB= 0.25
##$LEV0= 0
##$LPBIN= 0
##$MAXI= 10000
##$MC2= 0
##$MEAN= 0
##$ME_mod= 0
##$MI= 1.114404
##$NCOEF= 0
##$NC_proc= -7
##$NLEV= 6
##$NOISF1= 3.799351
##$NOISF2= 2.8
##$NSP= 0
##$NTH_PI= 0
##$NZP= 0
##$OFFSET= 15.52763
##$PC= 1
##$PHC0= -1356.506
##$PHC1= 5.990923
##$PH_mod= 1
##$PKNL= yes
##$PPARMOD= 0
##$PSCAL= 0
##$PSIGN= 0
##$REVERSE= no
##$SF= 200.129998813687
##$SI= 16384
##$SIGF1= 3
##$SIGF2= 2
##$SINO= 0.751879
##$SIOLD= 32768
##$SREGLST= <19F.Aceton>
##$SSB= 0
##$STSI= 16384
##$STSR= 0
##$SW_p= 3612.71676300578
##$SYMM= 0
##$S_DEV= 0
##$TDeff= 16384
##$TDoff= 0
##$TI= <>
##$TILT= no
##$TM1= 0
##$TM2= 0
##$TOPLEV= 0
##$USERP1= <user>
##$USERP2= <user>
##$USERP3= <user>
##$USERP4= <user>
##$USERP5= <user>
##$WDW= 1
##$XDIM= 16384
##$YMAX_p= 354721431
##$YMIN_p= -406431
$$ End of Bruker specific parameters
$$ ---------------------------------
##NTUPLES= NMR SPECTRUM
##VAR_NAME=  FREQUENCY,     SPECTRUM/REAL,   SPECTRUM/IMAG
##SYMBOL=    X,             R,               I
##VAR_TYPE=  INDEPENDENT,   DEPENDENT,       DEPENDENT
##VAR_FORM=  AFFN,          ASDF,            ASDF
##VAR_DIM=   16384,         16384,           16384
##UNITS=     HZ,            ARBITRARY UNITS, ARBITRARY UNITS
##FACTOR=    0.220516191357247, 1,           1
##FIRST=     3107.54454391915, 0,            0
##LAST=      -505.172219086627, 0,           0
##MIN=       -505.172219086627, -406431,     0
##MAX=       3107.54454391915, 354721431,    0
$$ Real data points
##PAGE= N=1
##DATA TABLE= (X++(R..R)), XYDATA
$$ [...]
6000D008370m20445j04605O5087o9311j12782J79850R7042N1017K99606J89867
5990D183696K58597L76804K88903N2816N34360M80981O15424Q74625J156643J092436
5980I915285Q78696K85889l20848k61025n34758p80415r97191r52425p50830n30270
5970E952108l87109j99507N2036P9894J4373L2883K57155M19772L85187J65927
5960F772719L36989M26262M30917N89626R97224J174267J387089J532392Q96940
5951A4544425j05335k49819n50239r42157j074808j515590j388771r86471n86989
5942G144246m56778l63980k11583j17418j89558J8991M7221K50604K80969J28008
5932F530722Q1522K93987K79727M18890O46245Q29226J070623R77249O81024p5101
$$ plain form
6000 4008370 3587925 3483320 3548407 3479096 3366314 3546164 3643206 3694223 3993829 4183696
5990 4183696 4442293 4819097 5108000 5160816 5695176 6176157 6791581 7666206 8822849 9915285
5980 9915285 10793981 11079870 10759022 10497997 9963239 9182824 8185633 7233208 6482378 5952108
5970 5952108 5564999 5365492 5417528 5497422 5511795 5544678 5801833 6221605 6606792 6772719
5960 6772719 7109708 7535970 7966887 8556513 9553737 10728004 12115093 13647485 14544425
5951 14544425 14439090 14189271 13639032 12696875 11622067 10106477 8717706 7731235 7144246
5942 7144246 6687468 6323488 6111905 5994487 5804929 5823920 5871141 6121745 6402714 6530722
5932 6530722 6612244 6906231 7185958 7604848 8251093 9080319 10150942 11128191 11809215 11734114
5922A1734114k55520m61758r03261j123749j357124j134163q19463m98988m20068
5913D760020k51191l89088k41176j04427L8614m8055m0069K504o3897O5631L4578
5902C763444K000K50236K13673K45229L70195L72459J81718l03622o5561k27241
5892D802530m17778n79156n05593l63097l50360l02872n3493j68990j40457j20401
5882A800333o8815k10773m5675K7218j16903q2772r0142R7350J18916n4227j49606
5871A224904o9248K58189M8670j6869l8034p9789j27161j01897k5429l6689K3725
5860A060372j41873j70446n0515P6746k3378j35224j14083K8274n1576m114j2799
5849D61384j44340k498P18q9361n7425N2862N6965o12p0906J50570M1598O366
$$ plain form
5922 11734114 11478594 11016836 10113575 8989826 7632702 6498539 5679076 5180088 4760020
5913 4760020 4508829 4119741 3878565 3774138 3812752 3764697 3724628 3727132 3663235 3728866 3763444
5902 3763444 3765444 4015680 4229353 4474582 4844777 5217236 5398954 5095332 5029771 4802530
5892 4802530 4384752 3805596 3300003 2936906 2586546 2283674 2230181 2061191 1920734 1800333
5882 1800333 1731518 1520745 1475070 1502288 1385385 1302613 1212471 1309821 1428737 1374510 1224904
5871 1224904 1155656 1413845 1462515 1445646 1407612 1327823 1200662 1098765 1073336 1036647 1060372
5860 1060372 918499 748053 697538 774284 750906 615682 501599 529873 478297 474183 461384
5849 461384 317044 314546 315264 225903 168478 221340 278305 277693 206787 357357 398955 405321
5837D05321K6949l5324O2963n227k22515q4030L6521o1357K8475k5318j0048J70448
5825B86858r8100m97q4838l9807l8302n8653k0649R3661Q0375J929j9610o6409
5813C5958J6386j0563j3068j02583P4752J98538m5064j12730r0627q8374L9693
5802i7682J34331J23647q5979k9301j12217J10981Q6678o3371r4725P8296n5886
5791e228J9546J809O9016J8321P8715n6576j8322j02862O2807J4086Q5257r4940
5779G1629j6105M3758r1138J23934q6317n3192M8258j04864m0271m1932L5004
5768a11236M3067O6712M1548r9807J9318L072j59971J00344J46663j79719M7903
5757h2106N4899l6141M4477k4950M1101L7137p303o7783o2331K9595M724m5144
$$ plain form
5837 405321 432270 396946 459909 454682 232167 148137 184658 123301 151776 126458 116410 286858
5825 286858 188758 188261 103423 63616 25314 -33339 -53988 39673 120048 121977 102367 35958
5813 35958 52344 41781 28713 -73870 882 199420 154356 41626 -49001 -137375 -97682
5802 -97682 36649 160296 74317 45016 -67201 43780 130458 67087 -27638 50658 -5228
5791 -5228 14318 16127 85143 103464 182179 125603 107281 4419 67226 81312 166569 71629
5779 71629 55524 99282 8144 132078 45761 -7431 40827 -64037 -104308 -146240 -111236
5768 -111236 -68169 -1457 40091 -59716 -40398 -37326 -197297 -96953 49710 -130009 -82106
5757 -82106 -27207 -63348 -18871 -43821 -2720 34417 27114 -40669 -103000 -73405 -68681 -113825
5745a13825J13317J63175o6364j81285n9331J28582p1474O5557K9545o9870J9332
5734d2641L7874j17645J13688M3241p1112j5140k2330J00930J76927o8135j95117
5723e9460R2049K1382q1983k7421J6122O455p1247l4722N4019O1227p0250K5058
5711f8771J37588J9870j17619m9032k5478L6345J137Q9828r6549j7870K8139j1033
5699g3445J89306K93m8721m7889j25569n3389L5436J70063q0474Q4066K5166m0173
5687C4670n8219M7254m1660j44769O7138J12307K6205K2629k5115P4105l4675
5676G9870q9018P0703O9347j0304j53248P9109K6718n2526j32178R7560L7730
5665B3763J4038j5053p1354J21490J30884J0181l4990q8955M9297j7488K6417
$$ plain form
5745 -113825 -508 162667 96303 -84982 -144313 -15731 -87205 -21648 7897 -61973 -42641
5734 -42641 -4767 -122412 -8724 34517 -36595 -51735 -74065 26865 203792 135657 -59460
5723 -59460 32589 53971 -28012 -55433 -39311 -32856 -104103 -138825 -84806 -23579 -93829 -68771
5711 -68771 68817 88687 -28932 -77964 -103442 -67097 -65960 23868 -72681 -90551 -62412 -73445
5699 -73445 115861 116154 67433 19544 -106025 -159414 -123978 46085 -34389 49677 74843 34670
5687 34670 -23549 23705 -17955 -162724 -95586 16721 42926 65555 40440 114545 79870
5676 79870 -9148 61555 130902 120598 -32650 46459 73177 20651 -111527 -13967 23763
5665 23763 37801 22748 -48606 72884 203768 213949 178959 90004 139301 121813 148230
5654A48230J7313p3072P3280j25631Q8658P0279Q622Q5801p2867m087q3128k4337
5642A09061n674J10630k8636K1622R4677j10871J14398r7359N837K30387j39648
5631C04424K4088O330o4001N794K1346L2124N2791Q5802m4197q490J63982n4850
5619E25143k7882j44585L975J92508N6730L1560K4281n1429j8547L2551l5402
5608E88903M2168r5058J6082J01860K9047l8546N8385J16073R7792N927P8172
5597A000805O8723n6050M4976L7337O9869K19817J0937n8489O7438R6278M2871
5586A544512p1689j4058R3248k0709r5099J32695L7627Q6363q352K4228J70265
5575A879031j43351J9410K03548P5288n7923N6706K32801Q4684j4277N6630J96662
$$ plain form
5654 148230 165543 92471 165751 40120 128778 199057 207679 293480 220613 216526 133398 109061
5642 109061 103387 214017 185381 207003 301680 190809 305207 207848 213685 444072 304424
5631 304424 328512 334842 270841 276635 297981 330105 382896 468698 424501 416011 579993 525143
5619 525143 497261 352676 356651 549159 605889 637449 661730 610301 591754 624305 588903
5608 588903 631071 536013 552095 653955 683002 644456 702841 818914 916706 922633 1000805
5597 1000805 1069528 1013478 1058454 1095791 1165660 1385477 1396414 1337925 1405363 1501641 1544512
5586 1544512 1472823 1458765 1552013 1531304 1436205 1568900 1606527 1692890 1684538 1708766 1879031
5575 1879031 1735680 1755090 1958638 2033926 1976003 2032709 2265510 2350194 2335917 2392547 2589209
5564B589209M1674p919L4374Q8392J98806j19788o0777o9988O6765o2924j71872
5553B525952l4751m6628l8167p9254L0187J40098N8565J27378n3667n0085J38475
5542B718103m3362M466j4167K06821J40406j29753j12682M9296l2703j80946j38037
5531B467442m9625l9936j60916J3327j47812K122j42182O253o3261j82500J1199
5520A714111J1522j0295r1830K39206j9042R0276J00496k5115L6541l684J43148
5509B185334q1682j45948M4390j36278j38627j45318J9871J573O815j82706q3385
5498A344039n7693l4692M9812r9486p0138r1353Q5545K08047j18685k7143O6411
5487A254664K4025N8816L131L0489J15975n9666n1392p082k7025q2739j30666
$$ plain form
5564 2589209 2630883 2622964 2657338 2745730 2944536 2824748 2763971 2693983 2760748 2697824 2525952
5553 2525952 2491201 2444573 2406406 2327152 2357339 2497437 2556002 2683380 2629713 2579628 2718103
5542 2718103 2674741 2679207 2665040 2871861 3012267 2882514 2769832 2819128 2786425 2605479 2467442
5531 2467442 2417817 2377881 2216965 2230292 2082480 2084602 1942420 1948673 1885412 1702912 1714111
5520 1714111 1725633 1715338 1623508 1862714 1843672 1933948 2034444 2009329 2045870 2042186 2185334
5509 2185334 2103652 1957704 2002094 1865816 1727189 1581871 1601742 1603315 1610130 1427424 1344039
5498 1344039 1286346 1251654 1301466 1201980 1131842 1040489 1126034 1334081 1215396 1188253 1254664
5487 1254664 1278689 1337505 1340636 1371125 1487100 1427434 1376042 1368960 1341935 1259196 1128530
5476A128530m6194J09255N0231j12995j5858P7937n566p1476J9066m6412J27285
5465A213803N4234J39621P7617j12913K0169m8181M8728Q8614J86383L0705m6972
5454A651808K92163O6682M8460r4737J03504j01603j97006J4269n0128J61827
5444A895239O09O1550O4371o9242J34932K70332Q6928M872P7775q8780J70656
5433B609242L25800O3901J02253J41916J3311N614M9328Q9132J59314q9879j18309
5422C351623J7424j16103j2453j54487k12726n2158J70828J1355j44631p493p606
5411B843573L4256q12M0721K11397M12851J58258J16595J04584O7020m4029M3870
5400C988284o4089j85709m9235j66432j52643o1896j11096j48255j59545j74861
$$ plain form
5476 1128530 1082336 1191591 1241822 1128827 1112969 1190906 1185340 1113864 1132930 1086518 1213803
5465 1213803 1268037 1407658 1485275 1372362 1392531 1344350 1393078 1481692 1668075 1698780 1651808
5454 1651808 1943971 2010653 2059113 1964376 2067880 1966277 1769271 1783540 1733412 1895239
5444 1895239 1895848 1957398 2021769 1952527 2087459 2357791 2444719 2449591 2527366 2438586 2609242
5433 2609242 2935042 2998943 3101196 3243112 3256423 3262037 3311365 3400497 3559811 3469932 3351623
5422 3351623 3369047 3252944 3240491 3086004 2873278 2821120 2991948 3003303 2858672 2851179 2843573
5411 2843573 2877829 2877017 2917738 3129135 3541986 3700244 3816839 3921423 3988443 3944414 3988284
5400 3988284 3924195 3738486 3689251 3522819 3370176 3308280 3197184 3048929 2889384 2714523
5390B714523j48159m7317R0201M3227j6507q7528k2021N085M5160k1215Q9717
5379B645166n7740O1798m4082Q265J34759j63984j24261m8037m601j47613j18448
5368B141222J31404n1066m4565j38841P0580J0180k5251r1938j4874N1437p1983
5357A966305p0712k7134O1427N3947J42698J6259j20666p3067J09425K1262m6895
5346B032849o0852J3830M2245J24751k8690K7971L3331K6570J10318R7829O8575
5335B488727q1456O9506P1208O4339q3250N3094J4409N6366J41374N0962M3829
5324B889108j6138N1709J5419J80876M7238J31910L4533J86306J27542j8646J01205
5313C731062J07571P6482J72003J77452J58921P1931J57171P3458J79898l6429
$$ plain form
5390 2714523 2566364 2519047 2609248 2652475 2635968 2548440 2526419 2531504 2576664 2555449 2645166
5379 2645166 2587426 2649224 2605142 2613407 2748166 2584182 2459921 2411884 2407283 2259670 2141222
5368 2141222 2272626 2221560 2176995 2038154 2108734 2118914 2093663 2001725 1986851 2038288 1966305
5357 1966305 1895593 1868459 1929886 1983833 2126531 2142790 2022124 1949057 2058482 2079744 2032849
5346 2032849 1971997 1985827 2028072 2152823 2124133 2152104 2185435 2212005 2322323 2420152 2488727
5335 2488727 2407271 2476777 2547985 2612324 2529074 2582168 2596577 2652943 2794317 2845279 2889108
5324 2889108 2872970 2924679 2940098 3120974 3168212 3300122 3334655 3520961 3648503 3629857 3731062
5313 3731062 3838633 3915115 4087118 4264570 4423491 4495422 4652593 4726051 4905949 4869520
5303D869520J20737K14478J47187J92172K29338K7800Q9104M35139L37557Q7457
5293F750489K10875K01422J21370K12587L74817K55687J98748K43280K85464K77471
5283I132210K94607N65632L20348M37720M09693M85259N57319M30082N25108P16394
5273A3874372O79217O99115P64419O70698O70659Q95303Q85730Q16247R03124
5264B0858884R58305J159187J176842R95811J213679J288545J185021J354849
5256C0191123J299983J352245J349769J329313J197722J254442J192586J013985
5248D0181168J093301R19806R49808P29677Q31738O41572R95565R23053Q67963
5239D8133651Q13486Q43771J180296J079111J263364J280886J178254J161533
$$ plain form
5303 4869520 4990257 5204735 5351922 5544094 5773432 5801232 5890336 6325475 6663032 6750489
5293 6750489 6961364 7162786 7284156 7496743 7871560 8127247 8325995 8569275 8854739 9132210
5283 9132210 9426817 9992449 10312797 10750517 11160210 11645469 12202788 12632870 13157978 13874372
5273 13874372 14553589 15252704 16017123 16687821 17358480 18253783 19139513 19955760 20858884
5264 20858884 21817189 22976376 24153218 25149029 26362708 27651253 28836274 30191123
5256 30191123 31491106 32843351 34193120 35522433 36720155 37974597 39167183 40181168
5248 40181168 41274469 42194275 43144083 43873760 44705498 45347070 46342635 47265688 48133651
5239 48133651 48947137 49790908 50971204 52050315 53313679 54594565 55772819 56934352
5231E6934352J164238J339783J342344J446657J327303J227890J373415J231208
5223F7387190J183784J046452P27928M31491M74388Q1928l34538l88747n04270
5214G0105606q08326j085766j260723j229378j455326j607315j400621j290849
5206E9967302j424153j314456j181353j330987j220219j002374j036765r68331
5198E0488664j005109j006206q43111q04348p64791p63415o70419p70832p49038
5189D3111395r70912q60853r17976j115843j257284j191405j328893j437189j455128
5180C2575912j370906j491434j306625j189829j240515j177007j207756j081597
5172B2510243j028092q70649q87287q43086p87713q01592p98038o66742o42585
$$ plain form
5231 56934352 58098590 59438373 60780717 62227374 63554677 64782567 66155982 67387190
5223 67387190 68570974 69617426 70345354 70776845 71251233 71333161 70998623 70609876 70105606
5214 70105606 69297280 68211514 66950791 65721413 64266087 62658772 61258151 59967302
5206 59967302 58543149 57228693 56047340 54716353 53496134 52493760 51456995 50488664
5198 50488664 49483555 48477349 47634238 46829890 46065099 45301684 44631265 43860433 43111395
5189 43111395 42140483 41279630 40361654 39245811 37988527 36797122 35468229 34031040 32575912
5180 32575912 31205006 29713572 28406947 27217118 25976603 24799596 23591840 22510243
5172 22510243 21482151 20611502 19724215 18881129 18093416 17291824 16493786 15827044 15184459
5163A5184459n59449n75864n46928n29898l50904m88986l12700l44355m70019
5154A1005356n41969k71981l35355k39288k65366m20847k75311k13863n7769k79710
5144H103897k83030l7468k35197j87618r5733k44187l41081j09746n4686j40237
5134F374914j80811j35188k31559k37077k43134j56152p9213j11109J5514j71681
5124D844504m4094j55648j04912o8302k03153n7940L803j09291k2347q1038j415
5113D000167r2508j83346P5670m9173j92799k4238p8483R05r2474j61540R1304
5102C293485K148j15017O014r9320K3883q2351l1015j79624o2878k3000p334m3443
5090B681548M1693p6071M9135m286q3233K7326o984J14185j19158m3099P4255
$$ plain form
5163 15184459 14625010 14049146 13502218 12972320 12621416 12132430 11819730 11475375 11005356
5154 11005356 10463387 10191406 9856051 9616763 9351397 8930550 8655239 8441376 8383607 8103897
5144 8103897 7820867 7783399 7548202 7360584 7264851 7020664 6679583 6569837 6515151 6374914
5134 6374914 6194103 6058915 5827356 5590279 5347145 5190993 5111780 5000671 5016185 4844504
5124 4844504 4800410 4644762 4539850 4471548 4268395 4210455 4214258 4104967 4082620 4001582 4000167
5113 4000167 3907659 3724313 3799983 3750810 3558011 3533773 3455290 3456195 3363721 3202181 3293485
5102 3293485 3295633 3180616 3186630 3087310 3111193 3028842 2997827 2818203 2755325 2732325 2724991 2681548
5090 2681548 2723241 2647170 2696305 2692019 2608786 2636112 2629128 2743313 2624155 2581056 2655311
5079B655311l8920j03832J55306N8232L9512J03145m9257J09449K7387k9074J72765
5068C100024Q3651J61217J85064J77687L8414K03750K87097M14444L93808N10319
5058E555475M28258N64499N54714L55626N01439O22643O69280O13499L29118L1959
5048A0226510j68409o3512j65535K6145J75946n858k37466m20278p40874q50026
5038G776643j043576q46825o51151m24011k02297l49287k59585k86467j86746
5029C526698k06018j39308j73117j92393k11787j39410j80370m9157N9815r6525
5019B198428j19825j65188l1463o4667r9487N7394p1297j72650m6242J7458q0081
5008A422380m4908k3459Q692J17781j08676l8297N5282j20216M717m4034Q3709
$$ plain form
5079 2655311 2616391 2512559 2667865 2726097 2765609 2868754 2819497 2928946 2956333 2927259 3100024
5068 3100024 3183675 3344892 3529956 3707643 3746057 3949807 4236904 4651348 5045156 5555475
5058 5555475 5983733 6548232 7102946 7458572 7960011 8582654 9251934 9865433 10194551 10226510
5048 10226510 10058101 9994589 9829054 9855199 10031145 10025287 9787821 9367543 8626669 7776643
5038 7776643 6733067 5886242 5235091 4811080 4608783 4259496 3999911 3713444 3526698
5029 3526698 3320680 3181372 3008255 2815862 2604075 2464665 2284295 2235138 2294953 2198428
5019 2198428 2078603 1913415 1881952 1817285 1717798 1775192 1703895 1531245 1485003 1502461 1422380
5008 1422380 1377472 1354013 1362705 1480486 1371810 1333513 1388795 1268579 1273296 1229262 1312971
4997A312971j07790m768K6853K4572M1522j27741O5257M1185m4264l9687j48637
4986A039473K8201l4692K0019K09835n2520p375q3370j53880J3118J11869J18923
4975A209601j00304J4084j57476M4160K0934k1940O6114m061k9016j32831J06898
4964A016163P5321j39049L4829O2801K2919n4604Q939P5161q6772Q4412M9060
4953A149180p2438J0309k5294j7678R0118J32491J19821j00267O4293M5466p0821
4942A325180J46696R0199j3494L8247J3508K28125J07633J30414L5372O0640j39011
4931B023509q0020J4314Q801Q4349j52871r3378j69008K4889J28959Q5186j44349
4920A730381j6260l5169p3971q513J43143J66739M0180j47310j30M0045J5233
$$ plain form
4997 1312971 1205181 1200413 1227266 1251838 1293360 1165619 1230876 1272061 1227797 1188110 1039473
4986 1039473 1067674 1032982 1053001 1262836 1210316 1202941 1119571 965691 978809 1090678 1209601
4975 1209601 1109297 1123381 965905 1010065 1030999 1009059 1075173 1071112 1042096 909265 1016163
4964 1016163 1091484 952435 987264 1050065 1072984 1018380 1027319 1102480 1015708 1100120 1149180
4953 1149180 1076742 1087051 1061757 1044079 1134197 1266688 1386509 1286242 1350535 1396001 1325180
4942 1325180 1471876 1562075 1548581 1586828 1600336 1828461 1936094 2066508 2101880 2162520 2023509
4931 2023509 1943489 1957803 1966604 2050953 1898082 1804704 1635696 1660585 1789544 1874730 1730381
4920 1730381 1714121 1678952 1604981 1596468 1739611 1906350 1946530 1799220 1799090 1839135 1854368
4909A854368j2149J82080Q608Q9194P6379j25205J8186M6184J08252J9703R4883
4898B360483j84r3461k4853P495p7842K43437j40861j64390L4842k680P7685m4841
4886B174830j5299k9337R0937J35935j33157J16617O0431Q1080n6092q3989p254
4875B334702k2966J11760J27526J1453j05246L8735J08482K17490M4822p7690
4865B789068L6508N1683M4924K3228O5475J45199J12502O0008N3018K00278J79921
4854C761812K78803K16815K74441L18647K61057M86158O87499P61486O04428O48260
4844H299406K56344j28677k17315l59490p87897q83653r49213o29666m72049m73303
4834C654487l38972l53231k94329k28267n7150j21826p9311n8699o7596j62937
$$ plain form
4909 1854368 1842219 2024299 2032907 2122101 2198480 2073275 2091461 2137645 2245897 2265600 2360483
4898 2360483 2360299 2266838 2241985 2249480 2171638 2415075 2274214 2109824 2144666 2141986 2219671 2174830
4886 2174830 2159531 2130194 2221131 2357066 2223909 2340526 2400957 2482037 2425945 2341956 2334702
4875 2334702 2311736 2423496 2551022 2562475 2457229 2495964 2604446 2821936 2866758 2789068
4865 2789068 2825576 2877259 2922183 2945411 3010886 3156085 3268587 3328595 3381613 3581891 3761812
4854 3761812 4040615 4257430 4531871 4850518 5111575 5597733 6285232 7046718 7651146 8299406
4844 8299406 8555750 8427073 8209758 7850268 7062371 6178718 5229505 4599839 4127790 3654487
4834 3654487 3315515 2962284 2667955 2439688 2382538 2260712 2181401 2122702 2055106 1892169
4824A892169k3777j7749l1187j68765o7409o5379p6779M345m3839P5156j5858
4813A460928r2524j39812k6749J2931N4580m2463O2019j19650n9133j05491j39480
4802H65156Q6747L0093j0872j90053j8173r5713K1459J0952j8416L2224m7510
4791F65894r8523j08619L2172J6799Q2879l7219q0508L1788j18986j8603J68940
4780E36014J2336j85323J6229Q978n4523k6144l2920P0176J15679m1923j1988
4769D06591o7264j00072r508P8928J8540j0897n2586J31799Q66L2457j11065J0065
4757C27854k1963j57095J8847Q1898R9687o6349m9972j51791M0179J17736k242
4746B36789J30185L3250j35149J1288j23558K30l2865l652o0779Q6114J32372
$$ plain form
4824 1892169 1868392 1850643 1819456 1650691 1583282 1517903 1441124 1445469 1401630 1476786 1460928
4813 1460928 1368404 1228592 1201843 1214774 1269354 1226891 1288910 1169260 1110127 1004636 865156
4802 865156 951903 981996 971124 781071 762898 667185 688644 699596 681180 713404 665894
4791 665894 567371 458752 490924 507723 590602 553383 472875 504663 385677 367074 536014
4780 536014 548350 363027 379256 388234 333711 307567 274647 344823 460502 418579 406591
4769 406591 339327 239255 229747 308675 327215 316318 263732 395531 396397 428854 317789 327854
4757 327854 305891 148796 167643 249541 349228 282879 232907 81116 121295 239031 236789
4746 236789 366974 400224 265075 276363 152805 153035 120170 116518 55739 141853 274225
4735B74225P1695j42852k1902O4139O3564o4556k057R7362k04647J7104Q9009
4724B41084m9992l6623N2814j3453l1333p9114j841K7094K5949M4429l1630j08358
4712C9026p9139K9503N5024K8741K1529O9365J5773O1125l5063O4317J5853r9827
4700A86227j3076k8807J24167p766L9288p8050o4389O4708j33686O1959N517m5854
4688A10238J02414k7481l8011K8063K6300n5711M4809Q615Q5637n2636J798J4680
4676B48715j23766Q9822J25675j09502j46006J51182R7940L8560O8389K6986o8915
4665C99080P3403n3428j8432P9582j73566q8008J73497J7618j4709K9710j40193
4654B84554l5324j8712m252R2840m2825l4247N2514M0424q4836l486J9034k1904
$$ plain form
4735 274225 345920 203068 181166 245305 308869 244313 242256 339618 134971 152075 241084
4724 241084 191092 154469 207283 193830 162497 83383 81542 108636 134585 179014 147384 39026
4712 39026 -40113 -10610 44414 73155 94684 164049 179822 240947 205884 270201 286054 186227
4700 186227 173151 144344 268511 260745 300033 221983 157594 222302 88616 150575 156092 110238
4688 110238 212652 185171 147160 175223 201523 145812 190621 199236 284873 232237 234035 248715
4676 248715 124949 214771 340446 230944 84938 236120 334060 372620 441009 467995 399080
4665 399080 472483 419055 400623 480205 306639 218631 392128 409746 395037 424747 284554
4654 284554 249230 230518 226266 319106 276281 242034 294548 334972 250136 246650 265684 243780
4642B43780N9869n728l4974Q26l4847J21664J4378o6073p1323p1444J34146j41822
4630A48452k682K6776P6438R0442j67126l6487J47530J39236N6355Q5934j02285
4619D62583k72361k3117L3952P4176K3415p9496l9039O3774J42229o6040j74453
4608A45623K9093r4702k4556Q9947J00861j18539o5203J11916J9405N5877l4532
4597B15190j25630p455Q0753J84996K93j43027J57394p6243n8340K6762N9195
4586C13888R1894m0023j02692N4692P4296j05831K4530J0526q43k4217M646k2373
4574B78493J9845O1672N2415k0475j0642P8298O8880J5226o055n2378p8474L8790
4562D45595J03537P86m0547n1865j70646N2336M0060K2820l5627P8605O8835K5967
$$ plain form
4642 243780 303649 297921 262947 263773 228926 350590 364968 298895 227572 156128 290274 148452
4630 148452 145770 172546 248984 339426 172300 135813 283343 422579 478934 564868 462583
4619 462583 190222 167105 201057 275233 298648 219152 180113 243887 386116 320076 145623
4608 145623 174716 80014 55458 145405 246266 127727 62524 174440 193845 249722 215190
4597 215190 89560 82105 162858 347854 348147 205120 362514 286271 227931 254693 313888
4586 313888 405782 365759 263067 317759 392055 286224 310754 321280 320437 296220 300866 278493
4574 278493 298338 360010 412425 391950 381308 459606 528486 543712 537657 485279 406805 445595
4562 445595 549132 549918 509371 457506 286860 339196 379256 402076 366449 445054 513889 539856
4550E39856j13271k43563N3239K25449L88o4047K2J36536j44255N9905J3767r1156
4538C72870j35208P6930K2388K0869J9016q4587J60405J55844k3366k67514N4167
4527C71814K8020O0513j18419P1187P5441q8612l27m4941J32063N3464k1939l9686
4515D78578Q2843R1890P2035L010j41882m2008o1157Q6243J90144j19046l5435
4504F05215m0160o7522N1305N444J34113l610m3562P5459J12694j32179o7123
4493F30074J28098J53724j42422j668n5548j926K515m9830Q9140J66120l3251
4482H85026K3313J0616j90535L3258p620m6823Q0456l3822R9540J95237m1666
4471A006980j0568m8006N9108Q223Q4230O2034n2920q2688J9081m1027Q5826q4297
$$ plain form
4550 539856 426585 183022 236261 461710 462098 398051 398073 534609 390354 450259 464026 372870
4538 372870 237662 314592 336980 357849 376865 292278 452683 608527 585161 317647 371814
4527 371814 399834 460347 341928 413115 488556 399944 399617 354676 486739 540203 518264 478578
4515 478578 561421 653311 725346 728356 586474 544466 483309 569552 759696 640650 605215
4504 605215 565055 497533 548838 554282 688395 684785 641223 716682 829376 697197 630074
4493 630074 758172 911896 769474 767806 712258 710332 712847 663017 752157 918277 885026
4482 885026 908339 918955 728420 761678 754058 707235 787691 753869 853409 1048646 1006980
4471 1006980 996412 948406 1007514 1015737 1099967 1162001 1109081 1026393 1045474 1004447 1090273 1005976
4459A005976l8124J32542k3325J18561Q437j18009l1136N4072K05424Q5132j51347
4448A248203R1412m698J8970o8956l2623J70904O0080k1854J42347j6735J4216
4437A601266J00677R5066N0019p0427r5473K8861J12006o3056L4944M6364J29349
4426A969596M5463k8974J42302J3637Q2039J37453O1049J49644J21016O5260J6042
4415B774527O0565J43158k1475J28404K10586K75044K81548J52775K5107J71732
4405D201971J72074J85063L00400J73625K95108L97805L38626K01974L25870M65086
4395G057602L49581M16737N30041N27207P41657O08289N38351M35224N81369L97490
4385A2183548M48176K26648L90339N22288N03773P21153Q01427J034123J050607
$$ plain form
4459 1005976 967852 1100394 1077069 1195630 1204067 1086058 1054922 1108994 1314418 1399550 1248203
4448 1248203 1339615 1334917 1353887 1284931 1252308 1423212 1483292 1461438 1603785 1587050 1601266
4437 1601266 1701943 1797009 1847028 1776601 1681128 1709989 1821995 1758939 1793883 1840247 1969596
4426 1969596 2015059 1986085 2128387 2142024 2224063 2361516 2422565 2572209 2693225 2758485 2774527
4415 2774527 2835092 2978250 2956775 3085179 3295765 3570809 3852357 4005132 4030239 4201971
4405 4201971 4374045 4559108 4859508 5033133 5328241 5726046 6064672 6266646 6592516 7057602
4395 7057602 7407183 7823920 8353961 8881168 9622825 10231114 10769465 11204689 11786058 12183548
4385 12183548 12631724 12858372 13248711 13770999 14274772 14995925 15797352 16831475 17882082
4376A7882082J028866R33546O48876M24423J51059J71632M5707k45051n0494K16171
4366B1206817N16506N83586N29862P57974R54018P88460O02083J71925m8123m36926
4356B5626182o87779p06812q36966q51295n37632j38855N6318O2897J82993K86931
4346B2455982J40662j93518k46791n44005r32023q72180j070069r35498p66768
4337A7035792o62785n59726l88052j69693k62692p1806r0402l48226l00051l35095
4327A3847264o38328n10489l69094m25017l01381l02900j96681M4535o5377p9380
4317A1003152J36111L6147J45982j45176J49220R0372J88885L28184R6211K16671
4307A2245759J98632L06983K53574L20613L86227L05734L07529M07005L65400
$$ plain form
4376 17882082 18910948 19844494 20493370 20917793 21068852 21240484 21286191 21041140 20990646 21206817
4366 21206817 21723323 22306909 22836771 23594745 24548763 25337223 25939306 26111231 26063108 25626182
4356 25626182 24938403 24231591 23394625 22543330 22005698 21866843 21923161 21986058 22169051 22455982
4346 22455982 22596644 22403126 22156335 21612330 20680307 19808127 18738058 17802560 17035792
4337 17035792 16373007 15813281 15425229 15255536 14992844 14921038 14830636 14482410 14182359 13847264
4327 13847264 13208936 12698447 12329353 11904336 11602955 11300055 11103374 11147909 11082532 11003152
4317 11003152 11139263 11175410 11321392 11176216 11325436 11415808 11604693 11932877 12029088 12245759
4307 12245759 12444391 12751374 13004948 13325561 13711788 14017522 14325051 14732056 15097456
4298A5097456M58200L53641M88221N58662N41098M51400M24055M38162L47282
4289A9158177K78571K61083K96454Q0318K70596L74443K41449L27820K38361K37591
4279B1764863K83953J73689R0160M5910k24907j68010p8961j87714m19016l10995
4269B0968972k34900k24398j76005j07855l50199m91309l32732k10611n66580
4260A8274383o18754n26316o96449m18305n24472m78221m24341l66946l96953
4251A3823626l05436n03999m47084m43598k42619k08604l77309m65185k65969
4242A0563823j82660l51556l07564j92285k86198j89633j24073k28934q7696n5636
4232H557588q1525k7759J8744j21435o2558J25383J46671M9131J9621q932K3019
$$ plain form
4298 15097456 15555656 15909297 16397518 16956180 17497278 17948678 18372733 18810895 19158177
4289 19158177 19436748 19697831 19994285 20074603 20345199 20719642 20961091 21288911 21527272 21764863
4279 21764863 22048816 22222505 22312665 22358575 22133668 21965658 21886697 21698983 21279967 20968972
4269 20968972 20734072 20509674 20333669 20225814 19875615 19384306 19051574 18840963 18274383
4260 18274383 17655629 17129313 16432864 16014559 15490087 15011866 14587525 14220579 13823626
4251 13823626 13518190 13014191 12567107 12123509 11880890 11672286 11294977 10829792 10563823
4242 10563823 10381163 10029607 9722043 9529758 9243560 9053927 8929854 8700920 8613224 8557588
4232 8557588 8476063 8448304 8467048 8345613 8283055 8408438 8555109 8604240 8623861 8614929 8637948
4221H637948M8363J86798P8366J05961R9847j6877P5430L64141K33400J29838
4211I943215N3354J32584K32070K69219L96231K95158K18390L43701J63742K80057
4201A2327721M39603N15605M58286L63558M74059M30273L72222L84911N10282
4192A6276520O84042O47288P88539P32533R21330R40911J019876J263656J422694
4183B4697389J432785J520736J733327J689042J923664J956681J872077J848565
4175C8674266J865859J672543J468205J399429J088761R11709O64849N71735O19959
4166D8937315O96806R11657J053642J246841J417367J347615J579149J619079
4158E8809471J542590J468417J361492J393333J333067J272206J365165J269700
$$ plain form
4221 8637948 8686311 8873109 8951475 9057436 9157283 9140406 9215836 9579977 9813377 9943215
4211 9943215 9996569 10129153 10361223 10630442 11026673 11321831 11540221 11883922 12047664 12327721
4201 12327721 12767324 13282929 13741215 14104773 14578832 15009105 15381327 15766238 16276520
4192 16276520 16960562 17607850 18396389 19128922 20050252 20991163 22011039 23274695 24697389
4183 24697389 26130174 27650910 29384237 31073279 32996943 34953624 36825701 38674266
4175 38674266 40540125 42212668 43680873 45080302 46169063 47080772 47745621 48317356 48937315
4166 48937315 49634121 50545778 51599420 52846261 54263628 55611243 57190392 58809471
4158 58809471 60352061 61820478 63181970 64575303 65908370 67180576 68545741 69815441
4150F9815441J465397J484445J664543K158264K142854K299624K009715J989422
4142H5029705J586932P51813p3062r29039j865869k255626k731241k829514k857290
4133G3826809k482581k222994j923117j563506j351731j222661j141515j142714
4125F0775990j258157j220939j348630j461531j460018j579963j430874j430715
4117D9585163j338847j101727r14805q11548p42298o72988p40942r81709j054049
4108D1226250r62495j375268j746868j760133j881957j831189j627416j651850
4100B8389074j718627j468990j274606j005389j002759r76141r30752q47167o88263
4091A8476380n25941o24922m98597m61376l93030k13393m51657l17667k19711
$$ plain form
4150 69815441 71280838 72765283 74429826 76588090 78730944 81030568 83040283 85029705
4142 85029705 86616637 87368450 87295388 86366349 84500480 82244854 79513613 76684099 73826809
4133 73826809 71344228 69121234 67198117 65634611 64282880 63060219 61918704 60775990
4125 60775990 59517833 58296894 56948264 55486733 54026715 52446752 51015878 49585163
4117 49585163 48246316 47144589 46229784 45418236 44675938 44002950 43262008 42280299 41226250
4108 41226250 40263755 38888487 37141619 35381486 33499529 31668340 30040924 28389074
4100 28389074 26670447 25201457 23926851 22921462 21918703 20942562 20011810 19164643 18476380
4091 18476380 17950439 17325517 16826920 16365544 15972514 15759121 15307464 14989797 14770086
4082A4770086j45000k96171j56228j22964k12697k13742r8081k31214j02679k25024
4072A2966286j79297j71165j29556L2041M9910K1270R5996m420o737O5601j00101
4061A2639828l135k8536q7822J7207Q1463j20653j02549J5912N7422j0231j02160
4050A2356746Q5212l8653p326n5067j26712l52992l9451R3534k08008P9377p8899
4039A1707761J30410J09335K1035j94367k4073o831m9716K0511J20859l5470j96943
4028A1602511P1626J38144J19117N5680R0709J7258P5479N3494K27851Q5045J36431
4017A2673345R7163R1620J61753L20191J74074J97379L84664L98244K78954M62879
4007A5240266N42344O38059N37422N72417Q00412Q56062J143786J160997J050002
$$ plain form
4082 14770086 14625086 14328915 14172687 14049723 13837026 13623284 13525203 13293989 13191310 12966286
4072 12966286 12786989 12615824 12486268 12518309 12568219 12589489 12685485 12681065 12674328 12739929 12639828
4061 12639828 12636693 12608157 12520335 12537542 12619005 12498352 12395803 12411715 12469137 12458906 12356746
4050 12356746 12441958 12403305 12395979 12340912 12214200 11861208 11821757 11915291 11707283 11786660 11707761
4039 11707761 11838171 11947506 11968541 11774174 11750101 11743270 11693554 11714065 11834924 11799454 11602511
4028 11602511 11674137 11812281 11931398 11987078 12077787 12095045 12170524 12224018 12451869 12536914 12673345
4017 12673345 12770508 12862128 13023881 13344072 13518146 13715525 14100189 14498433 14777387 15240266
4007 15240266 15782610 16420669 16958091 17530508 18330920 19186982 20330768 21491765 22541767
3998B2541767J231984J482481J607236J593293J928126K124433K389904K552076
3990C7451300K631302K925341L077289L415485L574069L477190L352976L343246
3982F3248198K905858K624295K110884J545344J107920N16493J57528r1194k60867
3973G3864459l35016k47248l03578j16025j02963o0658k19086n52450p99573j089420
3963G0038442j453040j978442k447059k470573k854320k816123k914094k831280
3955E0273511k564397k385747k116655j781395j431510j148595p63362n29129
3947C7552721k07999q8378L05480N37685O98212P07062J039162J293343J494986
3938D3332274J685428J760324J616086J812438J531432J426901J292692J068667
$$ plain form
3998 22541767 23773751 25256232 26863468 28456761 30384887 32509320 34899224 37451300
3990 37451300 40082602 43007943 46085232 49500717 53074786 56551976 59904952 63248198
3982 63248198 66154056 68778351 70889235 72434579 73542499 74058992 74216520 74125326 73864459
3973 73864459 73529443 73282195 72978617 72862592 72759629 72698971 72479885 71927435 71127862 70038442
3963 70038442 68585402 66606960 64159901 61689328 58835008 56018885 53104791 50273511
3955 50273511 47709114 45323367 43206712 41425317 39993807 38845212 38081850 37552721
3947 37552721 37344722 37256344 37561824 38099509 38797721 39504783 40543945 41837288 43332274
3938 43332274 45017702 46778026 48394112 50206550 51737982 53164883 54457575 55526242
3930E5526242O84671M99853J86675J14623m3223j70677l7646r3953k95251l29344
3920E6041970m36810n15557o37097r82965j334266j422228j613308j825931k059375
3911D5214433j943195k115273k098602k008282j907912j783883j820715j423282
3903C0113289j284593j479208j153669r87228j058581j074657r06231p44477p12899
3894B0711746o99309n12138l87239m32780l96420o42166l77758l46015l30046
3885A6587875l13583l00439m46697j68168l91749k51448k30315k43613j82035
3876A4059828j32961r2793k39596k86608j39724j56764m3408m4025j30908j50456
3866A2642585q5612j03072l5743J10363P2186M2765K6353J68319J0716P2864K1026
$$ plain form
3930 55526242 56210913 56710766 56897441 57012064 56968841 56798164 56760518 56666565 56371314 56041970
3920 56041970 55605160 55089603 54452506 53469541 52135275 50713047 49099739 47273808 45214433
3911 45214433 43271238 41155965 39057363 37049081 35141169 33357286 31536571 30113289
3903 30113289 28828696 27349488 26195819 25208591 24150010 23075353 22169122 21424645 20711746
3894 20711746 20012437 19500299 19113060 18680280 18283860 17641694 17263936 16917921 16587875
3885 16587875 16274292 15973853 15527156 15358988 14967239 14715791 14485476 14241863 14059828
3876 14059828 13926867 13834074 13594478 13307870 13168146 13011382 12967974 12923949 12793041 12642585
3866 12642585 12556973 12453901 12418158 12528521 12600707 12643472 12669825 12838144 12848860 12921724 12942750
3855A2942750J10295k8063J80527J72526J75810L03506Q3464J95616J43868L31438
3845A4611737L38081L91003M57399M91977M95093M08882O83766O48460Q84252
3836A9410650P43019Q81060R49050Q99054R81222R18566Q69660Q14892Q03379
3827B7270552O40955L92457L54011K90721J65128J13981l0378K94117K69377O7028
3817B9827949J29033M05020M11366O08932N09642K96462L48678J01304R3349K47431
3807C2979166J03777J65720J00759J17911M13637L89377N82361O71637R22543
3798C6446888J248054J359651J523910J655333K013094K282568K460072K886804
3790E1876374L192090L367171M003614M175340M674326N231588N665773O146189
$$ plain form
3855 12942750 13053045 13024982 13205509 13378035 13553845 13857351 13940815 14136431 14280299 14611737
3845 14611737 14949818 15340821 15798220 16290197 16785290 17194172 17877938 18526398 19410650
3836 19410650 20153669 21034729 21983779 22882833 23864055 24782621 25652281 26467173 27270552
3827 27270552 27911507 28303964 28657975 28948696 29113824 29227805 29197427 29491544 29760921 29827949
3817 29827949 29956982 30362002 30773368 31382300 31891942 32188404 32537082 32638386 32731735 32979166
3807 32979166 33082943 33248663 33349422 33467333 33880970 34270347 34852708 35524345 36446888
3798 36446888 37694942 39054593 40578503 42233836 44246930 46529498 48989570 51876374
3790 51876374 55068464 58435635 62439249 66614589 71288915 76520503 82186276 88332465
3782H8332465O731575O848589P073041O966252O908486O710764O361415N719044
3774A41651631N155546M563089M049234L458575K898396K544112K181693J928918
3766A68431194J684775J591040J342667J168121P54114K14994l34512j084144
3758A73768249k006033k787268l575191m164248m824199n144721n234415n319280
3750A40712894n236909m872622m638496m216876m003389l888457l374671l232098
3742A07249376l274893l156310l090503k990089l230903l237712l358618l424749
3734H1485599l485863l392900l291835l393494l185769l041292k854282k633378
3726E6206786k564042k317638k071404j845667j680023j424393j374286j272115
$$ plain form
3782 88332465 95064040 101912629 108985670 115951922 122860408 129571172 135932587 141651631
3774 141651631 146807177 151370266 155419500 158878075 161776471 164320583 166502276 168431194
3766 168431194 170115969 171707009 173049676 174217797 174971911 175186905 174852393 173768249
3758 173768249 171762216 168974948 165399757 161235509 156411310 151266589 146032174 140712894
3750 140712894 135475985 130603363 125964867 121747991 117744602 113856145 110481474 107249376
3742 107249376 103974483 100818173 97727670 94737581 91506678 88268966 84910348 81485599
3734 81485599 77999736 74606836 71315001 67921507 64735738 61694446 58840164 56206786
3726 56206786 53642744 51325106 49253702 47408035 45728012 44303619 42929333 41657218
3718D1657218r71914p93008q38579p97501p43246n35484o36147n00350m65598
3709C5375391n33774n40843n55147n99758m64269n30056p88421p70177p69640
3700B9823306n91461o74018p60825n02808o28504m90176l77596k51852k61290
3691B5284776k10329j48340l14489k15703k94649l04628m07920m85361p19599
3682B2183758o75568o06955o73328o19428m49643p20816o02387l48831o38112
3673A6848690n71291m87046m65325l02627l73527l48095k01592m39208k48439
3664A3411540j95739k01791j10890j90771j74181k01509k77606j59416j43735
3655A1755902k50650j51653o6727p1152j90640j12494k56972j35708o4541l5892
$$ plain form
3718 41657218 40685304 39892296 39053717 38256216 37512970 36977486 36341339 35840989 35375391
3709 35375391 34841617 34300774 33745627 33145869 32681600 32151544 31363123 30592946 29823306
3700 29823306 29231845 28557827 27797002 27294194 26665690 26175514 25797918 25546066 25284776
3691 25284776 25074447 24926107 24611618 24395915 24101266 23796638 23388718 22903357 22183758
3682 22183758 21508190 20901235 20227907 19608479 19158836 18438020 17835633 17486802 16848690
3673 16848690 16277399 15790353 15325028 15022401 14648874 14300779 14099187 13659979 13411540
3664 13411540 13215801 13014010 12903120 12712349 12538168 12336659 12059053 11899637 11755902
3655 11755902 11505252 11353599 11286872 11215720 11025080 10912586 10655614 10519906 10455365 10419473
3645A0419473J021N793p8363J3422J43248j04620j01731j43726o4760o935O8658
3634A0151480L2628J25160J09874n7772R5285q3099J63347Q6025J21751K57885
3624A1002564Q5607J92912K75263J69860N2543K59499M33825L38855L11792M29697
3614A3552417M03148L03023L32592M32019L59636M83201L65411M33332L01939
3605A6966718K46690L04114L77843L29997J29057L89306M73940M66029N19144
3596B0202838N86000N37586O62719O68827N63529M88320N09503N02020M58561
3587B5179903M69137M19317N55427O38252M36924L81182L90635N07492N47239
3578B9525508P30310O62218O89923P30561Q58046R94959J023440J265239J289183
$$ plain form
3645 10419473 10420494 10426287 10347924 10361346 10504594 10399974 10298243 10154517 10089757 10082822 10151480
3634 10151480 10184108 10309268 10419142 10361370 10456655 10373556 10536903 10622928 10744679 11002564
3624 11002564 11088171 11281083 11556346 11726206 11778749 12038248 12472073 12810928 13122720 13552417
3614 13552417 13955565 14258588 14591180 15023199 15382835 15866036 16231447 16664779 16966718
3605 16966718 17213408 17517522 17895365 18225362 18354419 18743725 19217665 19683694 20202838
3596 20202838 20788838 21326424 21989143 22657970 23221499 23709819 24219322 24721342 25179903
3587 25179903 25649040 26068357 26623784 27262036 27698960 28080142 28470777 28978269 29525508
3578 29525508 30255818 30918036 31607959 32338520 33196566 34191525 35214965 36480204 37769387
3569C7769387J242415J473290J623974J877837K160565K342701K582009K942457
3561E4014635L406763L847226M257517M590754M826782N382490N694898N823841
3553I1844906N697931N737353N465985N213364M907926M591890M317570M005399
3545A31782324L607729L344460L403814K985658K507621K076379J849907J555541
3537A53113433J009806M59284K60115l91253r25874j309105j770080k244279k560174
3528A45641873l084864l529335l749853l921385m351157m475496m364672m279258
3520A13885853m102778m018265l677135l399293l202279k725608k487502k499994
3512H7772999k179362j970138j896673j707701j339500j253535j176437r39196
$$ plain form
3569 37769387 39011802 40485092 42109066 43986903 46147468 48490169 51072178 54014635
3561 54014635 57421398 61268624 65526141 70116895 74943677 80326167 86021065 91844906
3553 91844906 97542837 103280190 108746175 113959539 118867465 123459355 127776925 131782324
3545 131782324 135390053 138734513 142138327 145123985 147631606 149707985 151557892 153113433
3537 153113433 154123239 154582523 154842638 154451385 153525511 152216406 150446326 148202047 145641873
3528 145641873 142557009 139027674 135277821 131356436 127005279 122529783 118165111 113885853
3520 113885853 109783075 105764810 102087675 98688382 95486103 92760495 90272993 87772999
3512 87772999 85593637 83623499 81726826 80019125 78679625 77426090 76249653 75310457
3504G5310457n86622l79078j53604m0090J83953L01932M20465N44346L69038N74770
3494G6545567P87060Q90489J022287Q15102L58415K63455K92954K01073j7988
3485H1158414m41355j089381j512082j871779k198048k526293k908070l242228
3477F5369178k867024k559080k313964k137730j921667j757736j642537j295509
3469D8873931j049039j069699p73353o47782j46714M5867L6716n2060k75784Q742
3459D4950825l1676M1271k3660k87230q84818j045193j040955j213564j220671
3450C9244329j437087j170193p91347l25714l47904j05121O8321K50275K37841
3441C5623400L11298K75117J91225L85090M17649M13219M65454M84299M51181
$$ plain form
3504 75310457 74723835 74344757 74191153 74151063 74335016 74636948 75057413 75601759 75970797 76545567
3494 76545567 77332627 78223116 79245403 80060505 80418920 80682375 80975329 81176402 81158414
3485 81158414 80717059 79627678 78115596 76243817 74045769 71519476 68611406 65369178
3477 65369178 62502154 59943074 57629110 55491380 53569713 51811977 50169440 48873931
3469 48873931 47824892 46755193 45981840 45334058 45187344 45233211 45269927 45217867 44942083 44950825
3459 44950825 44919149 44960420 44936760 44649530 43764712 42719519 41678564 40465000 39244329
3450 39244329 37807242 36637049 35845702 35519988 35172084 35066963 35135284 35385559 35623400
3441 35623400 35934698 36209815 36401040 36786130 37203779 37616998 38082452 38566751 39017932
3432C9017932N34507P02442O86630P64376R70693R77743J035551J378752J634802
3423D7703428J639275J916210K179507K799715L345367L940999M711237N406422
3415G3642160M821663L883999M372139N190982P700938J1303577J4587960J6996629
3407A42500047J7159360R917150m4574J08212m163955p697225j0910184j4669862
3399A32198969j0410486n682507k199922j55416J703343K845213L941420M857906
3391A27098520N816355O459070P039401P227072O076781M532801M332089M065157
3383A72647246N863104Q079950J0379429J1368479R895421K10383p852315p459850
3375B03131847j2427754j4985468j8732184k0355037j5333174j1052662p694745
$$ plain form
3432 39017932 39552439 40254881 40941511 41705887 42676580 43654323 44689874 46068626 47703428
3423 47703428 49342703 51258913 53438420 56238135 59583502 63524501 68235738 73642160
3415 73642160 78463823 82347822 86719961 91910943 99611881 110915458 125503418 142500047
3407 142500047 159659407 169576557 169531983 169640195 165476240 157779015 146868831 132198969
3399 132198969 121788483 116105976 113906054 113750638 115453981 118299194 122240614 127098520
3391 127098520 132914875 139373945 146413346 153640418 159717199 164250000 168582089 172647246
3383 172647246 178510350 186590300 196969729 208338208 218233629 218444012 210591697 203131847
3375 203131847 190704093 175718625 156986441 136631404 121298230 110245568 102550823
3368A02550823n961952m442125l462259k539834k020755j285024q48493l83788
3360H1606593k11538O107K68475L81685K06771L23364M97647K17629K44183L20300
3350H3861216L05109L6065J32291m1613k97003p57983j491132j985785k531107
3341G7230058k809127l241974l711261l492936l092164k919640k726120k415673
3333E2821163k185876k112044j956342j992578j850913j768877j675051j595371
3325C7684111j608567j317261r62361r57827o50665k54604m82672n27794o99152
3316C0223208j124581j336252j256453j459644j650063j458625j163719j007925
3308A9765946q40250p69942o32797p08271o21709l80421n08443m27399l08753
$$ plain form
3368 102550823 96588871 92146746 88684487 86144653 84123898 82838874 81990381 81606593
3360 81606593 81395055 81401162 81669637 82051322 82258093 82581457 83079104 83296733 83540916 83861216
3350 83861216 84166325 84202390 84334681 84293068 83996065 83238082 81746950 79761165 77230058
3341 77230058 74420931 71178957 67467696 63974760 60882596 57962956 55236836 52821163
3333 52821163 50635287 48523243 46566901 44574323 42723410 40954533 39279482 37684111
3325 37684111 36075544 34758283 33795922 32838095 32187430 31932826 31450154 30922360 30223208
3316 30223208 29098627 27762375 26505922 25046278 23396215 21937590 20773871 19765946
3308 19765946 18925696 18155754 17522957 16814686 16192977 15812556 15304113 14876714 14567961
3299A4567961l56596k44619j26350j89339j47019j27175l00754k5008m8447l9396
3289A2963258j13500k35609j08154j33161j72601k0672k51748k95538j40128l81204
3279A1110943j59099j10296j75741m09449k39260j85997j34476q0638j56889k26968
3269I232130j49742m2334j47893J04145k71215j66988p8388q5898M3149j7020
3259H419946o9965J0657j34195j60396q9423j4199K6825m7835l9483j30437p286
3248G764209j59074k6060j52232m397j61722l8337J6996M7478J00869K3736j46455
3237G265011L621j92270o7465J12192j5919P4038N094l256l2693m7813k5400j11527
3225F963613M2934J08836r1009q0649k8277P7123l2044O8182M3223n7034L6215
$$ plain form
3299 14567961 14211365 13966746 13840396 13651057 13504038 13376863 13076109 13051101 13002654 12963258
3289 12963258 12849758 12614149 12505995 12372834 12200233 12179561 11927813 11632275 11492147 11110943
3279 11110943 10951844 10841548 10665807 10256358 10017098 9831101 9696625 9615987 9459098 9232130
3269 9232130 9082388 9040054 8892161 8996306 8725091 8558103 8479715 8393817 8436966 8419946
3259 8419946 8349981 8360638 8226443 8066047 7976624 7962425 7989250 7941415 7901932 7771495 7764209
3248 7764209 7605135 7579075 7426843 7422446 7260724 7222387 7239383 7286861 7387730 7411466 7265011
3237 7265011 7268632 7076362 7008897 7121089 7105170 7179208 7184302 7181046 7148353 7100540 7075140 6963613
3225 6963613 7006547 7115383 7024374 6943725 6915448 6992571 6960527 7028709 7071932 7014898 7051113
3214G051113O9578l2610Q7709K9045Q4171J16194J17107O7999J28685k2565P2835
3203G769261K54197N4856J36577N1700J34314J45602R846Q7203K77234J74328
3193I095118L1109J05471R1143K4524J12073J85844K92019M95011J99781L33083
3183A0965176L54251K00378L69526L20653J89468K67677M48069M45531L91045
3174A3951774N4089K64623M81339N19996M15992M10903M77463N11167N34328N64396
3164A8186070O46352N34038P26813R12472Q41085Q03434J144755J031204J189461
3155B6015684J381397J347787J450622J611596J839174J866576K044857K406430
3147C9964123K403926K876251L063537L343455L720345M258201M788519N228564
$$ plain form
3214 7051113 7120691 7088081 7175790 7204835 7289006 7405200 7522307 7590306 7718991 7696426 7769261
3203 7769261 8023458 8078314 8214891 8266591 8400905 8546507 8556353 8643556 8920790 9095118
3193 9095118 9126227 9231698 9322841 9347365 9459438 9645282 9937301 10432312 10632093 10965176
3183 10965176 11319427 11519805 11889331 12209984 12399452 12667129 13115198 13560729 13951774
3174 13951774 14005863 14270486 14751825 15271821 15687813 16098716 16576179 17087346 17621674 18186070
3164 18186070 18832422 19366460 20093273 21005745 21846830 22650264 23795019 24826223 26015684
3155 26015684 27397081 28744868 30195490 31807086 33646260 35512836 37557693 39964123
3147 39964123 42368049 45244300 48307837 51651292 55371637 59629838 64418357 69646921
3139F9646921N826683O489483P642567Q518372R923988J1179126J2267728J2876580
3131A44371448J2800676J3031829J4233697J6936434K1085500K6143887L0192709
3124B78796180L0873661K6061110J5681434L309046p075474j6700945k5299137
3117C05645875l1404520l3511544l0446284k5032952j9794984j5373808j2373051
3110A37708732j0038619q286482p213608o204926n347491m627195m001348l142075
3102H8846988k487816j947737j507380r88794l96079R0150O05871J021529J382023
3093H4618755J481226J607043J886193K022803K289056K926239L404311L903688
3085A04139314M702986N146931N992409O577527P104522P603685Q051758Q825991
$$ plain form
3139 69646921 75473604 81963087 89605654 98124026 108048014 119227140 131494868 144371448
3131 144371448 157172124 170203953 184437650 201374084 222459584 248603471 278796180
3124 278796180 309669841 335730951 351412385 354721431 347645957 330945012 305645875
3117 305645875 274241355 240729811 210283527 185250575 165455591 150081783 137708732
3110 137708732 127670113 119383631 112170023 105965097 100617606 95990411 91989063 88846988
3102 88846988 86359172 84411435 82904055 81915261 81519182 81609332 82215203 83236732 84618755
3093 84618755 86099981 87707024 89593217 91616020 93905076 96831315 100235626 104139314
3085 104139314 108842300 113989231 119981640 126559167 133663689 141267374 149319132 158145123
3077A58145123R896585J1255632J2326493J2887597J2155004J0184011O648759
3070B33499204K219483k673272p567749j1475419j4223981j5621777j5600534
3063A68555955j4708803j3410157j1853298j0416484r277064q380892p533796
3056I2975461o830261o012413n677277n061375m576154m185692l822486l490241
3048E3319562l131978k818903k611191k466306k290367k117193j775880j730901
3040C4376843j718605j432817j327855j319822j090366j204914j243787j018892
3032B4019785p90528r17949q99344q29165o21288p53293o25913o89900o82222
3023A7210183m53047n93647n79439n18027m56434m47781l70507m41962l72014
$$ plain form
3077 158145123 168041708 179297340 191623833 204511430 216666434 226850445 233499204
3070 233499204 235718687 233045415 225477666 214002247 199778266 184156489 168555955
3063 168555955 153847152 140436995 128583697 118167213 108890149 100509257 92975461
3056 92975461 86145200 80132787 74455510 69394135 64817981 60632289 56809803 53319562
3048 53319562 50187584 47368681 44757490 42291184 40000817 37883624 36107744 34376843
3040 34376843 32658238 31225421 29897566 28577744 27487378 26282464 25038677 24019785
3032 24019785 23229257 22311308 21411964 20582799 19961511 19208218 18582305 17892405 17210183
3023 17210183 16757136 16163489 15584050 15066023 14609589 14161808 13791301 13349339 12977325
3014A2977325l68403k75225l25171k99544k39590j45337k38744j44518k39880
3005A0700913l03745k31827k23427k55460l39116j68350j43757k45363l13004
2996H476864j45715k07245k76586j16810j66044j52735k03389k30212p1838q6231
2986F820059k12716L113j9312n2943o3034n2996j93796j54317j27244k23333Q0883
2975E804364L1977j60618j71007k00622j87414K3974l1615k90988j21276n3228
2965D643547r3338R2786J63r7948j97341o9345L1196q0005n2495L2325j22784
2954D086761j93936r1734k8017j6506P975n2994k3140j9131j76367j91398m1947
2943C259566l3348n3778j24795q1786j08677l5701o3912l4116J15908k3294k17698
$$ plain form
3014 12977325 12608922 12333697 12008526 11708982 11469392 11324055 11085311 10940793 10700913
3005 10700913 10397168 10165341 9941914 9686454 9347338 9178988 9035231 8789868 8476864
2996 8476864 8331149 8123904 7847318 7730508 7564464 7411729 7208340 6978128 6906290 6820059
2986 6820059 6607343 6610456 6591144 6538201 6475167 6422171 6228375 6074058 5946814 5723481 5804364
2975 5804364 5836341 5675723 5504716 5304094 5116680 5140654 5109039 4818051 4696775 4643547
2965 4643547 4550209 4642995 4643158 4545210 4347869 4278524 4309720 4229715 4177220 4209545 4086761
2954 4086761 3892825 3801091 3773074 3756568 3764543 3711549 3688409 3669278 3492911 3301513 3259566
2943 3259566 3226218 3172440 3047645 2965859 2857182 2821481 2757569 2723453 2839361 2816067 2598369
2932B598369j91535p9518L8483m0364J3540q456j49493J48636J6563r1969q3212
2921B171044j06903N2326Q6390j31208K22M8392k7627m170p9178j59961N9731
2910A909058J53930q9876M4838M5402n7489R6067m4160j2415m6187j08729m3075
2899A847364r3416m1483K5182J01863l542j11482j10567o4341M3637O2762k1959
2888A634018j11271j34781p2121P630J74884k0414j22096j99046N0961Q0461N756
2877A293981M0891M5113J18274L5745r2242j01513k1577O6567L0164Q095r8593
2866A324905L1324Q5111N9561l3297K8270r3695o9710P317K16O8837Q5181q3360
2854A410660L2665J18557o3175k3408J03382P8021q2635J12295L3926R1056J01420
$$ plain form
2932 2598369 2406834 2327316 2365799 2325435 2338975 2330519 2181026 2329662 2346225 2254256 2171044
2921 2171044 2064141 2116467 2202857 2071649 2071871 2120263 2092636 2088466 2009288 1849327 1909058
2910 1909058 2062988 1973112 2017950 2063352 2005863 2101930 2057770 2045355 1999168 1890439 1847364
2899 1847364 1753948 1712465 1737647 1839510 1835968 1724486 1613919 1549578 1593215 1655977 1634018
2888 1634018 1522747 1387966 1315845 1323475 1498359 1477945 1355849 1156803 1207764 1288225 1293981
2877 1293981 1334872 1379985 1498259 1534004 1441762 1340249 1318672 1385239 1415403 1423498 1324905
2866 1324905 1356229 1441340 1500901 1467604 1495874 1402179 1332469 1339786 1340002 1408839 1494020 1410660
2854 1410660 1443325 1561882 1498707 1475299 1578681 1656702 1574067 1686362 1720288 1811344 1912764
2843A912764J62803l6163J30787K21910L3264K8319R5616m9488q4244K8183j55466
2832B288285j3219p8453k07878j84383j47680p2763p9299O795p5691r420O9750
2821A496044p3164k12981l9127n2583q0575M6633J08917L1648J04086P3947j45285
2810A257560j09808r1686M0772r169o6622J0858K1561J0021n1013J13384K0002
2799A145860K5140l7418O8309J34629Q0108n4331M8370p6107J36521J78485j50199
2788A499367k3203N7232K903J39499l864r7534l4587q5057j79558j5723J32865
2777A392340j57173j51634l8779p2630j19383l4240P4489O7205K28p6034j04232
2766G80157M3932o0642L109m0640k7957l2826l5043j6990j52894j17261N6283
$$ plain form
2843 1912764 2075567 2039404 2170191 2392101 2425365 2453684 2549300 2499812 2415568 2443751 2288285
2832 2288285 2275066 2196613 1988735 1804352 1656672 1583909 1504610 1511405 1435714 1426294 1496044
2821 1496044 1422880 1209899 1170772 1118189 1037614 1084247 1193164 1224812 1328898 1402845 1257560
2810 1257560 1147752 1056066 1096838 1087669 1021047 1031905 1053466 1063487 1012474 1125858 1145860
2799 1145860 1171000 1133582 1201891 1336520 1416628 1362297 1410667 1334560 1471081 1649566 1499367
2788 1499367 1476164 1533396 1536299 1675798 1671934 1574400 1539813 1454756 1275198 1259475 1392340
2777 1392340 1235167 1083533 1044754 972124 852741 818501 892990 960195 960423 884389 780157
2766 780157 824089 763447 766556 725916 697959 665133 630090 613100 460206 342945 399228
2755C99228l9740M583j8295J22721m7919k1Q6222j27577n0547M8969O0554n0762
2743C87416j2768J41521r3581j1P3453o4464k5081q996j36195l7821P8523M4982
2731C46978J099n6251K0163j8916m5208r8971J77351l1032j48067j6537k4862
2720A05747N1197j20861Q0550p746M6093P074r042K9681O2048M9458n2653n191
2708B36355j6246N2l1814j5148o9379k7024j61399J79454K11226o5938j15702
2697A24437l4207K9563k6130j48600J59951l658O1522q8724j30702J08270p8732
2686b7010P4462P0265Q5609o5351P3850j3818r1360j7464l8577J40806j32264
2675E9148n8784N4137r2501M4014m5525q195M4846p797j16811n3408L6571K58868
$$ plain form
2755 399228 359488 364071 345776 468497 420578 420557 506779 379202 328655 377624 438178 387416
2743 387416 374648 516169 422588 422577 496030 431566 406485 397489 261294 223473 301996 346978
2731 346978 348077 291826 311989 293073 247865 148894 326245 295213 147146 130609 105747
2720 105747 156944 36083 116633 108887 154980 162054 153012 182693 244741 294199 241546 236355
2708 236355 220109 220161 188347 173199 103820 76796 -84603 94851 306077 240139 124437
2697 124437 90230 119793 93663 -54937 105014 101356 162878 74154 -56548 51722 -27010
2686 -27010 47452 117717 203326 137975 211825 198007 106647 89183 50606 191412 59148
2675 59148 364 54501 -38000 6014 -39511 -47706 -2860 -10657 -127468 -180876 -144305 114563
2663A14563K5389k2541j7401j760k2678q0372O623L4760k4122m2490o62n3913
2651h4604L9210m0273j5000K0066Q795L7223Q1624m5536j1665o1383j1723p8360
2639a61626J23803M1541K0550k5599n2302l9517J9657J14263j29539k2742j8106
2628a29617P4894K3417j15142N3605J3025m7509N7325N9896N7169j19870l3478
2617a06285j6893N5900Q9066q0826j2669K1981r28K9334l6502m6834q1384O79
2605a85361P9062M4874J59427P0651r460R873J9944m0090n397k66383P922R8282
2593a6656l6882N1699k2729p546p0933J12420M2429p3911k6564R4274l4446J6124
2581B7279k515M3356r7188r5517K9625P0312j28236R3308N5319j7738O392l8653
$$ plain form
2663 114563 139952 117411 100010 98250 75572 -4800 1823 36583 12461 -30029 -30691 -84604
2651 -84604 -45394 -85667 -100667 -80601 -71806 -34583 47041 1505 -10160 -71543 -83266 -161626
2639 -161626 -37823 3718 24268 -1331 -53633 -93150 -73493 40770 -88769 -111511 -129617
2628 -129617 -54723 -31306 -146448 -92843 -79818 -127327 -70002 -10106 47063 -72807 -106285
2617 -106285 -123178 -67278 21788 -59038 -71707 -49726 -50654 -21320 -57822 -104656 -186040 -185361
2605 -185361 -106299 -61425 98002 168653 159193 169066 189010 148920 143523 -122860 -114938 -16656
2593 -16656 -53538 -1839 -24568 -32114 -103047 9373 51802 -22109 -48673 45601 11155 27279
2581 27279 24764 68120 -29068 -124585 -94960 -24648 -152884 -59576 -4257 -21995 -15603 -54256
2569e4256N0440O671r4501j26864Q3619P1957O4099N2418j21802M1756m0040R1303
2557B4800P7148m7040R1603r6738n233j18772R1815R1492m0348m629l3640j74514
2545a44056Q5441m672m9537R381J8404m847N0069P560q5144P8912L8727j90695
2533a90457l9902O7168J00685n1202o747K9221L5062j00476o2164J17061K5431
2522g6320j4537J6412J18412q3237L2068K4550p9401K7254k6757m1189M235p1725
2510a70235O8304J30290M0503K7039K8383j04863O0739J1979j13278M6013l750
2499B1124J5223l8775j10003J857J36312q1182m4642R7412K8443J832p6834M7368
2487a865j17722r6835L8390J03562J16533M9066L3824K1333k00434r0860K0659
$$ plain form
2569 -54256 -3816 2855 -91646 -218510 -134891 -62934 1165 53583 -68219 -26463 -66503 24800
2557 24800 101948 54908 146511 49773 44540 -74232 17583 109075 68727 64098 30458 -144056
2545 -144056 -58615 -63287 -112824 -103443 -85039 -89886 -39817 -32257 -117401 -38489 238 -190457
2533 -190457 -230359 -163191 -62506 -113708 -120455 -91234 -56172 -156648 -218812 -101751 -76320
2522 -76320 -90857 -74445 43967 -39270 -7202 17348 -62053 -34799 -61556 -102745 -98510 -170235
2510 -170235 -101931 28359 68862 95901 124284 19421 80160 92139 -21139 24874 21124
2499 21124 36347 -2428 -112431 -110574 25738 -55444 -100086 -2674 25769 27601 -49233 -1865
2487 -1865 -119587 -216422 -178032 -74470 42063 91129 124953 146286 -54148 -145008 -124349
2476a24349J55240l9247j56264J76873P4477m2741j9211K7124j64326M3500N6763
2465a2161n3316K1658P2815P0708M7633q8283j36365j8040k2590m2343l1993M108
2453a88169K7304m94K31895K3304l3530K5715r5156o3362q9140L9899L7480k4636
2441a08890Q2866P729k6715L2699K5709O3176n6618j41948L759J71809J28151
2430A81727M540P052q696j53559L0126r1996m9553J82881J39603j12833j40817
2419a1525m1425q433j77865P0385J24806J45455j9318k6998N5019J2262o5360
2408E7003n2244R6025j03581j11103N6288Q1378N040J10261Q356j25626K8536
2397E0333J54767p4707p9030o0627L3224J14367l1756p0580P8380n4250j9808
$$ plain form
2476 -124349 30891 -8356 -164620 12253 86730 43989 24778 51902 -112424 -68924 -12161
2465 -12161 -65477 -43819 28996 99704 147337 59054 -77311 -95351 -117941 -160284 -192277 -188169
2453 -188169 -160865 -161359 70536 93840 60310 86025 -9131 -72493 -161633 -121734 -84254 -108890
2441 -108890 -26024 -18295 -45010 -12311 13398 76574 19956 -121992 -118233 53576 181727
2430 181727 186267 193319 184623 31064 61190 -30806 -80359 102522 242125 129292 -11525
2419 -11525 -52950 -61383 -239248 -168863 -44057 101398 82080 55082 110101 122363 57003
2408 57003 4759 100784 -2797 -113900 -57612 23766 28806 139067 147423 21797 50333
2397 50333 205100 130393 51363 -9264 23960 138327 106571 35991 114371 60121 40313
2386D0313K106l0079J60J4178Q6554m5236R8947O9851o6096n1986P180O3428N2882
2373B42202o8468M8582J24902j89677k359O9717J01178P3491j01790j11760L7911
2362B23929J48701M9507j71771J9894L9906R0771N2116N061J3979n3824m3701
2351C74568l7826N4710j8521J12100J21774p3801M9512N7716l7515Q7805J20249
2340H10771J91647M3583j31666l7736Q0072n6383N3292J59863K24186k1038O0165
2329A376756J8216n2309K72828K28608L6217J06200Q240J83033J75902K59960
2319B613651K89961J89125J99270K10433L21834K69733K77283L52747M20425N44314
2309E688776O69107P15447P21584Q25463R81535R11648J152202J409896J421884
$$ plain form
2386 40313 42419 12340 12500 26678 113232 67996 166943 236794 170698 118712 125892 189320 242202
2373 242202 173734 222316 347218 157541 155182 224899 326077 399568 297778 186018 223929
2362 223929 372630 422137 250366 270260 310166 400937 453053 458114 472093 418269 374568
2351 374568 336742 391452 372931 485031 606805 533004 582516 640232 602717 690522 810771
2340 810771 1002418 1046001 914335 876599 956671 900288 953580 1113443 1337629 1316591 1376756
2329 1376756 1394972 1342663 1615491 1844099 1880316 1986516 1994756 2177789 2353691 2613651
2319 2613651 2903612 3092737 3292007 3502440 3824274 4094007 4371290 4724037 5144462 5688776
2309 5688776 6357883 7073330 7794914 8620377 9601912 10513560 11665762 13075658 14497542
2300A4497542Q13100J015120J359987J966418K821203L843084M689401M961551
2292C5967406K802920r60070q78053k559053l457201m341179n490074l723016
2284A7361680k657437j919582j371429j015196r94697p70970o16027m73952n31005
2275G011385l99033n51176l91025n02122l64179n15596l05891k04400k99497k56482
2265C221984j37153k46678k72016j59142j34349j12245j98004j5354j6266k30062
2255A700715o5609p7030N8110n6433j48406J4887j49533o1844l2202n8100j8115
2244A106440n0751j739k7593n2568o8794j52593q8353J53522j3319j59359Q1769
2233G26662k1958o2066q9492O3148M8892Q4455k2437j25544j33169l9865J38630
$$ plain form
2300 14497542 15310642 16325762 17685749 19652167 22473370 26316454 31005855 35967406
2292 35967406 38770326 37810256 36932203 34373150 30915949 26574770 21084696 17361680
2284 17361680 14704243 12784661 11413232 10398036 9403339 8632369 8016342 7542390 7011385
2275 7011385 6612352 6061176 5670151 5168029 4803850 4288254 3982363 3777963 3478466 3221984
2265 3221984 3084831 2838153 2566137 2406995 2272646 2160401 1962397 1947043 1930777 1700715
2255 1700715 1635106 1558076 1616186 1559753 1411347 1426234 1276701 1214857 1182655 1124555 1106440
2244 1106440 1055689 1053950 1026357 973789 904995 752402 664049 817571 804252 644893 726662
2233 726662 704704 642638 553146 616294 665186 749641 727204 601660 468491 428626 567256
2222E67256o3592J2960K1225m8006j24132K0489N1610j34158Q3783J17753j43927
2211C61261o2300O3218K8903M619P9842J0755K7614q4108j17083j05927j17879
2200H8915J27333J2444R6635N3720J14738j79148J6474L8547j51189N3138O5298
2189C36905j45188N3753j07032L679k4257m9276J42001M3277J9367p8629p4296
2178A20304Q0102J16747j41473j65383R4299M9096J27613o9874j02141K9143j64233
2167b5800M2585N6697j1991j36577K3261O5816l5040m526J3666N08j0136n0069
2155g1606J0499q0357P7827J92979k17905O4385K14209J23886q4936j60585K5116
2144I3512N5677j27712O6300l0110r0694p2068Q845J00458Q4709j16846n3418
$$ plain form
2222 567256 503664 516624 537849 489843 365711 386200 437810 303652 387435 505188 361261
2211 361261 298961 362179 391082 395701 475543 486298 513912 429804 312721 206794 88915
2200 88915 216248 228692 325327 379047 493785 314637 331111 369658 218469 271607 336905
2189 336905 191717 245470 138438 142117 117860 68584 210585 253862 273229 194600 120304
2178 120304 200406 317153 175680 10297 104596 153692 281305 211431 109290 138433 -25800
2167 -25800 16785 73482 61491 -75086 -51825 13991 -21049 -25575 -11909 -11401 -21537 -71606
2155 -71606 -61107 -141464 -63637 129342 -88563 -24178 190031 313917 228981 68396 93512
2144 93512 149189 21477 87777 57667 -33027 -105095 -96250 4208 88917 -27929 -81347
2133h1347l3233J14702l4439m8721Q7426O1874n5052m246J8965j17692j3292O2998
2121d2057O6139k1395J66763j08844n8831l9465J4097L9696M7019K7363k3609
2110F6876k2374J1628M638K1167k3598q4952n8408O7894J82618k6853o9401P5881
2098A45116j65028j79074n6367J73032n465Q5101J7780p3301m8044J83767r7494
2087a9977K3892L5346r5736L5845O5248n9984j15781N1898j51397J21837J5817
2076i2992r941J21314j079j15067r660O2488M5605j9759q4365p5136L6698K5787
2064a16107J1470L0719J2202l387j10060P1655n196o2535L1969R3605j5358Q07
2052f0216J49707p0937p8375J03601n6468j22667j25718J58039J38434J8303r3765
$$ plain form
2133 -81347 -114580 122 -34317 -83038 4388 66262 11210 6964 25929 -91763 -105055 -42057
2121 -42057 24082 2687 169450 60606 1775 -37690 -23593 16103 63122 90485 66876
2110 66876 44502 56130 60768 81935 58337 -26615 -85023 -17129 165489 138636 69235 145116
2098 145116 -19912 -198986 -255353 -82321 -87786 -2685 15095 -58206 -106250 77517 -19977
2087 -19977 3915 39261 -56475 -20630 44618 -15366 -131147 -79249 -230646 -108809 -92992
2076 -92992 -102933 18381 17302 -97765 -107425 -44937 668 -19091 -103456 -178592 -141894 -116107
2064 -116107 -104637 -73918 -61716 -65103 -175163 -103508 -108704 -171239 -139270 -45665 -61023 -60216
2052 -60216 89491 18554 -59821 43780 -12688 -135355 -261073 -103034 35400 53703 -40062
2041d0062Q1810Q2629n1188j96277j205J24163K4652J04507j7731j0202J6896
2030A17992P6853M1762k1639R759p7712N2442l1550J58632p3383m0519r8480j32834
2018a8677Q2496j105L3421l521m1738m7892l3313l1934n2508k2817K1542l3705
2006a49751m4151K5739L3024P954N1611p5135N1699K5804l5453N5065J47030j96976
1994a03540o594n212L583k2494L7402m3753J8661p6187J54651k3100K4751n8566
1982a00398J8448N7492l6153j2184j31191J9829J23123P8884q8227r5320J33982
1971c1715R1517j00973r4080O2109p4933m0501j7919o0744o4918M9291J55124
1960a27742J01384N3343K7260r260j64458M5052k9548o2132k2124L3950J84365
$$ plain form
2041 -40062 41748 124377 73189 -123088 -124293 -130 24522 129029 111298 101096 117992
2030 117992 194845 236607 214968 224727 147015 199457 167907 326539 253156 212637 114157 -18677
2018 -18677 63819 62714 96135 92614 50876 2984 -30329 -62263 -114771 -137588 -116046 -149751
2006 -149751 -193902 -168163 -135139 -127185 -75574 -150709 -99010 -73206 -108659 -53594 93436 -103540
1994 -103540 -110134 -115346 -111763 -134257 -96855 -140608 -121947 -198134 -43483 -66583 -41832 -100398
1982 -100398 -81950 -24458 -60611 -72795 -203986 -184157 -61034 17850 -70377 -165697 -31715
1971 -31715 59802 -41171 -135251 -73142 -148075 -188576 -206495 -267239 -332157 -282866 -127742
1960 -127742 -26358 26985 54245 44985 -119473 -74421 -103969 -166101 -188225 -154275 30090
1949C0090p6973L5587K2194p8726P0527n8161j10235R5353N5559j3682n2061k2332
1937a02860R7446o4000P072Q8629m0170j42013l849q1247L4574R7726j0049P0415
1925d8326n6333J5657j3970j51867P5343J43482q6721k4170L0O437J23275r9782
1913a16945K6216k931j6769k3183m2894n9480N3556r413l4613M4029O6263J5967
1901a00197N8752M6895j69374R1850M4488j06820q6827K11556M7761j83825K9425
1890a16316P6404k3737K0486k3341j29842K1309R9883J713O2622p6508k6484K4619
1878h9192m2925J30634J10132j21238o8885O1210k4727J00533j03737k3071j36905
1867b08171M0978J0709m0339R7008J84688l3957m9547M0640m7754j31032J0355
$$ plain form
1949 30090 -46883 -11296 10898 -67828 2699 -55462 -165697 -70344 -14785 -28467 -80528 -102860
1937 -102860 -5414 -69414 -62342 26287 -13883 -155896 -159745 -240992 -206418 -108692 -118741 -48326
1925 -48326 -104659 -89002 -102972 -254839 -179496 -36014 -122735 -146905 -146875 -140438 -17163 -116945
1913 -116945 -90729 -93660 -110429 -133612 -176506 -235986 -182430 -191843 -226456 -182427 -116164 -100197
1901 -100197 -41445 5450 -163924 -72074 -27586 -134406 -221233 -9677 38084 -145741 -116316
1890 -116316 -39912 -63649 -43163 -66504 -196346 -175037 -75154 -73441 -10819 -87327 -113811 -89192
1878 -89192 -132117 -1483 108649 -12589 -81474 -20264 -44991 55542 -48195 -71266 -208171
1867 -208171 -167193 -156484 -196823 -99815 84873 50916 1369 42009 -5745 -136777 -126422
1856a26422j10179J55639P0035j19927k7660p4874O5773O3501P3755O3874J8764
1845E2279q7716k11902L8299K25102j54937M6305K9575P412R7043j49685l5110
1834a43335n8103Q5645m3453O9765P4891N0255n9851j39261J0517J00758M2785
1823i387L497q1364P4112l9417Q3088R3393j33645p4365n6407l1592k5795J1113
1811a86769J72521l2059K9891o113j31759N517L2708N8923p8603J14089P4203
1800E2549j65596P1664j7244k55349J34626r9173m139J21848J47153o6175m9992
1789a29828K15736J21047j64864q5955N201J24487k05652l2646N6799Q6751m6357
1778e5281J02252P892j20353q4027J29320P659p1452J4487j7300j00421O3806
$$ plain form
1856 -126422 -236601 -80962 -10927 -130854 -158514 -233388 -167615 -104114 -30359 33515 52279
1845 52279 -35437 -247339 -209040 16062 -138875 -92570 -62995 -55583 41460 -108225 -143335
1834 -143335 -201438 -115793 -159246 -89481 -14590 35665 -24186 -163447 -152930 -52172 -9387
1823 -9387 -5890 -87254 -13142 -52559 30529 123922 -9723 -84088 -140495 -172087 -197882 -186769
1811 -186769 -14248 -46307 -16416 -22529 -154288 -148771 -116063 -57140 -135743 -21654 52549
1800 52549 -113047 -41383 -58627 -313976 -179350 -278523 -282662 -160814 -13661 -79836 -129828
1789 -129828 85908 206955 42091 -43864 -38663 85824 -119828 -152474 -95675 -8924 -55281
1778 -55281 46971 54863 -65490 -149517 -20197 -12538 -83990 -69503 -86803 -187224 -123418
1767a23418J69745j29495k0463J04163P1822j55712n3608K4950J10790p4200j10029
1756a85455M4214K5433N139j1936J11551o9387j9138M2322n2241L2418L567q604
1744h2117R1367P5488O9012j59660l2810n8314Q3688K5054k02992J40760R1778
1733D1254p1595q969Q0977j26438O1489O798L7441J4199p1189R2322m9641L0636
1721C7284o3964j7626m3718Q1865M1347q8873K9784J13469j18776l7387O1306
1710e289n6957j25347q243J52521q0976P0386k9320J3187O1297l7007k1714p1749
1698a39211p2423l1006m8692J06727l579J31758J37488j59443k6820j7601k3418
1687a46220J5574Q8212L3650M7677k6534j23407M3848J7097j09246K0421Q104
$$ plain form
1767 -123418 46327 -83168 -103631 532 72354 -83358 -136966 -112016 -1226 -75426 -185455
1756 -185455 -141241 -115808 -110669 -122605 -11054 -80441 -99579 -57257 -109498 -77080 -73513 -82117
1744 -82117 9250 84738 153750 -5910 -38720 -97034 -13346 11708 -191284 -50524 41254
1733 41254 -30341 -39310 41667 -84771 -23282 -16484 20957 35156 -36033 56289 6648 37284
1721 37284 -26680 -44306 -88024 -6159 35188 -53685 -23901 89568 -29208 -66595 -5289
1710 -5289 -62246 -187593 -195836 -43315 -124291 -53905 -83225 -70038 -8741 -45748 -67462 -139211
1698 -139211 -211634 -242640 -291332 -184605 -188184 -56426 81062 -78381 -105201 -122802 -146220
1687 -146220 -130646 -42434 -8784 38893 12359 -111048 -67200 -50103 -159349 -138928 -130824
1676a30824L1981J32681L9877K8414j30251l1058o6142L2665J2205O2614M4783
1665B6945q6931j806k0834k3242P020M0880l7037M4640o9663L4831M339j09396
1653a90254J05717N0719k2836J42842q437j85369P1909j09140J30354N5980R8564
1642A40049j74873j76196J62402r703l4540L6390J0534K4275k6907K9225l1878
1631e1222J07340P7711j45230p6658O2923j91429K7268J44411L5587K4855J25279
1620A40835q0340j36831l1217O7601Q4564j5603q4611M3707j4182M1368k6943
1609a1652r2638P4326m1984p3730J7548O981J68521q582r5863O2098j12016K5607
1597h1384k6187J25729N7294m2824M7109O7394j36220Q2699O744j97947o0952
$$ plain form
1676 -130824 -98843 33838 73715 102129 -28122 -59180 -125322 -92657 -80452 -17838 26945
1665 26945 -59986 -61792 -82626 -105868 -98848 -57968 -95005 -50365 -120028 -85197 -80858 -190254
1653 -190254 -84537 -33818 -56654 86188 77751 -107618 -35709 -144849 -14495 41485 140049
1642 140049 -34824 -211020 -48618 -58321 -92861 -56471 -45937 -21662 -48569 -19344 -51222
1631 -51222 56118 133829 -11401 -88059 -25136 -216565 -189297 -44886 -9299 15556 140835
1620 140835 60495 -76336 -107553 -39952 44612 29009 -55602 -11895 -26077 15291 -11652
1609 -11652 -104290 -29964 -71948 -145678 -128130 -121149 47372 38790 -57073 5025 -106991 -81384
1597 -81384 -107571 18158 75452 32628 79737 147131 10911 93610 100354 -97593 -158545
1586a58545O3722j31417j2304M6491J8535J8680Q2206N647m1344k1003L7462o419
1574i8289q9181l0128K7042Q54N7390O1257R475O1350m7021m0797l9831P9153
1562d8726J35810j33700l8757j81725M5822Q9157K6319q7405P9177J53309L2029
1551G1310J8281k07680l5285K72257r0857k92J17563j28035K4920j507j53019
1540a12344m7261R3816M0929O0404K2598O9658J2551j03651n0011j27162Q7738
1529e2735J5620p8893O54L0433j9336l050R5084J6909o9674j12673O7006R2150
1517a8505k3203q1k8370R1012L8562q2700p8008l1784J37000O8465l1471M2287
1505H3204j7139n6782j67427R7712R4129j06687j913J2578O8224n342j07576j7851
$$ plain form
1586 -158545 -94823 -226240 -238544 -192053 -173518 -154838 -72632 -66985 -108329 -129332 -91870 -98289
1574 -98289 -187470 -217598 -190556 -189702 -132312 -71055 -61580 -230 -47251 -88048 -127879 -48726
1562 -48726 87084 -46616 -85373 -267098 -221276 -132119 -105800 -193205 -114028 39281 71310
1551 71310 89591 -118089 -153374 118883 28026 27734 145297 17262 42182 40675 -112344
1540 -112344 -159605 -65789 -24860 35544 58142 127800 140351 36700 -13311 -140473 -52735
1529 -52735 -37115 -116008 -115354 -84921 -104257 -107307 -12223 4686 -64988 -177661 -110655 -18505
1517 -18505 -41708 -41789 -70159 20853 59415 -23285 -101293 -133077 3923 72388 40917 83204
1505 83204 66065 9283 -158144 -60432 33697 -72990 -74903 -62325 5899 557 -107019 -124870
1493a24870p5071K662R5004k3774R1702N166j45148l8567O7690m3p9654J80593
1481d4310R1870l2273k4232r0299O4408K5885m8887l3541J11690J06155J9428
1470A45894j20638k5640K274J54927k1139p4087j09913k3253m0196m0710J27653
1459b4828N5678l0595n3922j3145K8861l1203L8661O7538O9117r3828p6070L2612
1447c1124J21182o2262r5536J8154M7731l865Q3087l1975p8171l3676n0785L5355
1435h1885N5730J60186M7069n2697j01529l4851L7271J9191J33647j09920r2274
1424b0062m087o5495P859k3131j37453n6582K26402O1630j2487L037j32456J26596
1412b6229J04185m6428J9973j17662K9972j60178J4912J54678j32093N5308J11748
$$ plain form
1493 -124870 -199941 -197279 -102275 -126049 -34347 -29181 -174329 -212896 -145206 -145249 -224903 -44310
1481 -44310 47560 15287 -8945 -99244 -34836 -8951 -57838 -91379 20311 126466 145894
1470 145894 25256 -384 1890 156817 135678 61591 -48322 -71575 -111771 -152481 -24828
1459 -24828 30850 255 -53667 -66812 -37951 -69154 -30493 37045 106162 12334 -63736 -31124
1447 -31124 90058 27796 -67740 -49586 -1855 -5720 77367 45392 -32779 -66455 -117240 -81885
1435 -81885 -26155 134031 181100 128403 26874 -7977 29294 48485 182132 72212 -20062
1424 -20062 -24149 -89644 -81785 -104916 -242369 -298951 -72549 -10919 -23406 -20369 -152825 -26229
1412 -26229 77956 31528 51501 -66161 -36189 -196367 -181455 -26777 -158870 -103562 8186
1401H186L3688n7797p2833l5545R5971J216P9834l4633n6298q4042N4845J3058
1389e4350O6276K7937n3458K7107K2026j09811L2014l6817j9220J46626J42207
1378A90537n232l6529l0624n9832q089m7373M4030k23672m1792J64190Q9313k8257
1366F670M8491L1090l6404K0257j7322m2978J34159l6739j73908l4253P6516m487
1354b8908Q9798r9753L0762j1726l2073O4878l3877P9768M276j14206Q2536N602
1342C7077m2691l4504Q1245j1316K4085j64296J3433R4264l9680l7324M3302M3837
1330G432M7797r146j97450N6690J11023L5342m4672n4269J22879Q1608j4971n1281
1318I0982r0723j45665Q0484J03538q346L3395M3844N0234q2411q879N5931j3385
$$ plain form
1401 8186 41874 -15923 -88756 -124301 -28330 -27114 52720 18087 -38211 -122253 -67408 -54350
1389 -54350 11926 39863 -13595 13512 35538 -74273 -42259 -79076 -98296 48330 190537
1378 190537 185305 148776 118152 58320 50231 2858 46888 -176784 -218576 -54386 34927 6670
1366 6670 55161 86251 49847 70104 52782 9804 143963 107224 -66684 -100937 -24421 -28908
1354 -28908 60890 -38863 -8101 -19827 -51900 12978 -20899 58869 63145 -51061 31475 37077
1342 37077 -5614 -40118 41127 29811 53896 -110400 -96967 -2703 -42383 -79707 -36405 7432
1330 7432 55229 46083 -151367 -94677 16346 51688 7016 -47253 75626 157234 142263 90982
1318 90982 259 -145406 -64922 38616 30270 63665 107509 157743 75332 66453 122384 108999
1306A08999K9550r3914k2081j103J7596j98532o4011O5906J25872q0770K0754
1295i1734O8863J0415n9419j0661L2670P8488M715j09966J00688N704M1781k2955
1283D8589k4511k486J09577r541o6084m001Q5009r8767o1197R3761k3262K648
1271D9735J09256j54155R6248q0176j06598Q7007r5984N2559l7292n733J98548
1260A13415m7619L840n7518o0881l965O720P9557N0254n8894Q875m7647o7572
1248h1435l4347J13837M8343j02243j161N711J32372M7177j17530M4953j09610
1237e3933j1628M7521j59031M9832J73237k6581r0008J5594K5315P3365O6511
1226A10194p8867m9314m3271k6597P4929L1766l3442J42571j50263J02856n8568
$$ plain form
1306 108999 138549 44635 22554 21451 39047 -159485 -223496 -157590 -31718 -112488 -91734
1295 -91734 -22871 -12456 -71875 -82536 -49866 28622 33337 -76629 24059 29763 71544 48589
1283 48589 24078 21592 131169 121628 55544 51543 136552 37785 -23412 70349 47087 49735
1271 49735 158991 4836 101084 20908 -85690 1317 -94667 -42108 -79400 -85133 113415
1260 113415 65796 69636 12118 -48763 -52728 -46008 33549 83803 24909 33784 -13863 -81435
1248 -81435 -115782 -1945 46398 -55845 -57006 -51295 81077 128254 10724 55677 -53933
1237 -53933 -65561 -18040 -177071 -127239 45998 19417 -70591 -54997 -29682 43683 110194
1226 110194 31327 -17987 -61258 -87855 -12926 18840 -14602 127969 -22294 80562 21994
1215B1994o9475l998J2874L0876K124L5298P040j12502q3560J11204l5322J53783
1203G0336L5295J2251m0215r0991m646M3840O4800J8020K808N9430n1002j38435
1191a8509K4611k4246O5332k0593p4982k6731j3152J41138l704j58256q7279J20813
1179g5558J84477l7988q8286j7394R8677r1956P6580P5309n846m365q6426n612
1167B1612j01011N2214o0638L13O5037n2448O1130K2603j59224J58969l3942j00050
1155a25435Q0002J02028m174J6780p3666J02587l4463J46828p7613P8220q7286
1144A23808l2272k4469o2844O7557p297o3812J10311m7568j69293M0908L3106
1133c1865L4233j33102N4076K7263J180J28084L3889n1736L3252r1049J9322q7204
$$ plain form
1215 21994 -47481 -51479 -38605 -7729 -5605 29693 36733 -75769 -159329 -48125 -83447 70336
1203 70336 105631 117882 77667 -13324 -17970 25870 90670 108690 111498 170928 119926 -18509
1191 -18509 6102 -18144 47188 26595 -48387 -75118 -88270 52868 49164 -109092 -196371 -75558
1179 -75558 108919 70931 -17355 -34749 63928 -28028 48552 123861 118015 113650 27224 21612
1167 21612 -79399 -27185 -87823 -87510 -22473 -74921 -13791 8812 -150412 8557 -25385 -125435
1155 -125435 -45433 56595 52421 69201 -4465 98122 63659 210487 132874 211094 123808
1144 123808 91536 67067 4223 71780 64483 671 110982 63414 -105879 -64971 -31865
1133 -31865 2368 -130734 -76658 -49395 -48215 79869 113758 62022 95274 4225 23547 -63657
1121f3657k2622K4526N7143J7441n8975n161j9721M4171k8598l0530O2107j7979
1109d1855J12965M5313j26170M8073P812J5834j5157J06076K6723m5897N6276
1098A89993q5730o3129k815L9435p5761L0863J2974L9300m2799k9961K552M9311
1086F4233J0950j61059L3584Q9309j15917k261J55061K4183j57453L0084J65307
1075A36021L6607k37746l8910R2502L619K5796j08276q5099j8060P7024l143O6626
1063e3039J54963J2727j17483j55052R9822M0103m1183j7764j19485K7041J36468
1052c2882P3948k1634J2882K7251m4958J1903J32506j45073j38116L4117O5078
1041b4978L0090J3004O4692J601p0048n9690p8075K2532J7449p8003J35284P2223
$$ plain form
1121 -63657 -86279 -61753 -4610 12831 -46144 -51305 -71026 -26855 -55453 -85983 -23876 -41855
1109 -41855 71110 116423 -9747 38326 46138 61972 46815 152891 179614 133717 189993
1098 189993 104263 41134 38319 77754 1993 32856 45830 85130 42331 12370 14922 64233
1086 64233 75183 -85876 -52292 37017 -78900 -81161 73900 98083 -59370 -29286 136021
1075 136021 172628 -65118 -104028 -11526 -7907 17889 -90387 -175486 -193546 -116522 -119665 -53039
1063 -53039 101924 114651 -2832 -157884 -58062 -17959 -59142 -76906 -196391 -169350 -32882
1052 -32882 41066 19432 32314 59565 14607 26510 159016 13943 -124173 -90056 -24978
1041 -24978 5112 18116 82808 84409 14361 -45329 -123404 -100872 -83423 -161426 -26142 46081
1029D6081j3694M289j18237l6813J04557k8787J54680k0076m5539p1935K4527
1018i47M9642n3000p6986M5638L9599M6449m94P4836O3306o2154j47233M9394
1006B8050j47282J08944J8774j73575J03621K8811O5265j33392r043Q3455O7168
995D0796j1460K0336j75061J31345P5166M7986k0622k4001l3711l3242n4037J16974
983H0469r6191J04803M2551j41820j3003N7688j2166P1319L0223q9029J2683j67073
971a19546M876N3126M0875J12893o0174n3943L0063L4439m2336j3852N9407J15571
959A61399J44331q8881j14617j31392p911J15250N6000j58311O5610M4444N2960
948A38882M6850j02716q8635j06260k3100J68451j8156J15734j26173M7739k1728
$$ plain form
1029 46081 32387 36676 -81561 -118374 -13817 -42604 112076 92000 46461 -25474 -947
1018 -947 48695 -4305 -81291 -35653 3946 50395 49901 124737 188043 125889 -21344 28050
1006 28050 -119232 -10288 8486 -165089 -61468 -32657 32608 -100784 -109827 -26372 40796
995 40796 29336 49672 -125389 5956 81122 129108 108486 84485 50774 17532 -36505 80469
983 80469 -15722 89081 131632 -10188 -23191 34497 22331 93650 123873 34844 47527 -119546
971 -119546 -114670 -61544 -20669 92224 32050 -21893 8170 42609 273 -13579 45828 161399
959 161399 305730 216849 102232 -29160 -37071 78179 134179 -24132 41478 85922 138882
948 138882 185732 83016 -5619 -111879 -134979 33472 15316 131050 4877 52616 30888
937C0888r0647L8764m011O4432L0725q4505Q575R0588l4739J08205p3553o7776
925A6946J03229Q1803j1371p0741m9657q7877j8413O5211q4867P6039L7773O5838
913A23913j27821N7969P0528L6311j90124l5603J88923l8499j13147N3987L1552
902E7989j00234J4320j3294L4923n0825L786J41744j24653m2442K38202m8079
891A11437p754q7731j1349k6513N3030Q2213k5613l6087K6877Q3663j50590J1788
879B3371J18635k3067q8993N5476K4356q367j41284J6721j05375J40270R8830
868A10573r6002M6602j14224P4243J24876M2797k3221N342r8910P0371r7010n0859
856e422J70159m537k3118j5120j16452M3531O6051r1640J1579J08217r0308J47249
$$ plain form
937 30888 -59759 -20995 -25006 39426 70151 -14354 -5779 84809 50070 158275 84722 16946
925 16946 120175 201978 190607 119866 70209 -17668 -36081 29130 -55737 20302 58075 123913
913 123913 -3908 54061 124589 160900 -29224 -64827 124096 85597 -27550 26437 57989
902 57989 -42245 -27925 -41219 -6296 -57121 -53335 88409 -36244 -78686 159516 111437
891 111437 103683 15952 4603 -21910 31120 113333 87720 51633 78510 162173 11583 23371
879 23371 142006 118939 29946 85422 109778 101411 -39873 -23152 -128527 11743 110573
868 110573 14571 61173 -53051 21192 146068 188865 165644 170986 72076 142447 45437 -5422
856 -5422 164737 160200 137082 121962 5510 49041 115092 23452 35031 143248 52940 200189
844B00189J3806j14370n9096O3166Q0842r9521N8474N6270j51825J0968J34272
833A93175r6012L4080n1459p196m3289J09937K2554j4382k388j03383l5178M7522
821E3981L2432q1977N9402J6859j25244M919L5883j8983O8209K02169l6496r7493
809A13661K3001j6663n7098l5466m7793k791J83727J3572j9347m4384N359j10371
797E407j2805R7594j1467k9382o0507J20661K9562O4665j20112j31902J11371
786F3085J245K4424o1005k1201P9830m235j46092L3198N0156j20313Q9643P4240
774F2975K5144o7727l6491K2175J34589l7480p6289o3426O2622L3528l2547j8187
762H886K5622j10247j22582O7749q5719J60371Q9281K3496l0782q962P809L7656
$$ plain form
844 200189 213995 99625 40529 103695 184537 85016 143490 199760 47935 58903 193175
833 193175 97163 131243 79784 72588 29299 139236 161790 147408 145020 41637 6459 53981
821 53981 86413 4436 63838 80697 -44547 -39628 -3745 -22728 45481 247650 211154 113661
809 113661 136662 119999 62901 27435 -20358 -23149 160578 174150 154803 110419 115778 5407
797 5407 -7398 90196 78729 49347 -11160 109501 139063 203728 83616 -48286 63085
786 63085 64330 88754 27749 6548 86378 82143 -63949 -30751 19405 -100908 -11265 62975
774 62975 88119 20392 -16099 6076 140665 103185 26896 -36530 26092 59620 27073 8886
762 8886 34508 -75739 -198321 -130572 -216291 -55920 33361 56857 26075 17113 24922 62578
750F2578j21815O3412j5870m6926L8915Q6342J9884N7988J6864L5584k7356l3021
738A36579q4798n8353J07846p0923m6341J8883j6483K981L4676m3807K2994m7053
726d3799Q1187O1851m6174J3488o498j7081l1418m3327L7338L663P3983n8858
714B4355j17467k0125N5514J20608q4227m1136J40325O7584j27842o5584J15428
703F7433K0201l6698m9495N0163L2470j30805J9321l3440J36704m2583j21210
692h7939O1788Q2868k3886n135M6027m3786Q4168j7984K344j41488j20636O8772
680i4887j662J95269j4117J3986O137j12762n2302l5496N8007N695L1509j5490
668a6113k2582j22796J50313J34095J15856n739n3723m7393j02826r2520j0828
$$ plain form
750 62578 -59237 4175 -11695 -58621 -19706 66636 86520 144508 161372 196956 169600 136579
738 136579 51781 -6572 101274 30351 -15990 2893 -13590 -10609 24067 -19740 3254 -43799
726 -43799 37388 99239 53065 66553 60055 42974 11556 -31771 5567 9230 83213 24355
714 24355 -93112 -113237 -57723 62885 -21342 -62478 77847 145431 17589 -47995 67433
703 67433 87634 50936 1441 51604 84074 -46731 -27410 -60850 75854 33271 -87939
692 -87939 -26151 56717 32831 27696 73723 29937 114105 96121 98465 -43023 -163659 -94887
680 -94887 -96549 98720 84603 98589 104726 -8036 -60338 -95834 -37827 -32132 -623 -16113
668 -16113 -38695 -161491 -11178 122917 238773 233034 179311 131918 29092 -63428 -74256
657g4256O062L8863m0371R5136m5493j5997J102J39505p7515n5672j1755n8874
645i9265L9742J46436m869p0492P5565l0570k523p7819P19R3878m2439j2147m630
632A1586l1287J17287k7421K5792J0524O2067j00349J4820L0726n8980J0674P8950
620A44389o3655j7804l694j15808m6630l1338J2173J17024J5474Q0476q7146l0479
608b7018Q8281L6880K377o3094j5619j28733O5885P5663j63303j00935J15808
597a13808k2556Q7296j0298p6109R5870P2222K9139L1822k1772o9017l3502n988
585c6701l710J2230J6398p4199J93016P266p6242n1558M914J0138q8927L2507
573e4868L0877l1892l5199J9849P6696O636N6555j3253K23j17143J03062J1665
$$ plain form
657 -74256 -68194 -29331 -69702 25434 -20059 -36056 -34954 104551 27036 -28636 -40391 -99265
645 -99265 -59523 86913 82044 11552 87117 56547 54024 -23795 -23076 70802 28363 16216 11586
632 11586 -19701 97586 70165 95957 106481 168548 68199 83019 113745 54765 65439 144389
620 144389 80734 62930 59236 -56572 -103202 -134540 -122367 -5343 10131 90607 3461 -27018
608 -27018 61263 98143 100520 37426 21807 -106926 -41041 34622 -128681 -229616 -113808
597 -113808 -136364 -49068 -59366 -135475 -39605 32617 61756 93578 71806 2789 -30713 -36701
585 -36701 -40411 -28181 -11783 -85982 107034 114300 38058 -13500 -8586 1552 -87375 -54868
573 -54868 -23991 -55883 -91082 -71233 5463 12099 68654 55401 55624 -61519 41543 53208
561E3208l8775K1493N5217k9688M5234j649j86527l5273n925R4428L0655J01324
549A03722N0542J2546Q13q2822J9841j17011q721M1247m6697O2790m5478l0101
537c9329N0970O9317n5882J8415P9456r332k07881J26131J18513p1711N9070k5549
525A12188k962j28150j05267J30141P0193j27005Q4219k7564M4919N6503j12014
514d799n3629M9444J36331n7468n9826r827N8659M7361l6027m5578O7932n9198
502C3375M7415j00473o6583L4015M8667k2488o932q9877K17449l5562o594j6935
490C5477k3941O2536k8992L0511Q5807r0946n2602N706J2070o1836o4404r2465
478a83079J04093J51120o5198M4288j00157O9456q5212M481Q7002J33217o4503
$$ plain form
561 53208 14433 35926 91143 61455 106689 105040 -81487 -116760 -122685 -28257 2398 103722
549 103722 154264 166810 167623 84801 104642 -12369 -21090 20157 -26540 36250 -9228 -39329
537 -39329 11641 80958 25076 43491 122947 113615 -94266 31865 150378 78667 137737 112188
525 112188 109226 -18924 -124191 5950 76143 -50862 33357 5793 50712 107215 -4799
514 -4799 -58428 -8984 127347 69879 10053 226 58885 106246 70219 24641 92573 33375
502 33375 80790 -19683 -86266 -52251 -3584 -26072 -33004 -122881 94568 59006 52412 35477
490 35477 11536 74072 45080 75591 161398 70452 17850 23556 35626 -26210 -90614 -183079
478 -183079 -78986 72134 6936 51224 -48933 20523 -64689 -60208 26794 160011 95508
467I5508M946p9114K0946K2177L4784j49200m1117J73686o5306r7578o6262O1409
455h5121L5348J20207M1230j42980J56991l9874j73180K1814N2919O1277O017
444E4648l9211L2889J03538k39437J849J64471j4277m9073j13240O2524L8432
433C113J823M7504K9388J4004j22235K7843m1839L3300J45016p1191R0552J9914
421A77192k5556o349j3264o6039k2538J6187M392O8022j17909p8474J23516k9512
409B9668j04017o3501J71231P8199n4094j14206Q9689K3008n0123O2378N4890
398A23122r8014K751O7563j16422J61738n6580p8025m3216L5756M6608M7125k7646
386F4760j8905l7443m1156Q3704n4416K9276n418Q8802N1927j40524j06476J27075
$$ plain form
467 95508 100454 21340 42286 64463 99247 -49953 -91070 82616 17310 -80268 -146530 -85121
455 -85121 -49773 70434 111664 -31316 125675 85801 -87379 -65565 -12646 48631 54648
444 54648 15437 48326 151864 -87573 -85724 78747 64470 15397 -97843 -35319 3113
433 3113 4936 52440 81828 95832 -26403 1440 -40399 -7099 137917 66726 157278 177192
421 177192 151636 145287 132023 65984 43446 59633 64025 132047 14138 -64336 59180 29668
409 29668 -74349 -137850 33381 111580 57486 -56720 32969 55977 5854 68232 123122
398 123122 25108 27859 95422 -21000 140738 84158 6133 -37083 -1327 45281 92406 64760
386 64760 45855 8412 -32744 50960 -3456 25820 20402 109204 161131 20607 -85869 41206
374D1206K8285l3291m7864o913p820j9073m7196O5890R0458M1625J10184j47862
362F7629p9561r9402M2825N6764J7301M8514r6375n300J05375P4537j00563r8848
350f7104J54283N8545K2159l9056L0698L1553j97073L5513l2871q4599l9001n7177
338a84130M3944J53859L6182l0123p3029l393J84014M463j83229J29433N4593
327A32584j07126J11831j61080m0079P9903J3305O969M0825R2929M018j20734
316E3345j5677k541K23j41764k0854Q948K2279M5170J62124J3560M9354m9403
304A24764n6939K2523j3811r1544j4059K1114q3193R3115J6564L3587l8482l2873
292a9234Q0849Q9836m7423k26104Q6907L497K9500N5186k6675L68K3956J49028
$$ plain form
374 41206 69491 36200 -11664 -18577 -26397 -45470 -92666 -26776 63682 105307 215491 67629
362 67629 -11932 -111334 -68509 -11745 5556 54070 -42305 -47605 57770 132307 31744 -67104
350 -67104 87179 145724 167883 128827 159525 191078 -5995 29518 -3353 -87952 -126953 -184130
338 -184130 -140186 13673 49855 19732 -53297 -56690 127324 131787 -51442 77991 132584
327 132584 25458 137289 -23791 -63870 16033 29338 36307 77132 170061 174079 53345
316 53345 37668 35127 35350 -106414 -127268 -118320 -96041 -50871 111253 124813 174167 124764
304 124764 67825 90348 76537 -15007 -29066 -7952 -91145 1970 18534 52121 13639 -19234
292 -19234 61615 151451 104028 -122076 -35169 -31672 -2172 53014 26339 26707 50663 199691
280A99691j01107m0049L9158M9031J7267j31352m1578R4344j03188l1611J9108
269c0286O0267J05655k7172J8178j0804n0773M139J6331p4569j24946k222m0075
257a56277Q0434k0136P1375J6957O9266l0045n7886M6267o9034m1079K3675m5131
245a11614l0368N5316R9497L6795N1046m5152j054o9146n9687Q2136k0194r3891
233a06316K8635J28213P6120J50353r0530P411q6601j55218J6053l1657J9145
222d4392K9924O044K1605L9732j05290J16196j384L6106j04072O9084L4685K9963
210A28201L0359j27359M7483N4543o9483M5135L5860j06045K8185m8742O191o8007
198d3679J35279k8956Q8330j26240j7421o4758J82J07787j11200K1633o5981l2843
$$ plain form
280 199691 98584 58535 97693 146724 163991 32639 -8939 85405 -17783 -49394 -30286
269 -30286 29981 135636 108464 126642 115838 65065 69204 85535 10966 -113980 -116202 -156277
257 -156277 -75843 -95979 -24604 -7647 61619 31574 -26312 19955 -49079 -90158 -66483 -111614
245 -111614 -141982 -86666 12831 49626 100672 55520 54466 -14680 -74367 7769 -12425 -106316
233 -106316 -77681 50532 126652 277005 186475 193886 107285 -47933 -31880 -63537 -44392
222 -44392 -14468 -8424 13181 52913 -52377 63819 62435 98541 -5531 63553 98238 128201
210 128201 158560 31201 78684 133227 63744 108879 144739 38694 66879 18137 24328 -43679
198 -43679 91600 62644 150974 24734 7313 -57445 -57263 50524 -60676 -39043 -105024 -137867
186a37867Q9241O7024j11325J06092J0947P4001m5147l0684J04029N5961j13661
175F8611J38155j57416j30119O7533k6245M8587j7016M0303n7830J7201J2781
164D545J07201j15111k6330J1425J24495L5807r5900J08833q0519L4682L3361
153A42489j57560j2179K9468m774j17482N9675m5614K04241p9981q4066J71446
142A05663j6675m1149M6930l5261n4217L6728R3970j29403l9335k5519K1640M440
130c2188R9811m96j8904j8487j9251J16763m471q8070j0440J3324m9912J25317
118A12996Q5523j46465q6495P8642m7685m311p4145N5281O6500m9670r0725R3136
106g418O1136m0718j3661L5946l0631M2236j33866Q9205P3463M9839k1109j29115
$$ plain form
186 -137867 -48626 18398 -92927 13165 24112 98113 52966 22282 126311 182272 68611
175 68611 206766 49350 -80769 -13236 -39481 9106 -7910 32393 -25437 -8236 4545
164 4545 111746 -3365 -29695 -18270 106225 142032 46132 154965 74446 109128 142489
153 142489 -15071 -27250 2218 -2556 -120038 -60363 -105977 98264 18283 -65783 105663
142 105663 88988 47839 94769 59508 5291 42019 135989 6586 -32749 -58268 -36628 -32188
130 -32188 67623 67127 48223 29736 10485 127248 122777 34707 24267 37591 -12321 112996
118 112996 198519 52054 -34441 44201 -3484 -7795 -81940 -26659 39841 -9829 -100554 -7418
106 -7418 53718 13000 -661 35285 4654 46890 -86976 2229 75692 125531 104422 -24693
94b4693N0950j2211L6461j7466P9867q8365j35001K6901j1018J01095j0735l3316
82c7531J01900J184m5719Q2229p7235P900N188j0809L5308k6058R695m976N2066
69I3142j5822p8939R596o1175m4676R1935Q3784j3911m4855J24434J6105N884
57A65502l41o6167p0653p6957l7164j07652L6125M1518P5492N4828o5502J40160
45H9189j125m6067j4708K3480n487K266m5546k2691o670Q170P4922m4307k6397
32a4971l3452O1197J3440k1520K8817J9394K3338L3456P054n1812l0261N1891
20H6571r863L6141n6645k3712r0528P2436q51q1522J33625J7957L4906q5566j03264
7g0315K7256J7525L4743K5264q6730Q3192O4760
$$ plain form
94 -24693 26257 14046 50507 33041 112908 24543 -110458 -83557 -94575 6520 -4215 -37531
82 -37531 64369 65553 19834 102063 24828 32728 37916 27107 62415 36357 46052 41076 93142
69 93142 77320 -1619 7977 -53198 -97874 -5939 77845 63934 19079 143513 159618 165502
57 165502 165161 98994 28341 -48616 -85780 -193432 -157307 -115789 -40297 14531 -50971 89189
45 89189 88064 41997 27289 50769 45282 47548 2002 -20689 -27359 -19189 55733 11426 -14971
32 -14971 -48423 12774 26214 4694 33511 52905 76243 109699 116753 64941 34680 86571
20 86571 76708 112849 56204 32492 -58036 14400 13549 -67973 65652 83609 118515 32949 -70315
7 -70315 -43059 -25534 9209 34473 -52257 30935 95695
0I5695
$$ plain form
0 95695
$$ Imaginary data points
##PAGE= N=2
##DATA TABLE= (X++(I..I)), XYDATA
16383b386672K8813R4656J23683K8357j1931j1944N6165L0262k5863J2492K6662
16372b035320N5593l3012L4232J09340M2193k0236J0495J93308m8869K635L3892
16361a655749O2448m0903K2900J23946L5268j15773k2658J7885J32492J43054
16351a297090L809L705j4880P4876j03094K7476J6041M8982J32333k2705P1789
16340a058758n147k8050R8154O2181N0430K9043r3435p6513R9573O7198J08141
16329g47183L5554k5833N9151O8473N4049r6993P8023L9721N1052j7988k2459
16318e24433O7075r932J14892j04685j2247K51604M9010r7752l8951N2818R5347
16307a57254p00J5196J04546J1453k6658j8577M201K4889N6778J3095j9631Q0073
$$ plain form
16383 -2386672 -2357859 -2263203 -2139520 -2111163 -2123094 -2135038 -2078873 -2048611 -2074474 -2061982 -2035320
16372 -2035320 -1979727 -2012739 -1978507 -1869167 -1826974 -1847210 -1836715 -1643407 -1692276 -1689641 -1655749
16361 -1655749 -1593301 -1634204 -1611304 -1487358 -1452090 -1567863 -1590521 -1572636 -1440144 -1297090
16351 -1297090 -1293281 -1289576 -1304456 -1229580 -1332674 -1305198 -1289157 -1240175 -1107842 -1130547 -1058758
16340 -1058758 -1063905 -1091955 -993801 -931620 -881190 -852147 -945582 -1022095 -922522 -855324 -747183
16329 -747183 -711629 -737462 -678311 -609838 -555789 -652782 -574759 -535038 -483986 -501974 -524433
16318 -524433 -457358 -467290 -352398 -457083 -469330 -217726 -168716 -266468 -305419 -252601 -157254
16307 -157254 -157954 -142758 -38212 -26759 -53417 -71994 -67793 -42904 13874 26969 7338 87411
16295H7411N4361p1438N1057k641l3825Q3208O928Q7286K0160L5658K2675R7613
16283D38453m3092N0365M4457K0187j08379P253J42831k3614n6394N6548R4159
16272F22774P3547K8278j4816j5023k3852O7346K4146M9395j21132J79430J1786
16261H81879P489J7761K2869L0920M0518j5638Q410J4557M5620L1974k8294J06661
$$ plain form
16295 87411 141772 70334 121391 118750 84925 168133 175061 262347 282507 318165 340840 438453
16283 438453 395361 445726 490183 510370 401991 409244 552075 528461 472067 528615 622774
16272 622774 696321 724599 709783 694760 670908 738254 762400 811795 690663 870093 881879
16261 881879 889368 907129 929998 960918 1001436 985798 994208 1008765 1054385 1086359 1058065 1164726
$$ [...]
##END NTUPLES=NMR SPECTRUM
##END=
