##TITLE=1H_DE-80H_X3
 200.13MHz, d2o
 8 sc
 
 19ns.26.2.2025
##JCAMPDX= 6.0         $$ Bruker NMR JCAMP-DX V2.0
##DATA TYPE= NMR SPECTRUM
##DATA CLASS= NTUPLES
##ORIGIN= UXNMR, Bruker Analytische Messtechnik GmbH
##OWNER= pz
$$ XWIN-NMR		Version 3.5
$$ Wed Jul  9 10:54:32 2025 Russian Standard Time (UT+4h)  Yarkov@DPX200
##.OBSERVE FREQUENCY= 200.1313
##.OBSERVE NUCLEUS= ^1H
##.ACQUISITION MODE= SIMULTANEOUS
##.ACQUISITION SCHEME= undefined
##.AVERAGES= 8
##.DIGITISER RES= 18
##SPECTROMETER/DATA SYSTEM= spect
##.PULSE SEQUENCE= zg30
##.SOLVENT NAME= CDCl3
##.SHIFT REFERENCE= (INTERNAL, CDCl3, 0, 15.5331)
##AUDIT TRAIL= $$ (NUMBER, WHEN, WHO, WHERE, WHAT)
$$ ##TITLE= Audit trail, XWIN-NMR		Version 3.5
$$ ##JCAMPDX= 5.01
$$ ##ORIGIN= Bruker BioSpin GmbH
$$ ##OWNER= Yarkov
$$ C:/Bruker/XWIN-NMR/data/yarkov2/nmr/H-C/1/pdata/1/auditp.txt
$$ ##AUDIT TRAIL=  $$ (NUMBER, WHEN, WHO, WHERE, WHAT)
(   1,<2025-07-09 10:53:03.57 +0400>,<Yarkov>,<DPX200>,
      <created by zg, POWCHK disabled, PULCHK disabled
       configuration hash MD5:
       00 E9 B6 7A A2 85 ED C7 34 08 36 98 17 FE 4E 26
       data hash MD5: 16K
       A3 A2 52 FC 26 15 DD 64 5B 93 48 0C 6A D5 41 4A>)
(   2,<2025-07-09 10:53:08.71 +0400>,<Yarkov>,<DPX200>,
      <Start of raw data processing
       efp BC_mod = 2 LB = 0.25 FT_mod = 6 PKNL = 1 PHC0 = -1369.409 PHC1 = 23.24949 SI = 16K 
       data hash MD5: 16K
       FF F3 B5 8C 56 99 D4 4C 66 F7 E6 57 21 01 A6 E6>)
(   3,<2025-07-09 10:53:30.29 +0400>,<Yarkov>,<DPX200>,
      <abs ABSG = 5 
       data hash MD5: 16K
       CA 8A F1 3C F5 C5 FF 62 83 C7 D4 19 12 97 89 5E>)
(   4,<2025-07-09 10:53:35.32 +0400>,<Yarkov>,<DPX200>,
      <pk PHC0 = 8.499033 PHC1 = -6.999992 
       data hash MD5: 16K
       86 8E 3D 40 60 DF A2 46 F5 BD 60 EB E2 66 61 DF>)
(   5,<2025-07-09 10:53:48.15 +0400>,<Yarkov>,<DPX200>,
      <pk PHC0 = -0.6 PHC1 = 0 
       data hash MD5: 16K
       B7 49 1E 22 87 1E 9B 8E A3 23 27 8E 8C 66 AF 20>)
(   6,<2025-07-09 10:53:51.62 +0400>,<Yarkov>,<DPX200>,
      <abs ABSG = 5 
       data hash MD5: 16K
       F2 8C A8 49 8C 4F AB A4 CF BE FA 4A 91 6C 0E A3>)
$$ ##END=
$$ 
$$ hash MD5
$$ B6 3E 22 C3 E3 CE BC D6 E3 2B C9 ED C2 13 13 E0
##$RELAX= 
##$RELAX= 
##$RELAX= 
##$RELAX= 
##$RELAX= 
##$RELAX= 
$$ Bruker specific parameters
$$ --------------------------
##$DU= <C:/Bruker/XWIN-NMR>
##$EXPNO= 1
##$NAME= <H-C>
##$PROCNO= 1
##$TYPE= <nmr>
##$USER= <yarkov2>
##$AMP= (0..31)
100 100 100 100 100 100 100 100 100 100 100 100 100 100 100 100 100 100 
100 100 100 100 100 100 100 100 100 100 100 100 100 100 
##$AQSEQ= 0
##$AQ_mod= 1
##$AUNM= <au_zg>
##$AUTOPOS= <>
##$BF1= 200.13
##$BF2= 200.13
##$BF3= 200.13
##$BF4= 200.13
##$BF5= 200.13
##$BF6= 200.13
##$BF7= 200.13
##$BF8= 200.13
##$BYTORDA= 1
##$CFDGTYP= 0
##$CFRGTYP= 5
##$CHEMSTR= <none>
##$CNST= (0..31)
1 1 145 1 1 1 1 1 1 1 1 1 1 1 1 1 1 1 1 1 1 1 1 1 1 1 1 1 1 1 1 1 
##$CPDPRG= <>
##$CPDPRG1= <>
##$CPDPRG2= <>
##$CPDPRG3= <>
##$CPDPRG4= <mlev>
##$CPDPRG5= <mlev>
$$ [...]
##$SUBNAM3= <"">
##$SUBNAM4= <"">
##$SUBNAM5= <"">
##$SUBNAM6= <"">
##$SUBNAM7= <"">
##$SUBNAM8= <"">
##$SUBNAM9= <"">
##$SW= 18.0517328524113
##$SWIBOX= (0..15)
0 0 2 0 0 0 0 0 0 0 0 0 0 0 0 0 
##$SW_h= 3612.71676300578
##$TD= 16384
##$TD0= 1
##$TE= 0
##$TE2= 300
##$TE3= 300
##$TEG= 300
##$TL= (0..7)
0 120 120 120 120 120 120 120 
##$TP= (0..7)
150 150 150 150 150 150 150 150 
##$TP07= 0
##$TPNAME0= <>
##$TPNAME1= <>
##$TPNAME2= <>
##$TPNAME3= <>
##$TPNAME4= <>
##$TPNAME5= <>
##$TPNAME6= <>
##$TPNAME7= <>
##$TPOAL= (0..7)
0.5 0.5 0.5 0.5 0.5 0.5 0.5 0.5 
##$TPOFFS= (0..7)
0 0 0 0 0 0 0 0 
##$TUNHIN= 0
##$TUNHOUT= 0
##$TUNXOUT= 0
##$USERA1= <user>
##$USERA2= <user>
##$USERA3= <user>
##$USERA4= <user>
##$USERA5= <user>
##$V9= 5
##$VALIST= <valist>
##$VCLIST= <CCCCCCCCCCCCCCC>
##$VD= 0
##$VDLIST= <DDDDDDDDDDDDDDD>
##$VPLIST= <PPPPPPPPPPPPPPP>
##$VTLIST= <TTTTTTTTTTTTTTT>
##$WBST= 1024
##$WBSW= 4
##$XGAIN= (0..3)
0 0 0 0 
##$XL= 0
##$YL= 0
##$YMAX_a= 460229
##$YMIN_a= -458568
##$ZGOPTNS= <>
##$ZL1= 120
##$ZL2= 120
##$ZL3= 120
##$ZL4= 120
##$ABSF1= 15.51221
##$ABSF2= -2.539639
##$ABSG= 5
##$ABSL= 3
##$ALPHA= 0
##$AQORDER= 0
##$ASSFAC= 0
##$ASSFACI= 0
##$ASSFACX= 0
##$ASSWID= 0
##$AUNMP= <proc_1d>
##$AZFE= 0.1
##$AZFW= 0.1
##$BCFW= 0
##$BC_mod= 2
##$BYTORDP= 0
##$COROFFS= 0
##$CY= -3
##$DATMOD= 1
##$DC= 0
##$DFILT= <>
##$DTYPP= 0
##$F1P= 0
##$F2P= 0
##$FCOR= 1
##$FTSIZE= 16384
##$FT_mod= 6
##$GAMMA= 0
##$GB= 0
##$INTBC= 1
##$INTSCL= 3.241238e-09
##$ISEN= 128
##$LB= 0.25
##$LEV0= 0
##$LPBIN= 0
##$MAXI= 10000
##$MC2= 0
##$MEAN= 0
##$ME_mod= 0
##$MI= 1.114404
##$NCOEF= 0
##$NC_proc= -5
##$NLEV= 6
##$NOISF1= 3.799351
##$NOISF2= 2.8
##$NSP= 0
##$NTH_PI= 0
##$NZP= 0
##$OFFSET= 15.53314
##$PC= 1
##$PHC0= -1361.51
##$PHC1= 16.2495
##$PH_mod= 1
##$PKNL= yes
##$PPARMOD= 0
##$PSCAL= 0
##$PSIGN= 0
##$REVERSE= no
##$SF= 200.129997711028
##$SI= 16384
##$SIGF1= 3
##$SIGF2= 2
##$SINO= 0.751879
##$SIOLD= 32768
##$SREGLST= <19F.Aceton>
##$SSB= 0
##$STSI= 16384
##$STSR= 0
##$SW_p= 3612.71676300578
##$SYMM= 0
##$S_DEV= 0
##$TDeff= 16384
##$TDoff= 0
##$TI= <>
##$TILT= no
##$TM1= 0
##$TM2= 0
##$TOPLEV= 0
##$USERP1= <user>
##$USERP2= <user>
##$USERP3= <user>
##$USERP4= <user>
##$USERP5= <user>
##$WDW= 1
##$XDIM= 16384
##$YMAX_p= 301433088
##$YMIN_p= -244678
$$ End of Bruker specific parameters
$$ ---------------------------------
##NTUPLES= NMR SPECTRUM
##VAR_NAME=  FREQUENCY,     SPECTRUM/REAL,   SPECTRUM/IMAG
##SYMBOL=    X,             R,               I
##VAR_TYPE=  INDEPENDENT,   DEPENDENT,       DEPENDENT
##VAR_FORM=  AFFN,          ASDF,            ASDF
##VAR_DIM=   16384,         16384,           16384
##UNITS=     HZ,            ARBITRARY UNITS, ARBITRARY UNITS
##FACTOR=    0.220516191357247, 1,           1
##FIRST=     3108.64730916782, 0,            0
##LAST=      -504.069453837955, 0,           0
##MIN=       -504.069453837955, -244678,     0
##MAX=       3108.64730916782, 301433088,    0
$$ Real data points
##PAGE= N=1
##DATA TABLE= (X++(R..R)), XYDATA
$$ [...]
8788 3590 12861 22861 18082 -2572 -27782 -779 19166 10861 5028 34711 27291 34910 43795
8775 43795 44136 4638 -14332 -2417 2924 5174 -7759 12720 25793 12045 12926 15725 -5566
8762 -5566 -12276 -3906 -2575 22195 12847 44727 3738 -23920 -432 -15463 -13945 5743 13061
8749 13061 34256 68289 53202 36264 49209 32747 25368 42271 976 -3714 -830 24267
8737 24267 29453 31245 22450 -23903 -39305 -41156 -2361 16883 5198 -30361 -60137 -14377 -13932
8724 -13932 10544 25428 -12043 -1543 27250 41174 24725 21914 -660 -1645 21815 6033
8712 6033 -17066 -22886 -22147 2725 6072 -11698 -10608 16018 13684 -17255 -3923 23406 -8584
8699 -8584 -14960 13450 -4599 -7020 -16757 -9540 -16728 14871 10053 1834 -7191 -1032 -14447 23939
8685 23939 11595 -10183 -13891 -19726 33637 33163 612 16594 -6081 -18262 -20648 -31810 2992
8672 2992 14406 -16715 -20422 16445 37546 5121 -2133 -4528 -29139 -34289 -20720 -32180 -52690
8659 -52690 -30459 -28138 -20674 -1030 -6371 -17639 -2104 -7444 -748 -4184 -27880 -44114 -24682
8646 -24682 -18424 -11887 -9262 -8202 1446 7182 -26913 -46223 -39760 -29159 -21566 -4675 3775 -1297
8632 -1297 8869 -10555 -20627 -66808 -67751 -57020 -84969 -73270 -55669 -15923 -27015 -19301 -55489
8619 -55489 -72051 -67717 -40216 6031 -6917 -13451 -4465 -18972 -846 -35264 -33637 -29032 -39627
8606 -39627 -22248 -26933 -17422 -1973 -31471 -43555 -7925 8864 209 -34643 -20976 -22318 -27021
8593 -27021 -5519 16636 32903 14623 6810 28943 30075 21576 -20081 -58676 -35628 15812
8581 15812 15175 -7592 -14116 -38467 -81773 -42166 70303 37700 14309 30593 -5826 -1434
8569 -1434 -21824 -5090 19197 -5022 -5345 -15263 -2651 4127 15683 -12371 -31324 -24015 -17466
8556 -17466 8677 -11476 5834 25732 38564 243 -16154 8990 6003 -15549 -9187 -23039
8544 -23039 -31717 -20820 -29818 -33539 -3791 -700 36950 63937 15061 -5006 -10712 -37756 -45201
8531 -45201 -36205 -42180 -58468 -41995 -29816 -26239 -24214 -5619 12989 5012 11691 -18842 4714
8518 4714 2845 -21483 -12564 6903 1938 -2464 -10203 -3211 -38455 -43035 -30258 -44400 -56469
8505 -56469 -45473 -12994 -10190 -19803 -21779 7439 -1982 -3775 6681 29754 27846 25670 -4575
8492 -4575 -26450 -27897 -23666 20346 7894 16017 36523 19531 16919 -15529 -37724 -9225 -6391
8479 -6391 -23462 -28170 -47666 -44218 -40339 -14579 -19731 -28041 -11162 3448 6572 -4805 -34287
8466 -34287 -38076 -29679 -32845 -15001 -28635 -34917 -32146 -23423 -29083 -35758 7211 23055 2611
8453 2611 20095 19542 16151 48146 26876 11342 -7679 -7829 19835 6655 -9371 -8751 -15217 -14323
8439 -14323 15485 496 -21858 -12745 8963 10932 8739 20130 -8594 11256 -16081 -50048
8427 -50048 -39902 -30274 -32341 -32075 -496 15834 42273 -16216 -35377 -19260 -46629 -63465 -78067
8414 -78067 -30696 -35548 -17076 -8502 -16256 -5803 7375 -1541 -6455 6363 2796 82 -31911
8401 -31911 -6403 -6781 -3846 -15778 -57102 -41687 -55619 -44523 -46830 -42458 -28921 -22631 -39389
8388 -39389 -50203 -4974 -17105 -10427 -13826 -31933 -24985 -8711 948 -12845 -24042 12183 14941
8375 14941 -6168 -35049 -11635 -23975 -30887 -45304 -44006 -27451 1600 -19098 1499 5021
8363 5021 -6110 6911 -11584 -44008 -50848 -35246 11389 10334 -3734 -23780 -20944 -10579 -21514
8350 -21514 -2048 -8959 -5042 -20426 -6036 8071 31185 12754 -19567 -55765 -60685 -47456
8338 -47456 -7888 -18156 -16871 -10523 -15173 -13060 -19081 -1789 -49070 -40266 -30241 -10410 6102
8325 6102 -5332 -20657 -33923 -7356 -31436 -6017 -33017 -36012 -24520 1760 -14457 -23017
8313 -23017 628 -13253 -7970 -5729 6272 19018 -9074 -52579 -39506 -19820 -3263 1298
8301 1298 3655 2304 -10620 11815 -11754 -8857 1249 -2704 12403 6403 -3750 -13479 -2194
8288 -2194 -23018 -19136 -3863 -11544 -17846 -13756 13576 -6201 -26113 -72826 -21265 13592 -4602
8275 -4602 -63924 -56971 -32172 -41170 -32880 -42095 -30356 -49168 -24350 -24247 -13158 -2385 -3454
8262 -3454 -15191 -41960 -26304 -6336 -28125 -19096 -30493 3683 -14856 -10939 -4447 141 6418
8249 6418 -419 -10595 -19054 -51745 -73907 -90330 -60741 -3676 3966 -12750 -39067 -23570 -5614
8236 -5614 -7845 -52546 -93451 -73670 -44447 -46006 -48383 -48333 -20230 -13524 -27902 -22706 -29391 -33783
8222 -33783 -19676 4490 -14195 -31074 -28173 -24876 -56481 -61976 -43679 -73663 -34809 24173
8210 24173 334 -23530 -26509 -16915 -29170 -52865 -64018 -66580 -46073 -62975 -45996 -53122 -82420
8197 -82420 -100841 -75525 -146383 -164527 -244678 156957 280717 46231 38877 4805 22957
8186 22957 14541 41681 35375 19854 -34566 -29024 1572 19804 5064 -2200 -10886 14954 5335
8173 5335 18746 19493 20901 -51316 -4134 8747 -13443 -11796 -18694 -3809 -11298 -800 -15686
8160 -15686 -13469 -4614 23791 16556 2189 11336 16775 -6074 -27154 -25058 -44615 -21143 -32886
8147 -32886 -21111 12813 13942 -9257 5342 6887 -3126 10137 -16127 -42347 -21661 9843
8135 9843 10232 8809 -30885 -15552 30644 13011 10634 -12401 -12104 -19614 903 33106 -3981
8122 -3981 15685 17720 5718 -2835 -39972 -31583 -42177 -27327 7771 -7125 2808 -1839 26865
8109 26865 12910 25294 53227 65357 57480 -23356 -21672 -14892 -11652 -9258 -35404 10380 20972
8096 20972 45112 37771 -905 -12055 -21280 -3541 -6874 -23126 -16905 -5464 9212 13268 51943
8083 51943 22254 6209 -34023 -18418 2354 -17778 -27565 -2400 17093 -6431 5882 -19350
8071 -19350 -1591 8227 -3235 -18976 -7311 -30604 -28053 18075 15773 -22952 -18091 -7184 -3502
8058 -3502 -18482 -10603 -19208 -5760 12060 20444 3454 -51523 -34294 -5737 5947 105 6671
8045 6671 -13656 -25849 -16684 -13153 -17448 -25743 -34835 692 37614 36316 8109 -9451 3393
8032 3393 11074 9090 -26524 -16271 -14109 -16402 -44854 -7087 6052 19486 35612 8603 -1471
8019 -1471 -8291 -7732 18661 3073 4529 -5232 -32368 -22702 -27922 506 -4729 7820 -5898 -34284
8005 -34284 -18678 -8335 -29316 -18369 -38887 -40249 -41099 -6892 -32974 -60318 -27516 19683
7993 19683 42303 24095 7923 18532 20933 10656 8211 -20489 -30783 -3961 -18355 -36150
7981 -36150 -5954 20786 12834 2163 -7027 -6062 4127 2278 4907 -4421 206 -4966 -18026 -6814
7967 -6814 -22156 -13370 -39401 -23800 22443 35424 5365 10684 -961 -29531 1410 -20139
7955 -20139 -12610 -8729 8622 -8650 -31323 -41272 -28244 -13796 177 6183 12470 -12738 -40795
7942 -40795 -6249 -13638 -23844 12116 22526 25626 16196 17034 20228 17041 -9461 -11645 -21191 -27399
7928 -27399 -4500 21234 36389 -2057 -14917 -9140 -11100 -10608 4302 27616 52587 16221 -28177
7915 -28177 -8945 20822 34875 7816 -1336 -2313 8296 -10325 23664 33531 30309 56286 33436
7902 33436 -532 -24238 -26764 -41199 -57713 -45405 -42308 -14232 -9177 -10327 -54177 -30305 -21367
7889 -21367 -66131 -23107 5736 27398 45260 -10494 -17997 -23014 -35775 -18213 -14424 -20541 -33418
7876 -33418 -30969 -54749 -43041 -26369 -22213 -34671 -20289 -16678 -7289 15192 16152 -13801 12291
7863 12291 -8900 -26682 -17846 -12931 -7487 5122 7286 -1484 -6334 -30979 -46278 -22736 -21572
7850 -21572 -17237 -29953 -27914 -39247 -64991 -48582 -10625 8019 4882 -1024 11763 -6489 -50539
7837 -50539 -40229 -14652 -31378 -17506 6382 -3208 8840 -1755 23286 999 14791 14630
7825 14630 4953 3833 -25779 -33012 -38402 -53709 -61818 -29906 -36133 -41284 -55714 -63851 -47467
7812 -47467 -39737 -48909 -128770 87157 140062 27905 51192 -61954 -64573 -34414 -16056 -6637
7800 -6637 -5519 13331 13857 7219 2821 -14264 -16134 -20770 -8149 7256 7338 13677 21607 36765
7786 36765 12878 -9049 18687 -16471 -10782 -1926 -37055 -47892 -16703 11114 -13233 -23454
7774 -23454 16387 9888 -16628 -8418 -41613 -62765 -38697 -32518 -4421 -29375 -31267 -9444 -19204
7761 -19204 -33135 -44091 -31952 -20996 17647 -3139 -16825 -26182 -237 -4224 -8623 -30087
7749 -30087 -24408 -18916 -50029 -34650 -20836 -7646 -34744 -49106 -40267 -12627 -21416 4583 9277
7736 9277 -9659 -21221 -63484 -44996 -14408 -4166 -11028 -33591 -62593 -55065 -43900 -16587
7724 -16587 -41213 -30320 -17020 -9043 12724 -12783 4240 26586 5644 5163 -5395 -8935 -20647
7711 -20647 -53741 -24410 9738 17806 20321 35110 33740 12352 -2452 5408 -9343 -10818 852
7698 852 16956 -27445 -26929 -9479 -38145 -13421 -16174 -15934 -31035 16581 33117 -4338 -20900
7685 -20900 -50051 -35381 -13242 -44907 -64321 -38821 -17776 6040 -23629 -54001 -42527 -25284
7673 -25284 -16212 -6084 11189 -4397 -19899 4426 20692 28879 36560 -11258 -20919 -23748 -13784
7660 -13784 -33307 -17184 -22192 -14517 8575 15581 24054 3456 -311 1050 -5368 -17197 -15845
7647 -15845 -55963 -60270 -30156 -23507 -19243 -17975 32729 5151 -19725 -4537 -1477 7955 -11625
7634 -11625 -20942 -43916 -50251 -70500 -47177 -62849 -30790 -44149 -25871 -14926 -22511 -39135
7622 -39135 -37710 -45193 -48250 -27237 -23047 -22936 -20837 -16524 -40963 -26408 -36520 -42733 -47034 -43574
7608 -43574 -30534 -30245 -41072 -23430 2173 -11803 -35239 -30034 -33833 -19138 17806 -13948 -5519
7595 -5519 19018 -17933 -23247 -29701 -55063 -50078 -15975 -4629 3544 29331 7257 -31975 -23460
7582 -23460 -16891 -4630 -19735 -10532 -11959 -43702 -69444 -38839 -59473 -76993 -41993 -55908
7570 -55908 -42767 -26527 -24773 -13000 -37278 -37393 -7852 -19561 3533 -22471 4655 15123
7558 15123 -12244 -13407 -33465 -31773 -7970 -18613 -10673 -44551 -61523 -23644 -28125 -6958 -7519
7545 -7519 -27401 -18160 -18067 -1769 30515 5972 -39883 -41266 -6598 15284 -500 -13908 3461
7532 3461 -21282 -19580 -29475 -38253 -16966 -6617 -24134 -10660 -9585 -23287 -10223 5697 12261
7519 12261 900 12589 1585 -22534 -17957 -40503 -31407 -12315 413 -10362 -7749 -332 -2172
7506 -2172 -14225 -9313 -2360 -23270 -40417 -16125 -13072 -21867 13915 6606 -12982 -34015 -19331
7493 -19331 7670 22408 -20676 -18127 26871 21526 -15962 -21329 -22855 -5649 -10991 4347 11468
7480 11468 -15213 -24253 -40648 -42619 -61904 -44944 1273 -43790 -31571 -39766 -17879 -5656
7468 -5656 -19046 -31232 -23785 -13697 -33418 -30820 -22519 -26070 -53097 -49741 -46788 -32274 -13695
7455 -13695 -22362 -34319 -37451 -47459 -19120 -42379 -50765 -72521 -39479 -22264 -20148 5188 -4110
7442 -4110 -16875 -13117 -18720 -10170 -22452 -11303 -24747 -38306 -43337 -30049 -26779 -9587 -5891
7429 -5891 -18061 -7084 2236 30542 -14592 -51425 -8908 -19955 -43111 -34776 -6537 16351
7417 16351 -4877 -43675 -21790 -4649 -17646 -22004 3789 12269 2964 6689 -2742 -13351 -7345
7404 -7345 -27247 -61700 -61297 -38376 -11333 7653 -30286 -39044 -13907 -11360 38139 19053 -4713
7391 -4713 -10749 -24983 -22452 -7122 1352 20593 -1976 -2395 3403 8366 20363 -14904 -7124 5987
7377 5987 -25667 -37825 -12183 27546 7858 -9628 79 9386 -7198 -45943 -69109 -53610
7365 -53610 -26493 8854 16667 1362 -12283 -36122 -33239 9353 20353 -7219 -26511 -13317
7353 -13317 -34307 -34299 -52761 -31016 -19588 -15592 6740 19403 17962 9713 -40529 -57786 -67396
7340 -67396 -67566 -47537 -35783 -19325 -14578 27792 11626 -33755 -47948 -21220 -1128 -13599
7328 -13599 -27552 -33632 -46729 -26187 -20852 -43377 24744 7084 -16274 -1617 8706 11296
7316 11296 18199 -1888 -38859 -52291 -41074 -31108 -35265 -23950 -25535 -42625 -19406 5496 -15024
7303 -15024 -40446 -63374 -30834 -32752 -73899 -39855 -20061 -44696 -29047 -16616 -43698 -52768
7291 -52768 -40977 -32745 -399 -21526 -45014 -63069 -71072 -56823 -36990 -15442 -45488 -25641
7279 -25641 14558 -31244 866 -13673 -23420 -44923 -28766 -4493 -29770 -31037 -20318 -17999
7267 -17999 -1632 -27496 -26084 -33287 -14315 -13810 -4187 -2970 -13109 -23830 -31089 -36346 -45042 -50901
7253 -50901 -46561 -56464 -33751 -44969 -36059 -12723 -12991 -48388 -29506 -26730 -18953 6377 17186
7240 17186 25219 14463 1007 19660 38957 -6197 -22867 -14855 33463 -17779 -35565 -59479
7228 -59479 -37360 -14481 -27849 -38948 -53942 -42465 -19936 -16587 4436 6295 -27049 -34474
7216 -34474 -36302 -56000 -42286 7008 333 -24831 -40197 -33798 -24969 -26570 -34457 -23065 5226
7203 5226 7542 -23831 -35840 -41350 -62209 -20440 -22946 -17443 -15876 -31523 -2807 8901 -25761
7190 -25761 -55880 -51278 3521 -11787 -23394 -29793 -53658 -31790 -42522 -47297 -24995 -12337
7178 -12337 -35836 -21934 -12458 -39536 -8731 -11523 -15369 -8049 -10831 -4232 -24284 -50865 -29006
7165 -29006 -28926 -27357 -16109 14679 -15567 -22870 -38884 -35580 -5078 1422 -9662 -6849 -5063 -15676
7151 -15676 10639 18144 -14302 18194 -20854 -27198 -1268 -8400 -43560 -44631 -40921 -21917 2670
7138 2670 -23044 -22315 -21930 -38546 -51282 -34236 -42887 -6986 -18017 -29411 -19787 -38672 -33332
7125 -33332 -36645 -32546 -43808 -66896 -32730 -15896 -13105 -13629 -50243 -52317 -46452 -46912 -54970 -63955
7111 -63955 -26607 -37533 -56292 -50217 -39823 -55436 -51137 -48377 -23646 -12915 -32268 -45029
7099 -45029 -29868 -28728 -34324 -29609 -40281 -51462 -10877 5067 8820 -3954 -21118 -32225 -23517
7086 -23517 -25860 -48039 -60131 -64728 -102958 -94619 -58753 -49097 -64951 -21547 -4203 -24890 4246
7073 4246 -1056 -14361 -5052 -27123 -42280 -50576 5643 -23290 -28759 -50901 -58781 -52962 -83584
7060 -83584 -45922 -40074 -45835 -41536 -33666 -8333 -5484 -19643 -4395 -35169 -25394 -16804 -40481
7047 -40481 -54174 -57293 -62344 -20910 -2747 -17432 2933 2239 -794 -19143 -23188 -57260 -47968
7034 -47968 -29352 -17373 -46918 -49185 -7015 8203 13807 -15847 -33636 584 2157 -33864
7022 -33864 -23492 -9213 -7504 -6264 -18026 -27061 -38435 -19861 822 -2296 -617 -15007 -4044
7009 -4044 7683 -22790 -66482 -46341 -55479 -14358 -41103 -42591 -9455 26296 -934 -9372 -11174
6996 -11174 -9441 -32324 -21848 -26264 -33065 8982 15984 -17347 -28086 -27285 -2117 -8846 -43547
6983 -43547 -43201 -20570 -14319 -8974 -34088 -29113 -12093 1864 16127 -9435 13372 3152 -10700
6970 -10700 -21485 -25404 -17503 -44571 -62676 -48557 -27735 13807 171 -27656 -28462 11904 11229
6957 11229 -28132 -26503 -15667 -40428 -37187 -40586 -38586 -5956 -3848 -15707 -13614 -2292 -44653
6944 -44653 -38938 -40605 -30776 -14447 -33132 -38887 -25871 -1920 -13596 -33436 -16282 11430 -23349
6931 -23349 -38390 -37868 -38465 -13941 -11763 -28973 -5856 -7321 -46267 -46392 -64797 -35340 -30106 -51320
6917 -51320 -9423 23840 18969 8557 9525 -1931 14859 25564 21495 -18425 -14451 -43455 -52094
6904 -52094 -20695 5083 26847 -26917 -36527 -954 -19706 -9301 -12914 -2077 -8797 -5873 -19400
6891 -19400 -1523 7619 -14540 -12199 -2522 -19479 210 -7126 -18489 -18647 -76203 -113744 -58830
6878 -58830 -28331 -27577 -32964 -22016 -38798 -40118 -14517 -33832 -34005 -45619 -17133 3911 16766
6865 16766 -11713 -31928 -25462 2953 18723 11951 -29468 -20553 6150 -5292 -21697 -21905 -24239
6852 -24239 -16914 -8937 -10101 -34487 -37055 -32053 -10392 -9691 -27060 -29892 -18321 -16294 -8679 -11607
6838 -11607 -17795 -29186 -9402 -18685 -29057 -34121 -47152 -24822 -16618 -10189 -4347 -18667 -57210
6825 -57210 -28897 -5611 -9447 -12034 13069 12506 44390 36434 25231 1828 5709 12619 16950
6812 16950 34952 16465 -7460 8658 21998 2179 7071 -229 6953 3846 7006 3858 9560
6799 9560 22521 20436 27632 20442 4299 3950 6466 -7076 -1036 33830 43683 56237 75847 83449
6785 83449 21743 29495 53504 72453 55937 38046 32220 48069 40694 33725 75377 78040 102064
6772 102064 95222 108821 125671 110655 114773 130439 145416 175748 147774 153975 187705 200550
6760 200550 156245 131650 149862 172219 151875 130641 155283 170152 170046 129941 156465 171385
6748 171385 192507 211291 214190 239155 278190 295529 319985 372109 390508 417698 411760 443148
6736 443148 488427 461736 474130 464828 463892 456757 416572 387452 328198 324049 353354 329128 303605
6723 303605 294978 255753 251590 322108 318721 318232 331717 321143 344247 403283 531977 565917
6711 565917 574662 587542 580852 595905 629627 654469 638725 607122 586455 575297 531216 476530
6699 476530 470581 453911 434052 398620 341424 331934 330811 315964 287297 274704 284312 297875
6687 297875 300425 363278 389532 406269 450973 490957 473407 462838 459501 474333 470453 463850
6675 463850 444359 419618 380741 352795 325983 340881 323855 284160 237146 202753 193373 175949
6663 175949 157852 190905 174424 141802 180783 197895 211593 194973 224866 203712 203412 169925
6651 169925 205254 244882 229727 230519 218181 202206 175053 115588 151280 134052 121704 108094
6639 108094 99672 92425 97277 86307 83744 84622 80013 88687 85711 86704 36036 31224 51463 21331
6625 21331 32450 56243 36518 11134 20944 32890 3509 45803 40658 26149 4790 -285
6613 -285 29508 36810 20301 -28093 -20681 -15785 31050 56455 41833 13040 34071 18411 -7656
6600 -7656 9470 12312 9447 -14610 -9657 -1885 -22088 -1845 -5818 -16226 15263 1996 -8712
6587 -8712 -7099 2742 15491 30314 33180 10468 -32570 -60055 -12405 -12031 10213 34490 42942
6574 42942 29833 -19903 -20782 -14824 -19682 -41733 6880 14617 33884 32118 16743 7225 -4122
6561 -4122 18523 35807 25985 35462 -10587 12525 21715 17458 24269 18676 -23858 -18366 2577
6548 2577 9987 -27279 -37945 -17029 -7394 9680 967 -15816 -15286 -16866 13083 -19941 -38289
6535 -38289 -38491 5855 20347 -21844 -8193 20976 35497 20468 17707 6544 38101 34222 1522
6522 1522 4836 25582 25652 28451 25895 30260 16209 63115 30990 6205 26688 18681 29193 22784
6508 22784 30915 24638 44234 48535 5355 -6939 5954 28421 19006 45937 51634 62162 60484
6495 60484 63983 26490 12195 11539 -2839 -2350 2790 -33991 -20071 15562 6625 18720 8152
6482 8152 26704 39485 39596 19548 19836 20443 8889 9795 15819 34778 38911 31231 14920 42694
6468 42694 53578 61449 62775 56760 34851 9977 -4280 12000 36212 7059 17686 39185
6456 39185 41353 43947 21514 43356 73790 64993 61408 53992 75871 67106 76779 85885 81529 88415
6442 88415 64135 41364 24563 50781 77622 58107 53940 48046 41781 53805 82158 80152 86136
6429 86136 58508 69709 74353 21397 35841 -12017 -13026 -10519 -23916 7943 23264 10928
6417 10928 -5593 6668 19173 19557 43403 33338 51041 48625 14311 5381 13097 53441 33361
6404 33361 9112 -21465 -3789 22873 12907 24410 39836 15656 -8340 -17178 -10938 -4143 -5689
6391 -5689 -9612 -4374 5123 -5036 -11699 6724 39149 25070 -5049 3601 31892 41038 16270
6378 16270 31642 34537 12916 -3773 5572 28885 28841 16547 2201 -5937 -16869 -17694 -10220 -15268
6364 -15268 -37018 -41811 -9359 -25746 -32006 -39414 -16858 -20400 -7960 -19987 -36894 -30947 29690
6351 29690 38920 26909 37254 16209 3105 -9244 30 -30842 -38170 -6474 25411 13519
6339 13519 19722 -4798 2588 9515 25550 35723 37459 4460 8146 -4649 -12066 8873 27834
6326 27834 20515 31682 41806 14897 32545 46451 44605 58980 33001 9708 2341 -19523
6314 -19523 -19914 26267 28557 5113 1051 -5938 2145 10509 10105 -8348 2494 7086 35384 11687
6300 11687 -994 25806 15760 7920 11069 10382 19289 40052 37480 47696 65758 51274 27221
6287 27221 36448 62027 52303 43552 41967 18578 34686 32619 18520 20209 8185 14904 10722
6274 10722 20925 28175 16112 -16034 -9102 -18308 -13465 -1751 9479 46683 67142 56989 38308
6261 38308 35182 47358 37212 39739 38753 23171 37175 28619 20076 5415 12856 26463 54250
6248 54250 51650 28278 33533 64436 96286 96945 63325 28169 65406 63644 49737 82448 53143
6235 53143 46607 71289 51628 74474 92216 91336 112135 112272 121354 99925 121025 124883 112032
6222 112032 112090 131089 150448 154991 150028 186621 202496 198694 217760 219962 254327 249913 267974
6209 267974 265896 316637 336136 366626 409324 444066 480945 544059 611838 645222 637628 686122
6197 686122 761357 769015 812495 872125 887814 949069 1001405 1068135 1128786 1193765 1249894 1304093
6185 1304093 1355888 1369827 1450908 1440161 1460280 1424026 1450053 1468585 1432328 1466887 1542610
6174 1542610 1616286 1665205 1677236 1660104 1644738 1626466 1669083 1676246 1684129 1707773 1763250 1811262
6162 1811262 1838111 1919904 1933327 1882555 1800804 1729306 1665434 1601930 1518217 1449441 1366926
6151 1366926 1294536 1202055 1124757 1112072 1086879 1010591 966731 960268 928770 908459 867554 869370
6139 869370 854784 877300 873871 859157 869685 874405 891953 868375 819085 769179 706810 693924
6127 693924 669108 585312 538556 498637 466595 418591 412323 392564 355990 331166 320043 317164
6115 317164 328431 321707 312289 267156 303082 303913 270209 288774 284784 290670 300905 319349 379813
6102 379813 395000 404337 393038 409598 484118 482325 552733 612809 626066 638975 699075 683266
6090 683266 658358 647987 641471 658039 666051 703641 704923 696293 713803 733695 787849 839254
6078 839254 871790 922819 981036 1035250 1127356 1182238 1224987 1299641 1394869 1452461 1503589 1533351
6066 1533351 1531086 1495497 1470156 1422508 1419741 1399023 1366349 1352838 1344998 1353947 1344778 1340481 1330492
6053 1330492 1311744 1297817 1292250 1360814 1424961 1455014 1495785 1576448 1606850 1596325 1625476 1579046
6041 1579046 1515814 1457568 1396116 1296909 1207427 1136500 1087375 1041650 984731 946839 912741
6030 912741 882246 840191 829961 870556 857549 851908 844918 827259 818603 781219 783390 758981
6018 758981 730674 729182 759383 784163 749822 713758 645694 622076 602123 569235 560221 501311
6006 501311 456311 444840 419055 436108 373713 352212 372574 351249 382229 385979 355082 331447
5994 331447 289421 271539 318958 306346 256341 284428 259008 208212 187808 192510 219053 225762
5982 225762 223888 212200 240943 207941 181326 205753 170114 168608 181577 194958 156331 149384
5970 149384 144319 142556 135045 130127 133713 134077 108696 130745 113675 114378 112609 115258 130390 131038
5956 131038 112811 125759 167579 179360 187680 199683 194669 195892 211549 209670 225858 210753
5944 210753 212901 193929 190522 168089 183196 215113 202424 178592 169137 175091 182213 190273 172297
5931 172297 131902 200952 217129 216717 155617 137525 173876 189577 194104 195348 184828 178218 181530
5918 181530 187540 209344 211704 207647 206450 176400 147950 160522 187006 173092 196160 189105 174671
5905 174671 194245 186975 174270 153226 163271 132022 120317 170947 153174 162561 150937 130999
5893 130999 143820 142135 141162 115561 132969 130726 135374 138412 119998 110823 112884 107495 116505 135245
5879 135245 142681 132558 104427 79141 101000 64217 66540 97601 70853 43250 47582 53899
5867 53899 83858 68745 68859 93103 75498 71452 83589 70392 47571 32032 31869 31601 35226
5854 35226 28257 69214 95802 15272 11786 13402 5876 11879 31420 19665 30413 47368 25441
5841 25441 24663 19261 12228 19962 6438 33514 34441 41838 57280 41458 45107 44202 42109 67582
5827 67582 68955 46405 48107 48470 39931 7512 7076 3036 -13876 11354 -6455 -15612 10740 16429
5813 16429 9149 24770 53550 22683 8256 -9982 -15812 -11438 -205 -15662 9180 46594
5801 46594 26545 -4721 -14874 -12076 32642 31277 256 5558 24109 19966 3385 675 -6928
5788 -6928 -6569 -5219 13663 31223 45505 59253 35918 21771 35402 41657 39689 62300 23374
5775 23374 -8608 26434 31389 3450 18458 50775 26061 5889 10335 6314 9478 6730 4231
5762 4231 11421 21521 31256 32498 40475 10782 16445 16484 -1460 -154 -29620 -2396 9267 -29996
5748 -29996 -20535 -18773 4203 -4697 -17016 580 -797 -12991 16663 28084 59712 43889 23331
5735 23331 29125 11633 14415 3577 17556 14215 13895 -12305 4672 8158 1688 38005 11312
5722 11312 -11978 -2016 24392 14078 45991 14405 -13197 -2759 19480 18421 2204 60126
5710 60126 37476 36492 21200 14716 -8007 24290 52028 40539 41998 29129 51674 39476 63314
5697 63314 32743 4069 -11840 33686 17320 18249 29619 42107 51146 52083 27644 5953 19424
5684 19424 41889 30574 34033 61827 91840 74283 10560 28772 22888 13503 -4966 23293
5672 23293 41632 63065 48930 23012 8076 19370 3475 -2839 26979 11857 -4084 -15735
5660 -15735 -10354 23915 68123 65455 47227 58817 59293 56411 42081 54963 48172 22806 21637
5647 21637 37753 37493 55055 20318 65951 47053 9737 1040 35919 28605 15239 25960 45422
5634 45422 70716 70105 61462 81792 97753 101799 90185 39622 26724 54536 85755 93233 86288
5621 86288 65444 29655 28758 35511 18270 48482 63301 71659 69147 62081 107295 140915 140503
5608 140503 119905 113370 139481 142341 158124 139931 129439 121696 134998 132930 132067 133724 164829
5595 164829 168367 193848 195677 232178 255305 285627 291956 283653 269566 264370 261218 274811 294225
5582 294225 342870 357576 391272 419927 430215 481124 522849 536942 550380 579573 590884 624541
5570 624541 672597 653538 665823 662340 664567 717929 750089 760454 771899 849150 864916 878743
5558 878743 900489 948147 939691 991123 1006853 1060305 1109146 1137540 1171842 1161213 1144933 1108285
5546 1108285 1088228 1054989 1079200 1050442 997292 1009179 974165 963481 989257 994494 990569 987577
5534 987577 1028673 1055428 1086302 1094894 1121055 1199361 1245152 1200079 1186138 1127129 1084688 1034341
5522 1034341 981237 924923 879829 865770 791648 738470 685799 654255 622711 591067 581661 604627
5510 604627 646098 666050 630783 639309 637728 685966 727870 737484 787256 824586 841192 852367
5498 852367 833834 829290 776988 719980 678468 625471 591044 552143 516738 490584 436420 442857
5486 442857 403046 405224 397393 411720 425871 408268 437693 476329 488139 498744 504486 519252
5474 519252 563259 576668 587851 544392 517814 479280 468908 435366 427654 425203 408075 356327
5462 356327 314636 311219 307914 309142 298312 284295 295839 245328 249547 311132 334358 302182
5450 302182 271050 309465 352425 353851 380309 392511 396129 388387 386767 419209 436329 414800
5438 414800 418853 419591 381000 364626 405169 440141 486493 486598 479095 509305 504646 548535 574426
5425 574426 624706 672537 746031 748363 719485 762510 776276 730785 732812 761472 717871 725508
5413 725508 734503 724676 725168 730301 759947 756999 779645 819769 866692 893190 908995 940165 997253
5400 997253 1027203 1056046 1122356 1211904 1288362 1313110 1342461 1369261 1316945 1306982 1256003 1214107
5388 1214107 1201384 1143977 1069414 1052732 1055533 1035605 1015661 1012983 1036035 1033812 1067195 1084735
5376 1084735 1115472 1168390 1188777 1177552 1158744 1123028 1103810 1096979 1090280 1054706 965973 916529
5364 916529 878961 800049 746560 693313 643466 639779 598938 567904 524904 480887 498867 475527
5352 475527 466088 444716 456386 496471 500514 532321 585658 568673 534934 519337 490422 454324
5340 454324 429769 381330 358554 328397 297974 257227 271158 274374 233265 186081 214941 225534
5328 225534 189432 199799 195326 174075 195766 169767 140108 128719 142088 169061 168099 154128
5316 154128 137990 158461 149183 132830 122677 117980 118538 149310 136180 104382 83998 90400 83950
5303 83950 38790 63826 94140 99519 138568 130453 81740 60423 69590 67405 75559 46343 67165
5290 67165 94955 97671 102977 70984 60646 40893 29195 44879 62635 44014 45220 71989
5278 71989 104556 73688 62627 74143 52099 66510 84691 83234 67063 87792 94044 74895
5266 74895 40292 107223 88628 59874 65190 93134 94543 79117 61272 41463 18831 30603
5254 30603 33279 61849 94670 96467 116330 96430 98982 64555 94652 82929 47078 23150
5242 23150 19637 23432 21824 19098 25620 33416 27478 36753 76449 47396 13315 49408 90231
5229 90231 91381 43208 68360 62195 72610 61792 61019 57004 41954 68993 51286 45673 64423
5216 64423 64150 88604 89886 63352 42890 62768 90654 87769 113526 104715 82211 59162 45655
5203 45655 77691 70407 35456 50142 65583 76843 62879 49326 66335 63946 43356 68500
5191 68500 111822 59193 35171 63307 46895 44901 7864 25713 53596 64212 66994 53697
5179 53697 39984 25572 41144 75915 95945 73223 63660 60654 69265 64972 89424 71633 49537
5166 49537 78045 71964 70191 63638 67090 70195 92749 117363 91532 63815 82383 96058 108511
5153 108511 73337 77998 96823 92474 77280 89222 85782 77983 86861 99832 93180 78805 98470
5140 98470 68556 49992 74453 90178 92851 78996 81933 90250 98695 72982 35596 84161 97484
5127 97484 97195 93358 91214 90803 109484 109726 89970 90625 87027 115521 109250 93327 108600 110382
5113 110382 91652 69750 91414 112764 105631 84923 60992 66718 108622 149971 119250 102457
5101 102457 97632 101113 99923 136027 168976 157314 136512 134747 146736 139995 137730 146834 143656
5088 143656 118743 115831 148215 157578 166864 140191 129728 170206 159217 165344 189967 224961
5076 224961 230211 196306 178836 167094 138975 155053 171276 195538 226572 243065 261830 270669
5064 270669 318042 349505 330799 351228 371005 409743 448682 463861 492720 544917 581301 630922
5052 630922 726489 833485 899488 1006931 1142145 1243241 1374943 1527640 1706037 1958082
5042 1958082 2267095 2540894 2887485 3256462 3545040 3888926 4364561 4824411 5311131 5647900
5032 5647900 5697664 5713795 5881272 6108138 6440020 6625687 6308419 5785139 5237759 4770202
5022 4770202 4482271 4267882 3888444 3489525 3113167 2758963 2477227 2285480 2123635 1967943
5012 1967943 1768454 1639730 1505540 1392657 1282581 1202708 1174264 1085735 1005593 965763
5002 965763 895570 819219 766736 710595 688736 660529 608661 560472 547823 546975 543263 530193
4990 530193 514212 496362 445410 425213 461732 443336 419232 422013 436476 386695 345337 330207
4978 330207 325660 324440 305551 288498 291951 301883 318865 274506 241338 239671 249064 285066 269013
4965 269013 234693 224905 278422 243297 233943 227981 200314 242021 217787 170246 169050 183913
4953 183913 185800 179332 211481 243120 216553 223569 220698 222559 197950 189176 187874 223295 241397
4940 241397 274522 248137 224555 263658 266561 257688 270364 301974 276939 274104 312939 336331
4928 336331 348988 358716 376967 375415 357142 341526 385345 433935 443813 418939 416523 429161
4916 429161 449379 443058 442127 429850 399288 396054 361710 367564 351324 343295 357145 327712 328812
4903 328812 309129 301562 320396 306731 266465 252868 281558 252387 271141 284534 273712 252974
4891 252974 250027 272319 264313 275622 265719 271349 271790 286312 304738 333655 325481 317560 267502
4878 267502 267192 252831 254852 254553 261166 290055 265035 273012 281707 266735 272630 261307 231534
4865 231534 242139 282027 273193 273690 300660 308441 333803 315638 343798 359315 326532 314988
4853 314988 370582 381167 349437 382806 413546 382952 348992 332224 365926 399306 440129 446629
4841 446629 452434 455659 446607 423577 448448 477325 514067 552051 627307 654211 666261 645444
4829 645444 630587 627512 648125 640377 616449 583502 582276 555525 543606 558015 628780 656026
4817 656026 640605 614500 614506 663993 725776 714830 726304 729930 735741 762393 776888 808319 825383
4804 825383 879155 916204 933625 918184 902666 894499 904243 906609 923645 952749 960019 991327
4792 991327 1035299 1034917 1070514 1082595 1110764 1156220 1179778 1181944 1235669 1256718 1285355 1325989
4780 1325989 1386620 1480550 1553299 1637356 1688083 1769814 1906077 1989782 2101826 2216032 2348641
4769 2348641 2459189 2619830 2782265 2962422 3148982 3391897 3576199 3816421 4065531 4328055
4759 4328055 4560466 4858856 5255525 5658209 6126796 6623473 7083071 7534517 8011851 8573092
4749 8573092 9332832 10233397 11296388 12468813 13570538 14529447 15326982 16012606 16628393
4740 16628393 17213030 17731938 18132015 18435192 18675564 19008516 19436639 19920516 20339407
4731 20339407 20769960 21322152 22024900 22846525 23755925 24630169 25440940 26295211 27192126
4722 27192126 28037301 28933245 29903177 30926518 32112514 33504470 35046543 36554478 37767782
4713 37767782 38427275 38523912 38232901 37692026 37021778 36270292 35365571 34378564 33430232 32619046
4703 32619046 31807597 30894487 29923725 28891530 27950028 27094355 26322498 25593535 24902572
4694 24902572 24240894 23653090 23217953 22888791 22664846 22435195 22128216 21841109 21637912
4685 21637912 21524957 21331263 20870135 20069109 18987493 17777923 16569871 15526916 14585279
4676 14585279 13626833 12710851 11869054 11139766 10497095 9891702 9369033 8890674 8472882
4667 8472882 8057688 7655605 7279200 6916964 6637372 6347708 6042608 5734609 5463782 5205672
4657 5205672 4963723 4723025 4510800 4275833 4059376 3891102 3743396 3567793 3428844 3305946
4647 3305946 3189252 3082175 3008504 2923372 2835766 2792785 2742553 2700854 2652979 2639727 2623016
4636 2623016 2577611 2548252 2498181 2456470 2428748 2387171 2377463 2376340 2372945 2312135 2251187 2232383
4624 2232383 2185070 2086456 1999758 1931792 1855267 1801341 1746754 1727391 1679266 1597275 1565938
4613 1565938 1535470 1491987 1436007 1428736 1374719 1328536 1314771 1298800 1280422 1274356 1249420 1225595
4601 1225595 1209819 1213780 1191316 1145505 1133552 1124369 1086641 1055398 1039104 988667 952564 918883
4589 918883 898447 857687 815813 798202 772119 701687 689498 679926 642432 611402 619028 615627
4577 615627 573858 563347 542086 520617 542297 539272 528914 507080 504863 508248 511057 491202
4565 491202 461290 495576 478757 439250 446057 447757 409597 427128 413044 415592 416288 416366 400328
4552 400328 393703 395552 385426 420693 401497 377061 370594 393194 391140 382410 374490 392464 393665
4539 393665 377459 355246 336889 334385 342510 363139 363254 385684 352999 354857 363090 353415 350273
4526 350273 361477 363388 339506 364543 357905 353742 377630 378766 373005 346376 327759 318152 298802
4513 298802 294131 319426 315107 309552 318036 306796 293766 315092 319587 313274 293556 293567 277820
4500 277820 274273 265786 270380 269665 297147 283168 262485 241775 218508 234396 256619 262708 237898
4487 237898 269904 265023 234898 207497 227581 228460 222142 224392 246087 221129 204730 216550 187273
4474 187273 169940 190163 179694 174824 161842 163673 192243 192483 147431 156358 190740 164110 171584
4461 171584 208119 203361 205343 213093 168485 183508 196937 167213 149362 168304 196524 179581
4449 179581 184454 179883 175942 178482 164000 165857 172617 169221 189281 194215 218133 213379 215050 242726
4435 242726 219101 229775 187205 209803 242646 224580 219084 193741 193036 216964 211760 202611 229442
4422 229442 241455 247839 262139 278306 265399 271430 264259 272638 319761 314649 276469 297721 306632
4409 306632 294730 286313 309718 331199 314444 337518 325227 338060 356839 353965 371297 352887
4397 352887 346251 315824 318346 335938 319355 343258 314846 292906 334639 324978 316979 319373 295890
4384 295890 307835 304477 310585 315592 308421 294143 285905 311435 316418 284877 262818 257371 251097
4371 251097 282993 340064 302860 266443 283898 249300 230934 226859 225199 229990 208950 211908
4359 211908 209705 212209 198093 222340 241885 219407 213929 225961 204472 211878 252132 243869 252175
4346 252175 230083 251904 280119 294810 270902 270070 300166 298661 286338 270761 285532 300535
4334 300535 277757 269451 257391 258603 257614 259273 257150 274594 266578 266672 263447 294272 273855 285473
4320 285473 326446 335463 343548 327701 328784 341928 383558 365478 350476 354083 363495 343219 332120
4307 332120 318774 326187 338051 323114 351837 374174 367206 388031 392232 419196 435853 428606
4295 428606 423188 422601 442172 493691 479993 503479 507020 518430 514806 547820 541648 572497 623905
4282 623905 670086 651349 655593 716125 764255 784321 837534 887472 905194 967931 1064789 1167883
4270 1167883 1234710 1336767 1419978 1584540 1674228 1783087 1921851 2056468 2201983 2388452
4260 2388452 2555850 2735927 2985711 3284753 3615281 3903791 4202633 4458768 4720180 4995419
4250 4995419 5260482 5547183 5802060 6101291 6399936 6790124 7293613 7858375 8408737 9022855
4240 9022855 9675908 10274014 10796962 11200604 11551343 11856824 12102865 12379815 12690738 13033626
4230 13033626 13408195 13910631 14479068 15135731 15864698 16574569 17248588 17747405 18101070
4221 18101070 18292330 18313303 18276307 18206092 18097730 18030218 18035667 18098436 18239162 18496733 18861859
4210 18861859 19250196 19548431 19737494 19709329 19516962 19154814 18684777 18110284 17513322 16957474
4200 16957474 16407804 15920645 15572319 15334944 15226339 15165518 15066535 14904305 14597562 14166026
4190 14166026 13620713 12963328 12286930 11620923 10950505 10318294 9714702 9225087 8883921
4181 8883921 8580968 8326197 8108829 7827889 7477128 7084976 6672621 6245897 5887911 5520556
4171 5520556 5146396 4790447 4466228 4169760 3911203 3678406 3518214 3379347 3245996 3097347
4161 3097347 2920367 2767061 2635632 2491623 2364568 2218679 2127094 2021289 1949205 1872451
4151 1872451 1752843 1655046 1606131 1551031 1476481 1444921 1382156 1331138 1291905 1263195 1188012
4140 1188012 1150798 1136471 1134970 1042568 1031248 1026424 982594 944808 949874 944682 921913 919636
4128 919636 873725 870210 862538 850876 818012 826072 817778 813772 802131 813467 771978 764376 780048
4115 780048 758579 786133 750812 695889 664540 678824 685017 706631 668102 659018 649109 642695
4103 642695 624805 619486 606877 605957 610405 622629 616903 631572 623153 589200 598236 580354 630814
4090 630814 635591 647218 655647 637751 619414 626314 631055 672587 696322 691233 695351 712492 737640
4077 737640 730497 740728 785227 782510 811370 845162 845892 915571 992699 1020546 1074300 1125940
4065 1125940 1126283 1121913 1158869 1210162 1238595 1286431 1330471 1404530 1471039 1562343 1603746 1626155
4053 1626155 1649309 1701857 1711923 1720473 1755738 1741629 1762754 1847412 1933162 1972005 2062226 2117637
4041 2117637 2161168 2208853 2229386 2210124 2174580 2176897 2151950 2098376 2051825 2063998 2020584 2008798
4029 2008798 2036750 2041605 2079731 2042940 2007254 1943149 1895949 1870794 1854772 1819385 1769984 1725181
4017 1725181 1706455 1707790 1717427 1678432 1617656 1565045 1524570 1515853 1523184 1517581 1506958 1472660
4005 1472660 1447713 1437804 1460051 1431927 1414204 1426269 1451457 1465823 1472604 1533801 1513403 1513314
3993 1513314 1543995 1554418 1590665 1619277 1652484 1652206 1666396 1708326 1672451 1672676 1711122 1736978
3981 1736978 1803368 1830908 1854350 1904497 1901494 1931539 1954004 1980415 2008214 2083530 2131264 2137035
3969 2137035 2140254 2169467 2182152 2213351 2209139 2227640 2248150 2297462 2303100 2318911 2368179 2377199
3957 2377199 2389162 2400803 2399145 2385957 2430679 2466794 2491856 2527195 2550774 2587258 2617568 2646801
3945 2646801 2656419 2689721 2722412 2748735 2789931 2789731 2781571 2754766 2694109 2685488 2728480 2719831 2698319
3932 2698319 2693518 2733256 2725983 2776386 2833716 2944135 3031219 3146511 3233292 3384193 3497746
3921 3497746 3590619 3684135 3694890 3676214 3703827 3755489 3779367 3832711 3862797 3925630 3949785
3910 3949785 4057006 4202647 4370290 4527927 4741405 4952275 5256021 5583827 5958732 6444840
3900 6444840 6977955 7585842 8106862 8604563 9168024 9764694 10440396 11278330 12308935
3891 12308935 13522114 14781766 15999214 16986529 17776026 18382605 18897295 19371792 19825684
3882 19825684 20199109 20522109 20907929 21457442 22229121 23156857 24142325 25102916 25931643
3873 25931643 26616649 27203029 27743724 28243561 28721399 29221799 29717971 30244674 30824496
3864 30824496 31573681 32588997 33910128 35573868 37567973 39497441 40912614 41381379
3856 41381379 40959658 39997074 38783738 37566046 36404471 35140534 33780013 32469374
3848 32469374 31319094 30432410 29847089 29491168 29242954 28998999 28657899 28140759 27436382
3839 27436382 26497446 25514438 24598293 23733684 22932543 22195717 21517810 20947812 20498624
3830 20498624 20187672 19987028 19727456 19223294 18489586 17566149 16552111 15547817 14595014
3821 14595014 13705834 12817795 12037663 11325344 10650400 10040427 9492059 8944084 8489458
3812 8489458 8107705 7745598 7376047 7048563 6769699 6533047 6281090 6105307 5958020 5777351
3802 5777351 5659471 5553785 5470524 5400700 5368954 5314018 5265660 5240554 5164948 5025297 4878177
3791 4878177 4768832 4645400 4489779 4386559 4297475 4195457 4107825 3999179 3921034 3863134
3781 3863134 3787024 3779747 3786958 3773356 3704572 3598399 3579004 3586549 3584068 3569437 3518058 3453175
3769 3453175 3463293 3436996 3382120 3365390 3308469 3226812 3223312 3201772 3156835 3187985 3144473 3126800
3757 3126800 3124322 3122593 3124354 3160110 3201255 3234316 3258446 3298588 3385608 3409858 3456067 3501707
3745 3501707 3599653 3698128 3784389 3912584 4057636 4192902 4323906 4516295 4744420 4991099
3735 4991099 5275816 5575644 5890897 6261715 6708035 7246026 7812969 8421388 9124812 9942891
3725 9942891 10861187 11870807 13021879 14347561 15770491 17330258 19036138 20791064
3717 20791064 22493698 24093556 25576518 26817514 27788795 28507814 28957605 29137491 29162575
3708 29162575 29082582 28917030 28784998 28727691 28802787 28934241 29027527 29118275 29113725 28985723 28614919
3697 28614919 28015508 27184091 26100923 24799341 23374978 21896606 20377995 18873679
3689 18873679 17422127 16088312 14846193 13692127 12633758 11709810 10890805 10162061 9545395
3680 9545395 8978337 8471833 8011491 7582892 7206366 6885476 6646362 6373991 6112861 5903020
3670 5903020 5695956 5532639 5351794 5194840 5057107 4938576 4853600 4725708 4668716 4578301
3660 4578301 4518940 4460138 4365705 4315466 4196051 4130021 4077498 4030819 3974408 3922336 3890481
3649 3890481 3836000 3783378 3749256 3713477 3680727 3624452 3594906 3635042 3625680 3600110 3588485 3580521
3637 3580521 3558857 3571356 3586869 3573013 3635212 3657834 3683021 3682024 3707712 3777876 3794750 3848940
3625 3848940 3889859 3960534 4047211 4090158 4175455 4283330 4345864 4442990 4523763 4606243 4674314
3614 4674314 4757718 4883403 4960944 5018516 5103546 5170586 5304501 5410279 5518038 5687877
3604 5687877 5829111 6032220 6271096 6506819 6759183 7019572 7389967 7757858 8150195 8621424
3594 8621424 9165827 9816990 10528180 11335310 12268806 13334288 14567838 16000231 17620510
3585 17620510 19456853 21437774 23532154 25673474 27820804 29907815 31832637 33526710
3577 33526710 34961611 36092624 36925182 37481671 37870699 38143298 38372309 38647311 38924739
3568 38924739 39212879 39469193 39725086 39817316 39703647 39380889 38760092 37865287 36638611
3559 36638611 35167795 33411031 31516992 29614343 27704532 25811837 24020383 22369248
3551 22369248 20895736 19606995 18461411 17456981 16599280 15901541 15283978 14798125 14381679
3542 14381679 14082119 13873840 13726589 13722158 13762295 13862536 14132969 14436180 14858967 15398573
3532 15398573 16044173 16828666 17706537 18723968 19891309 21261870 22770735 24474648 26387049
3523 26387049 28583601 31022652 33655561 36385069 39129988 41899510 44650433 47374987
3515 47374987 50039616 52586809 55002015 57206725 59123047 60699812 61925863 62839008
3507 62839008 63399020 63611789 63498495 63135541 62520239 61646849 60572886 59340671 57952082
3498 57952082 56412133 54755602 52939929 51097720 49280893 47437323 45638069 43864985
3490 43864985 42212892 40719366 39412200 38424323 37777913 37521476 37550172 37763991 38012961
3481 38012961 38281056 38778013 39643961 40890389 42505584 44293800 46070334 47988946 50211403
3472 50211403 52764094 55668207 58804012 61985512 65140235 68258154 71375715 74373950
3464 74373950 77169908 79783184 82281926 84726987 87302311 90143703 93323068 96945873
3456 96945873 100999130 105383412 109895424 114262368 118456105 122385250 125823149 128587470
3448 128587470 130313968 130677367 129721755 127764833 125067868 121990083 118778895 115482185
3440 115482185 112247756 109218055 106458382 103981503 101726413 99638356 97610784 95490024
3432 95490024 93129957 90385947 87242192 83731977 79976757 76040756 71937209 67843166
3424 67843166 63822094 59911712 56221739 52791814 49667664 46914324 44479997 42340560
3416 42340560 40509565 38928622 37658323 36710192 36024210 35585059 35386848 35391145 35610276
3407 35610276 36075009 36789498 37792581 39214228 40911193 42930262 45220825 47607790
3399 47607790 49986930 52312080 54584351 56863347 59064637 61157658 62991354 64406454
3391 64406454 65454758 66061731 66345082 66366035 66123381 65658810 65052193 64325238 63548074
3382 63548074 62801462 62083338 61368275 60643553 59882815 59055149 58067264 56932654 55610546
3373 55610546 54041634 52197289 50164736 47937027 45586058 43136311 40669735 38282044
3365 38282044 35932998 33688239 31555816 29609862 27873885 26330401 24954271 23749115
3357 23749115 22715473 21761422 20862869 20102412 19448580 18881729 18420775 18045244 17738813
3348 17738813 17467411 17275428 17198136 17217006 17295937 17551099 17922600 18378786 18873987 19294793
3338 19294793 19537457 19577447 19420492 19190827 19028384 18808439 18637320 18518422 18364688 18297751
3328 18297751 18261661 18307984 18413045 18464357 18463648 18497383 18523304 18486379 18457764 18459411 18474177 18519550
3316 18519550 18658697 18926778 19344639 19950192 20596094 21201605 21724853 22070883 22378568
3307 22378568 22824259 23456347 24273607 25305450 26423314 27615142 28961517 30498242 32192829
3298 32192829 34035163 36021443 38038792 40053319 42029813 43839513 45577036 47236453
3290 47236453 48884634 50551424 52204395 53765136 55084135 56182436 57108728 57842751
3282 57842751 58475862 59031306 59517874 59706582 59576413 59094979 58335056 57354319 56123549
3273 56123549 54679235 52939970 50915943 48625463 46137688 43516420 40782702 38044875
3265 38044875 35336205 32661954 30115260 27725734 25488390 23448239 21586215 19915045
3257 19915045 18394677 17053451 15879083 14815919 13849041 12992188 12276631 11588792 10975023
3248 10975023 10435279 9954563 9508357 9109681 8722310 8397493 8145403 7938671 7744208
3239 7744208 7564178 7409890 7295820 7204968 7130374 7079532 7055840 7029660 7000681 6977618 6896338
3228 6896338 6815254 6759270 6674371 6609283 6514694 6394313 6277516 6206818 6104802 6002588 5937255
3217 5937255 5808904 5694364 5569739 5437748 5310965 5146594 5014787 4849494 4670686 4504929
3207 4504929 4341733 4136173 3985350 3836991 3708113 3591369 3482390 3385637 3291739 3201742
3197 3201742 3122532 3069555 3009104 2937124 2921694 2896967 2914565 2910119 2857437 2895241 2891343 2911877
3185 2911877 2922865 2907472 2929544 2930550 2958339 2949740 2915383 2885988 2889090 2920579 2850794 2840643
3173 2840643 2846854 2839405 2837858 2840016 2870419 2836953 2797221 2850379 2882357 2896399 2895117 2909389
3161 2909389 2902150 2914378 2914166 2939379 2985006 3000068 2999096 3049130 3078515 3104728 3149262 3163863
3149 3163863 3173581 3171139 3199349 3197659 3161432 3144198 3114569 3064568 3023914 3023295 3005402 2978664
3137 2978664 2956130 2949966 2959790 2943663 2932180 2938437 2955878 2968394 2986622 2996705 2960606 2936214
3125 2936214 2934666 2907648 2916470 2930517 2940677 2947275 2987068 3042974 3095401 3113670 3167987 3224946
3113 3224946 3305056 3391762 3490458 3562009 3637494 3737220 3800884 3888292 3998593 4109743 4156717
3102 4156717 4199180 4255453 4343557 4392276 4457945 4546306 4588110 4649181 4772433 4886996 5058453
3091 5058453 5232817 5494897 5766863 6073943 6480997 6885611 7336645 7874108 8414397 8985415
3081 8985415 9634018 10381048 11167293 12043523 12987510 14056149 15310259 16663077 18258068
3072 18258068 20080966 22135472 24496587 27149732 30127414 33509823 37394714 41956882
3064 41956882 47396549 53729580 61175909 69664706 78810994 88385043 98853446 111407492
3056 111407492 127201691 146899817 169738199 194073564 217212765 236063338 249983450
3049 249983450 262487060 276488673 291175645 301433088 300212380 286416748 265207687
3042 265207687 242198829 221242907 202302510 182919864 162537245 143096021 126490235
3035 126490235 112931078 101663423 91972893 83543095 76131998 69609297 63832195 58651667
3027 58651667 54010083 49827752 46109831 42801734 39861202 37165036 34723992 32419796
3019 32419796 30212941 28160114 26255420 24570036 23051037 21678467 20460191 19400193
3011 19400193 18472991 17627734 16841382 16148081 15490002 14899441 14390540 13888733 13385659
3002 13385659 12873127 12401670 11932601 11525777 11119463 10689158 10260102 9837019 9433382
2993 9433382 9066121 8770611 8491521 8196489 7916963 7633963 7386671 7178291 6968766 6762729
2983 6762729 6601877 6424045 6231103 6065418 5883493 5745499 5608230 5487619 5323829 5150212
2973 5150212 5026909 4918699 4794454 4661232 4516108 4374285 4241913 4151680 4048825 4003940
2963 4003940 3867429 3740857 3692189 3654859 3613509 3546643 3458639 3378514 3332226 3257468 3173841
2952 3173841 3137273 3080736 3017669 2951127 2912823 2852709 2781462 2719976 2645659 2608144 2593448
2941 2593448 2576653 2574326 2579801 2573045 2552161 2560683 2545167 2509260 2433134 2443490 2427646 2370340
2929 2370340 2315755 2272668 2227919 2182698 2105661 2073327 2051977 2016800 1988012 1931808 1915282
2918 1915282 1867363 1817466 1796191 1774878 1704611 1688962 1678071 1643678 1616808 1598415 1594278 1613301
2906 1613301 1611254 1619462 1603689 1556844 1533021 1546917 1568099 1587813 1601244 1595802 1569425 1537893
2894 1537893 1541993 1535185 1511865 1498007 1454215 1417167 1425481 1416796 1342753 1338793 1317808 1307324
2882 1307324 1263438 1257871 1212392 1177516 1171580 1165181 1108598 1089565 1048806 997404 1009133 1028599
2870 1028599 1004840 982882 995213 943066 945409 947896 931460 941001 940582 934953 936123 921183 907895
2857 907895 919502 914240 899459 883662 869855 834268 804223 796720 779956 763533 736172 739981
2845 739981 733109 756151 782280 759994 730919 712302 689934 656667 638679 604919 605189 641771
2833 641771 637216 603028 631007 646428 631535 635174 636648 628334 608811 594898 571844 583428
2821 583428 579316 565761 551890 536918 508132 508154 513466 517837 519802 489194 500732 543822 528727
2808 528727 546057 538216 527447 537403 536990 550753 548449 570484 560554 544277 545015 552897 560257 558587
2794 558587 589756 574098 575940 575947 604604 635447 613135 627535 655233 650066 683619 704815 723444
2781 723444 730165 730045 765049 825308 901299 908827 926872 994221 1099588 1174369 1301812 1428728
2769 1428728 1517128 1599631 1672418 1740195 1800339 1895749 1907853 1924383 1857446 1727453 1580883
2758 1580883 1478488 1431532 1327248 1223694 1106454 1011562 921829 835940 756086 720884 669394
2747 669394 627357 609161 619538 606686 545762 502710 494434 517220 523028 491253 462321 450006
2735 450006 414841 418848 415814 379229 370080 379747 359592 329231 340174 335806 295464 314610 384266
2722 384266 373118 369518 371817 335178 329383 325454 317535 307534 308823 317470 289196 307811 337923
2709 337923 294815 290766 310970 293874 294211 309731 313332 299510 292697 337845 318321 302038 315933
2696 315933 296296 311657 340632 317338 306655 271043 222484 216972 219266 197463 197670 191339 212833
2683 212833 205430 171158 207518 231686 255145 212499 199962 186932 164149 151235 165982 170110
2671 170110 164632 171506 189340 190876 181941 192039 192979 200429 189811 186171 152841 164669 135804
2658 135804 99801 138291 144263 136890 137881 173875 170668 174916 148258 118887 124646 129597 138400
2645 138400 127666 120606 142804 163002 156958 113716 91858 136460 128536 104891 94414 98596
2633 98596 79237 72437 66886 79275 66715 54915 77848 80570 78725 101007 101979 76715 87686
2620 87686 133275 117894 84554 99719 88640 105506 117357 107336 94657 90611 96727 91178
2608 91178 91191 39233 53485 84031 92930 108982 88856 99916 109840 122967 77501 77902 62763
2595 62763 73877 99677 100856 80758 93557 84067 96827 79126 67810 86358 135383 126240
2583 126240 113086 131862 87001 82011 109134 110934 110645 120117 115885 105935 130050 125957 97311
2570 97311 106761 113744 114291 105495 106390 120606 97019 116363 122664 121205 118549 126887 140263 128575
2556 128575 162234 156553 182534 151023 160026 183458 151514 135399 148594 111015 74384 77318
2544 77318 129658 98352 89623 87826 88292 109034 123185 104971 128887 130790 90745 91689 125473
2531 125473 131741 114948 113963 97322 73718 85896 91462 99110 91698 108708 84302 91553 84583
2518 84583 93573 64467 71314 76121 68848 84295 36100 38859 65591 38759 34821 46590 61058
2505 61058 60605 33669 37343 28894 63012 65275 80324 76106 83913 67465 37353 33797 80423
2492 80423 101483 62052 67176 71262 57554 40757 75492 84286 33850 62273 52614 67756 29232
2479 29232 44176 63817 66559 46075 47764 25100 27586 43965 76484 58722 72752 80555 70625
2466 70625 74190 63623 52512 46458 106544 90282 78204 69367 66607 29657 48578 95103 54952
2453 54952 54651 80780 78394 46781 37124 39861 31649 13458 1193 13181 31326 31955 31509 18912
2439 18912 29937 48329 53983 60652 39937 21084 36361 47732 45774 52304 22623 34530 59022
2426 59022 41861 26334 22799 39196 31853 62581 84947 44098 22617 55841 71497 48191
2414 48191 46722 37574 27706 34343 22452 23461 41646 80893 77812 83834 89340 93614 92040 70229
2400 70229 79849 73438 77121 40827 43881 38233 46633 51954 70146 64410 55275 83462 109645 86259
2386 86259 76043 89470 89021 72235 95206 115195 128135 107895 110124 89709 63553 68709 78474
2373 78474 76037 74424 67584 78745 63241 55997 47070 57541 85921 75959 53084 87564 97444
2360 97444 72831 70168 43077 39531 50183 55947 52702 65403 53087 56763 79418 94043 76768
2347 76768 89134 91569 89610 92911 109754 98817 105073 91082 94711 82813 79716 113723 100169
2334 100169 81378 106786 129033 138874 99268 79289 98185 122148 118913 119585 133777 133881 149632
2321 149632 164587 152285 158283 164898 159863 171110 195163 269248 300254 292947 338800 341573 380697
2308 380697 448491 505731 578324 623137 710105 789183 877118 958366 1044428 1164661 1323577
2297 1323577 1515130 1835553 2091997 2228109 2409583 2632432 2914503 3486050 4355585 5380845
2287 5380845 6326813 6607884 6225911 5779185 5171242 4760523 4507272 4046961 3464372 2918694
2277 2918694 2530043 2226608 2040330 1871975 1747391 1591287 1492365 1352466 1235908 1166575
2267 1166575 1085553 1003914 940050 852311 780890 737574 683244 638224 608492 581730 519577
2256 519577 465259 419529 392698 357612 358411 368973 333273 314474 308412 314422 312565 299425 265640
2243 265640 276458 259039 243955 233281 243557 202851 179332 205465 186786 174133 154897 172025
2231 172025 171096 153583 152353 178237 187096 134360 152183 161822 158946 141507 108160 105863 103068
2218 103068 112992 117972 129432 152880 118116 110990 117804 124824 117956 82108 89324 78618 69801
2205 69801 52208 86480 93772 86681 88206 71822 63137 78554 75426 100566 109450 102790 115635
2192 115635 99739 66495 75215 96016 75098 56382 91988 102808 93626 75569 44513 44708
2180 44708 75403 72198 37077 47109 56541 51252 71204 82900 88293 43097 41282 65383 73300
2167 73300 97671 68480 38482 42448 50126 43090 32073 7630 13236 39158 66558 89778 90213
2154 90213 68396 33977 59412 47015 26733 36586 44100 34536 25718 20693 19489 43143 9210
2141 9210 14944 27072 19714 27520 30775 31322 28202 3947 -22991 10710 23163 33755 41236 65309
2127 65309 77876 105008 69134 44519 49665 33694 31597 31848 50735 30184 -11634 178 19342
2114 19342 17804 43868 60790 66783 74958 81370 82208 66482 16730 47772 78003 57900 9876
2101 9876 10605 14211 36486 26889 24464 47011 33816 35485 16676 14698 23038 18814 22594 12110
2087 12110 12264 30342 55079 43424 30026 7482 20372 18480 20461 21505 45546 58135 53734
2074 53734 13149 18474 6246 19262 62201 38036 73453 71988 82283 75652 55947 27434
2062 27434 27344 17824 17455 33545 22871 16745 37221 26918 23710 44909 17811 8581 -15496 -39039
2048 -39039 1199 4620 -8362 279 18549 29575 47771 22204 4147 2924 18107 -555
2036 -555 16809 49426 26481 24602 1571 -398 24829 5652 15335 43750 52110 47813 33445
2023 33445 29541 67904 76030 43946 52686 40428 5470 9356 28486 36761 69048 61648 49343
2010 49343 32850 24862 29172 33351 21600 84776 67990 39977 16858 2513 21214 5023
1998 5023 -10891 -240 12406 6980 32666 -194 -22848 -12258 -12417 594 -5831 -1149 40428
1985 40428 58859 34116 14074 5764 -17303 11300 19798 28807 23402 33366 14597 9950 32391
1972 32391 29470 16393 -883 -39948 -14500 13 23316 36887 11667 23322 7750 28870
1960 28870 49743 22284 24370 18757 47920 21360 -24438 -6773 1881 2774 3143 -3105 26469
1947 26469 33306 1095 35283 41080 35753 15233 -19761 -9257 -22133 -24073 25942 1334 6900
1934 6900 -12811 -25868 -688 19570 -354 -17391 -21798 -915 11171 7627 -5644 -10450 4071
1921 4071 18754 24402 6353 -845 23072 20909 17611 -6948 -17635 31568 53309 38130 41968
1908 41968 39359 32810 19768 -9530 -722 -7137 7786 32936 37492 15227 -23955 -3646 21729
1895 21729 8773 5721 7956 21538 11847 11029 12125 -240 -14890 -56160 -23870 4999 2414
1882 2414 -18775 -10060 13546 -15342 -2894 -15753 4360 25518 43178 29112 -14928 -17663
1870 -17663 686 11753 42696 41206 52428 26160 25200 44330 49506 15283 29425 24858 9634
1857 9634 -16548 -17831 21912 37207 34226 23682 41508 43160 46797 49666 23532 10242 8637
1844 8637 -557 8963 -4681 -4916 -1708 -25269 -37248 -19001 -34819 -38195 -4464 21836 23410
1831 23410 22278 1348 -3099 -2040 62911 26955 -2916 -9603 -341 -12169 -9099 11369 2302
1818 2302 33511 45347 30675 9374 -10809 -1918 11980 -9836 -33967 -31519 -21561 -643 29507
1805 29507 26155 -23592 -27889 2640 29936 36393 -10838 -12487 -2089 5646 51168 56501 59382
1792 59382 26202 5934 16219 16910 24609 35445 40974 17047 38223 19957 -29318 -25681 -39745
1779 -39745 -1233 -29902 -53062 -23156 -31080 -1619 11457 6235 11530 36917 14494 9195 -15922
1766 -15922 -19570 -20548 -46053 -20884 -11831 -25274 17752 8354 -33831 1104 43709 61477 39417
1753 39417 1579 -14251 -9540 -50 -33014 -20322 -12951 -8063 27326 28285 30790 23256 28587 43579
1739 43579 58223 29364 -6302 29668 23471 -15864 -7522 43375 27304 -12490 13384 21953
1727 21953 4104 2892 35658 14664 -28314 -5994 -318 16889 -24479 -25333 -17074 -19783 12747
1714 12747 -11696 -32632 -24055 6774 14173 -21676 -13149 36441 56260 44244 11156 13151 12538
1701 12538 -50306 -38388 -15908 -13362 -16193 12949 28773 6566 23165 33073 23914 42260 39015
1688 39015 67825 73093 38622 -11078 -16326 -9535 -16003 20133 -9711 -27458 -26427 -24864 -22773
1675 -22773 -22667 -13071 1497 -9876 -60794 -69665 -35023 18507 15572 -2848 20412 -10746 8965
1662 8965 -545 4573 -4977 -19183 -22743 23288 15973 -17599 -22907 -14602 -22335 -7423 7762 1339
1648 1339 1447 9955 14874 -710 -1981 -26391 -32592 -4618 25238 8288 -18213 -16531 -17787 -10660
1634 -10660 12456 31450 28259 38413 22886 -4893 -3429 -11720 -1770 27608 18229 27162 39193
1621 39193 -19360 -53838 -34799 -24618 -9645 -20772 -31052 -32034 -15803 3340 11918 -9633
1609 -9633 -22984 -24265 -29213 -17289 -7549 24587 29755 2142 -6091 5867 3072 2152 4687 21532
1595 21532 24222 5117 20515 -6784 -20107 26 17173 37268 13974 24496 10699 13065
1583 13065 2753 1710 25805 24681 1742 4932 36484 23488 1485 14097 -7858 26971
1571 26971 15019 8831 36487 -2392 -13121 -29464 -28494 -25302 -1712 31923 -6898 -1349 4615
1558 4615 -23120 -10058 26434 25231 -795 -8951 315 -385 -12044 -24985 -10911 7894 26293
1545 26293 22282 3297 2088 -9736 -27376 -10870 19735 26266 45051 25935 753 -56 10052
1532 10052 21377 -3599 -16254 24615 56637 12179 -8875 2254 -11927 -15623 -17266 -17964 4992
1519 4992 18324 4231 -5182 -35613 -26245 -9958 -32822 -18205 -16910 -25046 13446 5476 -7473
1506 -7473 -9314 -29100 -41191 -42657 -5120 38728 40607 51660 41961 22388 8043 -42934 -45356
1493 -45356 -1130 -11065 -17901 -22832 -21110 -36441 -33883 7394 5766 1718 -52 13255 28589
1480 28589 40470 7839 7039 -967 -14427 17 -20555 -12330 -18240 -906 36612 51627 26224
1467 26224 -9771 -7266 13044 25494 19541 17966 -3462 -3028 3142 48135 791 -12112 -6075
1454 -6075 -28461 -14120 -25812 -9944 19920 3610 -14393 -28764 -39422 -12135 -35253 -21101
1442 -21101 10554 35078 18311 14298 34312 315 -8510 9676 12823 765 -22240 -28280 -8428
1429 -8428 -181 -4285 14860 1706 24917 -158 7767 -9903 -9018 -999 6112 11491 28956 19310
1415 19310 -609 7970 15224 18570 22044 10860 14815 8312 20468 24273 11597 12395 22819 16776
1401 16776 2843 23829 10629 -4422 -14587 -13188 -17448 -20960 -45435 -39800 -9714 370 41588
1388 41588 43854 13100 15888 -1556 5525 11171 26103 2781 3782 2364 8218 31895 32066 -21277
1374 -21277 -16216 -788 23020 33375 21517 2257 -14808 -3559 37297 13664 -11234 -25038
1362 -25038 -7142 -3841 -19487 19348 35672 18238 -2491 -5587 -9811 933 3877 4552 19227
1349 19227 9520 -4278 -20180 4065 -19091 -34417 -19346 15784 14086 15721 11200 25658 46127
1336 46127 -5437 -2152 -7203 -12048 -32259 -20253 -33813 -33869 -38656 -16873 -9528 -27045 -7670
1323 -7670 -1480 -5129 -2764 16387 22659 11448 26929 29280 10087 -26695 -6699 16512 2934
1310 2934 26384 17120 -21724 -11035 6454 34754 23609 -2217 -18022 -12151 -22569 -22005 -25598
1297 -25598 -2137 19229 25812 15951 -3498 20093 11794 -20613 -16508 9089 -9964 -2096 -15975
1284 -15975 -54957 -43990 -1243 23129 21565 34301 29840 9915 -1466 -13352 2423 20142
1272 20142 12488 -4152 8324 20260 4920 11851 18649 -23889 -55463 -40249 13254 36130
1260 36130 25039 4695 17051 13121 -12890 -5169 15726 22353 40461 24469 16664 -10169 -16535
1247 -16535 9531 33296 22683 6967 -563 2244 44317 31300 8195 -10643 -22676 -26070
1235 -26070 -38822 -26335 -19534 11114 5611 -10467 -29140 -27857 25662 16343 -16848 -33868 -3452
1222 -3452 -8458 -29824 -14570 -22458 -4093 -35842 -13582 18824 -15469 4041 -189 -9813 -34943
1209 -34943 -6134 10681 31747 41504 31675 17368 -6064 -15670 1236 12347 35488 31640 28804
1196 28804 5345 15481 -7441 -22275 -19619 -33522 -64483 -35682 -442 -24828 -31329 -42966
1184 -42966 -23812 -15964 -14503 -384 23401 7539 -8702 -19014 16260 47415 42999 31773
1172 31773 24586 5575 3607 8581 -4201 2353 21464 21028 -9080 -15599 -19201 -29795 -36576 -17180
1158 -17180 -7983 27659 44717 33043 -2662 -40670 -30343 -20642 4067 10702 -19744 -3792
1146 -3792 20403 14553 -6883 2350 -20382 -40740 -8254 15767 -2247 2907 1660 -29211 -3578
1133 -3578 -31186 -53384 -58724 -17604 -31824 20 23153 19096 -4136 -16064 13688 42249
1121 42249 -2098 -15297 -5569 -39218 -29879 -304 18482 28771 20247 12187 7250 -25867 -35674
1108 -35674 -6449 -23583 -29906 -9782 33529 28975 701 -32715 -42830 -26063 -31795 -20703
1096 -20703 -36414 -32310 6433 -9136 -11080 -14410 -17385 -36565 -27758 -763 11385 -20232 2687
1083 2687 -16051 -28782 6870 11617 -5764 -31683 6175 30959 32822 8000 -948 -25747 880
1070 880 -5102 3101 4774 -19721 -20459 37428 39205 25234 -24615 -6792 15103 -16572 -34461
1057 -34461 -24611 -28406 -8582 -4526 11122 -7828 -17126 -2621 -788 19485 -241 -21218 -18430
1044 -18430 8633 12316 11843 -20986 -26688 -32751 -21913 24306 12232 -6892 8654 28761 19354
1031 19354 28342 38712 21463 7629 38152 40816 34313 27412 -18182 -36091 -48671 -26998 8243
1018 8243 24216 20613 20304 23209 5123 -825 -7846 -3433 -10013 -21517 8458 665 6947 23665
1004 23665 25886 8286 -21829 -5598 5544 -7735 -1615 -7249 5648 -23875 -5170 9792
992 9792 -23921 1363 13945 934 -40243 -28591 -28182 8265 -34283 -29883 7326 -6065 -9684
979 -9684 -20495 -38068 -45678 -59719 -47731 -63158 -49150 -19192 -11898 -12846 -24145 -14418 -23838
966 -23838 -20210 -19338 18407 11785 28889 22863 -3588 -18528 -15664 459 41040 23022 -590
953 -590 -11551 12652 15015 15033 -4316 9040 -9245 -22895 -23354 1454 -4180 7312 -15732 -9116
939 -9116 -29715 -81372 -46135 -5000 9039 16274 7753 -6399 57026 31018 27724 13752 2394
926 2394 -12899 -3983 1298 -3352 -39778 -19063 3179 -10314 -31716 -20752 -27684 -9460 8687
913 8687 6393 27526 14073 37412 41554 16280 9318 12264 17960 28604 23774 41794 13456
900 13456 13367 24775 278 8241 -13240 -42365 5248 1618 30551 44101 11529 16608 30431
887 30431 4014 -21941 -11322 -1079 2296 -4775 -7798 -3919 -434 -7423 7194 43269 34344
874 34344 7537 -10211 -65976 -56194 -47963 -42823 -14232 28559 40022 18140 17353 -7683 -16025
861 -16025 -19328 15879 8498 -49416 -42363 -33119 -15175 -11705 14373 -4834 -46164 -6379 -40337
848 -40337 -47471 -13379 -7932 17209 31154 1233 -20093 -6388 16739 35145 -12866 -12898 -9372
835 -9372 -20670 -25268 -13242 -13453 1285 15788 -14354 -28639 -12338 -12685 -2238 -7824 -9192 11202
821 11202 49139 54557 35096 8043 -11413 -3905 89 203 17898 16169 -20051 -24419 -9111
808 -9111 -1093 1856 487 3834 16392 12796 32263 29955 39671 39624 61344 47685 25078 36413
794 36413 11512 12665 27227 24244 17663 7827 -25058 -30265 -14145 -16726 -19960 23764 7421
781 7421 -3507 14801 -20094 -26814 -25069 -15075 8527 4447 -13935 -26357 -24350 4968 18245
768 18245 13705 -17920 -30815 -10976 -15851 -40647 -34121 -36419 -5199 24415 38648 63047 33948
755 33948 28983 43807 18913 18280 -8924 -9514 -33995 -14937 4623 -19393 1010 -37407 -11828
742 -11828 -13249 -41593 -35196 -15870 -13207 9544 18373 13105 -16085 -30511 -18345 1713 8151
729 8151 -1787 -5748 14858 9221 -37548 -11882 -11871 -10914 12802 -7617 9244 -7636 -28961 -19487
715 -19487 -38097 -21887 -4291 9219 -10216 14487 31027 27951 29119 34281 -8233 -9348 -11476
702 -11476 8227 3716 -15587 12690 -15449 -38511 -18012 -1146 10355 30141 16545 13100
690 13100 -32852 -17303 3822 -3626 -247 -4689 21610 26731 17630 -1993 -1988 -12142 6332 26305
676 26305 4045 -635 -34506 -28934 -9259 34365 44946 17322 -5830 -25091 -30302 -14443 -31308
663 -31308 -42860 -23080 -11021 21583 -14266 -33732 -37652 -54866 -46581 21078 26799 -1480 -20888
650 -20888 -20387 -57193 -15133 -1155 -23795 -2510 8066 11827 1827 -25286 -54354 -41034 -50151
637 -50151 -18277 1066 -18154 -16024 -17322 -17611 -11112 7885 26814 21019 28036 -35741 -41877 -37651
623 -37651 -38574 -5455 7944 -278 3648 -18085 -14899 -8730 -30843 -24750 -30620 -20449 -6745 -21607
609 -21607 -18897 7940 -12389 10619 31575 38234 17750 4489 -10022 -39992 -13939 -8076 -6748
596 -6748 -29968 -26846 -42286 -33113 -31131 -4876 28657 8603 9860 -2269 -62128 -53876 -14398
583 -14398 -15958 -17466 -12171 -4646 10717 1461 -25124 -35235 -25802 -55275 -50794 4721 36206
570 36206 15059 -4471 22210 38625 8083 -30710 -22928 -25023 17598 5391 -11512 13767
558 13767 -12496 -15502 -42758 -54582 -30647 -27821 -17316 -6564 -48491 -40000 25155 33916 53442
545 53442 24330 5211 -31129 -48081 -23536 -9596 -565 -14321 -7989 17133 52790 22680
533 22680 5262 13262 440 -15114 -15799 8249 7843 -1439 -5291 10303 -39927 1153 60741
520 60741 29807 794 -4020 16322 -7741 -2508 -8814 -9883 -143 -2494 9763 -5235 -29245
507 -29245 -27696 -36613 -1331 -10263 -26349 -8253 7066 5839 -16329 -7432 -36669 -28759 23851
494 23851 6579 1468 -26404 -28297 33653 19164 21130 9971 -30068 -26358 -18036 -17863 -27295 -7448
480 -7448 32526 31457 22690 -20433 -3621 159 -12236 -26940 -6160 24986 10036 -8021 18388
467 18388 -722 11563 -18976 -14365 -15396 -44330 -11606 18648 10563 -21552 -36378 -27493 -28990
454 -28990 -35545 -5571 -11798 -1213 12930 19760 4286 -3497 -11537 -12290 1722 14273 -8746
441 -8746 -5626 -25437 -34855 -37992 -63353 -47858 -15014 -18694 -47318 -18792 -11879 -34280 -26220
428 -26220 -11405 -277 -15006 -13895 -7277 -16095 1494 5710 -4656 -24701 -42552 -37911 -78476
415 -78476 -39814 -6169 -20367 -32809 -2510 -12188 -27360 -23896 -27732 -8084 -24072 -28567 -59743
402 -59743 -38948 -31894 -22017 -26491 -28355 -20577 -54048 -26621 -2481 19461 594 -19142 -20728
389 -20728 -10452 18506 20069 6816 -725 4076 -14621 -62216 -58338 -47451 -52961 -51561 -52133 -35803
375 -35803 -18398 -8327 -2880 -46865 -65538 -51813 -23588 -15569 -7892 -30378 -25043 -11853 -31367
362 -31367 -20863 -22422 -48851 -56364 -56637 -72683 -70049 -57628 -46563 -22942 4222 -25066 -34156
349 -34156 -16840 -7248 -36495 -29097 -8267 12330 -6397 -41584 5773 22828 -749 -20524
337 -20524 -3418 -16869 -16180 -13134 -1016 -34773 -23606 -11560 -28203 -49394 -61845 -39189 -42754
324 -42754 -62038 -45173 -19793 -9794 -29023 -8165 8103 9015 2001 -37071 -67441 -73019 -43119
311 -43119 -25961 -7696 -40637 -23345 -33709 -28006 -37094 -36980 -33523 -11641 5016 -10012 -56151
298 -56151 -27924 -31692 -17536 -3131 19449 12083 -8163 -26212 -44832 -35820 -61377 -54657 -33936
285 -33936 -56285 -28464 -23811 5299 2282 -9257 28867 -2986 754 -24030 -30597 -10985 -26928
272 -26928 -27642 -14389 -35959 -30485 -55456 -57823 -72501 -43301 -31519 -32318 -778 -8807 -11341 -47249
258 -47249 -46226 -8906 -17771 -37422 -3821 15132 -14165 -39618 -38119 -44758 -42511 -36957 -40852
245 -40852 -38502 -27620 -42897 -47096 -57178 -58899 -54669 -84763 -57424 -36732 -47921 -33011 -13269
232 -13269 -22705 -46346 -46879 -41210 -39467 -38674 -31839 -26543 -23290 -20168 -22895 -21081 -24983 -32590 -42938
217 -42938 -42758 -57963 -40357 -39030 -25674 -5598 -23637 -31494 -28378 -35901 -17147 -36581 -32245
204 -32245 -26138 -41039 -49637 -48954 -43335 -43684 -51150 -36377 -48485 -30875 -10434 -22638 -1869 -2357
190 -2357 -24448 -32869 -14252 -10352 -40878 -32694 -30264 -28371 -26997 -37169 -40825 -27207 -36167 -37727
176 -37727 -52211 -42369 21259 9648 4322 -7583 -33912 -29316 -27366 -59867 -57967 -40656 -28633
163 -28633 -44432 -59818 -71276 -52062 -14761 -32414 -25882 -24923 -36738 -17420 -49517 -36308 -39148
150 -39148 -32780 -14290 -30973 -49153 -9303 -14387 -21990 -30350 -34750 -33302 -31851 -6332 -19813
137 -19813 -44610 -44610 -24858 -20670 -7523 -8374 -19766 -50436 -31603 -43865 -58598 -44643 -37036 -34007
123 -34007 -39743 -57645 -38503 -41740 -16502 -10689 -19177 -41011 -14960 -7377 -16590 -5743 -12189
110 -12189 -20171 -16732 -10950 -39226 -48627 -48646 -31353 -42319 -36528 -29850 -26355 -28612 -33683 -43089 -36127
95 -36127 -41739 -39889 -35751 -44464 -45599 -32178 -32401 -34039 -32803 -16900 -29150 -23301 1331 -567
81 -567 -17397 -31939 -24097 -22869 -57574 -52316 -39512 -49155 -25244 -18420 -25449 -31554 -44259 -40110
67 -40110 -40284 -66372 -68393 -53271 -34607 -34469 -52509 -36054 -49848 -56154 -43449 -43695 -47667 -38864
53 -38864 -26881 -3376 -26662 -40128 -31434 -28542 -35988 -47950 -67643 -77534 -50082 -46046 -45616 -23918
39 -23918 -9205 -20953 -34977 -45962 -32669 -38496 -46630 -70383 -73975 -47393 -43984 -23318 -38484
26 -38484 -50447 -57351 -53263 -38091 -46540 -32607 -40256 -15828 -20867 -22953 -38507 -45226 -42089 -44781
12 -44781 -39534 -37285 -13997 -1022 -8417 -27435 -43820 -42231 -31469 -24003 -30354 -36484
0 -36484
$$ Imaginary data points
##PAGE= N=2
##DATA TABLE= (X++(I..I)), XYDATA
16383 -890229 -873802 -845522 -833748 -817336 -805366 -813430 -806071 -795409 -798591 -773385 -752542 -758561
16371 -758561 -752099 -757436 -742359 -715389 -693606 -695350 -690293 -676182 -648773 -610138 -596918 -603710
16359 -603710 -610737 -588887 -585122 -592067 -582357 -563760 -534859 -529037 -521469 -517471 -494016 -463558 -488161
16346 -488161 -463772 -450766 -459652 -446759 -431322 -424410 -406066 -379901 -405138 -387688 -349455 -358859
16334 -358859 -351977 -324022 -314255 -296678 -302784 -301042 -298411 -290821 -258156 -248401 -230237 -224136 -236560
16321 -236560 -221234 -229158 -223947 -195722 -160824 -162616 -154664 -143670 -145572 -142113 -117089 -108857 -85610
16308 -85610 -95813 -91502 -92778 -81994 -72736 -85566 -85460 -79633 -47106 -17748 -21116 -9798 -4158
16295 -4158 12177 26027 67920 69951 53103 72173 47491 62293 84591 92733 82534 105568
16283 105568 102555 130349 138475 150550 167360 184528 182555 173860 197027 189676 217870 205952
16271 205952 207078 223260 251763 281902 260469 275431 279393 267361 261276 281897 272064 305789
16259 305789 312809 303628 312720 339871 352419 335794 328469 336510 343023 349899 352348 388657 349864
16246 349864 347329 354992 384961 412712 431717 447471 415486 412172 415621 402337 437613 457554
16234 457554 454079 449087 449719 458129 464679 484295 472400 494636 490269 464927 485969 504920 482519
16221 482519 508062 515915 517703 486836 502013 505801 501951 525408 543550 571553 592194 592597 614417
16208 614417 591319 585744 606650 590148 603903 621813 581704 566863 621458 603961 596804 620108
16196 620108 615206 632755 649175 649816 670706 667980 636560 643804 638306 677362 684561 642360 622949
16183 622949 633602 636788 652520 676067 695011 698048 685581 667270 643056 674977 697347 701335
16171 701335 709820 684895 708827 710416 703702 695354 716398 692762 657854 702571 706519 717654
16159 717654 738708 740497 758992 759153 763911 742645 750337 750485 740925 773322 769532 758363 766743
16146 766743 794647 766622 743104 757052 779594 777513 718382 701237 736979 749856 761262 766203
16134 766203 771686 746056 745723 773290 790305 780177 778133 798636 787270 790631 807845 801378 782420
16121 782420 787639 796822 833181 820586 812589 836286 823025 808148 815348 795732 794780 811990 813414
16108 813414 842336 867044 850207 803812 815180 830527 815913 790655 816776 823298 826338 828168
16096 828168 829351 805492 794329 790092 816554 809679 821577 796506 805703 821607 828740 835347 853419
16083 853419 864388 847421 789990 806519 824172 822976 814688 817296 794500 794934 841934 798924
16071 798924 818610 864681 842538 814217 837888 852453 847149 846329 858551 823639 843515 828087
16059 828087 839765 822501 769022 816104 815441 785615 804632 820935 834778 830445 853350 872069
16047 872069 854086 849782 854788 839428 817079 843667 834665 832254 855348 853792 829392 838528 860974
16034 860974 843953 856247 837793 863671 856784 853704 863541 874054 874283 847466 837716 867951 858829
16021 858829 859561 842841 849563 844137 849520 850398 834203 869218 874914 861205 859747 895980 884528
16008 884528 869636 872982 866697 857883 856719 826527 811933 822370 826535 847542 872734 894351
15996 894351 889599 875604 849042 839197 864353 873377 861776 850417 823165 841253 835305 848571
15984 848571 854402 859110 868232 857376 846088 853311 870832 852120 860816 839395 842174 861997 867657
15971 867657 896403 861962 871461 909102 915867 883061 883088 919703 892305 876863 867868 860059 887169
15958 887169 861479 859984 866903 832869 809203 805886 830283 823407 833928 837506 833434 806857 818602
15945 818602 810734 856944 861511 869723 872271 870585 877763 894451 894673 879482 858085 860602 867639
15932 867639 832678 835615 833658 846177 865718 859933 841813 823382 829390 843452 845326 860778
15920 860778 844811 834485 854941 880495 863670 836576 823224 846730 848631 842255 844597 846097
15908 846097 850625 894859 876992 840880 873463 902327 875620 832781 872177 885406 881048 885749
15896 885749 887202 887001 864642 864939 854521 824359 841796 868792 862026 844612 849434 888948 890086
15883 890086 882927 880907 870954 888407 866248 835529 802913 813607 843847 850096 853211 856582 830594
15870 830594 820408 833928 864862 861408 867804 893225 914518 905681 878748 882386 909530 894823
15858 894823 899814 887965 856489 868640 868771 879487 842132 876993 901073 875405 881002 853589
15846 853589 861137 909050 909462 885401 884257 876048 831801 835313 851402 851921 867560 868352 878172 888676
15832 888676 882810 895043 871587 841741 845686 832995 851810 872871 898241 892508 900224 875367
15820 875367 868054 845390 836840 834777 859316 866288 839110 830047 811993 836636 876577 887679
15808 887679 857773 842068 834973 855718 861306 887191 878898 891698 879717 869920 881172 876444
15796 876444 839813 862609 898553 894682 866659 863118 889840 882019 870239 874415 864321 849329
15784 849329 848589 889258 894891 872452 856214 840061 849464 881428 874699 859719 877491 873494 888637
15771 888637 877784 868241 860194 849644 870728 868295 858445 841439 854832 843669 844681 872928
15759 872928 886317 896662 902503 880155 842438 864486 863944 858117 848106 858826 884702 881387
15747 881387 879903 883147 881406 856783 854891 865385 872793 864430 875811 851202 855239 869234 878480
15734 878480 883679 852551 850143 881043 906339 894704 896097 887719 848625 892373 888519 890708 897279
15721 897279 859267 862700 886298 889307 895038 891079 902287 910651 880848 884199 860383 876129 907079
15708 907079 890503 858048 847772 863544 861615 864854 875967 859067 889042 893230 878901 854539
15696 854539 858600 880690 876712 872058 890565 881693 898764 907514 902194 891637 883439 861284 853265
15683 853265 882134 897485 890768 892312 875775 894309 846495 866086 838357 837376 880794 872204
15671 872204 873700 889643 893964 856177 873563 902881 917276 884325 876082 847636 838154 863766
15659 863766 866542 859134 875818 887604 872876 881740 872778 873580 858693 890019 885185 871254 889979
15646 889979 917983 907850 881044 882275 883923 863852 874285 885452 887878 906693 884427 877314
15634 877314 859788 866036 868090 886841 879461 899539 888794 875223 884957 885594 896668 892768 891133
15621 891133 879624 864212 867967 878351 894956 887690 879438 916308 902253 879632 874151 854395
15609 854395 873040 844504 851453 873799 904493 883151 865095 877155 880861 877254 868763 885782
15597 885782 907209 901200 912885 889073 893109 901631 879655 904685 880736 886566 887965 877253
15585 877253 895835 879352 876915 896305 893232 852448 839051 840691 881469 891078 886961 886635 866974
15572 866974 868090 920867 937319 935129 909083 897930 896304 889025 891550 904671 926784 910013
15560 910013 914612 918714 904477 874150 925700 917260 897006 907157 917332 881609 854465 910839
15548 910839 902816 918414 920726 915471 895745 899468 891339 860139 873993 861540 857334 872275 866189
15535 866189 869579 872523 869293 908239 922699 883589 884203 910966 912627 914783 912532 895291 850616
15522 850616 863716 888232 917817 906952 888593 875826 896396 918672 896183 931057 915620
15511 915620 869953 935337 900613 836507 830075 861892 879063 872976 879687 893418 894350 905094
15499 905094 919489 898422 887264 897577 893080 874717 882747 895393 911319 911925 924989 918202
15487 918202 907267 898709 905206 899497 855806 843484 885741 883995 882469 866849 890359 885380 844221
15474 844221 861573 898033 863176 836451 862458 891901 892012 887022 885650 860244 882058 880977
15462 880977 863912 869128 840806 831762 884810 882960 875391 885036 896738 923681 953998 939962
15450 939962 907132 900377 911324 919517 895438 874589 926178 932978 907327 928037 922565 886611
15438 886611 879237 916169 911650 894434 916882 891330 909000 891704 884604 897124 923299 923718
15426 923718 895372 903779 932538 931307 904367 885656 871517 882537 900198 898246 876903 900163
15414 900163 912220 906199 908761 899904 907951 902894 899917 883460 895415 882500 886750 897939 862532
15401 862532 840672 901392 910350 930697 934806 915527 918381 872464 878568 897728 910697 871072
15389 871072 850526 899361 903631 891827 920839 901922 894280 927184 908809 912164 889023 878228
15377 878228 893608 881506 899652 908085 944090 926995 925587 908189 897050 889263 892498 884246
15365 884246 877834 866622 884945 888027 865552 860354 871218 864616 897990 923373 898461 892822
15353 892822 905557 896095 901575 863413 837640 840719 880867 920191 911181 907208 949207 939460 897621
15340 897621 851933 885690 902065 909572 900478 895543 901821 908966 936002 932267 935590 927777 913058
15327 913058 894005 876505 890727 903384 889039 889285 923878 933157 922635 922241 912983 916332 901816
15314 901816 917181 890653 901938 920074 909415 930846 942510 917696 903090 926856 905907
15303 905907 911121 928801 932787 931517 914210 908366 925819 925366 903242 876768 846537 874654 899606
15290 899606 923490 893782 897123 893360 897262 894775 874279 862181 904033 884943 884022 868160 877351
15277 877351 901883 891520 897961 893815 885178 862611 831760 857209 881054 848149 870884 898007
15265 898007 934718 923679 872183 887985 910310 907861 928204 958139 919311 930862 910068 885140
15253 885140 902516 863426 875640 933025 933663 923636 902672 868658 872706 872795 897742 941921 934546
15240 934546 917894 903391 885289 898816 918840 929723 927765 906564 908599 907886 908419 892087 916920
15227 916920 940009 911762 912169 889366 902758 894615 908401 905394 876257 868826 879649 888391 898103
15214 898103 915740 905493 910945 908993 890327 883258 903943 908027 910931 919278 922567 900252 895403
15201 895403 928229 923561 929340 937264 931316 945117 939686 928232 877409 908114 897880 895900 885929
15188 885929 892990 932717 930451 935151 910453 946655 919219 918346 936125 916157 913874 933369 922652
15175 922652 923788 924089 924701 918002 878477 904247 950141 929635 928550 956343 956962 928272 932996
15162 932996 928881 931121 952685 937054 885033 867011 897952 938567 915731 884228 893434 912468
15150 912468 922461 932673 909796 926685 937182 947986 924314 914083 934294 897142 896176 923149
15138 923149 932741 922136 911225 899156 885101 903336 907135 881774 899971 901390 905584 911156
15126 911156 887193 924162 908777 912466 944234 926159 927011 915466 903970 930241 923760 901226
15114 901226 917159 924532 920580 907846 915168 933895 941804 900989 900544 950249 911461 914334 919099
15101 919099 920228 906284 936715 943174 941061 936285 926441 937347 916934 910557 918741 899800 858832
15088 858832 908439 918748 920145 906862 928952 945234 964278 961305 913456 893229 908409 916829
15076 916829 907440 899364 915641 915791 871830 867031 885940 917721 952529 921787 914001 900547 903915
15063 903915 879311 884990 901670 937315 925041 920415 956110 933248 938374 939590 936279 911916
15051 911916 916172 905911 905251 937362 941454 934689 907289 898898 916176 920341 943988 924404 917070
15038 917070 932768 937464 918838 933458 916663 930307 942787 926213 886286 899614 963063 951860
15026 951860 961534 922668 916103 878117 884613 896344 893993 864374 900572 905124 896271 881848 902101
15013 902101 916008 907683 923237 933703 933536 963793 948343 919650 940786 939524 928386 932659
15001 932659 929459 912838 935254 979009 986282 977577 971338 938873 922546 928500 930872 926864 929115
14988 929115 926219 933689 920707 925608 930621 961120 969997 946093 948607 942618 915999 897838 923015
14975 923015 938617 927264 928137 966238 968836 924817 944953 928575 936081 924554 921342 923642 906052
14962 906052 912173 929133 943166 985428 935267 952554 928807 919358 915284 898216 907289 927727
14950 927727 948420 928329 906362 918188 909029 907351 927025 962696 935418 914514 941698 948781
14938 948781 946506 919102 911059 920262 936645 926687 931627 928276 928279 929284 915680 906642 900011 903917
14924 903917 922325 898283 931793 941516 937491 969128 958656 970586 966327 945182 909176 901982
14912 901982 895697 893533 931002 947960 962313 949894 917765 897699 926685 928219 898944 928449
14900 928449 938438 921048 918647 940798 903725 888505 923803 932970 932209 902080 911201 932487 927785
14887 927785 921332 961268 974635 942233 955734 948046 969337 960087 952878 965800 963649 954456 934948
14874 934948 955464 958283 991818 967729 973072 943011 945773 966255 966942 935878 895626 915593
14862 915593 954679 914549 888641 931831 936276 925029 941822 964400 967720 952603 958502 924569
14850 924569 891425 923738 962950 948735 942039 932863 949883 951528 970765 962870 929197 926673
14838 926673 939061 943570 924524 902221 900135 921637 945846 969692 971735 941534 934023 947156
14826 947156 948713 953611 968527 979624 966011 947520 919138 920256 954818 962936 945055 936457
14814 936457 952639 973296 948379 952160 976591 954303 932393 948354 934111 945831 953449 954233
14802 954233 950563 914682 922382 940054 937805 951361 966573 970892 939813 955511 982105 963258
14790 963258 953776 977438 932271 911493 956066 973784 979432 959554 971049 952023 951274 999193
14778 999193 973368 939712 933757 941811 953249 971527 935041 940989 922382 934536 929375 925419
14766 925419 936733 932753 915337 944976 960561 952974 946300 933094 937692 987450 966650 959272
14754 959272 978619 971883 982448 996302 1007320 979969 969779 955880 933673 931512 918148 955778
14742 955778 969553 945470 946245 925848 942783 948029 956862 974836 979370 936742 963301 991400
14730 991400 981161 958612 961616 962558 931676 927236 930014 926419 964977 975631 932811 957256 979507
14717 979507 961517 1008754 990116 963923 957746 956258 926062 944508 944842 945038 933621 925333 929031
14704 929031 921258 920075 941675 931244 939237 952500 949656 967576 980539 965770 941367 977643
14692 977643 948048 914885 909252 942296 980959 994908 989243 965910 953119 983504 990425 936734
14680 936734 956939 959316 952524 956191 980916 967147 959833 969610 954381 953085 965793 950749 976865
14667 976865 1004167 985915 974100 936382 937140 959915 956269 981247 1002679 1003265 1010248 977774 961655
14654 961655 963487 963610 963960 1012793 989010 969300 939519 921770 908678 942777 963270 948138
14642 948138 933592 919855 917470 939216 962966 1002047 1006304 972368 962692 950072 968015 981361
14630 981361 990571 991935 982247 939550 930775 933112 923825 941235 942200 967551 946277 946204 956249 949134
14616 949134 941005 949012 961326 964444 978765 959352 971402 980936 973258 974553 987534 976770 943802
14603 943802 975114 962813 974638 962173 953805 945847 931086 954096 941462 951045 944488 923349
14591 923349 941575 940374 991840 1025090 1018283 1000908 992057 989177 963934 957572 951577 965615 935664
14578 935664 972912 991378 973790 976244 982816 1001344 991593 966351 955293 955049 973687 983831
14566 983831 968733 969322 988539 962742 982313 956361 958848 981150 996154 988660 961446 941284
14554 941284 943353 923562 958207 962013 964480 986196 973934 959920 991593 1000659 949441 985405
14542 985405 1018469 981074 983288 981461 950705 964390 948609 962149 954198 957168 967971 974761
14530 974761 973717 977098 987998 963642 959733 965980 985978 978191 970209 979758 976144 957538 940539
14517 940539 966224 998591 1022324 1002707 985287 1009092 1001758 1008862 1008679 1003277 1003997 975974 964270
14504 964270 976856 982472 951158 950643 970831 978745 983683 994515 971377 953092 991522 1025342
14492 1025342 988233 985905 997615 974774 984936 953332 930431 961232 950797 951550 971844 999815
14480 999815 964290 961542 957135 985858 1010959 986738 969638 944091 955791 946269 975127 991125
14468 991125 964660 960448 942473 943070 988584 983403 956630 932186 942185 949195 981020 974865 958128
14455 958128 977541 992613 981234 957696 963734 993869 993439 980174 995719 968259 974572 958401
14443 958401 968363 961717 977202 988423 955780 945697 958053 935664 961653 952047 931735 944938
14431 944938 965525 958533 948876 958812 977628 987548 963244 975551 972993 982525 974428 976168 968028
14418 968028 956185 991386 1007061 1011659 1007902 998888 1011142 1012137 1001823 1019436 986555 956692
14406 956692 1003190 964467 944312 944229 977799 973452 983677 1011512 1021976 1010743 1004075 1014196
14394 1014196 983318 984950 1010729 1001145 1007513 982912 962177 972508 944442 965991 961572 963809
14382 963809 993028 979177 1012045 1013763 1039902 1036486 980543 968024 978265 983366 979916 966611
14370 966611 956319 988847 985865 982075 970798 983958 996311 996818 1005570 1024042 1025337 1002309 974047
14357 974047 968670 969029 1006011 999167 983799 999735 999154 1000287 978829 945307 968744 972103 952662
14344 952662 978496 989677 960111 980243 973225 976038 1005760 1004965 976285 976705 989279 986807 981429
14331 981429 979382 960552 951298 1020871 998939 1007626 991851 968507 1010269 1041899 994790 981987
14319 981987 1021286 1005667 989153 1000058 997679 992930 975411 973456 976876 978376 960306 989580
14307 989580 1019671 1056818 1009816 946294 946004 970390 963148 993524 1004184 990324 956310 950831
14295 950831 981671 980408 984561 994260 982939 966445 970127 946688 941458 939086 946110 943146 981024
14282 981024 1004677 1013606 1015144 1008636 1033969 1007646 983917 1006615 1012947 1005354 968483 990501
14270 990501 972726 962862 974054 957247 930366 948944 978806 989266 994024 983302 959045 991231
14258 991231 1009835 995369 1008391 1000719 1005911 1006153 1004379 1024852 1006074 980753 980947 999746 993014
14245 993014 986044 979508 992266 986602 1006839 977981 953901 981724 951579 955667 986670 998352
14233 998352 1005438 1004349 1006598 1020792 1013773 1000852 983625 987017 976877 981479 974464 966524 992847
14220 992847 976613 983028 1013607 1015187 987181 997186 1019628 1041045 1035746 1029196 985817 973068
14208 973068 972351 995240 1021819 1012709 1028295 993041 1009749 1039841 1016613 982812 997096 999664
14196 999664 997629 1000703 967298 991388 990589 1002903 1003078 976176 975655 1007087 992477 993875 986463
14183 986463 983312 981586 996004 1020862 991500 997526 970895 964932 970422 1010843 1003735 1001653 982065
14170 982065 968584 991730 998929 980716 983312 966043 982756 961048 967803 976031 954816 957261
14158 957261 957560 962722 969513 995646 969282 975410 1005301 987751 969598 995072 1008884 1007679 1007518
14145 1007518 983850 997385 1003131 1015790 1010164 991972 1016733 1019550 1008141 1023397 999818 995942
14133 995942 1014363 1038978 1016910 994061 1004033 1040605 1015134 992481 1007949 978818 1004678 1021099
14121 1021099 997596 961880 965059 976720 983571 1014036 1016516 1007413 1001992 992792 997291 983566 970228
14108 970228 1025655 1065910 1009831 994653 1002029 1016269 992537 996952 1000095 992970 1008243 1031210
14096 1031210 1018480 1008330 1021640 1026981 1045224 1040878 1031325 1036734 1031857 990556 985974 991471 1017151
14083 1017151 1023988 1004805 979980 994524 1013199 1044706 985934 950972 999534 999221 1043863 998141
14071 998141 984998 1015330 1025250 1036300 1022759 1003069 1014536 986201 975981 1002018 1009649 1014791
14059 1014791 1016556 1032578 1014118 1012280 1024676 996447 1010385 1037926 1041479 1019430 1013203 1001365
14047 1001365 1030199 1028446 1016824 1020401 1023716 1048928 1033285 1081233 1068468 1030038 1008202 1009552
14035 1009552 1032884 1022191 998082 1007794 1018647 1000724 1001222 1017012 1022540 993098 1008152 1036643
14023 1036643 1027356 1010000 1014732 1009830 1016743 1011704 998786 1000395 1039681 1038925 1036998 1028226 980019
14010 980019 1023912 994618 983974 1031520 1022134 1013268 1048338 1040101 1028831 1023319 1046253 1039239
13998 1039239 1001600 1027219 1049407 1058715 1049184 1017326 977461 1011862 1024229 1042333 1018788 1032770
13986 1032770 1007981 977947 978311 1018013 1052192 1070075 1046082 1022819 1040195 1022142 1022740 1019795
13974 1019795 1051017 1025114 1025685 989741 1013189 1053229 1053257 1044147 1042604 1044916 1024258 1022756 1030669
13961 1030669 1064637 1047340 1020155 1021427 1029835 1054486 1003307 1026553 1029840 1027830 1062687 1057553
13949 1057553 1058274 1056396 1037957 1057898 1055805 1043169 1083702 1050439 1018657 1019154 1020164 1027626 1025107
13936 1025107 1017457 1004098 1041598 1039075 1037466 1026645 1014779 1027006 1024647 1020231 1033869 1052066
13924 1052066 1035944 1070872 1065966 1039671 1043811 1040637 1034993 1042961 1036749 1048397 1050269 1079519 1065324
13911 1065324 1078652 1049629 1025433 1051407 1035714 1021641 996251 983657 989172 1000349 1010102 1034594
13899 1034594 1063878 1088072 1083668 1054802 1020213 1010090 1024892 1038841 1011207 1012714 982535 991175
13887 991175 1047729 1033288 1019660 1014319 1036375 1040876 1018339 1003075 1028041 1013335 1023087 1030176
13875 1030176 1026546 1057950 1066439 1072387 1061662 1065476 1048444 1031852 1013849 1017464 1031705 1026975
13863 1026975 1022836 1034058 1051537 1046475 1022375 1025662 1032841 1009454 1019767 1048764 1051396 1056606
13851 1056606 1047500 1050464 1011471 1012811 1012408 1016902 1023141 1010463 1029619 1027084 1015092 1040518 1069448
13838 1069448 1051605 1024513 1043818 1060133 1061770 1072019 1065365 1040337 1038038 1053471 1047695 1060048
13826 1060048 1069690 1033524 991196 1008947 1028469 1018297 1019467 1048347 1070381 1052797 1002526 1002642
13814 1002642 1026771 1075266 1057612 1023381 1016873 1015266 1045279 1036210 1019891 1036562 1022559 1009874
13802 1009874 1007927 1007213 1021975 1018505 1036351 1047494 1046494 1028035 1075753 1068595 1029411 1020924 1028171
13789 1028171 1032405 1008988 1030039 1019485 1000474 1016450 1000703 1007753 1046757 1031415 1066574 1074586
13777 1074586 1072458 1060263 1055318 1033398 1016042 1036152 1070023 1080843 1064583 1059552 1072534 1029252
13765 1029252 1025866 1048412 1025688 1040195 1045154 1022755 1017890 1046319 1058393 1066224 1071571 1059891
13753 1059891 1020289 1004646 1020144 1053765 1095921 1076507 1057044 1046457 1023903 1038200 1048251
13742 1048251 1017638 1026557 1030924 1044445 1056322 1062256 1040376 1014710 1031517 1052508 1072263 1056241
13730 1056241 1049377 1045123 1038517 1017776 1004688 1052824 1054129 1022432 1028320 1042956 1033724 1027861 1040447
13717 1040447 1063520 1058120 1019555 1026981 1023350 1033183 1020397 1000966 1031907 1007568 1026516 1023758
13705 1023758 1010311 1033625 1032514 1056618 1070919 1092561 1050975 1031918 1046819 1066431 1060159 1073210
13693 1073210 1075420 1078617 1032446 1031145 1020047 1016141 1054590 1077944 1074462 1078943 1024784 1024580 1077455
13680 1077455 1088082 1082202 1077904 1057221 1060950 1091444 1116663 1115122 1081967 1084000 1090028 1088864 1087494
13667 1087494 1070817 1073833 1084847 1101530 1070637 1050250 1088172 1100792 1063142 1069661 1067348 1063453
13655 1063453 1093707 1075646 1102581 1061833 1040137 1057512 1045330 1039720 1079749 1061138 1056432 1050525
13643 1050525 1038876 1019164 1029825 1045145 1044988 1081904 1034852 1032495 1062385 1032349 1015458 1044787
13631 1044787 1062057 1051632 1084836 1051066 1043528 1051769 1051692 1062908 1052924 1041066 1020918 1033235
13619 1033235 1075888 1067261 1074435 1065843 1052388 1045013 1081007 1069548 1056227 1031272 1070283 1089852
13607 1089852 1062206 1053323 1034793 1047963 1029128 1048170 1070442 1077234 1082966 1087070 1096460 1093831
13595 1093831 1030341 1050587 1044099 1015576 1035082 1018196 1003982 1019599 1039280 1014980 1025834
13584 1025834 1065239 1074290 1076833 1084225 1074961 1035289 1054306 1075614 1057412 1057464 1059407 1077494 1083833
13571 1083833 1112951 1084070 1060559 1062658 1064776 1059057 1053176 1034169 1037026 1059548 1066971 1041563
13559 1041563 1080830 1086073 1063543 1074789 1069926 1097212 1054419 1059488 1085928 1079320 1030798 1040015
13547 1040015 1034045 1053610 1056438 1070518 1049560 1064405 1039869 1028269 1040154 1081195 1051819 1050122
13535 1050122 1049950 1019057 1052934 1061208 1080705 1075359 1072654 1070864 1094873 1094140 1091565 1057261 1045435
13522 1045435 1107684 1105032 1069954 1084122 1053181 1090671 1079475 1069723 1063026 1026903 1008491 1010003
13510 1010003 1063319 1074263 1088028 1058055 1041451 1040318 1043588 1061173 1054149 1081043 1071667 1070785
13498 1070785 1101107 1059392 1009167 1038705 1081712 1059823 1030385 1033086 1016830 1045127 1056983
13487 1056983 1073854 1095134 1104060 1087195 1097081 1122953 1080023 1071152 1055414 1068879 1079022 1075181
13475 1075181 1099585 1109245 1122198 1089540 1062204 1058264 1090966 1062143 1076787 1092995 1102641 1095981
13463 1095981 1117399 1109222 1070151 1095775 1117123 1108809 1030696 1041430 1059311 1062412 1054720 1047632
13451 1047632 1042413 1088411 1093063 1075480 1059532 1068522 1108715 1135189 1103977 1062293 1075371 1074171
13439 1074171 1090154 1115515 1126845 1135284 1109288 1072657 1065266 1097300 1109899 1107583 1123441 1143216
13427 1143216 1139323 1128217 1122879 1074114 1051042 1063813 1079584 1059632 1059291 1072161 1073416 1080970
13415 1080970 1062503 1041818 1054965 1039685 1051739 1064532 1059747 1060799 1043680 1045943 1049120 1062314
13403 1062314 1055571 1089294 1100504 1112994 1107679 1065302 1046069 1025162 1034918 1045781 1096878 1113433
13391 1113433 1116259 1108280 1079849 1082459 1081337 1073799 1087134 1097714 1110781 1073166 1072814 1090314 1089259
13378 1089259 1088644 1076621 1090628 1095741 1115011 1087133 1065394 1059712 1068002 1056512 1076837 1100636
$$ [...]
##END NTUPLES=NMR SPECTRUM
##END=
