##TITLE=1H_DE-80H_X3
 200.13MHz, d2o
 8 sc
 
 19ns.26.2.2025
##JCAMPDX= 6.0         $$ Bruker NMR JCAMP-DX V2.0
##DATA TYPE= NMR SPECTRUM
##DATA CLASS= NTUPLES
##ORIGIN= UXNMR, Bruker Analytische Messtechnik GmbH
##OWNER= pz
$$ XWIN-NMR		Version 3.5
$$ Mon Jul  7 11:39:01 2025 Russian Standard Time (UT+4h)  Yarkov@DPX200
##.OBSERVE FREQUENCY= 200.1313
##.OBSERVE NUCLEUS= ^1H
##.ACQUISITION MODE= SIMULTANEOUS
##.ACQUISITION SCHEME= undefined
##.AVERAGES= 8
##.DIGITISER RES= 18
##SPECTROMETER/DATA SYSTEM= spect
##.PULSE SEQUENCE= zg30
##.SOLVENT NAME= CDCl3
##.SHIFT REFERENCE= (INTERNAL, CDCl3, 0, 15.5375)
##AUDIT TRAIL= $$ (NUMBER, WHEN, WHO, WHERE, WHAT)
$$ ##TITLE= Audit trail, XWIN-NMR		Version 3.5
$$ ##JCAMPDX= 5.01
$$ ##ORIGIN= Bruker BioSpin GmbH
$$ ##OWNER= Yarkov
$$ C:/Bruker/XWIN-NMR/data/yarkov2/nmr/H-C/1/pdata/1/auditp.txt
$$ ##AUDIT TRAIL=  $$ (NUMBER, WHEN, WHO, WHERE, WHAT)
(   1,<2025-07-07 11:37:52.62 +0400>,<Yarkov>,<DPX200>,
      <created by zg, POWCHK disabled, PULCHK disabled
       configuration hash MD5:
       00 E9 B6 7A A2 85 ED C7 34 08 36 98 17 FE 4E 26
       data hash MD5: 16K
       B5 9E 3D 69 D6 87 45 21 4B 9C 62 EC DA B1 DF F3>)
(   2,<2025-07-07 11:37:59.06 +0400>,<Yarkov>,<DPX200>,
      <Start of raw data processing
       efp BC_mod = 2 LB = 0.25 FT_mod = 6 PKNL = 1 PHC0 = -1361.838 PHC1 = 13.64948 SI = 16K 
       data hash MD5: 16K
       9B 4D 45 3D 7B 96 C0 A7 53 B5 59 C1 E1 CF 49 E7>)
(   3,<2025-07-07 11:38:07.60 +0400>,<Yarkov>,<DPX200>,
      <abs ABSG = 5 
       data hash MD5: 16K
       36 75 C6 61 3C 36 CF 63 8B E6 3F A8 5A 5E 0E 59>)
$$ ##END=
$$ 
$$ hash MD5
$$ AA 30 87 BA C7 C0 A7 4E 6D F4 89 A4 2C F6 2D EF
##$RELAX= 
##$RELAX= 
##$RELAX= 
##$RELAX= 
##$RELAX= 
##$RELAX= 
$$ Bruker specific parameters
$$ --------------------------
##$DU= <C:/Bruker/XWIN-NMR>
##$EXPNO= 1
##$NAME= <H-C>
##$PROCNO= 1
##$TYPE= <nmr>
##$USER= <yarkov2>
##$AMP= (0..31)
100 100 100 100 100 100 100 100 100 100 100 100 100 100 100 100 100 100 
100 100 100 100 100 100 100 100 100 100 100 100 100 100 
##$AQSEQ= 0
##$AQ_mod= 1
##$AUNM= <au_zg>
##$AUTOPOS= <>
##$BF1= 200.13
##$BF2= 200.13
##$BF3= 200.13
##$BF4= 200.13
##$BF5= 200.13
##$BF6= 200.13
##$BF7= 200.13
##$BF8= 200.13
##$BYTORDA= 1
##$CFDGTYP= 0
##$CFRGTYP= 5
##$CHEMSTR= <none>
##$CNST= (0..31)
1 1 145 1 1 1 1 1 1 1 1 1 1 1 1 1 1 1 1 1 1 1 1 1 1 1 1 1 1 1 1 1 
##$CPDPRG= <>
##$CPDPRG1= <>
##$CPDPRG2= <>
##$CPDPRG3= <>
##$CPDPRG4= <mlev>
##$CPDPRG5= <mlev>
##$CPDPRG6= <mlev>
##$CPDPRG7= <mlev>
##$CPDPRG8= <mlev>
##$CPDPRGB= <>
##$CPDPRGT= <>
##$D= (0..31)
0 0.7 0 0 0 0 0 0 0 0 0 0.03 0 0 0 0 0 0 0 0 0 0 0 0 0 0 0 0 0 0 0 0 
##$DATE= 1751873872
##$DBL= (0..7)
120 120 120 120 120 120 120 120 
##$DBP= (0..7)
150 150 150 150 150 150 150 150 
##$DBP07= 0
##$DBPNAM0= <>
##$DBPNAM1= <>
##$DBPNAM2= <>
##$DBPNAM3= <>
##$DBPNAM4= <>
##$DBPNAM5= <>
##$DBPNAM6= <>
##$DBPNAM7= <>
##$DBPOAL= (0..7)
0.5 0.5 0.5 0.5 0.5 0.5 0.5 0.5 
##$DBPOFFS= (0..7)
0 0 0 0 0 0 0 0 
##$DE= 6
$$ [...]
##$SUBNAM3= <"">
##$SUBNAM4= <"">
##$SUBNAM5= <"">
##$SUBNAM6= <"">
##$SUBNAM7= <"">
##$SUBNAM8= <"">
##$SUBNAM9= <"">
##$SW= 18.0517328524113
##$SWIBOX= (0..15)
0 0 2 0 0 0 0 0 0 0 0 0 0 0 0 0 
##$SW_h= 3612.71676300578
##$TD= 16384
##$TD0= 1
##$TE= 0
##$TE2= 300
##$TE3= 300
##$TEG= 300
##$TL= (0..7)
0 120 120 120 120 120 120 120 
##$TP= (0..7)
150 150 150 150 150 150 150 150 
##$TP07= 0
##$TPNAME0= <>
##$TPNAME1= <>
##$TPNAME2= <>
##$TPNAME3= <>
##$TPNAME4= <>
##$TPNAME5= <>
##$TPNAME6= <>
##$TPNAME7= <>
##$TPOAL= (0..7)
0.5 0.5 0.5 0.5 0.5 0.5 0.5 0.5 
##$TPOFFS= (0..7)
0 0 0 0 0 0 0 0 
##$TUNHIN= 0
##$TUNHOUT= 0
##$TUNXOUT= 0
##$USERA1= <user>
##$USERA2= <user>
##$USERA3= <user>
##$USERA4= <user>
##$USERA5= <user>
##$V9= 5
##$VALIST= <valist>
##$VCLIST= <CCCCCCCCCCCCCCC>
##$VD= 0
##$VDLIST= <DDDDDDDDDDDDDDD>
##$VPLIST= <PPPPPPPPPPPPPPP>
##$VTLIST= <TTTTTTTTTTTTTTT>
##$WBST= 1024
##$WBSW= 4
##$XGAIN= (0..3)
0 0 0 0 
##$XL= 0
##$YL= 0
##$YMAX_a= 272145
##$YMIN_a= -271263
##$ZGOPTNS= <>
##$ZL1= 120
##$ZL2= 120
##$ZL3= 120
##$ZL4= 120
##$ABSF1= 15.5056
##$ABSF2= -2.546249
##$ABSG= 5
##$ABSL= 3
##$ALPHA= 0
##$AQORDER= 0
##$ASSFAC= 0
##$ASSFACI= 0
##$ASSFACX= 0
##$ASSWID= 0
##$AUNMP= <proc_1d>
##$AZFE= 0.1
##$AZFW= 0.1
##$BCFW= 0
##$BC_mod= 2
##$BYTORDP= 0
##$COROFFS= 0
##$CY= -3
##$DATMOD= 1
##$DC= 0
##$DFILT= <>
##$DTYPP= 0
##$F1P= 0
##$F2P= 0
##$FCOR= 1
##$FTSIZE= 16384
##$FT_mod= 6
##$GAMMA= 0
##$GB= 0
##$INTBC= 1
##$INTSCL= 3.241238e-09
##$ISEN= 128
##$LB= 0.25
##$LEV0= 0
##$LPBIN= 0
##$MAXI= 10000
##$MC2= 0
##$MEAN= 0
##$ME_mod= 0
##$MI= 1.114404
##$NCOEF= 0
##$NC_proc= -7
##$NLEV= 6
##$NOISF1= 3.799351
##$NOISF2= 2.8
##$NSP= 0
##$NTH_PI= 0
##$NZP= 0
##$OFFSET= 15.53755
##$PC= 1
##$PHC0= -1361.838
##$PHC1= 13.64948
##$PH_mod= 1
##$PKNL= yes
##$PPARMOD= 0
##$PSCAL= 0
##$PSIGN= 0
##$REVERSE= no
##$SF= 200.129996829746
##$SI= 16384
##$SIGF1= 3
##$SIGF2= 2
##$SINO= 0.751879
##$SIOLD= 32768
##$SREGLST= <19F.Aceton>
##$SSB= 0
##$STSI= 16384
##$STSR= 0
##$SW_p= 3612.71676300578
##$SYMM= 0
##$S_DEV= 0
##$TDeff= 16384
##$TDoff= 0
##$TI= <>
##$TILT= no
##$TM1= 0
##$TM2= 0
##$TOPLEV= 0
##$USERP1= <user>
##$USERP2= <user>
##$USERP3= <user>
##$USERP4= <user>
##$USERP5= <user>
##$WDW= 1
##$XDIM= 16384
##$YMAX_p= 535820952
##$YMIN_p= -1149975
$$ End of Bruker specific parameters
$$ ---------------------------------
##NTUPLES= NMR SPECTRUM
##VAR_NAME=  FREQUENCY,     SPECTRUM/REAL,   SPECTRUM/IMAG
##SYMBOL=    X,             R,               I
##VAR_TYPE=  INDEPENDENT,   DEPENDENT,       DEPENDENT
##VAR_FORM=  AFFN,          ASDF,            ASDF
##VAR_DIM=   16384,         16384,           16384
##UNITS=     HZ,            ARBITRARY UNITS, ARBITRARY UNITS
##FACTOR=    0.220516191357247, 1,           1
##FIRST=     3109.52982674529, 0,            0
##LAST=      -503.186936260495, 0,           0
##MIN=       -503.186936260495, -1149975,    0
##MAX=       3109.52982674529, 535820952,    0
$$ Real data points
##PAGE= N=1
##DATA TABLE= (X++(R..R)), XYDATA
$$ [...]
$$ plain form
5964 922373 915319 976067 965058 885894 778808 672828 810244 939846 934954 885933 923915
5953 923915 915798 972781 985846 880257 883084 855013 868772 904808 889183 864702 905237 956430
5941 956430 1070374 1206730 1198592 1235709 1096236 1121645 1016593 931213 978125 957869 898914
5930 898914 1080451 1027974 915108 1022151 1059501 1070476 1050562 1175473 1067466 1207027
5920 1207027 1193492 1181529 1271740 1282709 1316295 1238124 1059916 1028016 1198894 1107789 1179783
5909 1179783 1112927 1030238 1204692 1152312 997613 999729 999100 1124599 927751 953412 1084968
5898 1084968 1049207 999235 859418 936608 919307 825557 895966 878479 910844 1087359 1088490
5887 1088490 1127945 974404 924407 1000470 994383 1009139 969881 919201 885331 827251 857845
$$ packed form
5964I22373p054O0748j1009p9164j07086j05980J37416J29602m892m9021L7982
5953I23915q117N6983J3065j05589K827k8071J3759L6036j5625k4481M0535N1193
5941I56430J13944J36356q138L7117j39473K5409j05052q5380M6912k0256n8955
5930H98914J81537n2477j12866J07043L7350J0975j9914J24911j08007J39561
5920A207027j3535j1963R0211J0969L3586p8171j78208l1900J70878r1105P1994
5909A179783o6856q2689J74454n2380j54699K116o29J25499j96848K5661J31556
5898A084968l5761m9972j39817P7190j7301r3750P0409j7487L2365J76515J131
5887A088490L9455j53541m9997P6063o087J4756l9258n0680l3870n8080L0594
$$ plain form
5876 857845 945361 1043709 938232 877602 964185 938839 854143 854813 843449 851874 759577 834863
5864 834863 816672 683549 748851 795019 957897 933187 830437 813028 732073 590490 714283
5853 714283 669981 734105 780785 808513 780527 886353 862791 736660 768927 884827 886075
5842 886075 1030546 1045442 881379 976952 1082226 855890 827214 868317 862593 723883 798072
5831 798072 835872 777976 885152 834739 802198 900697 996772 716733 687468 830878 821569
5820 821569 873583 965657 829241 791582 927013 990188 1024591 1055207 1023618 1076462 1073216
5809 1073216 1058092 1001842 893574 798034 960992 953527 963638 1007603 895295 898235 1104452
5798 1104452 1055987 1050062 1097611 1117870 1055067 901429 934007 1037643 1124658 1102923 1175810
$$ packed form
5876H57845Q7516R8348j05477o0630Q6583k5346q4696O70j1364Q425r2297P5286
5864H34863j8191j33123O5302M6168J62878k4710j02750j7409q0955j41583J23793
5853G14283m4302O4124M6680K7728k7986J05826k3562j26131L2267J15900J248
5842H86075J44471J4896j64063R5573J05274k26336k8676M1103n724j38710P4189
5831G98072L7800n7896J07176n0413l2541R8499R6075k80039k9265J43410r309
5820H21569N2014R2074j36416l7659J35431O3175L4403L0616l1589N2844l246
5809A073216j5124n6250j08268r5540J62958p465J0111M3965j12308K940K06217
5798A104452m8465n925M7549K0259o2803j53638L2578J03636Q7015k1735P2887
$$ plain form
5787 1175810 1146985 1084887 1106033 1050601 1160971 1228560 1213012 1244336 1138131 1090171 1215554
5776 1215554 1251900 1222042 1268506 1185931 1228672 1285963 1245340 1333515 1217714 1356036 1435705
5765 1435705 1314305 1473603 1426429 1395759 1318153 1420624 1529131 1391844 1484001 1520167
5755 1520167 1403437 1541237 1688172 1619730 1667165 1817641 1831559 1835879 1741354 1786215 1846401
5744 1846401 1714270 1852752 1905429 1956539 1879782 1979491 2012169 1922526 1942002 1992447 2016537
5733 2016537 2063024 2005087 2173762 2281403 2209859 2279002 2361061 2563680 2679726 2534197
5723 2534197 2719925 2820946 2933831 3129897 3241054 3447880 3599023 3699817 4016295 4438560
5713 4438560 4790391 4896537 5287903 5902472 6575251 7409550 8130799 7873998 7059298 6425316
$$ packed form
5787A175810k8825o2098K1146n5432J10370O7589j5548L1324j06205m7960J25383
5776A215554L6346k9858M6464q2575M2741N7291m0623Q8175j15801J38322P9669
5765A435705j21400J59298m7174l0670p7606J02471J08507j37287R2157L6166
5755A520167j16730J37800J46935o8442M7435J50476J3918M320r4525M4861O0186
5744A846401j32131J38482N2677N1110p6757R9709L2678q9643J9476N0445K4090
5733B016537M6487n7937J68675J07641p1544O9143Q2059K02619J16046j45529
5723B534197J85728J01021J12885J96066J11157K06826J51143J00794L16478M22265
5713D438560L51831J06146L91366O14569O72779Q34299P21249k56801q14700o33982
$$ plain form
5703 6425316 5940026 5582003 5184418 5034535 4899626 4922466 4994295 5040305 4982273 5204690
5693 5204690 5334412 5539518 5873817 6015557 6303059 6636342 7022811 7448819 7751861 8378719
5683 8378719 9282919 10101911 10706323 11579135 12786285 14324176 16404028 18747154 20115939
5674 20115939 19195844 16634795 14269213 12458515 11060684 10101418 9333272 8644211 8256244
5665 8256244 8047899 7905722 7588555 7620894 7576173 7637697 7871161 7993617 8158999 8346556
5655 8346556 8742052 9209583 9723277 10255890 10952608 11610289 12295176 13215714 14319679
5646 14319679 16028499 18188409 20333535 21218371 19882225 17011823 14494662 12526076
5638 12526076 11317047 10309995 9414417 8924512 8648371 8181590 7899013 7650567 7338223
$$ packed form
5703F425316m85290l58023l97585j49883j34909K2840P1829M6010n8032K22417
5693E204690J29722K05106L34299J41740K87502L33283L86469M26008L03042O26858
5683H378719R04200Q18992O04412Q72812J207150J537891K079852K343126J368785
5674B0115939r20095k561049k365582j810698j397831r59266p68146o89061l87967
5665H256244k08345j42177l17167L2339m4721O1524K33464J22456J65382J87557
5655H346556L95496M67531N13694N32613O96718O57681O84887R20538J103965
5646A4319679J708820K159910K145126Q84836j336146k870402k517161j968586
5638A2526076j209029j007052q95578m89905k76141m66781k82577k48446l12344
$$ plain form
5629 7338223 7012167 6980077 6987237 6902664 6909519 6914928 6921941 7022580 7245793 7308286 7516641
5618 7516641 7771999 7941747 8164393 8752532 9238335 9852089 10492513 10676694 10084104 9114954
5608 9114954 8162079 7567560 7032244 6566006 6358074 6239719 5994753 5794809 5800003 5790623
5598 5790623 5568441 5599493 5532518 5527067 5373220 5368515 5418683 5455396 5359722 5333411 5324752 5382404
5586 5382404 5322335 5486565 5629533 5644741 5605697 5485742 5500560 5612946 5610492 5647064 5754614
5575 5754614 5508136 5601016 5675075 5755372 5716285 5718079 5733311 5762879 5749613 5839545 6034317
5564 6034317 6131553 6202131 6339487 6472756 6428846 6593329 6499667 6532455 6662609 6611983 6658086
5553 6658086 6721579 6862542 7059621 7128416 7189596 7178029 7157088 7256877 7262252 7354045 7341722
$$ packed form
5629G338223l26056l2090P160q4573O855N409P013J00639K23213O2493K08355
5618G516641K55358J69748K22646N88139M85803O13754O40424J84181n92590r69150
5608I114954r52875n94519n35316m66238k07932j18355k44966j99944N194r380
5598E790623k22182L1052o6975n451j53847m705N0168L6713r5674k6311q659N7652
5586E382404o0069J64230J42968J5208l9044j19955J4818J12386k454L6572J07550
5575E754614k46478R2880P4059Q0297l9087J794J5232K9568j3266Q9932J94772
5564F034317R7236P0578J37356J33269m3910J64483r3662L2788J30154n0626M6103
5553F658086O3493J40963J97079O8795O1180j1567k0941R9789N375R1793j2323
$$ plain form
5542 7341722 7269792 7278336 7336903 7375905 7500271 7693016 7773446 7937793 8088211 8062242 8093434
5531 8093434 8237157 8374704 8508510 8445519 8455781 8519480 8680637 8733100 8790171 9071310
5521 9071310 9203439 9133211 9163287 9039789 9016624 8968899 8938243 8907530 8899574 9168725 9147290
5510 9147290 9272407 9480585 9662244 9649345 9724631 9878523 10110954 10082949 10192616 10384838
5500 10384838 10329299 10293557 10511899 10827030 10800965 10891909 11010209 11124048 11115129 11146236 11275421
5489 11275421 11425206 11448734 11382110 11286308 11398568 11650829 11803714 12021278 12226886 12329490
5479 12329490 12500912 12619346 12709388 12753490 12916437 13096662 13207771 13153898 13174312 13462848
5469 13462848 13675009 14042919 14234250 14443431 14700458 14853981 15144327 15337947 15510504
$$ packed form
5542G341722p1930Q544N8567L9002J24366J92745Q0430J64347J50418k5969L1192
5531H093434J43723J37547J33806o2991J0262O3699J61157N2463N7071K81139
5521I071310J32129p0228L0076j23498k3165m7725l0656l0713p956K69151k1435
5510I147290J25117K08178J81659j2899P5286J53892K32431k8005J09667J92222
5500A0384838n5539l5742K18342L15131k6065R0944J18300J13839q919L1107J29185
5489A1275421J49785K3528o6624r5802J12260K52261J52885K17564K05608J02604
5479A2329490J71422J18434R0042M4102J62947J80225J11109n3873K0414K88536
5469A3462848K12161L67910J91331K09181K57027J53523K90346J93620J72557
$$ plain form
5460 15510504 15646091 16010028 16414861 16921918 17476154 17930805 18464126 18952778 19620996
5451 19620996 20415303 21182723 22022324 23201647 24388933 25730718 27297150 28898913 30794819
5442 30794819 32654357 34391878 36319374 38843271 42774820 48283937 55424585 61707472
5434 61707472 62386207 55009327 46561558 40462919 36162570 33039520 30663347 29003085
5426 29003085 27749262 26636286 25856869 25114163 24466087 24056486 23465129 23043592 22557336
5417 22557336 22224372 22078823 21960330 21832696 21833477 21636102 21339565 21007156 20680149 20217719
5407 20217719 20013839 19741455 19443020 19267891 19115119 18881176 18871986 18922960 18968386 18883327
5397 18883327 18953203 19097211 19052011 19055256 18908216 18718838 18804583 18654273 18558794 18530975 18613435
$$ packed form
5460A5510504J35587L63937M04833N07057N54236M54651N33321M88652O68218
5451A9620996P94307P67420Q39601J179323J187286J341785J566432J601763J895906
5442C0794819J859538J737521J927496K523897L931549N509117P140648O282887
5434F1707472O78735p376880q447769o098639m300349l123050k376173j660262
5426B9003085j253823j112976p79417p42706o48076m09601n91357m21537m86256
5417B2557336l32964j45549j18493j27634P81j97375k96537l32409l27007m62430
5407B0217719k03880k72384k98435j75129j52772k33943r190N0974M5426q5059
5397A8883327O9876J44008m5200L245j47040j89378Q5745j50310r5479k7819Q2460
$$ plain form
5386 18613435 18424541 18336342 18520858 18496964 18184160 17897697 17899791 17877605 17630080 17436218
5376 17436218 17372833 17313687 17261385 17270960 17254730 17206370 17195062 17172516 17158435 17068138 17037156
5365 17037156 17037199 16957058 16845255 16737294 16663222 16606723 16467940 16380219 16400843 16399873 16467092 16324287
5353 16324287 16217984 16170402 16150075 16149785 16079726 15993554 15998233 16000772 15825430 15767472 15703787 15612189
5341 15612189 15622301 15724242 15827027 15765090 15605660 15473510 15314616 15394569 15353776 15392206
5331 15392206 15367247 15331386 15368882 15342965 15259266 15185919 15226249 15313536 15290885 15204816 15294256
5320 15294256 15248015 15236654 15296844 15145643 15122947 15010337 14926269 14873003 14845805 14926752 14965563
5309 14965563 14954656 14826294 14770930 14526061 14481672 14512421 14706395 14601278 14491458 14498346
$$ packed form
5386A8613435j88894q8199J84516k3894l12804k86463K094k2186k47525j93862
5376A7436218o3385n9146n2302R575j6230m8360j1308k2546j4081r0297l0982
5365A7037156M3q0141j11803j07961p4072n6499j38783q7721K0624r70O7219j42805
5353A6324287j06303m7582k0327k90p0059q6172M679K539j75342n7958o3685r1598
5341A5612189J0112J01941J02785o1937j59430j32150j58894P9953m0793L8430
5331A5392206k4959l5861L7496k5917q3699p3347M0330Q7287k2651q6069Q9440
5320A5294256m6241j1361O0190j51201k2696j12610q4068n3266k7198Q0947L8811
5309A4965563j0907j28362n5364k44869m4389L0749J93974j05117j09820O888
$$ plain form
5299 14498346 14477367 14460767 14488387 14495478 14621377 14576813 14544087 14526119 14471011 14402820 14470137
5288 14470137 14457495 14279715 14277612 14273592 14522241 14512291 14395178 14463291 14250304 14174072 14311851
5277 14311851 14224059 14248739 14241128 14108638 14099048 14088417 14106332 14163720 14109834 14097061 14132948
5266 14132948 14061308 14021242 14128743 14031118 14131876 14127286 14111824 14256898 14250649 14203445 14094327
5255 14094327 14044042 14247068 14264271 14222153 14115590 14039891 14163957 14224191 14161882 14111431 14133727
5244 14133727 14116702 14101231 14018244 14003768 14140183 14096065 14191819 14219060 14082488 14244487 14147566
5233 14147566 14115289 14141142 14275943 14410156 14346887 14402140 14375680 14314026 14187122 14328481
5223 14328481 14227056 14278025 14398734 14419870 14396360 14476594 14379829 14338836 14450313 14376186 14347637
$$ packed form
5299A4498346k0979j6600K7620P091J25899m4564l2726j7968n5108o8191O7317
5288A4470137j2642j77780k103m020K48649r950j17113O8113k12987p6232J37779
5277A4311851q7792K4680p611j32490r590j0631J7915N7388n3886j2773L5887
5266A4132948p1640m0066J07501r7625J00758m590j5462J45074o249m7204j09118
5255A4094327n0285K03026J7203m2118j06563p5699J24066O0234o2309n0451K2296
5244A4133727j7025j5471q2987j4476J36415m4118R5754K7241j36572J61999r6921
5233A4147566l2277K5853J34801J34213o3269N5253k6460o1654j26904J41359
5223A4328481j01425N0969J20709K1136k3510Q0234r6765m0993J11477p4127k8549
$$ plain form
5212 14347637 14377877 14439472 14512612 14465515 14559052 14568749 14572891 14536905 14614515 14630170 14714467 14563668
5200 14563668 14506682 14514931 14570696 14630460 14542257 14606131 14692234 14668890 14767104 14733585 14764512
5189 14764512 14868386 14860869 14949822 14942072 14963425 14825262 14864659 14879068 14893991 14975993 15034621
5178 15034621 15025497 15210448 15046262 15003017 15094854 14929049 14912912 15064627 15192402 15268032
5168 15268032 15296594 15278504 15233108 15312490 15380886 15391788 15243900 15216212 15122794 15255691 15320605
5157 15320605 15348758 15420236 15426676 15446678 15524587 15516966 15481671 15524702 15482184 15359075 15402237
5146 15402237 15456310 15532334 15590207 15569190 15492618 15454884 15381413 15419740 15400690 15467621 15565116
5135 15565116 15709770 15567052 15476171 15435760 15568200 15565110 15605352 15653092 15616782 15604523 15512849
$$ packed form
5212A4347637L0240O1595P3140m7097R3537R697M142l5986P7610J5655Q4297j50799
5200A4563668n6986Q249N5765N9764q8203O3874Q6103k3344R8214l3519L0927
5189A4764512J03874p517Q8953p750K1353j38163L9397J4409J4923Q2002N8628
5178A5034621r124J84951j64186m3245R1837j65805j6137J51715J27775P5630
5168A5268032K8562j8090m5396P9382O8396J0902j47888k7688r3418J32897O4914
5157A5320605K8153P1478O440K0002P7909p621l5295M3031m2518j23109M3162
5146A5402237N4073P6024N7873k1017p6572l7734p3471L8327j9050O6931R7495
5135A5565116J44654j42718r0881m0411J32440l090M0242M7740l6310j2259r1674
$$ plain form
5124 15512849 15455431 15325101 15421931 15545468 15616833 15573940 15590202 15519861 15457478 15540291 15399317
5113 15399317 15467570 15526535 15445414 15453472 15433165 15450090 15326141 15158946 14996296 14960554 14909010
5102 14909010 14750954 14852082 14869066 14827024 14741187 14709770 14786851 14655333 14754757 14642087
5092 14642087 14607635 14464391 14401003 14195257 14349221 14324058 14416982 14323999 14106380 14042076
5082 14042076 13912442 13841611 13742900 13721453 13807261 13770225 13776477 13745837 13641852 13594036 13506674
5071 13506674 13451187 13372166 13456003 13366492 13378672 13234036 13002283 13065862 13125990 13110652 13098363
5060 13098363 12851732 12798312 12888280 12893913 12746086 12725156 12890653 12818905 13035181 12969625 12971301
5049 12971301 13067576 12916415 12828457 12746242 12852036 12910718 12702918 12475043 12272306 12113680
$$ packed form
5124A5512849n7418j30330R6830J23537P1365m2893J6262p0341o2383Q2813j40974
5113A5399317O8253N8965q1121Q058k0307J6925j23949j67195j62650l5742n1544
5102A4909010j58056J01128J6984m2042q5837l1417P7081j31518R9424j12670
5092A4642087l4452j43244o3388k05746J53964k5163R2924r2983k17619o4304
5082A4042076j29634p0831r8711k1447Q5808l7036O252l0640j03985m7816q7362
5071A3506674n5487p9021Q3837q9511J2180j44636k31753O3579O0128j5338j2289
5060A3098363k46631n3420Q9968N633j47827k0930J65497p1748K16276o5556J676
5049A2971301R6275j51161q7958q2215J05794N8682k07800k27875k02737j58626
$$ plain form
5039 12113680 11905212 11730692 11593829 11545827 11520948 11250639 11274054 11217704 11125549 10969858
5029 10969858 10847142 10834049 10726904 10642700 10458101 10447303 10344850 10392146 10333198 10128163
5019 10128163 9984391 9912292 9921502 9791725 9718004 9687232 9671660 9644101 9689136 9615267 9394325
5008 9394325 9354135 9237165 9133737 9241080 9181279 9147656 9041192 8967224 8934224 8833684
4998 8833684 8768699 8808363 8813899 8685002 8589908 8715278 8658993 8702523 8676438 8712044 8877702
4987 8877702 8826781 8823701 8767967 8699635 8790795 8777737 8643313 8706890 8549446 8322378 8330024
4976 8330024 8324055 8233627 8324028 8222429 8206610 8162668 8142825 8282960 8230977 8163004 8268685
4965 8268685 8388274 8416612 8426489 8571834 8646766 8447193 8223387 8094428 8219565 8236387
$$ packed form
5039A2113680k08468j74520j36863m8002k4879k70309K3415n6350r2155j55691
5029A0969858j22716j3093j07145q4204j84599j0798j02453M7296n8948k05035
5019A0128163j43772p2099R210j29777p3721l0772j5572k7559M5035p3869k20942
5008I394325m0190j16970j03428J07343n9801l3623j06464p3968l3000j00540
4998H833684o4985L9664N536j28897r5094J25370n6285M3530k6085L5606J65658
4987H877702n0921l080n5734o8332R1160j3058j34424O3577j57444k27068P646
4976H330024n969r0428R0401j01599j5819m3942j9843J40135n1983o7973J05681
4965H268685J19589K8338R877J45345P4932j99573k23806j28959J25137J6822
$$ plain form
4955 8236387 8132841 8060991 8127801 8168917 8189884 8181624 8102213 8010230 7882984 7972514 8018168
4944 8018168 7996125 7978248 7890718 7939971 7936694 8126416 8034064 8008436 8000413 7917430 7909930 8043996
4932 8043996 8112339 8155293 8185884 8270138 8336908 8354976 8390635 8195828 8024819 7901856 7923607
4921 7923607 7679965 7497513 7355641 7301424 7422020 7319392 7203841 7090640 7075066 7024525
4911 7024525 6841158 6757228 6615925 6530920 6435443 6340867 6243074 6168713 6109421 5824093 5797757
4900 5797757 5816908 5747235 5749466 5633628 5564735 5466107 5481562 5545508 5342357 5278795 5329473
4889 5329473 5306814 5239002 5250070 5098491 4921564 4862451 4716629 4675196 4549719 4397337
4879 4397337 4359204 4369877 4335826 4243400 4148498 4132010 4210353 4095620 3940046 3844082 3907353
$$ packed form
4955H236387j03546p1850O6810M1116K0967q260p9411r1983j27246Q9530M5654
4944H018168k2043j7877q7530M9253l277J89722r2352k5628q023q2983p500J34066
4932H043996O8343M2954L0591Q4254O6770J8068L5659j94807j71009j22963K1751
4921G923607k43642j82452j41872n4217J20596j02628j15551j13201j5574n0541
4911G024525j83367q3930j41303q5005r5477r4576r7793p4361n9292k85328k6336
4900E797757J9151o9673K231j15838o8893r8628J5455O3946k03151o3562N0678
4889E329473k2659o7812J1068j51579j76927n9113j45822m1433j25477j52382
4879D397337l8133J0673l4051r2426r4902j6488P8343j14733j55574r5964O3271
$$ plain form
4868 3907353 3874888 3720965 3789501 3663559 3830334 3697144 3576499 3753295 3724028 3630300
4858 3630300 3676852 3694796 3711604 3804625 3797146 3778292 3864836 3935542 3898589 3853834 3823843 3959043
4846 3959043 4048371 4134059 4343557 4524552 4773372 5074681 5334846 5575880 5863885 6228066
4836 6228066 6750204 7082917 7448705 8143001 8940248 9680153 10519310 11489887 12887623
4827 12887623 14770141 17164761 18833291 18469779 16085508 13349329 11298935 9755489
4819 9755489 8624315 7800876 7072785 6524844 6138279 5654003 5290115 5088495 4884730
4810 4884730 4537656 4235440 4103043 4017351 3818406 3647876 3600203 3447261 3306789 3345394
4800 3345394 3139686 3089564 3074769 2951025 2995289 2977602 2780738 2691402 2749864 2715935 2559988
$$ packed form
4868C907353l2465j53923O8536j25942J66775j33190j20645J76796k9267r3728
4858C630300M6552J7944J6808R3021p479j8854Q6544P0706l6953m4755k9991J35200
4846C959043Q9328Q5688K09498J80995K48820L01309K60165K41034K88005L64181
4836F228066N22138L32713L65788O94296P97247P39905Q39157R70577J397736
4827A2887623J882518K394620J668530l63512k384271k736179k050394j543446
4819I755489j131174q23439p28091n47941l86565m84276l63888k01620k03765
4810D884730l47074l02216j32397q5692j98945j70530m7673j52942j40472L8605
4800C345394k05708n0122j4795j23744M4264j7687j96864q9336N8462l3929j55947
$$ plain form
4789 2559988 2446212 2293468 2382873 2456893 2526167 2293433 2240928 2379568 2292506 2159374
4779 2159374 2119099 2172212 2097110 2063838 1918616 1805706 1932631 2004464 1999434 2006433 1862602
4768 1862602 1995140 2175472 2189141 1949104 1772037 1834291 1774943 1862256 1830847 1775225 1636782
4757 1636782 1706722 1676478 1618976 1673381 1749814 1835108 1829071 1768509 1757489 1705807 1632560 1583503
4745 1583503 1654197 1686312 1662543 1639400 1585214 1518964 1607005 1771515 1784278 1722858 1736738
4734 1736738 1772311 1663764 1488599 1487868 1456542 1456840 1571707 1550732 1517588 1530974 1460400 1387429
4722 1387429 1416925 1422342 1420438 1500956 1451065 1444530 1585639 1713294 1561355 1393547 1336893
4711 1336893 1447794 1452204 1478581 1581188 1571777 1537738 1476755 1437668 1528883 1511312 1328835
$$ packed form
4789B559988j13776j52744Q9405P4020O9274k32734n2505J38640q7062j33132
4779B159374m0275N3113p5102l3272j45222j12910J26925P1833n030O999j43831
4768A862602J32538J80332J3669k40037j77067O2254n9348Q7313l1409n5622j38443
4757A636782O9940l0244n7502N4405P6433Q5294o037o0562j1020n1682p3247m9057
4745A583503P0694L2115k3769k3143n4186o6250Q8041J64510J2763o1420J3880
4734A736738L5573j08547j75165p31l1326K98J14867k0975l3144J3386p0574p2971
4722A387429K9496N417j904Q0518m9891o535J41109J27655j51939j67808n6654
4711A336893J10901M410K6377J02607r411l4039o0983l9087R1215j7571j82477
$$ plain form
4700 1328835 1470397 1444902 1436103 1470423 1450269 1299550 1360895 1423099 1427487 1415443 1629685
4689 1629685 1533431 1472386 1452260 1409631 1426407 1453247 1417050 1513034 1528603 1582265 1476268
4678 1476268 1469819 1621463 1699349 1630196 1535564 1475784 1508670 1526175 1583517 1549029 1451504
4667 1451504 1421689 1511611 1531260 1591377 1623647 1577688 1570571 1517507 1433323 1373395 1397510 1429334
4655 1429334 1509284 1500515 1529362 1637005 1482109 1468658 1551127 1446612 1377703 1363578 1545953
4644 1545953 1396364 1460416 1578759 1475081 1379260 1499785 1599178 1567079 1350545 1421723
4634 1421723 1334380 1343051 1412024 1471863 1495286 1518056 1471452 1447204 1561451 1435760 1463960
4623 1463960 1467893 1396351 1436037 1378157 1433731 1493622 1579856 1548935 1511027 1535441 1549694 1618801
$$ packed form
4700A328835J41562k5495q799L4320k0154j50719O1345O2204M388j2044K14242
4689A629685r6254o1045k0126m2629J6776K6840l6197R5984J5569N3662j05997
4678A476268o449J51644P7886o9153r4632n9780L2886J7505N7342l4488r7525
4667A451504k9815Q9922J9649O0117L2270m5959p117n3064q4184n9928K4115L1824
4655A429334P9950q769K8847J07643j54896j3451Q2469j04515o8909j4125J82375
4644A545953j49589O4052J18343j03678r5821J20525R9393l2099k16534P1178
4634A421723q7343Q671O8973N9839K3423K2770m6604k4248J14247j25691K8200
4623A463960L933p1542L9686n7880N5574N9891Q6234l0921l7908K4414J4253O9107
$$ plain form
4611 1618801 1614186 1591609 1536614 1495996 1537961 1515842 1709193 1662060 1585632 1572155 1477392
4600 1477392 1466270 1533581 1593278 1430059 1499535 1497079 1363462 1464992 1653290 1659675 1446331
4589 1446331 1505204 1574432 1682643 1637761 1566539 1677787 1667729 1679266 1572090 1653119 1506969
4578 1506969 1500643 1701748 1721920 1733659 1685713 1696439 1734175 1679709 1667600 1711634 1722179
4567 1722179 1607177 1581136 1584354 1651519 1729306 1772436 1792382 1743300 1712477 1886623 1882566
4556 1882566 1772753 1744928 1864467 1865492 1777120 1856418 1957840 1830305 1845272 1854116 1836989
4545 1836989 1850466 1882048 1919561 1903342 1960811 2034160 2045878 2058910 2148334 1951335 1952134 2005968
4533 2005968 1920812 1982981 2056074 2099172 2204172 2027438 1955043 2020505 2028662 2056348 2103809
$$ packed form
4611A618801m615k2577n4995m0618M1965k2119J93351m7133p6428j3477r4763
4600A477392j1122O7311N9697j63219O9476k456j33617J01530J88298O385k13344
4589A446331N8873O9228J08211m4882p1222J11248j0058J1537j07176Q1029j46150
4578A506969o326K01105K0172J1739m7946J0726L7736n4466j2109M4034J0545
4567A722179j15002k6041L218O7165P7787M3130J9946m9082l0823J74146m057
4556A882566j09813k7825J19539J025q8372P9298J01422j27535J4967Q844j7127
4545A836989J3477L1582L7513j6219N7469P3349J1718J3032Q9424j96999P99N3834
4533B005968q5156O2169P3093M3098J05000j76734p2395O5462Q157K7686M7461
$$ plain form
4522 2103809 2087527 2187956 2244961 2179942 2086508 2179826 2215214 2152598 2158492 2261678 2299365
4511 2299365 2260866 2149607 2101338 2318088 2503739 2554801 2399351 2237614 2365413 2471268
4501 2471268 2480768 2495952 2500508 2548634 2592079 2487508 2433735 2417884 2444391 2549814 2474595
4490 2474595 2334480 2398654 2583607 2646054 2777774 2761206 2670158 2582245 2689829 2797188
4480 2797188 2732387 2707891 2785342 2881382 2960556 2899803 2916348 2987879 2932724 2945313 2962281
4469 2962281 2960872 3024567 3028673 3042668 3079312 3192548 3192605 3282996 3176417 3201459 3307224 3326843
4457 3326843 3320947 3348632 3311212 3473742 3600286 3583104 3624394 3511885 3520857 3540314 3675008
4446 3675008 3743555 3815080 3857276 3940034 3904290 3997167 4151111 4174761 4253522 4213998 4172426
$$ packed form
4522B103809j6282J00429N7005o5019r3434R3318L5388o2616N894J03186L7687
4511B299365l8499j11259m8269K16750J85651N1062j55450j61737J27799J05855
4501B471268R500J5184M556M8126M3445j04571n3773j5851K6507J05423p5219
4490B474595j40115O4174J84953O2447J31720j6568r1048q7913J07584J07359
4480B797188o4801k4496P7451R6040P9174o0753J6545P1531n5155J2589J6968
4469B962281j409O3695M106J3995L6644J13236N7R0391j06579K5042J05765J9619
4457C326843n896K7685l7420J62530J26544j7182M1290j12509Q972J9457J34694
4446C675008O8547P1525M2196Q2758l5744R2877J53944K3650P8761l9524m1572
$$ plain form
4435 4172426 4268109 4316457 4434567 4552498 4651084 4770224 4777378 4863553 4943631 5004346 5085190
4424 5085190 5185761 5378945 5537629 5814829 5965116 6082105 6198459 6353779 6547840 6716404
4414 6716404 7060419 7268310 7520372 7907900 8268926 8578435 8899886 9266380 9626536 9952630
4404 9952630 10335774 10802514 11241995 11656385 12169527 12809702 13570976 14353528 15375639
4395 15375639 16263919 17182111 18172759 18758124 19240052 19655681 20061670 20513967 21180051
4386 21180051 21947658 22762077 23915515 25302845 26770998 28345446 29974454 31394637
4378 31394637 32387115 32940246 32945981 32700037 32349212 32260067 32430325 32752776 33361787 34324543
4368 34324543 35367276 36823416 38428564 39966417 41120921 41402771 41033714 39981308
$$ packed form
4435D172426R5683M8348J18110J17931R8586J19140P154Q6175Q0078O0715Q0844
4424E085190J00571J93184J58684K77200J50287J16989J16354J55320J94061J68564
4414F716404L44015K07891K52062L87528L61026L09509L21451L66494L60156L26094
4404I952630L83144M66740M39481M14390N13142O40175P61274P82552J022111
4395A5375639Q88280R18192R90648N85365M81928M15629M05989M52297O66084
4386B1180051P67607Q14419J153438J387330J468153J574448J629008J420183
4378C1394637R92478N53131N735k45944l50825q9145J70258L22451O09011R62756
4368C4324543J042733J456140J605148J537853J154504K81850l69057j052406
$$ plain form
4360 39981308 38650886 37262592 36077373 35358172 34917654 34887662 35095706 35659061 36434710
4351 36434710 37013988 37408905 37450964 37029231 35991500 34552828 33045717 31836732 30809378
4342 30809378 30137686 29647374 29411140 28969834 28469444 28071219 27642030 27322803 26756317
4333 26756317 25941172 25235842 24466432 23535436 22927572 22218622 21738383 21437985 21269639
4324 21269639 20931808 20762410 20628004 20500994 20416216 20254688 20116121 20044341 20083305 19988787
4314 19988787 19849216 19856382 19990093 20095959 20118674 20017805 20266645 20403015 20429596 20467765
4304 20467765 20706244 20816169 21048196 21165530 21465294 21653188 21853647 22147413 22317920
4295 22317920 22551763 22526975 22704934 22832873 23093978 23303605 23531634 23615450 23698654 23892433
$$ packed form
4360C9981308j330422j388294j185219p19201m40518k9992K08044N63355P75649
4351C6434710N79278L94917M2059m21733j037731j438672j507111j208985j027354
4342C0809378o71692m90312k36234m41306n00390l98225m29189l19227n66486
4333B6756317q15145p05330p69410r30996o07864p08950m80239l00398j68346
4324B1269639l37831j69398j34406j27010q4778j61528j38567p1780L8964r4518
4314A9988787j39571P166J33711J05866K2715j00869K48840J36370K6581L8169
4304B0467765K38479J09925K32027J17334K99764J87894K00459K93766J70507
4295B2317920K33843k4788J77959J27939K61105K09627K28029Q3816Q3204J93779
$$ plain form
4285 23892433 24022367 24108838 24102013 24063845 24145695 24219154 24246833 24326367 24222892 24255709 24349322
4274 24349322 24486833 24521727 24458450 24486240 24450709 24411006 24460774 24421251 24205724 24144693 24066018
4263 24066018 24209445 24286272 24309180 24187049 24168546 24097098 24019597 24219290 24271676 24221420 24318629
4252 24318629 24484560 24549619 24444764 24597756 24527375 24588459 24567026 24639202 24849589 25038615
4242 25038615 25169790 25219082 25335396 25394744 25686598 25819298 25910908 26050840 26406941 26725247
4232 26725247 26833529 26971139 27241875 27263983 27469948 27761498 28017948 28068911 28328895 28756102
4222 28756102 29080816 29104396 29228179 29556972 29689922 29984821 30231523 30410517 30636447 30844588
4212 30844588 30996776 31117163 31229846 31301832 31540784 31656099 31881162 32146103 32441580 32352168
$$ packed form
4285B3892433J29934Q6471o825l8168Q1850P3459K7679P9534j03475L2817R3613
4274B4349322J37511L4894o3277K7790l5531l9703M9768l9523k15527o1031p8675
4263B4066018J43427P6827K2908j22131j8503p1448p7501J99693N2386n0256R7209
4252B4318629J65931O5059j04855J52992p0381O1084k1433P2176K10387J89026
4242B5038615J31175M9292J16314N9348K91854J32700R1610J39932L56101L18306
4232B6725247J08282J37610K70736K2108K05965K91550K56450N0963K59984M27207
4222B8756102L24714K3580J23783L28793J32950K94899K46702J78994K25930K08141
4212C0844588J52188J20387J12683P1986K38952J15315K25063K64941K95477q9412
$$ plain form
4202 32352168 32560920 32901337 33057021 33124130 33348660 33576787 33921157 34148584 34287874 34340296
4192 34340296 34447552 34720520 34940166 35147042 35336724 35457104 35533597 35631780 35776177 35976961
4182 35976961 36191720 36268922 36350158 36599464 36802789 36880477 36838235 36941659 36961032 37022511
4172 37022511 36998005 37058510 37104692 37185151 37182953 37198350 37265985 37285542 37286696 37177928 37207436
4161 37207436 37406423 37511961 37457959 37533755 37563982 37552339 37524597 37511441 37646416 37764061
4151 37764061 37929928 37856343 37846783 37946935 37927039 37792926 37835260 37683677 37621152 37444292
4141 37444292 37301526 37117361 36955042 36914858 36958933 36788592 36618322 36404688 36307205 36197961
4131 36197961 36086290 35962704 35887577 35829431 35657731 35283811 35057375 35073620 35008903 34869110
$$ packed form
4202C2352168K08752L40417J55684O7109K24530K28127L44370K27427J39290N2422
4192C4340296J07256K72968K19646K06876J89682J20380P6493R8183J44397K00784
4182C5976961K14759P7202Q1236K49306K03325P7688m2242J03424J9373O1479
4172C7022511k4506O0505M6182Q0459k198J5397O7635J9557J154j08768K9508
4161C7207436J98987J05538n4002P5796L0227j1643k7742j3156J34975J17645
4151C7764061J65867p3585r560J00152j9896j34113M2334j51583o2525j76860
4141C7444292j42766j84165j62319m0184M4075j70341j70270k13634r7483j09244
4131C6197961j11671j23586p5127n8146j71700l73920k26436J6245o4717j39793
$$ plain form
4121 34869110 34723940 34523699 34437829 34354743 34056964 33820891 33749893 33716560 33603232 33426276
4111 33426276 33282527 33095256 32903405 32730432 32491023 32367302 32225436 31941639 31757435
4102 31757435 31586551 31226679 30992274 30735885 30602299 30367339 30140816 29878916 29759951
4093 29759951 29602765 29491400 29313946 29157339 29083975 28984719 28905917 28809801 28853190 28631854
4083 28631854 28544969 28484935 28303954 28158037 27966919 27900617 27941593 27857097 27810790 27846000 27746832
4072 27746832 27685841 27563445 27742923 27810834 27738621 27843434 27825666 27942911 28108751 28118337
4062 28118337 28246130 28371456 28576704 28747283 28993943 29058473 29012987 29025645 29170478 29156088
4052 29156088 29204864 29268010 29266663 29397354 29412479 29437729 29365906 29343829 29299510 29305057 29202811
$$ packed form
4121C4869110j45170k00241q5870q3086k97779k36073p0998l3333j13328j76956
4111C3426276j43749j87271j91851j72973k39409j23721j41866k83797j84204
4102C1757435j70884l59872k34405k56389j33586k34960k26523k61900j18965
4093B9759951j57186j11365j77454j56607p3364r9256p8802r6116M3389k21336
4083B8631854q6885o0034j80981j45917j91118o6302M0976q4496m6307L5210r9168
4072B7746832o0991j22396J79478O7911p2213J04813j7768J17245J65840R586
4062B8118337J27793J25326K05248J70579K46660O4530m5486J2658J44833j4390
4052B9156088M8776O3146j347J30691J5125K5250p1823k2077m4319N547j02246
$$ plain form
4041 29202811 29213891 29143145 29001258 28814338 28717670 28689071 28842542 28725964 28751713 28824139
4031 28824139 28818720 28850001 28938125 29228494 29488031 29838202 30007795 30437092 30982056 31618394
4021 31618394 32464778 33283334 34222080 35482741 36875663 38318275 39953857 41876927 43728103
4012 43728103 45995373 48261412 50920786 53778627 56920550 60159659 63579015 67203840
4004 67203840 71334606 75832709 80462412 85382303 90273628 95319112 100125831 104486852
3996 104486852 108093886 110942725 112928195 113879966 114102056 113490848 112240219 110888661
3988 110888661 109415500 108128054 107049420 106197673 105680981 105299731 104700063 103738620 102245501
3979 102245501 100083797 97364562 93883193 89777614 85100249 80012119 74822276 69805790
$$ packed form
4041B9202811J1080p0746j41887j86920r6668k8599J53471j16578K5749P2426
4031B8824139n419L1281Q8124K90369K59537L50171J69593M29297N44964O36338
4021C1618394Q46384Q18556R38746J260661J392922J442612J635582J923070J851176
4012D3728103K267270K266039K659374K857841L141923L239109L419356L624825
4004F7203840M130766M498103M629703M919891M891325N045484M806719M361021
3996A04486852L607034K848839J985470R51771K22090o11208j250629j351558
3988A10888661j473161j287446j078634q51747n16692l81250n99668r61443j493119
3979A02245501k161704k719235l481369m105579m677365n088130n189843n016486
$$ plain form
3971 69805790 64905283 60217787 55783045 51867848 48533147 45390746 42678196 40214386
3963 40214386 38179468 36242269 34386757 32788687 31261632 29943333 28550472 27286186
3955 27286186 26230005 25269876 24404232 23628768 22964174 22250235 21769872 21183064 20592767
3946 20592767 20217575 19801507 19261748 18891527 18571696 18267312 17960058 17703522 17465293
3937 17465293 17156275 16968256 16699852 16589885 16479030 16245221 16204706 16120928 15932522 15768085
3927 15768085 15665052 15680742 15639670 15429387 15253849 15214472 15014021 14960425 15018720 14953583
3917 14953583 14948024 14954582 15066918 15046456 15002724 14839489 14935996 14856960 14877129 15007335 15072096
3906 15072096 15024735 15129333 15260375 15360968 15400832 15619010 15675650 15784097 15936705 16100760
$$ packed form
3971F9805790m900507m687496m434742l915197l334701l142401k712550k463810
3963D0214386k034918j937199j855512j598070j527055j318299j392861j264286
3955B7286186j056181r60129q65644p75464o64594p13939m80363n86808n90297
3946B0592767l75192m16068n39759l70221l19831l04384l07254k56536k38229
3937A7465293l09018j88019k68404j09967j10855k33809m0515q3778j88406j64437
3927A5768085j03033J5690m1072k10283j75538l9377k00451n3596N8295o5137
3917A4953583n559O558J12336k0462m3732j63235R6507p9036K0169J30206O4761
3906A5072096m7361J04598J31042J00593L9864K18178N6640J08447J52608J64055
$$ plain form
3896 16100760 16259189 16423118 16487532 16660447 16967854 17253942 17475609 17513747 17706175 17875856
3886 17875856 18034137 18190325 18445332 18792544 19098544 19094904 19355018 19482650 19507443 19485869
3876 19485869 19545240 19718640 19691549 19964823 20396652 20565971 20951306 21243817 21543288 22112808
3866 22112808 22616370 23220352 24006004 24650575 25315451 25989906 26666091 27483043 28250025
3857 28250025 29076936 30048638 31025306 31916687 33011214 34205751 35455684 36684341 38065886
3848 38065886 39650890 41145329 42676443 44208041 46007285 47579412 48976618 50261750
3840 50261750 51347844 52267217 52799015 53186441 53653274 54055821 54270673 54497571 54596261
3831 54596261 54757376 54913916 55043191 55086385 55076921 55230356 55212256 55014680 54765260 54796943
$$ packed form
3896A6100760J58429J63929O4414J72915L07407K86088K21667L8138J92428J69681
3886A7875856J58281J56188K55007L47212L06000l640K60114J27632K4793k1574
3876A9485869N9371J73400k7091K73274M31829J69319L85335K92511K99471N69520
3866B2112808N03562O03982P85652O44571O64876O74455O76185Q16952P66982
3857B8250025Q26911R71702R76668Q91381J094527J194537J249933J228657J381545
3848C8065886J585004J494439J531114J531598J799244J572127J397206J285132
3840E0261750J086094R19373N31798L87426M66833M02547K14852K26898R8690
3831E4596261J61115J56540J29275M3194r464J53435j8100j97576k49420L1683
$$ plain form
3821 54796943 54843966 54975466 55123064 55536910 55841578 56249821 56889099 57607915 58364897 59195099
3811 59195099 60201563 61489268 62866783 64292578 66100621 68078914 70302996 72966581
3803 72966581 76228990 79844727 84119231 89015866 94297292 100489130 107687517 115655430
3795 115655430 124148640 133146008 141948001 150335042 158017214 164686246 170391791 174912577
3787 174912577 178421595 180860725 181904268 182126676 181406817 179994878 177772762 175026401
3779 175026401 171942729 168436977 164922762 161272171 157302093 152936127 148276405 143109045
3771 143109045 137419784 131155363 124556992 117700954 110807369 103796668 97014626 90460851
3763 90460851 84343632 78746337 73322457 68419001 64091405 59910901 56200190 52983000
$$ packed form
3821E4796943M7023J31500J47598M13846L04668M08243O39278P18816P56982Q30202
3811E9195099J006464J287705J377515J425795J808043J978293K224082K663585
3803G2966581L262409L615737M274504M896635N281426O191838P198387P967913
3795A15655430Q493210Q997368Q801993Q387041P682172O669032N705545M520786
3787A74912577L509018K439130J043543K22408p19859j411939k222116k746361
3779A75026401l083672l505752l514215l650591l970078m365966m659722n167360
3771A43109045n689261o264421o598371o856038o893585p010701o782042o553775
3763I0460851o117219n597295n423880m903456m327596m180504l710711l217190
$$ plain form
3755 52983000 50188620 47484561 44968905 42643962 40475010 38590766 36700931 35034232
3747 35034232 33630215 32397907 31178889 30051105 29096429 28387308 27678977 26849679 26355481
3738 26355481 25961587 25621548 25276697 25110931 25046128 25097487 25220202 25515672 25895781 26102495
3728 26102495 26568331 27016429 27376474 27602422 28166932 28515356 28498766 28442863 28220384 27852180
3718 27852180 27419877 26972306 26272395 25484364 24627417 23818476 22985820 22179799 21330714
3709 21330714 20593948 19761928 18952582 18282437 17631563 16911480 16328853 15865367 15396591
3700 15396591 15016384 14580133 14147499 13809263 13455498 13123544 12958464 12751897 12434165
3691 12434165 12224979 11968627 11718330 11489279 11273039 11323785 11191944 10871656 10900074 10926884
$$ packed form
3755E2983000k794380k704059k515656k324943k168952j884244j889835j666699
3747C5034232j404017j232308j219018j127784r54676p09121p08331q29298m94198
3738B6355481l93894l40039l44851j65766o4803N1359J22715K95470L80109K06714
3728B6102495M65836M48098L60045K25948N64510L48424j6590n5903k22479l68204
3718B7852180m32303m47571o99911p88031q56947q08941q32656q06021q49085
3709B1330714p36766q32020q09346o70145o50874p20083n82627m63486m68776
3700A5396591l80207m36251m32634l38236l53765l31954j65080k06567l17732
3691A2434165k09186k56352k50297k29051k16240N0746j31841l20288K8418K6810
$$ plain form
3681 10926884 10926214 10836385 10625101 10452933 10414832 10480314 10461510 10310930 10225046 10077201 9955367
3670 9955367 9823252 9965739 9801980 9675335 9525750 9430037 9373051 9201241 9041473 8898851
3660 8898851 8847347 8740199 8732116 8630038 8566696 8583107 8555906 8477533 8512964 8504490 8510075 8585660
3648 8585660 8559566 8616238 8704671 8827906 8722481 8620119 8694924 8732357 8819632 8871940 8865726
3637 8865726 8733362 8912788 9131334 9364969 9420628 9437204 9497022 9517842 9729940 9886676
3627 9886676 10116387 10233932 10451130 10788310 11044938 11361409 11749161 12154826 12604210 13111302
3617 13111302 13415293 14054961 14658886 15250783 15851777 16615813 17303423 18020970 18564308
3608 18564308 19182296 19611249 20071453 20331235 20659647 20897342 21224014 21482139 21939620
$$ packed form
3681A0926884o70q9829k11284j72168l8101O5482j8804j50580q5884j47845j21834
3670I955367j32115J42487j63759j26645j49585r5713n6986j71810j59768j42622
3660H898851n1504j07148q083j02078o3342J6411k7201p8373L5431q474N585P5585
3648H585660k6094N6672Q8433J23235j05425j02362P4805L7433Q7275N2308o214
3637H865726j32364J79426K18546K33635N5659J6576N9818K0820K12098J56736
3627I886676K29711J17545K17198L37180K56628L16471L87752M05665M49384N07092
3617A3111302L03991O39668O03925N91897O00994P64036O87610P17547N43338
3608A8564308O17988M28953M60204K59782L28412K37695L26672K58125M57481
$$ plain form
3599 21939620 22328230 22536970 22883247 23161450 23414470 23558744 23732397 23860933 24067415
3590 24067415 24030367 23970750 24010172 23883771 23874735 24009566 24128020 24358213 24603890 24942619
3580 24942619 25261867 25675442 26145009 26807821 27545821 28365975 29298386 30418835 31693048
3571 31693048 33231841 34845350 36676845 38704568 41218728 44073586 47059789 50182891
3563 50182891 53688501 57925088 62465031 67501933 73179442 79271584 86017577 93300888
3555 93300888 101097246 109191241 117376033 125624030 133748488 141278223 148329950 154736450
3547 154736450 160614210 166008715 170975187 175420147 179482818 183285749 186518227 189197651
3539 189197651 191209669 192415023 192725081 192084115 190276465 187626974 184290855 180278458
$$ packed form
3599B1939620L88610K08740L46277K78203K53020J44274J73653J28536K06482
3590B4067415l7048n9617L9422j26401r036J34831J18454K30193K45677L38729
3580B4942619L19248M13575M69567O62812P38000Q20154R32411J120449J274213
3571C1693048J538793J613509J831495K027723K514160K854858K986203L123102
3563E0182891L505610M236587M539943N036902N677509O092142O745993P283311
3555I3300888P796358Q093995Q184792Q247997Q124458P529735P051727O406500
3547A54736450N877760N394505M966472M444960M062671L802931L232478K679424
3539A89197651K012018J205354L10058o40966j807650k649491l336119m012397
$$ plain form
3531 180278458 175877722 171075423 165933138 160362441 154326748 148086601 141520522 134757160
3523 134757160 127689220 120517774 113467981 106414313 99792650 93548395 87653244 82348807
3515 82348807 77638625 73558795 69837798 66622675 63985170 61601304 59505873 57815943
3507 57815943 56221300 54799933 53645820 52646818 51777231 51104409 50435382 49995664 49638081
3498 49638081 49213511 48909773 48499695 48051811 47718673 47591781 47369509 47163488 47111582 46985866
3488 46985866 46897499 46987540 47078770 47286238 47579374 47807873 48122245 48389489 48535900 48665350
3478 48665350 48776246 49036046 49270552 49690543 49898664 49755328 48875474 46753372 43923681
3469 43923681 41614783 40005350 38668894 37431713 36514624 35774100 35110500 34592686 34255145
$$ packed form
3531A80278458m400736m802299n142285n570697o035693o240147o566079o763362
3523A34757160p067940p171446p049793p053668o621663o244255n895151n304437
3515H2348807m710182m079830l720997l215123k637505k383866k095431j689930
3507E7815943j594643j421367j154113r99002q69587o72822o69027m39718l57583
3498D9638081m24570l03738m10078m47884l33138j26892k22272k06021n1906j25716
3488D6985866q8367R0041R1230K07468K93136K28499L14372K67244J46411J29450
3478D8665350J10896K59800K34506M19991K08121j43336q79854k122102k829691
3469D3923681k308898j609433j336456j237181r17089p40524o63600n17814l37541
$$ plain form
3460 34255145 34046321 34119379 34340642 34583032 35003886 35722306 36745057 37885421 39209102
3451 39209102 40694052 42500420 44388237 46478753 48627184 51101140 54065775 57050851
3443 57050851 58821542 57507654 53286491 48680838 45300638 42931984 41284161 39934829
3435 39934829 38927964 38259925 37825220 37526640 37382553 37225347 37159071 37210408 37245987 37596363
3425 37596363 38199604 38687992 39184941 39964167 40970088 42037126 43209410 44482407 45674207
3416 45674207 47259802 49292525 52279638 57138005 63445296 68913677 69432362 64408903
3408 64408903 59403181 56227414 54563240 54216125 54742521 55998348 57990896 60537376
3400 60537376 63289401 66515083 70155590 74171360 78868137 84240457 90123306 96716895
$$ packed form
3460C4255145k08824P3058K21263K42390M20854P18420J022751J140364J323681
3451C9209102J484950J806368J887817K090516K148431K473956K964635K985076
3443E7050851J770691j313888m221163m605653l380200k368654j647823j349332
3435C9934829j006865o68039m34705k98580j44087j57206o6276N1337L5579L50376
3425C7596363O03241M88388M96949P79226J005921J067038J172284J272997J191800
3416D5674207J585595K032723K987113M858367O307291N468381N18685n023459
3408F4408903n005722l175767j664174l47115N26396J255827J992548K546480
3400F0537376K752025L225682L640507M015770M696777N372320N882849O593589
$$ plain form
3392 96716895 103979362 111696476 119320759 126661254 133602095 139503894 144214458 147579366
3384 147579366 149288972 149329390 148127871 145811713 142870102 138302490 130627611 120566127
3376 120566127 110583978 101906655 94232841 87603831 81976907 77142032 72766968 69280795
3368 69280795 66300065 63470008 61082996 58862220 56904042 55152748 53420175 51918761
3360 51918761 50396064 49157198 48013441 46879072 45898343 45048195 44233078 43507575 42968733
3351 42968733 42662648 42566533 42812533 43099422 42786676 41395821 39313017 37420820 35835557
3342 35835557 34326505 33071082 31984510 31088568 30477789 29970432 29416679 28530009 27282563
3333 27282563 26004493 25038742 24386003 23843489 23343115 23068397 22918698 22766589 22744146
$$ packed form
3392I6716895P262467P717114P624283P340495O940841N901799M710564L364908
3384A47579366J709606M0418j201519k316158k941611m567612p674879j0061484
3376A20566127r982149q677323p673814o629010n626924m834875m375064l486173
3368F9280795k980730k830057k387012k220776j958178j751294j732573j501414
3360E1918761j522697j238866j143757j134369r80729q50148q15117p25503n38842
3351D2968733l06085r6115K46000K86889l12746j390855k082804j892197j585263
3342C5835557j509052j255423j086572q95942o10779n07357n53753q86670j247446
3333B7282563j278070r65751o52739n42514n00374k74718j49699j52109k2443
$$ plain form
3324 22744146 22810140 23142617 23668762 24479476 25171330 25016443 24054847 22627751 21444326
3315 21444326 20388062 19517243 19066950 18740639 18455146 18378030 18128430 17837918 17285884
3306 17285884 16325910 15336557 14525467 14022717 13479933 13226540 12950468 12752199 12541065
3297 12541065 12192269 12003841 11708648 11508207 11315374 11214133 11068968 10979304 10776430 10576328
3287 10576328 10312793 10120155 10040943 9677860 9529870 9359395 9217533 9116735 8925350 8789608
3277 8789608 8712874 8523082 8286686 8246421 8301042 8276741 8316199 8177600 8059270 8111699 8027227
3266 8027227 7940420 7901680 8019844 7901025 7796494 7724042 7741693 7589710 7599381 7643148 7642490
3255 7642490 7711138 7615962 7573892 7433497 7423285 7469079 7503229 7551293 7471880 7401529 7262135
$$ packed form
3324B2744146O5994L32477N26145Q10714O91854j54887r61596j427096j183425
3315B1444326j056264q70819m50293l26311k85493p7116k49600k90512n52034
3306A7285884r59974r89353q11090n02750n42784k53393k76072j98269k11134
3297A2541065l48796j88428k95193k00441j92833j01241j45165q9664k02874k00102
3287A0576328k63535j92638p9212l63083j47990j70475j41862j00798j91385j35742
3277H789608p6734j89792k36396m0265N4621k4301L9458j38599j18330N2429q4472
3266H027227q6807l8740J18164j18819j04531p2452J7651j51983R671M3767o58
3255G642490O8648r5176m2070j40395j0212M5794L4150M8064p9413p0351j39394
$$ plain form
3244 7262135 7173116 7118121 7039547 7058782 7048370 6932288 6754342 6875167 6721304 6658127 6665447
3233 6665447 6819258 6736791 6838855 6787091 6803625 6817409 6756555 6715897 6743669 6797979 6837456
3222 6837456 6795533 6847879 6877649 6920003 7020366 6889350 6915005 6945800 6985087 6918403 7185516
3211 7185516 7326577 7479209 7458930 7387982 7349208 7377705 7599786 7608098 7449099 7656220 7664432
3200 7664432 7723371 7804892 7906384 7984081 8102588 8339931 8652019 8898760 9022229 9233138
3190 9233138 9279766 9654499 10012615 10216013 10564794 10865291 11114381 11380568 11542338 11904194
3180 11904194 12295820 12595338 12927007 13309171 13832535 14376461 14813820 15286730 15749955
3171 15749955 16133234 16487727 17072002 17573255 18028998 18723990 19385838 20066694 20523595
$$ packed form
3244G262135q9019n4995p8574J9235j0412j16082j77946J20825j53863o3177P320
3233F665447J53811q2467J02064n1764J6534J3784o0854m0658K7772N4310L9477
3222F837456m1923N2346K9770M2354J00363j31016K5655L0795L9287o6684K67113
3211G185516J41061J52632k0279p0948l8774K8497K22081Q312j58999K07121Q212
3200G664432N8939Q1521J01492P7697J18507K37343L12088K46741J23469K10909
3190I233138M6628L74733L58116K03398L48781L00497K49090K66187J61770L61856
3180A1904194L91626K99518L31669L82164N23364N43926M37359M72910M63225
3171A5749955L83279L54493N84275N01253M55743O94992O61848O80856M56901
$$ plain form
3162 20523595 21286613 22131081 22953765 23952570 25020958 26219432 27531330 28860904 30317844
3153 30317844 31962748 33627216 35345693 37422482 39423759 41586598 44108583 46954813
3145 46954813 50052498 53587632 57415147 61909398 66910652 72392695 78510595 85223528
3137 85223528 92969649 101616825 111362368 122051411 134220942 147651877 162683094 179481756
3129 179481756 197955288 218198570 240443142 264871938 292043259 323479019 361693597
3122 361693597 408423029 461501276 510268550 535820952 523257005 477071220 417421365
3115 417421365 360860070 313268027 275117076 245063505 221435830 202900792 187799085
3108 187799085 174591731 162691514 152137622 142773174 134448543 127229737 121162714 116247232
$$ packed form
3162B0523595P63018Q44468Q22684R98805J068388J198474J311898J329574J456940
3153C0317844J644904J664468J718477K076789K001277K162839K521985K846230
3145D6954813L097685L535134L827515M494251N001254N482043O117900O712933
3137H5223528P746121Q647176R745543J0689043J2169531J3430935J5031217J6798662
3129A79481756J8473532K0243282K2244572K4428796K7171321L1435760L8214578
3122C61693597M6729432N3078247M8767274K5552402j2563947m6185785n9649855
3115D17421365n6561295m7592043l8150951l0053571k3627675j8535038j5101707
3108A87799085j3207354j1900217j0553892r364448q324631p218806o067023m915482
$$ plain form
3100 116247232 112254885 109304382 107119762 105207125 103902256 102990903 102661077 102719345 102881852
3091 102881852 102828837 102251444 101101171 99352601 97495188 95608353 94000213 92782585
3083 92782585 91993969 91775666 92105132 92836450 94105536 95968653 98408381 101146366 104395446
3074 104395446 107699027 110623207 112481583 112543112 110381688 105957711 100120349 93758889
3066 93758889 87220052 81036479 75553543 70842355 66610742 62749686 59450818 56480577
3058 56480577 54072720 51743222 49614448 47775396 46304168 44731818 43243013 41751168
3050 41751168 39931554 38068207 36268095 34358175 32503206 30994581 29663301 28364916
3042 28364916 27354996 26365714 25296930 24398757 23554142 22728821 21817706 21105224 20438899
$$ packed form
3100A16247232l992347k950503k184620j912637j304869r11353l29826N8268J62507
3091A02881852n3015n77393j150273j748570j857413j886835j608140j217628
3083I2782585p88616k18303L29466P31318J269086J863117K439728K737985L249080
3074A04395446L303581K924180J858376O1529k161424m423977n837362o361460
3066I3758889o538837o183573n482936m711188m231613l861056l298868k970241
3058E6480577k407857k329498k128774j839052j471228j572350j488805j491845
3050D1751168j819614j863347j800112j909920j854969j508625j331280j298385
3042B8364916j009920r89282j068784q98173q44615q25321r11115p12482o66325
$$ plain form
3033 20438899 19728034 19184781 18601296 17963943 17396043 16957957 16475563 16135530 15656758
3024 15656758 15134028 14771600 14477478 14011103 13460472 13090777 12831761 12529468 12251371
3015 12251371 12045424 11882980 11589820 11345118 11237360 11010534 10743060 10684826 10463569 10246885
3005 10246885 10050502 9871825 9791257 9573385 9231176 9040632 8996795 8917567 8754503 8527740
2995 8527740 8465840 8148989 7741816 7612269 7587569 7340132 7206533 7172781 6911188 6781647
2985 6781647 6774060 6505013 6399773 6354047 6224118 6103561 6110632 5996705 5862425 5750998
2975 5750998 5697548 5511346 5396924 5309646 5324158 5203449 5036579 5015135 5031571 4935643 4842021
2964 4842021 4786898 4722641 4625668 4710049 4589272 4510042 4526619 4387664 4343759 4186094 4043850
$$ packed form
3033B0438899p10865n43253n83485o37353n67900m38086m82394l40033m78772
3024A5656758n22730l62428k94122m66375n50631l69695k59016l02293k78097
3015A2251371k05947j62444k93160k44702j07758k26826k67474n8234k21257k16684
3005A0246885j96383j78677q0568k17872l42209j90544m3837p9228j63064k26763
2995H527740o1900l16851m07173j29547k4700k47437j33599l3752k61593j29541
2985F781647p587k69047j05240m5726j29929j20557P071j13927j34280j11427
2975E750998n3450j86202j14422q7278J4512j20709j66870k1444J6436r5928r3622
2964D842021n5123o4257r6973Q4381j20777p9230J6577j38955m3905j57665j42244
$$ plain form
2953 4043850 4104093 4164270 4048802 3887259 3735371 3640612 3684768 3598141 3572123 3578013 3519489
2942 3519489 3377739 3268965 3237730 3233655 3164807 3216739 3302297 3341998 3320339 3202059 3149838
2931 3149838 3094814 3009260 2959193 2977997 2888157 2880734 2937874 2761097 2500352 2522252 2628621
2920 2628621 2673008 2701813 2747264 2646842 2577348 2507669 2646119 2652085 2569257 2633391 2488160
2909 2488160 2395657 2352153 2366584 2395235 2398316 2330747 2150634 2244932 2301694 2396536 2386189
2898 2386189 2385720 2337659 2315989 2232212 2263510 2210591 2085524 2011661 2110735 2139500 2053634 2059953
2886 2059953 2009497 2022590 2076381 1972848 2055459 2130406 2026808 2031742 1921794 1856136 1952410
2875 1952410 2008779 1913420 2048394 1998584 1854058 1779614 1752344 1885333 1791460 1796948 1701975
$$ packed form
2953D043850O0243O0177j15468j61543j51888r4759M4156q6627k6018N890n8524
2942C519489j41750j08774l1235m075o8848N1932Q5558L9701k1659j18280n2221
2931C149838n5024q5554n0067J8804q9840p423N7140j76777k60745K1900J06369
2920B628621M4387K8805M5451j00422o9494o9679J38450N966q2828O4134j45231
2909B488160r2503m3504J4431K8651L081o7569j80113R4298N6762R4842j0347
2898B386189m69m8061k1670q3777L1298n2919j25067p3863R9074K8765q5866O319
2886B059953n0456J3093N3791j03533Q2611P4947j03598M934j09948o5658R6274
2875A952410N6369r5359J34974m9810j44526p4444k7270J32989r3873N488r4973
$$ plain form
2864 1701975 1727083 1697078 1831901 1856818 1816438 1994196 1937175 1922465 2006353 2040015 2014040
2853 2014040 1941917 2101781 2113043 2023871 2092353 2198532 2227823 2293873 2390446 2431675 2423519
2842 2423519 2500922 2620802 2666211 2726257 3025593 3324387 3551175 3775439 3826671 3728662
2832 3728662 3647290 3546395 3367038 3095338 2765854 2401258 2287581 2297128 2175050 2096833
2822 2096833 1940413 1902227 1862290 1856316 1878747 1916417 1740576 1791307 1743393 1602851 1541551
2811 1541551 1597909 1553814 1527866 1620756 1717572 1747569 1784301 1643193 1705748 1746992 1539795
2800 1539795 1586355 1650247 1519800 1512259 1483315 1472991 1365330 1442076 1586761 1477794 1386765
2789 1386765 1461587 1585981 1473092 1422364 1395395 1291085 1313327 1378938 1422032 1357430 1221108
$$ packed form
2864A701975K5108l0005J34823K4917m0380J77758n7021j4710Q3888L3662k5975
2853B014040p2123J59864J1262q9172O8482J06179K9291O6050R6573M1229q156
2842B423519P7403J19880M5409O0046K99336K98794K26788K24264N1232r8009
2832C728662q1372j00895j79357k71700l29484l64596j13677R547j22078p8217
2822B096833j56420l8186l9937n974K2431L7670j75841N0731m7914j40542o1300
2811A541551N6358m4095k5948R2890R6816K9997L6732j41108O2555M1244k07197
2800A539795M6560O3892j30447p541k8944j0324j07661P6746J44685j08967r1029
2789A386765P4822J24394j12889n0728k6969j04310K2242O5611M3094o4602j36322
$$ plain form
2778 1221108 1115266 1021190 976909 1054765 1081964 1059259 1161331 1194122 1054406 1080897 1103280
2767 1103280 1173932 1125692 1128533 1061901 956746 1113609 1090637 937799 994933 1003569 940835
2756 940835 963805 993141 960521 790029 807791 873797 906115 912533 877420 811704 710816
2745 710816 832497 926164 891151 852527 844467 936768 910658 903587 957797 918951 860643 885705
2733 885705 727780 651200 729956 661119 834072 836811 764975 671932 830326 723744 655177
2722 655177 798323 790981 677600 431109 504963 650939 659317 626664 735143 604330 633431
2711 633431 648946 652645 621783 703475 606759 531013 524467 637220 620323 621059 727618 700326
2699 700326 804469 724686 682979 631796 640217 555079 471601 657601 650774 645004 637657 622037
$$ packed form
2778A221108j05842r4076m4281P7856K7199k2705J02072L2791j39716K6491K2383
2767A103280P0652m8240K841o6632j05155J56863k2972j52838N7134Q636o2734
2756I40835K2970K9336l2620j70492J7762O6006L2318O418l5113o5716j00888
2745G10816J21681R3667l5013l8624q060R2301k6110p071N4210l8846n8308K5062
2733H85705j57925p6580P8756o8837J72953K739p1836r3043J58394j06582o8567
2722F55177J43146p342j13381k46491P3854J45976Q378l2653J08479j30813K9101
2711F33431J5515L699l0862Q1692r6716p5746o546J12753j6897P36J06559k7292
2699G00326J04143p9783m1707n1183Q421q5138q3478J86000o827n770p347j5620
$$ plain form
2687 622037 651480 604456 619747 616410 508269 413654 383876 397132 393105 491582 482921 346663
2675 346663 351999 499596 428639 443638 404665 480797 457333 428641 547829 484053 465266
2664 465266 465740 466611 437744 388526 417223 481152 457691 462470 529095 365570 316829 386076
2652 386076 421318 356590 395546 501211 524296 359502 292912 194438 166350 136653 194345
2641 194345 313600 400427 423847 353742 401272 285056 243572 240060 256967 318128 199618
2630 199618 129849 184577 147791 196465 276897 300817 275408 371694 377831 405148 450005 303990
2618 303990 196897 212476 200612 198441 319962 202961 172725 255660 215796 290082 184280
2607 184280 203740 280585 327445 407298 454172 454554 389463 272369 305627 274927 193633 145853
$$ packed form
2687F22037K9443m7024J5291l337j08141r4615k9778J3256m027R8477q661j36258
2675C46663N336J47597p0957J4999l8973P6132k3464k8692J19188o3776j8787
2664D65266M74Q71k8867m9218K8697O3929k3461M779O6625j63525m8741O9247
2652C86076L5242o4728L8956J05665K3085j64794o6590r8474k8088k9697N7692
2641A94345J19255Q6827K3420p0105M7530j16216m1484l512J6907O1161j18510
2630A99618o9769N4728l6786M8674Q0432K3920k5409R6286O137K7317M4857j46015
2618C03990j07093J5579j1864k171J21521j17001l0236Q2935l9864P4286j05802
2607A84280J9460P6845M6860P9853M6874L82o5091j17094L3258l0700q1294m7780
$$ plain form
2595 145853 346353 261245 259616 316358 270095 94186 118291 220997 268286 313111 335935
2584 335935 362163 242043 236765 245628 310497 394022 293935 349015 307192 212931 221441 368448
2572 368448 228441 204292 300920 248780 274305 188803 304259 358537 324619 319269 253444
2561 253444 283617 260547 185682 231613 266462 252084 297327 401481 407954 509562 512623 451975
2549 451975 468370 397982 192745 168304 211163 261836 346870 316262 111275 145205 181111
2538 181111 159215 202315 209051 234749 183680 338990 179689 177221 339804 420727 413297 253390
2526 253390 190746 174394 215388 271697 241492 192132 159562 112066 224506 221128 216314 224090
2514 224090 238964 298603 303434 253182 214735 132935 287174 319517 180638 46650 114365
$$ packed form
2595A45853K00500q5108j629N6742m6263j75909K4105J02706M7289M4825K2824
2584C35935K6228j20120n278Q863O4869Q3525j00087N5080m1823r4261Q510J47007
2572C68448j40007k4149R6628n2140K5525q5502J15456N4278l3918n350o5825
2561B53444L0173k3070p4865M5931L4849j4378M5243J04154O473J01608L061o0648
2549D51975J6395p0388k05237k4441M2859N0673Q5034l0608k04987L3930L5906
2538A81111k1896M3100O736K5698n1069J55310j59301k468J62583Q0923p430j59907
2526B53390o2644j6352M0994N6309l0205m9360l2570m7496J12440l378m814P776
2514B24090J4874N9639M831n0252l8447q1800J54239L2343j38879j33988O7715
$$ plain form
2503 114365 334368 247645 125370 239579 258870 192648 271032 262245 154099 208490 168481
2492 168481 74571 -4096 18983 83013 274434 401540 294253 181663 143816 166701 203939
2481 203939 193198 181189 328316 485964 413368 241671 227657 227147 261899 216352 262704
2470 262704 358522 193985 189624 272082 218595 273817 292327 197139 340034 272369 350871
2459 350871 532014 442796 211484 233681 177804 59326 159694 251971 317400 171190 252863
2448 252863 322133 228600 211167 139327 92853 201820 235494 293976 337038 311656 169149
2437 169149 112338 259331 263365 235930 378672 262662 187441 282994 313375 365793 240298
2426 240298 248168 266049 246444 400281 345437 294199 250201 178587 149714 296513 290991 290470
$$ packed form
2503A14365K20003q6723j22275J14209J9291o6222P8384q787j08146N4391m0009
2492A68481r3910p8667K3079O4030J91421J27106j07287j12590l7847K2885L7238
2481B03939j0741j2009J47127J57648p2596j71697j4014n10L4752m5547M6352
2470B62704R5818j64537m361Q2458n3487N5222J8510r5188J42895o7665P8502
2459C50871J81143q9218k31312K2197n5877j18478J00368R2277O5429j46210Q1673
2448B52863O9270r3533j7433p1840m6474J08967L3674N8482M3062k5382j42507
2437A69149n6811J46993M034k7435J42742j16010p5221R5553L0381N2418j25495
2426B40298P870J7881j9605J53837n4844n1238m3998p1614k8873J46799n522n21
$$ plain form
2414 290470 185666 195805 172422 242755 397734 251621 242427 193781 141241 87743 193086
2403 193086 292476 251670 196707 71065 -9533 153396 210750 317820 270346 298047 234448
2392 234448 278650 272167 283294 374799 387481 438566 403547 485869 356281 240228 159401
2381 159401 175419 299352 300827 255137 286885 280480 316499 342850 400202 484356 297018 277387
2369 277387 431047 406377 351712 417927 262735 179565 405692 497588 429024 388279 425575
2358 425575 472861 561595 606180 550152 664641 566449 497291 593253 653066 672651 595374
2347 595374 515639 469164 609738 643432 650597 492013 481230 644913 655270 673712 708079
2336 708079 639188 777863 865255 948476 997582 794208 779055 912434 949690 1098313 1122752
$$ packed form
2414B90470j04804J0139k3383P0333J54979j46113r194m8646n2540n3498J05343
2403A93086R9390m0806n4963j25642q0598J62929N7354J07070m7474K7701o3599
2392B34448M4202o483J1127R1505J2682N1085l5019Q2322j29588j16053q0827
2381A59401J6018J23933J475m5690L1748o405L6019K6351N7352Q4154j87338j9631
2369B77387J53660k4670n4665O6215j55192q3170K26127R1896o8564m0745L7296
2358D25575M7286Q8734M4585n6028J14489r8192o9158R5962N9813J9585p7277
2347E95374p9735m6475J40574L3694P165j58584j0783J63683J0357J8442L4367
2336G08079o8891J38675Q7392Q3221M9106k03374j5153J33379L7256J48623K4439
$$ plain form
2325 1122752 1177219 1151406 1188560 1237455 1337575 1435918 1565380 1710473 1679405 1800556 2109452
2314 2109452 2113979 2116208 2277005 2485842 2622851 2770041 2896308 3164971 3546626 3836376
2304 3836376 4126272 4410882 4910887 5629721 6263523 7033603 7870043 8560699 9199454 9863821
2294 9863821 10688277 11867543 13278952 15012504 17011880 18782395 20584246 22835105
2286 22835105 26251354 31707632 39408806 46597437 46893137 38247225 29777579 24135394
2278 24135394 20094030 17262181 14908543 13246719 11936925 10932962 10140453 9344845
2270 9344845 8713974 8360111 7899481 7425669 6713148 6222128 5669829 5350972 4918353 4621093
2260 4621093 4287836 3966006 3777382 3524104 3387125 3362679 3090870 2973120 2847828 2631321
$$ packed form
2325A122752N4467k5813L7154M8895J00120R8343J29462J45093l1068J21151L08896
2314B109452M527K229J60797K08837J37009J47190J26267K68663L81655K89750
2304C836376K89896K84610N00005P18834O33802P70080Q36440O90656O38755O64367
2294I863821Q24456J179266J411409J733552J999376J770515J801851K250859
2286B2835105L416249N456278P701174P188631K95700q645912q469646n642185
2278B4135394m041364k831849k353638j661824j309794j003963p92509p95608
2270I344845o30871l53863m60630m73812p12521m91020n52299l18857m32619k97260
2260D621093l33257l21830j88624k53278j36979k4446k71809j17750j25292k16507
$$ plain form
2250 2631321 2516932 2496528 2377450 2160968 2060379 2019642 1949073 1879119 1817007 1735934 1534437
2239 1534437 1340080 1317219 1385981 1264486 1224294 1238326 1284236 1261163 1172669 1140044 1035377
2228 1035377 1131208 917627 907138 909623 932299 975598 934102 821093 788541 867504 802282
2217 802282 728947 759813 772996 830848 730057 713192 813763 840269 663572 773954 917941
2206 917941 948452 863425 629251 596647 667357 631058 666857 657360 584994 667283 695372 611784
2194 611784 560219 607293 610938 621146 587230 530990 541650 430576 278959 366455 460389
2183 460389 478122 507552 448888 427131 490544 544998 430713 421367 312068 185768 287421
2172 287421 237917 223786 280695 275464 362346 383723 458047 383164 309648 184690 182011 243610
$$ packed form
2250B631321j14389k0404j19078k16482j00589m0737p0569o9954o2112q1073k01497
2239A534437j94357k2861O8762j21495m0192J4032M5910k3073q8494l2625j04667
2228A035377R5831k13581j0489K485K2676M3299m1496j13009l2552P8963o5222
2217H02282p3335L0866J3183N7852j00791j6865J00571K6506j76697J10382J43987
2206I17941L0511q5027k34174l2604P0710l6299L5799r497p2366Q2289K8089q3588
2194F11784n1565M7074L645J0208l3916n6240J0660j11074j51617Q7496R3934
2183D60389J7733K9430n8664k1757O3413N4454j14285r346j09299j26300J01653
2172B87421m9504j4131N6909n231Q6882K1377P4324p4883p3516j24958k679O1599
$$ plain form
2160 243610 232446 220240 342350 335912 260158 155320 184826 245143 266920 331014 324226 206221
2148 206221 233258 327718 140312 120203 157336 321785 247757 177071 168402 207847 190890
2137 190890 177774 229732 368223 329310 263588 170906 317275 376911 236941 181464 215574
2126 215574 74205 135925 159203 149448 137738 183384 325565 487821 390666 271434 230833
2115 230833 175466 171210 196046 299191 334712 303581 349101 306833 266922 175939 124913 69042
2103 69042 -5537 95519 79035 241383 326436 234221 179021 101291 86559 21049 10993
2092 10993 146903 198478 169185 190176 84002 39169 117308 165494 162144 242430 198615 220508
2080 220508 75491 90061 167108 35705 -36007 14339 165749 236630 177618 238303 223077
$$ packed form
2160B43610j1164j2206J22110o438p5754j04838K9506O0317K1777O4094o788j18005
2148B06221K7037R4460j87406k0109L7133J64449p4028p0686q669L9445j6957
2137A90890j3116N1958J38491l8913o5722r2682J46369N9636j39970n5477L4110
2126B15574j41369O1720K3278r755j1710M5646J42181J62256r7155j19232m0601
2115B30833n5367m256K4836J03145L5521l1131M5520m2268l9911r0983n1026n5871
2103F9042p4579J01056j6484J62348Q5053r2215n5200p7730j4732o5510j0056
2092A0993J35910N1575k9293K0991j06174m4833P8139M8186l350Q0286m3815K1893
2080B20508j45017J4570P7047j31403p1712N0346J51410P0881n9012O0685j5226
$$ plain form
2069 223077 88673 107776 14966 87736 139593 146838 210295 228184 176235 162881 167722 197009
2057 197009 119061 95951 729 133848 247347 103293 116541 226410 152680 204722 129189
2046 129189 122284 63217 162802 172756 206567 224506 124795 235878 329662 245511 71286 79184
2034 79184 -5723 -4988 166286 56351 134354 406212 336311 247418 200391 129920 163151 120707
2022 120707 172385 105088 151063 184998 142474 68567 56777 157929 150691 187720 274412 324992
2010 324992 258586 163536 198206 158301 35983 19990 15895 26548 84327 115569 58270 49596
1998 49596 102198 176671 16664 72890 98267 43311 189361 190815 298623 249357 89863
1987 89863 -116998 -127976 41372 92094 -50672 -9125 47923 -40515 -38401 -25798 -44439
$$ packed form
2069B23077j34404J9103r2810P2770N1857P245O3457J7889n1949j3354M841K9287
2057A97009p7948k3110r5222J33119J13499j44054J3248J09869p3730N2042p5533
2046A29189o905n9067R9585R954L3811J7939r9711J11083R3784q4151j74225P898
2034G9184q4907P35J71274j09935P8003K71858o9901q8893m7027p0471L3231m2444
2022A20707N1678o7297M5975L3935m2524p3907j1790J01152p238L7029Q6692N0580
2010C24992o6406r5050L4670l9905j22318j5993m095J0653N7779L1242n7299q674
1998D9596N2602P4473j60007N6226K5377n4956J46050J454J07808m9266j59494
1987H9863k06861j0978J69348N0722j42766M1547N7048q8438K114J2603j8641
$$ plain form
1976 -44439 -52436 -36177 10130 223328 195363 -35542 -93843 -127968 -76190 -19246 38407 31697
1964 31697 25716 135321 31238 -72971 -62844 -37845 -68247 -3819 44857 187507 187403 116570
1952 116570 100652 -18779 -77558 -64006 118733 185689 -22764 -181835 -150210 -100932 7505
1941 7505 231875 165982 174182 159800 107642 103952 124532 19825 26124 97116 51617 261
1929 261 24697 26218 59492 3641 43097 64800 -74878 -201670 -85358 -82116 -81897 -154318
1917 -154318 -195421 -25031 68625 -20923 38757 78830 47760 4607 -63121 149007 98911
1906 98911 7394 -41870 -165425 -81080 38389 -10418 -49452 23829 134905 170045 217428
1895 217428 116928 21169 -71918 -160303 -235747 -130141 31805 69181 14020 -11919 38229
$$ packed form
1976d4439p997J6259M6307K13198k7965k30905n8301l4125N1778N6944N7653o710
1964C1697n981J09605j04083j04209J0127K4999l0402O4428M8676J42650j04p0833
1952A16570j5918j19431n8779J3552J82739O6956k08453j59071L1625M9278J08437
1941G505K24370o5893Q200j4382n2158l690K0580j04707O299P0992m5499n1356
1929B61K4436J521L3274n5851L9456K1703j39678j26792J16312L242K19p2421
1917a54318m1103J70390R3656q9548N9680M0073l1070m3153o7728K12128n0096
1906I8911r1517m9264j23555Q4345J19469m8807l9034P3281J11076L5140M7383
1895B17428j00500r5759r3087q8385p5444J05606J61946L7376n5161k5939N0148
$$ plain form
1884 38229 -75643 -144211 -139187 -32016 27534 53647 -8018 -18616 21358 16841 34661 28946
1872 28946 8375 -79898 65351 113054 169923 49911 -17024 -43510 11192 14090 57363 148157
1860 148157 79924 55854 -5970 3934 5304 89221 138465 -45280 -74741 -94299 -105421 -84616
1848 -84616 -37644 -109671 29759 41500 -54668 -65548 45718 89735 5012 2665 21293 160710
1836 160710 150134 58634 73916 122605 -67216 -166304 -293533 -246905 -100715 42597 -22186
1825 -22186 -10504 25749 19816 -19573 9301 -2114 -45859 -7619 -1080 117735 90216 44866
1813 44866 57607 6063 -66156 -14353 -27181 -69603 70203 -33353 -75394 -15930 -37635
1802 -37635 -100416 -186591 -160217 -106840 -113821 10303 -6978 12086 11815 -41646 -136225 30765
$$ packed form
1884C8229j13872o8568N024J07171N9550K6113o1665j0598L9974m517J7820n715
1872B8946k0571q8273J45249M7703N6869j20012o6935k6486N4702K898M3273R0794
1860A48157o8233k4070o1824R904J370Q3917M9244j83745k9461j9558j1122K0805
1848h4616M6972p2027J39430J1741r6168j0880J11266M4017q4723k347J8628J39417
1836A60710j0576r1500J5282M8689j89821r9088j27229M6628J46190J43312o4783
1825b2186J1682L6253n933l9389K8874j1415m3745L8240O539J18815k7519m5350
1813D4866J2741n1544p2219N1803j2828m2422J39806j03556m2041N9464k1705
1802c7635o2781q6175K6374N3377o981J24124j7281J9064k71n3461r4579J66990
$$ plain form
1790 30765 50528 -90237 -13816 35243 63669 -82187 -150243 -141694 -105878 -92605 -119620 -159498
1778 -159498 -85439 -140891 -87120 -151930 -152951 -59549 -2568 -23091 -39777 -107212 -54939 -12392
1766 -12392 44432 -68049 -271293 -134747 -21637 -7470 -118603 -104974 -98345 -62251 -11711
1755 -11711 -66639 -69927 -125137 -37624 78018 11220 -37061 38199 105746 -22987 -32747 37070
1743 37070 30386 48190 31453 162207 26801 22644 157904 -53558 -50876 11864 -57913 66757
1731 66757 47737 -28061 -83516 62829 101154 143042 73428 7520 16315 102768 104002 -2889
1719 -2889 -1658 24120 46942 -43260 -51772 -67200 21927 -44202 -13350 66773 81011 -10547
1707 -10547 237 214927 73455 -70339 -24498 -90668 -38013 -47208 11664 -38111 -67922
$$ packed form
1790C0765J9763j40765P6421M9059K8426j45856o8056Q549L5816J3273k7015l9878
1778a59498P4059n5452N3771o4810j021R3402N6981k0523j6686o7435N2273M2547
1766a2392N6824j12481k03244J36546J13110J4167j11133J3629O629L6094N0540
1755a1711n4928l288n5210Q7513J15642o6798m8281P5260O7547j28733r760O9817
1743C7070o684J7804j6737J30754j35406m157J35260k11462K682O2740o9777J24670
1731F6757j9020p5798n5455J46345L8325M1888o9614o5908Q795Q6453J234j06891
1719b889J231K5778K2822r0202q512j5428Q9127o6129L0852Q0123J4238r1558
1707a0547J0784K14690j41472j43794M5841o6170N2655r195N8872m9775k9811
$$ plain form
1696 -67922 -54810 -892 14831 348 -112086 -98064 -32385 43404 74471 -14415 -106555 -132878
1684 -132878 -3392 43274 12962 10215 108745 11536 -79878 -124644 -179219 -189313 355
1673 355 189217 160932 7685 -19661 7131 76172 -5471 -58655 139234 4057 -108285
1662 -108285 -105358 -36722 -186450 -206627 -67807 -102192 -106378 10798 49848 53554 42326 -81924
1650 -81924 -50358 124152 118450 85296 89982 67373 110077 61204 -20164 89115 112691 3052
1638 3052 -52558 -64413 -71559 -42018 2634 -21416 -99941 -126624 -47023 6253 50039 -39231
1626 -39231 -87222 15299 92068 -144839 -160602 -23550 9847 34653 -30501 -137083 -193781
1615 -193781 -72046 4111 61154 -33584 -50686 -52969 -18115 873 -80298 -88962 -101597 -60018
$$ packed form
1696f7922J3112N3918J5723j4483j12434J4022O5679P5789L1067q8886r2140k6323
1684a32878J29486M6666l0312k747R8530r7209r1414m4766n4575j0094J89668
1673C55J88862k8285j53247k7346K6792O9041q1643n3184J97889j35177j12342
1662a08285K927O8636j49728k0177J38820l4385m186J17176L9050L706j1228j24250
1650h1924L1566J74510n702l3154M686k2609M2704m8873q1368J09279K3576j09639
1638C052n5610j1855p146K9541M4652k4050p8525k6683P9601N3276M3786q9270
1626c9231m7991J02521P6769k36907j5763J37052L3397K4806o5154j06582n6698
1615a93781J21735P6157N7043r4738j7102k283L4854J8988q1171q664j2635M1579
$$ plain form
1603 -60018 54113 56316 -56209 72450 -56413 -123585 -82325 -49136 61633 145433 252718
1592 252718 175172 44389 90595 111790 91754 81612 -56829 25443 -56950 -106838 -46241
1581 -46241 -47331 -42711 -50837 -63261 -42996 8980 -95559 -53241 -61432 -132976 -54066 99997
1569 99997 143464 62626 88400 155605 45267 -97894 -92639 -167283 -138688 -116265 -29783 129893
1557 129893 -14301 -112242 -142909 -90972 68004 174904 108527 -116514 -115003 -42924 56705
1546 56705 -80949 -112617 71610 21687 16865 89085 45259 109360 113069 -37355 -58608 -16990
1534 -16990 -3824 60167 -21507 17009 161836 -49534 22427 -82682 -109490 -24214 1159
1523 1159 17534 56227 120829 182416 163259 109777 -25137 -121252 -190414 -178909 -101240 -7031
$$ packed form
1603f0018J14131K203j12525J28659j28863o7172M1260L3189J10769Q3800J07285
1592B52718p7546j30783M6206K1195k0036j0142j38441Q2272q2393m9888O0597
1581d6241j090M620q126j2424K0265N1976j04539M2318q191p1544P8910J54063
1569I9997M3467q0838K5774O7205j10338j43161N255p4644K8595K2423Q6482J59676
1557A29893j44194r7941l0667N1937J58976J06900o6377k25041J511P2079R9629
1546E6705j37654l1668J84227m9923m822P2220m3826O4101L709j50424k1253M1618
1534a6990J3166O3991q1674L8516J44827k11370P1961j05109k6808Q5276K5373
1523A159J6375L8693O4602O1587j9157n3482j34914r6115o9162J1505P7669R4209
$$ plain form
1511 -7031 -7628 -154874 -82293 86704 -4303 -112347 6829 9058 53147 -117288 -187686 -150882
1499 -150882 1688 76279 32276 27187 -10723 -56964 -68981 37754 117102 78191 89146
1488 89146 167765 75171 -35523 -177568 -133861 -10354 56049 -29189 -47510 1341 103118
1477 103118 7471 -32326 51877 71735 18464 107975 159602 159457 -2427 -6567 -31796 -44009
1465 -44009 32726 -78672 11199 -26072 -36120 136647 146113 120911 40463 -7741 -42054 7888
1453 7888 102895 51859 41392 131074 104793 116693 72936 19367 47130 34668 -1095 -67602
1441 -67602 91182 25814 30787 -4519 18721 -7024 -151238 -199368 -117192 -165012 -55097
1430 -55097 71845 19634 -12272 -28282 -31167 2407 -194597 -179960 -160154 -81953 -4964 -31001
$$ packed form
1511g031n97j47246P2581J68997r1007j08044J19176K229M4089j70435p0398L6804
1499a50882J52570P4591m4003n089l7910m6241j2017J06735P9348l8911J0955
1488H9146P8619r2594j10694j42045M3707J23507O6403q5238j8321M8851J01777
1477A03118r5647l9797Q4203J9858n3271Q9511N1627j45j61884m140k5229j2213
1465d4009P6735j11398Q9871l7271j0048J72767R466k5202q0448m8204l4313M9942
1453G888R5007n1036j0467Q9682k6281J1900m3757n3569K7763j2462l5763o6507
1441f7602J58784o5368M973l5306K3240k5745j44214m8130Q2176m7820J09915
1430e5097J26942n2211l1906j6010k885L3574j97004J4637J9806P8201P6989k6037
$$ plain form
1418 -31001 -49373 -50845 -177219 -133784 -40406 7107 -108158 -141336 -78447 -100483 -169545 -79460
1406 -79460 11573 -7103 39293 99878 -77284 -263925 -220295 -128155 3858 -47477 62068
1395 62068 188768 99770 40550 65101 33622 3396 73414 3742 -53748 -146760 -153513 -125983
1383 -125983 -52650 45690 113864 -41841 19144 -42546 -56225 16929 -46699 -86494 -159434
1372 -159434 -30632 -38109 -89481 -103325 19602 -82916 -68865 -45475 -83128 -130440 -126390
1361 -126390 -94429 -36967 4066 54772 -8815 5699 29803 114604 114417 187955 174451 10045
1349 10045 -70267 65259 -3822 -79605 -202710 -120331 -119189 -33711 150504 27569 -39207
1338 -39207 46333 80094 -184183 -201877 -23957 38770 -89636 41649 38894 -78274 -30950
$$ packed form
1418c1001j8372j472j26374M3435R3378M7513j15265l3178O2889k2036o9062R0085
1406g9460R1033j8676M6396O0585j77162j86641M3630R2140J32013n1335J09545
1395F2068J26700q8998n9220K4551l1479l0226P0018o9672n7490r3012o753K7530
1383a25983P3333R8340O8174j55705O0985o1690j3679P3154o3628l9795p2940
1372a59434J28802p477n1372j3844J22927j02518J4051K3390l7653m7312M050
1361a26390L1961N7462M1033N0706o3587J4514K4104Q4801j87P3538j3504j64406
1349A0045q0312J35526o9081p5783j23105Q2379J142Q5478J84215j22935o6776
1338c9207Q5540L3761k64277j7694J77920O2727j28406J31285k755j17168M7324
$$ plain form
1327 -30950 -10112 55748 -222453 -226273 3552 90432 -18275 -135783 -131342 29588 -25254
1316 -25254 22870 76889 1918 -121796 -145303 -17650 -18665 -37032 123893 30280 -68926
1305 -68926 22080 8281 120612 127232 55715 104293 73734 50092 -43169 -25252 -44893 -66400
1293 -66400 -25059 -83078 -75461 -93960 37493 62650 -8789 49329 81054 45830 9919 -90889
1281 -90889 -166015 -158609 -40327 -23122 15487 114074 2418 1202 -19061 73391 43030 5092
1269 5092 794 -164854 -96980 -182884 -205624 -75680 85131 -7520 -61799 -131713 -84124 -25810
1257 -25810 -31933 -22134 9180 -25124 -19198 138844 164576 98342 69246 7764 -83860 -55085
1245 -55085 62641 -31095 73347 -102583 -77917 -87164 -132358 -155353 -19778 44590 2708
$$ packed form
1327c0950K0838O5860k78201l820K29825Q6880j08707j17508M441J60930n4842
1316b5254M8124N4019p4971j23714k3507J27653j015j8367J60925r3613r9206
1305f8926R1006j3799J12331O620p1517M8578l0559k3642r3261J7917j9641k1507
1293f6400M1341n8019P617j8499J31453K5157p1439N8118L1725l5224l5911j00808
1281i0889p5126P406J18282J7205L8609R8587j11656j216k0263R2452l0361l7938
1269E092m298j65648O7874q5904k2740J29944J60811r2651n4279o9914M7589N8314
1257b5810o123R799L1314l4304N926J58042K5732o6234k9096o1482r1624K8775
1245e5085J17726r3736J04442j75930K4666r247m5194k2995J35575O4368m1882
$$ plain form
1234 2708 38274 -34390 -43217 68389 65592 62850 -42594 -40593 -62743 -54383 1942 -103939
1222 -103939 -70182 -58461 99276 10389 -36602 -17152 12867 143689 145918 -52486 7309
1211 7309 53694 16891 48096 -27716 -12306 -27875 -110420 -20022 11725 -118115 -126437 -83801
1199 -83801 -154181 -244981 -114570 -204692 -83481 -71848 -113044 11139 33391 -33451 -164047
1188 -164047 -109752 -229950 -170670 13594 74771 63559 79458 -90273 -114510 -71341 62439
1177 62439 80162 27471 -35310 -147502 -132840 -57331 -79063 -12081 69654 -600 -83793 -42352
1165 -42352 28930 -1568 -30853 -5463 -51147 -132791 -60386 -21079 -44507 -50439 -22690 170
1153 170 -117412 -13987 -94719 -157441 11998 -36687 52048 85308 -14568 -71605 -23820 172350
$$ packed form
1234B708L5566p2664q827J11606k797k742j05444K001k2150Q360N6325j05881
1222a03939L3757J1721J57737q8887m6991J9450L0019J30822K229j98404N9795
1211G309M6385l6803L1205p5812J5410j5569q2545R0398L1747j29840q322M2636
1199h3801p0380r0800J30411r0122J21211J1633m1196J24183K2252o6842j30596
1188a64047N4295j20198N9280J84264O1177j1212J5899j69731k4237M3169J33780
1177F2439J7723n2691o2781j12192J4662P5509k1732O6982Q1735p0254q3193M1441
1165d2352P1282l0498k9285K5390m5684q1644P2405L9307k3428n932K7749K2860
1153A70j17582J03425q0732o2722J69439m8685Q8735L3260r9876n7037M7785J96170
$$ plain form
1141 172350 18842 -112687 -42065 105126 61916 -30679 -138613 -70955 -56730 -147767 -66073
1130 -66073 -3727 70100 -15085 -100954 -156863 -58313 29573 58581 -30392 -85694 -73339 -171638
1118 -171638 -216452 -188894 -60442 23240 57431 57137 31273 -6359 -40904 34983 -10521 -55553
1106 -55553 -105686 -115440 -117277 -196574 -146781 -83256 19728 -62380 -23748 -72207 -169394 -148992
1094 -148992 -126732 106225 -33743 -69970 -126915 -163637 -43844 18860 -9341 -60230 -80054
1083 -80054 -166989 -23814 -1375 13997 19658 96360 99456 100759 230626 74961 -56098 -9827
1071 -9827 107755 51659 24808 105970 216356 37732 69729 168254 -96469 -197840 -38564
1060 -38564 -22314 -38670 -12394 -11610 7442 28209 83900 -4314 68126 115403 -7505 -68953
$$ packed form
1141A72350j53508j31529P0622J47191m3210r2595j07934O7658J4225r1037Q1694
1130f6073O2346P3827q5185q5869n5909R8550Q7886K9008q8973n5302J2355r8299
1118a71638m4814K7558J28452Q3682L4191k94k5864l7632l4545P5887m5504m5032
1106e5553n0133r754j837p9297M9793O3525J02984q2108L8632m8459r7187K0402
1094a48992K2260K32957j39968l6227n6945l6722J19793O2704k8201n0889j9824
1083h0054q6935J43175K2439J5372N661P6702L096J303J29867j55665j31059M6271
1071i827J17582n6096k6851Q1162J10386j78624L1997R8525k64723j01371J59276
1060c8564J6250j6356K6276P84J9052K0767N5691q8214P2440M7277j22908o1448
$$ plain form
1048 -68953 -109396 -175365 -100473 -725 -71171 -106563 -57321 -101236 -55564 -135104 -136242 -173697
1036 -173697 -127041 -35479 -93901 -57337 -98575 -105884 -13811 -48127 -57153 -78032 -131485 -198423
1024 -198423 -132582 -29082 -116520 -136718 -60952 -10853 -152421 21231 124138 25200 -8989
1013 -8989 -22120 164816 146543 7818 42214 -71282 -29359 25943 -12598 38805 -49365
1002 -49365 -175935 -170563 -116386 -11915 55101 -61351 -190927 -238504 -295656 -132743 -43770
991 -43770 -49059 43093 23307 5712 15731 -70162 -152611 -132452 -79848 -132916 -84509 -64939
979 -64939 19081 -20543 34008 -10234 -123646 -59909 -93030 -153282 -155329 -62636 -81345 -148948
967 -148948 -49208 115848 118985 -45544 -53220 -75306 -25697 25995 67413 94470 -8063 68285
$$ packed form
1048f8953m0443o5969P4892R9748p0446l5392M9242m3915M5672p9540j138l7455
1036a73697M6656R1562n8422L6564m1238p309R2073l4316r026k0879n3453o6938
1024a98423O5841J03500q7438k0198P5766N0099j41568J73652J02907r8938l4189
1013h989j3131J86936j8273j38725L4396j13496M1923N5302l8541N1403q8170
1002d9365j26570N372N4177J04471O7016j16452j29576m7577n7152J62913Q8973
991d3770n289R2152j9786j7595J0019q5893q2449K0159N2604n3068M8407J9570
979f4939Q4020l9624N4551m4242j13412O3737l3121o0252k047R2693j8709o7603
967a48948R9740J65056L137j64529p676k2086M9609N1692M1418K7057j02533P6348
$$ plain form
955 68285 130262 -25008 30029 -54352 -97142 -54964 -110070 -146882 -46399 121195 17856
944 17856 -40400 -115239 -44886 -99559 101996 183096 -27172 -173747 -17172 63356 55568
933 55568 -111262 -135600 -124843 -141190 -192295 -156353 -12510 -632 -99905 -46704 -49061 -66312
921 -66312 40861 31839 -116595 -38037 75770 55034 41346 -22482 -68793 -117687 -98900 -44118
909 -44118 71074 74307 62262 20795 -94064 -160407 3799 44371 -44568 -209194 -120229
898 -120229 81636 137732 -23743 -33938 172662 99189 30672 5616 1993 36111 38156 -10465
886 -10465 45939 95388 79986 77503 -27574 -14998 58101 81531 -5574 -45393 -17297 -14858
874 -14858 -90513 -32135 -28219 -49201 -11567 -25746 -76780 -122354 -113820 -83080 -21806 22171
$$ packed form
955F8285O1977j55270N5037q4381m2790M2178n5106l6812J00483J67594j03339
944A7856n8256p4839P0353n4673K01555Q1100k10268j46575J56575Q0528p788
933E5568j66830k4338J0757j6347n1105L5942J43843J1878r9273N3201k357j7251
921f6312J07173r022j48434P8558J13807k0736j3688o3828m6311m8894J8787N4782
909d4118J15192L233j2045m1467j14859o6343J64206M0572q8939j64626Q8965
898a20229K01865N6096j61475j0195K06600p3473o8517k5056l623L4118K045m8621
886a0465N6404M9449j5402k483j05077J2576P3099K3430q7105l9819K8096K439
874a4858p5655N8378L916k0982L7634j4179n1034m5574Q534L0740O1274M3977
$$ plain form
862 22171 79019 74880 108237 49012 1792 -48897 -5241 -7819 -15255 63221 -5481 -118501
850 -118501 -89966 98184 -26302 -167489 -41708 5101 18946 -29599 -10656 -37742 -68288
839 -68288 -32417 38073 24690 47243 154502 133776 6579 -137725 -107137 -9886 -126104
828 -126104 -112279 38978 87583 30335 -23862 54237 104606 -92822 -104884 -154139 -53967
817 -53967 82751 79006 50150 -50850 -45228 -67465 43251 87646 93281 37820 35173 -85681
805 -85681 -174503 -188376 -5277 50931 -2512 -140837 -106221 -6214 -25505 -87987 89276
794 89276 51473 37250 -35148 -131442 -230750 -152930 -78211 -18613 -10097 -101289 84368 134836
782 134836 142397 73832 87196 129222 79557 -47856 -115478 -122286 -73576 -89004 -5428 -72507
$$ packed form
862B2171N6848m139L3357n9225m7220n0689M3656k578p436P8476o8702j13020
850a18501K8535J88150j24486j41187J25781M6809J3845m8545J8943k7086l0546
839f8288L5871P0490j3383K2553J07259k0726j27197j44304L0588R7251j16218
828a26104J3825J51257M8605n7248n4197P8099N0369j97428j2062m9255J00172
817e3967J36718l745k8856j01000N622k2237J10716M4395N635n5461k647j20854
805h5681q8822j3873J83099N6208n3443j38325L4616J00007j9291o2482J77263
794H9276l7803j4223p2398r6294r9308P7820P4719N9598Q516r1192J85657N0468
782A34836P561o8565J3364M2026m9665j27413o7622o808M8710j5428Q3576o7079
$$ plain form
770 -72507 87689 16956 -17361 48293 40600 -8458 19601 122263 -20287 75852 21653 -44507
758 -44507 980 -44616 -59768 -95669 -35428 -84158 -112622 -140395 -165870 -52454 -13486 22336
746 22336 71239 69100 105705 3232 -110339 -163241 -125666 21278 17759 -5636 -36287 -36661
734 -36661 4837 22973 -31217 -20171 74430 -25586 -51890 5136 -119999 -61007 -190524
723 -190524 -217700 58680 60325 -21604 -15395 -51237 51196 82631 74275 -54790 -18237 -22182
711 -22182 31614 -13394 47651 78637 -147024 -65409 -56047 111937 96995 73283 -27562 -80073
699 -80073 -127434 -107897 -89967 -159703 -132636 -101788 -87218 76052 26176 158381 197299 2316
687 2316 69902 126657 15209 -61433 -79606 -74695 -66285 -46277 -101824 -139511 -76746 27707
$$ packed form
770g2507J60196p0733l4317O5654p693m9058K8059J02662j42550R6139n4199o6160
758d4507M5487m5596j5152l5901O0241m8730k8464k7773k5475J13416L8968L5822
746B2336M8903k139L6605j02473j13571n2902L7575J46944l519k3395l0651l74
734c6661M1498J8136n4190J1046R4601j00016k6304N7026j25135N8992j29517
723a90524k7176K76380J645q1929O209l5842J02433L1435q356j29065L6553l945
711b2182N3796m5008O1045L0986k25661Q1615R362J67984j4942k3712j00845n2511
699h0073m7361J9537J7930o9736K7067L0848J4570J63270m9876J32205L8918j94983
687B316O7586N6755j11448p6642j8173M911Q410K0008n5547l7687O2765J04453
$$ plain form
675 27707 54547 55349 60996 -81865 -62817 138159 62434 -133811 -160212 9067 42974 14087
663 14087 -37120 6029 93645 12769 10236 -81492 -127931 -1767 42214 -139526 -53637 -3226
651 -3226 -308455 -322517 -36191 -97635 -89006 -38146 -45034 -76248 -131223 -90428 -70938 27634
639 27634 -2881 -105652 -43439 -178931 -163465 -11728 -7778 -4415 112845 138384 18821
628 18821 -176401 -29105 -116911 -297353 -228508 -95117 27451 57878 14459 59536 134626
617 134626 74017 -10473 11981 74590 177395 96895 -25500 -108118 -66464 44349 -28269
606 -28269 -9380 74665 -35376 967 -59754 -150384 -72094 -81393 -25395 38860 51484 2435
594 2435 8940 74774 68028 -87131 -117129 -149598 -95223 -52459 -16413 -15655 62821 50068 54540
$$ packed form
675B7707K6840Q02N647j42861J9048K00976p5725j96245k6401J69279L3907k8887
663A4087n1207M3149Q7616q0876k533r1728m6439J26164M3981j81740Q5889N0411
651c226l05229j4062K86326o1444Q629N0860o888l1214n4975M0795J9490R8572
639B7634l0515j02771O2213j35492J5466J51737L950L363J17260K5539j19563
628A8821j95222J47296q7806j80442O8845J33391J22568L0427m3419M5077P5090
617A34626o0609q4490K2454O2609J02805q0500j22395q2618M1654J10813p2618
606b8269J8889Q4045j10041L6343o0721r0630P8290r299N5998O4255J2624m9049
594B435O505O5834o746j55159k9998l2469N4375M2764L6046P58P8476j2753M472
$$ plain form
581 54540 31980 169125 123759 -68984 -29411 61703 -75246 -176625 -45160 -1503 -76685
570 -76685 15326 30359 -36449 -46019 71676 53263 -96541 -45735 -15272 -59722 -122652 -80525
558 -80525 -77111 -109562 -1311 75992 247327 239805 86378 30915 -71701 4795 -49945 -3675
546 -3675 9459 -76087 -77213 -98885 -11752 48193 -39200 -130082 16960 -30743 -165196 -107649
534 -107649 55071 125679 176178 50266 -10221 120155 102380 123795 113906 -93342 -38405
523 -38405 101838 180175 56190 46260 52255 31016 141459 -27424 8483 24735 66201 90478
511 90478 108341 92670 -80130 -114850 -98764 -203783 -79041 -16851 93244 114364 102099
500 102099 90674 165193 214211 120219 43231 10233 -127120 -177705 -188352 8290 107144
$$ packed form
581E4540k2560J37145m5366j92743L9573R1114j36949j01379J31465M3657p5182
570g6685R2011J5033o6808r570J17695j8413j49804N0806L0463m4450o2930M2127
558h0525L414l2451J08251P7303J71335p522j53427n5463j02616P6496n4740M6270
546c675J3134q5546j126k1672Q7133N9945q7393r0882J47042m7703j34453N7547
534a07649J62720P0608N0499j25912o0487J30376j7775K1415r889k07248N4937
523c8405J40243P8337j23985r930N995k1239J10443j68883L5907J6252M1466K4277
511I0478J7863j5671j72800l4720J6086j05019J24742O2190J10095K1120j2265
500A02099j1425P4519M9018r3992p6988l2998j37353n0585j0647J96642R8854
$$ plain form
489 107144 49022 -37401 -108712 -25160 -11178 118641 135732 38545 60550 140149 210602 179788
477 179788 83785 109042 97334 122217 117457 -18847 -56209 -138846 -166927 -55769 -53241 4500
465 4500 -8575 -123301 -115792 -148710 -79731 -67606 -46323 -63124 -125366 -84886 -129993 -98481
453 -98481 -19290 -94408 -75186 77970 34829 -26952 -49136 22104 -32954 -48271 -136960 -32289
441 -32289 -152973 -140808 -30742 8240 53094 20547 85282 106432 128800 -148082 -193746
430 -193746 -130895 -139646 -81690 -140830 -109910 -202117 -292940 -112814 -140176 -160123 -129921 -195176
418 -195176 -49851 43986 18110 73149 14861 -44009 -132127 -153628 -156775 -87842 3595 -104583
406 -104583 -71630 -116668 -64683 44747 28171 46634 -74214 -186861 -101613 20138 -15455
$$ packed form
489A07144n8122q6423p1311Q3552J3982J29819J7091r7187K2005P9599P0453l0814
477A79788r6003K5257j1708K4883m760j36304l7362q2637k8081J11158K528N7741
465D500j3075j14726P509l2918O8979J2125K1283j6801o2242M0480m5107L1512
453i8481P9191p5118J9222J53156m3141o1781k2184P1240n5058j5317q8689J04671
441c2289j20684J2165J10066L8982M4854l2547O4735K1150K2368k76882m5664
430a93746O2851q751N7956n9140L0920r2207r0823J80126k7362j9947L0202o5255
418a95176J45325R3837k5876N5039n8288n8870q8118k1501l147O8933R1437j08178
406a04583L2953m5038N1985J09430j6576J8463j20848j12647Q5248J21751l5593
$$ plain form
395 -15455 -17920 41339 -118704 -29455 42352 96518 51615 -66528 -11515 -58935 -118619 -131801
383 -131801 12767 -20946 -79303 -51431 9202 -138342 -128378 -77715 -13443 40902 -165836
372 -165836 -59132 -48049 -45471 -11406 -64312 -117087 -118202 91311 57982 18909 25932 20037
360 20037 -71501 -66176 -34987 -41811 -7588 -73523 -66981 -23858 -42416 -51219 -16723 20732 -21720
347 -21720 -73442 -70666 -133290 -180214 -79597 43005 105239 99389 66551 -25097 -11381 45161
335 45161 -47274 147920 37558 -175868 -181884 -23228 88118 39579 -16524 -89751 -65063
324 -65063 -100549 -87089 -39776 14414 -81536 87624 56923 -69167 -136506 -190705 3409
313 3409 -80239 -1948 -23583 -100829 -116575 -134787 -119145 -71837 -57932 -175806 -101930 -32455
$$ packed form
395a5455k465N9259j60043Q9249P1807N4166m4903j18143N5013m7420n9684j3182
383a31801J44568l3713n8357K7872O0633j47544R964N0663O4272N4345k06738
372a65836J06704J1083K578L4065n2906n2775j115K09513l3329l9073P023n895
360B0037r1538N325L1189o824L4223o5935O542M3123j8558q803L4496L7455m2452
347b1720n1722K776o2624m6924J00617J22602O2234n850l2838r1648J3716N6542
335D5161r2435J95194j10362k13426o016J58656J11346m8539n6103p3227K4688
324f5063l5486J3460M7313N4190r5950J69160l0701j26090o7339n4199J94114
313C409q3648P8291k1635p7246j5746j8212J5642M7308J3905j17874P3876O9475
$$ plain form
301 -32455 37790 73570 -11225 -87982 -126419 -87327 -86247 -55848 -87164 -84875 -15217 -39923
289 -39923 -31190 -9260 -40355 5691 -129742 -92068 -45379 -47604 57967 -25534 -36151 -177832
277 -177832 -288177 -123029 48124 29684 134994 90608 -74816 -81839 -80660 18105 2192
266 2192 -48368 -12374 24709 132236 118811 76636 9814 -25063 -19014 -151099 -181968 -187922
254 -187922 -44130 44205 50225 60795 -20234 -153506 -120030 -98359 -95879 -89874 -168285 -135057
242 -135057 -86508 53307 -41589 -89557 -37873 -115693 -24428 31699 -14873 -108807 -97127 25585
230 25585 -48202 -33912 25165 49152 -86009 -109088 -136731 -104747 -86556 -82012 -38802 3626
218 3626 2695 -38295 -12685 116395 34228 -52250 -102715 -96668 -72853 -89042 -43482 -25992 17650
$$ packed form
301c2455P0245L5780q4795p6757l8437L9092J080L0399l1316K289O9658k4706
289c9923Q733K1930l1095M6046j35433L7674M6689k225J05571q3501j0617j41681
277a77832j10345J65148J71153j8440J05310m4386j65424p023J179R8765j5913
266B192n0560L5994L7083J07527j3425m2175o6822l4877O049j32085l0869n954
254a87922J43792Q8335O020J0570q1029j33272L3476K1671K480O005p8411L3228
242a35057M8549J39815r4896m7968N1684p7820R1265N6127m6572r3934J1680J22712
230B5585p3787J4290N9077K3987j35161k3079k7643L1984J8191M544M3210M2428
218C626r31m0990K5610J29080q2167q6478n0465O047K3815j6189M5560J7490M3642
$$ plain form
205 17650 -71726 -74544 90282 47156 -42016 19141 -9947 -76920 -75882 72866 34183 57428
193 57428 -27974 -56733 37132 8434 28187 -81513 -141273 -103301 -69721 -117762 -260219 -217724
181 -217724 -112244 -59651 -29917 -50564 412 -15454 -58202 -84945 -53000 -29404 -86132 -73339
169 -73339 -61795 -10172 -17646 -41665 -25258 20130 -49991 -100570 -4004 132160 153250 80517
157 80517 33985 108761 11418 -48602 -46806 -22762 52755 4555 -66945 -58269 -105205 -141381
145 -141381 -124913 -123598 -148782 -125750 -140903 -146909 -99510 -75267 -128694 -126152 -40902 -31608 -48307
132 -48307 819 19436 721 36940 -12226 8037 26671 -57651 -51530 -9900 -7388 -78124
120 -78124 -115696 -141210 -129049 -77569 -73680 -61949 -59292 -82211 -124308 -6122 43138 -5143
$$ packed form
205A7650q9376k818J64826m3126q9172O1157k9088o6973J038J48748l8683K3245
193E7428q5402k8759R3865k8698J9753j09700n9760L7972L3580m8041j42457M2495
181b17724J05480N2593K9734k0647N0976j5866m2748k6743L1945K3596n6728J2793
169g3339J1544N1623p474k4019J6407M5388p0121n0579R6566J36164K1090p2733
157H0517m6532P4776r7343o0020J796K4044P5517m8200p1500Q676m6936l6176
145a41381J6468J315k5184K3032j5153o006M7399K4243n3427K542Q5250R294j6699
132d8307M9126J8617j8715L6219m9166K0263J8634q4322O121M1630K512p0736
120g8124l7572k5514J2161N1480L889J1731K657k2919m2097J18186M9260m8281
$$ plain form
108 -5143 72692 51304 -68331 -139679 -125069 -28240 68429 49917 -96250 -74590 -1024 5177
96 5177 -71582 -144028 -153121 -73594 -6699 6157 -13501 2913 40066 92829 100212 -5192 -24699
83 -24699 -58518 -52154 -81135 -27090 -80933 -34784 32626 -5565 13547 -10659 -82587 -103823
71 -103823 -27370 -41846 -48025 -13824 -111617 -100493 -149453 -217115 -162437 -116430 -27947 -105301
59 -105301 -68471 -135909 -83649 -105899 -214720 -214941 -223216 -90969 45595 11959 -32023 -37949
47 -37949 -49555 30783 113000 42823 3747 -38256 52131 -17069 21929 47184 -20931 61781
35 61781 3563 -11280 -51751 -140801 -83854 -95589 -90537 -54336 -97998 -113721 -23738 -78605
23 -78605 -14156 85619 52882 100507 29152 -14127 -30011 -86950 -59593 -85818 -99186 -117596
$$ packed form
108e143P7835k1388j19635p1348J4610R6829R6669j8512j46167K1660P3566O201
96E177p6759p2446r093P9527O6895J2856j9658J6414L7153N2763P383j05404j9507
83b4699l3819O364k8981N4045n3843M6149O7410l8191J9112k4206p1928k1236
71a03823P6453j4476o179L4201r7793J1124m8960o7662N4678M6007Q8483p7354
59a05301L6830o7438N2260k2250j08821k21q275J32247J36564l3636m3982n926
47c7949j1606Q0338Q2217p0177l9076m2003R0387o9200L8998K5255o8115Q2712
35F1781n8218j4843m0471q9050N6947j1735N052L6201m3662j5723Q9983n4867
23g8605O4449R9775l2737M7625p1355m3279j5884n6939K7357k6225j3368j8410
$$ plain form
11 -117596 -63435 -92181 -182595 -113273 -41230 -71187 -60601 -39286 -73222 -4873 72822
0 72822
$$ packed form
11a17596N4161k8746r0414O9322P2043k9957J0586K1315l3936O8349P7695
0G2822
$$ Imaginary data points
##PAGE= N=2
##DATA TABLE= (X++(I..I)), XYDATA
$$ plain form
16383 -2227830 -2136063 -2080872 -2011082 -1917938 -1943332 -1885444 -1778500 -1785335 -1705446 -1692074 -1685466
16372 -1685466 -1687100 -1695682 -1674024 -1643640 -1625499 -1562547 -1497979 -1458138 -1509809 -1510198 -1485628 -1309444
16360 -1309444 -1232171 -1284156 -1244586 -1303210 -1275275 -1237652 -1190485 -1128858 -1116165 -1101410 -1094200
16349 -1094200 -1018753 -994178 -944418 -902480 -925056 -917903 -895009 -839632 -784535 -770880 -747185
16338 -747185 -642874 -663562 -629918 -588289 -668501 -741892 -599704 -643113 -613716 -540240 -364511
16327 -364511 -406799 -419052 -322924 -419680 -336886 -299536 -286744 -209789 -127250 -83194 -132140
16316 -132140 -264610 -145750 -59300 -113634 -134626 -109605 -61727 -79495 -77097 7366 129161
16305 129161 54126 141661 193721 191440 276782 294127 321908 407846 376570 301914 444970
$$ packed form
16383b227830R1767N5191O9790R3144k5394N7888J06944o835P9889J3372O608
16372a685466j634q582K1658L0384J8141O2952O4568L9841n1671l89K4570J76184
16360a309444P7273n1985L9570n8624K7935L7623M7167O1627J2693J4755P210
16349a094200P5447K4575M9760M1938k2576P153K2894N5377N5097J3655K3695
16338g47185J04311k0688L3644M1629q0212p3391J42188m3409K9397P3476J75729
16327c64511m2288j2253R6128r6756Q2794L7350J2792P6955Q2539M4056m8946
16316a32140j32470J18860Q6450n4334k0992K5021M7878j7768K398Q4463J21795
16305A29161p5035Q7535N2060k281Q5342J7345K7781Q5938l1276p4656J43056
$$ plain form
16294 444970 406820 407425 396610 346375 407083 336752 444593 475624 571376 601694 613285 687196
$$ packed form
16294D44970l8150O05j0815n0235O0708p0331J07841L1031R5752L0318J1591P3911
$$ [...]
##END NTUPLES=NMR SPECTRUM
##END=
