##TITLE=1H_DE-80H_X3
 200.13MHz, d2o
 8 sc
 
 19ns.26.2.2025
##JCAMPDX= 6.0         $$ Bruker NMR JCAMP-DX V2.0
##DATA TYPE= NMR SPECTRUM
##DATA CLASS= NTUPLES
##ORIGIN= UXNMR, Bruker Analytische Messtechnik GmbH
##OWNER= pz
$$ XWIN-NMR		Version 3.5
$$ Thu Jun 26 09:39:27 2025 Russian Standard Time (UT+4h)  Yarkov@DPX200
##.OBSERVE FREQUENCY= 200.1313
##.OBSERVE NUCLEUS= ^1H
##.ACQUISITION MODE= SIMULTANEOUS
##.ACQUISITION SCHEME= undefined
##.AVERAGES= 8
##.DIGITISER RES= 18
##SPECTROMETER/DATA SYSTEM= spect
##.PULSE SEQUENCE= zg30
##.SOLVENT NAME= CDCl3
##.SHIFT REFERENCE= (INTERNAL, CDCl3, 0, 15.51)
##AUDIT TRAIL= $$ (NUMBER, WHEN, WHO, WHERE, WHAT)
$$ ##TITLE= Audit trail, XWIN-NMR		Version 3.5
$$ ##JCAMPDX= 5.01
$$ ##ORIGIN= Bruker BioSpin GmbH
$$ ##OWNER= Yarkov
$$ C:/Bruker/XWIN-NMR/data/yarkov2/nmr/H-C/1/pdata/1/auditp.txt
$$ ##AUDIT TRAIL=  $$ (NUMBER, WHEN, WHO, WHERE, WHAT)
(   1,<2025-06-26 09:38:15.67 +0400>,<Yarkov>,<DPX200>,
      <created by zg, POWCHK disabled, PULCHK disabled
       configuration hash MD5:
       00 E9 B6 7A A2 85 ED C7 34 08 36 98 17 FE 4E 26
       data hash MD5: 16K
       0B F8 B2 27 49 12 D1 7C 55 0F 0D C0 0D 4B 7B 91>)
(   2,<2025-06-26 09:38:22.03 +0400>,<Yarkov>,<DPX200>,
      <Start of raw data processing
       efp BC_mod = 2 LB = 0.25 FT_mod = 6 PKNL = 1 PHC0 = -1721.113 PHC1 = 8.566601 SI = 16K 
       data hash MD5: 16K
       A3 E6 84 B7 27 1A 29 27 40 79 5D F4 C3 A1 02 74>)
(   3,<2025-06-26 09:38:38.59 +0400>,<Yarkov>,<DPX200>,
      <pk PHC0 = 2.361401 PHC1 = 3 
       data hash MD5: 16K
       2D 21 21 71 40 7F E2 D9 75 7E 26 4C CD 67 47 EA>)
(   4,<2025-06-26 09:38:41.40 +0400>,<Yarkov>,<DPX200>,
      <abs ABSG = 5 
       data hash MD5: 16K
       22 7C 4C 50 A8 23 4E 3C AD 06 2F C4 34 93 38 D3>)
$$ ##END=
$$ 
$$ hash MD5
$$ 37 55 1E D2 AF 61 49 DC 36 A6 EA 44 45 0F 38 90
##$RELAX= 
##$RELAX= 
##$RELAX= 
##$RELAX= 
##$RELAX= 
##$RELAX= 
$$ Bruker specific parameters
$$ --------------------------
##$DU= <C:/Bruker/XWIN-NMR>
##$EXPNO= 1
##$NAME= <H-C>
##$PROCNO= 1
##$TYPE= <nmr>
##$USER= <yarkov2>
##$AMP= (0..31)
100 100 100 100 100 100 100 100 100 100 100 100 100 100 100 100 100 100 
100 100 100 100 100 100 100 100 100 100 100 100 100 100 
##$AQSEQ= 0
##$AQ_mod= 1
##$AUNM= <au_zg>
##$AUTOPOS= <>
##$BF1= 200.13
##$BF2= 200.13
##$BF3= 200.13
##$BF4= 200.13
##$BF5= 200.13
##$BF6= 200.13
##$BF7= 200.13
##$BF8= 200.13
##$BYTORDA= 1
##$CFDGTYP= 0
##$CFRGTYP= 5
##$CHEMSTR= <none>
##$CNST= (0..31)
1 1 145 1 1 1 1 1 1 1 1 1 1 1 1 1 1 1 1 1 1 1 1 1 1 1 1 1 1 1 1 1 
##$CPDPRG= <>
##$CPDPRG1= <>
##$CPDPRG2= <>
##$CPDPRG3= <>
##$CPDPRG4= <mlev>
##$CPDPRG5= <mlev>
##$CPDPRG6= <mlev>
##$CPDPRG7= <mlev>
##$CPDPRG8= <mlev>
##$CPDPRGB= <>
##$CPDPRGT= <>
##$D= (0..31)
0 0.7 0 0 0 0 0 0 0 0 0 0.03 0 0 0 0 0 0 0 0 0 0 0 0 0 0 0 0 0 0 0 0 
##$DATE= 1750916295
##$DBL= (0..7)
120 120 120 120 120 120 120 120 
##$DBP= (0..7)
150 150 150 150 150 150 150 150 
##$DBP07= 0
##$DBPNAM0= <>
##$DBPNAM1= <>
##$DBPNAM2= <>
$$ [...]
##$SUBNAM3= <"">
##$SUBNAM4= <"">
##$SUBNAM5= <"">
##$SUBNAM6= <"">
##$SUBNAM7= <"">
##$SUBNAM8= <"">
##$SUBNAM9= <"">
##$SW= 18.0517328524113
##$SWIBOX= (0..15)
0 0 2 0 0 0 0 0 0 0 0 0 0 0 0 0 
##$SW_h= 3612.71676300578
##$TD= 16384
##$TD0= 1
##$TE= 0
##$TE2= 300
##$TE3= 300
##$TEG= 300
##$TL= (0..7)
0 120 120 120 120 120 120 120 
##$TP= (0..7)
150 150 150 150 150 150 150 150 
##$TP07= 0
##$TPNAME0= <>
##$TPNAME1= <>
##$TPNAME2= <>
##$TPNAME3= <>
##$TPNAME4= <>
##$TPNAME5= <>
##$TPNAME6= <>
##$TPNAME7= <>
##$TPOAL= (0..7)
0.5 0.5 0.5 0.5 0.5 0.5 0.5 0.5 
##$TPOFFS= (0..7)
0 0 0 0 0 0 0 0 
##$TUNHIN= 0
##$TUNHOUT= 0
##$TUNXOUT= 0
##$USERA1= <user>
##$USERA2= <user>
##$USERA3= <user>
##$USERA4= <user>
##$USERA5= <user>
##$V9= 5
##$VALIST= <valist>
##$VCLIST= <CCCCCCCCCCCCCCC>
##$VD= 0
##$VDLIST= <DDDDDDDDDDDDDDD>
##$VPLIST= <PPPPPPPPPPPPPPP>
##$VTLIST= <TTTTTTTTTTTTTTT>
##$WBST= 1024
##$WBSW= 4
##$XGAIN= (0..3)
0 0 0 0 
##$XL= 0
##$YL= 0
##$YMAX_a= 190697
##$YMIN_a= -188532
##$ZGOPTNS= <>
##$ZL1= 120
##$ZL2= 120
##$ZL3= 120
##$ZL4= 120
##$ABSF1= 15.51221
##$ABSF2= -2.539639
##$ABSG= 5
##$ABSL= 3
##$ALPHA= 0
##$AQORDER= 0
##$ASSFAC= 0
##$ASSFACI= 0
##$ASSFACX= 0
##$ASSWID= 0
##$AUNMP= <proc_1d>
##$AZFE= 0.1
##$AZFW= 0.1
##$BCFW= 0
##$BC_mod= 2
##$BYTORDP= 0
##$COROFFS= 0
##$CY= -3
##$DATMOD= 1
##$DC= 0
##$DFILT= <>
##$DTYPP= 0
##$F1P= 0
##$F2P= 0
##$FCOR= 1
##$FTSIZE= 16384
##$FT_mod= 6
##$GAMMA= 0
##$GB= 0
##$INTBC= 1
##$INTSCL= 3.241238e-09
##$ISEN= 128
##$LB= 0.25
##$LEV0= 0
##$LPBIN= 0
##$MAXI= 10000
##$MC2= 0
##$MEAN= 0
##$ME_mod= 0
##$MI= 1.114404
##$NCOEF= 0
##$NC_proc= -7
##$NLEV= 6
##$NOISF1= 3.799351
##$NOISF2= 2.8
##$NSP= 0
##$NTH_PI= 0
##$NZP= 0
##$OFFSET= 15.51
##$PC= 1
##$PHC0= -1718.752
##$PHC1= 11.5666
##$PH_mod= 1
##$PKNL= yes
##$PPARMOD= 0
##$PSCAL= 0
##$PSIGN= 0
##$REVERSE= no
##$SF= 200.130002342329
##$SI= 16384
##$SIGF1= 3
##$SIGF2= 2
##$SINO= 0.751879
##$SIOLD= 32768
##$SREGLST= <19F.Aceton>
##$SSB= 0
##$STSI= 16384
##$STSR= 0
##$SW_p= 3612.71676300578
##$SYMM= 0
##$S_DEV= 0
##$TDeff= 16384
##$TDoff= 0
##$TI= <>
##$TILT= no
##$TM1= 0
##$TM2= 0
##$TOPLEV= 0
##$USERP1= <user>
##$USERP2= <user>
##$USERP3= <user>
##$USERP4= <user>
##$USERP5= <user>
##$WDW= 1
##$XDIM= 16384
##$YMAX_p= 465127489
##$YMIN_p= -553779
$$ End of Bruker specific parameters
$$ ---------------------------------
##NTUPLES= NMR SPECTRUM
##VAR_NAME=  FREQUENCY,     SPECTRUM/REAL,   SPECTRUM/IMAG
##SYMBOL=    X,             R,               I
##VAR_TYPE=  INDEPENDENT,   DEPENDENT,       DEPENDENT
##VAR_FORM=  AFFN,          ASDF,            ASDF
##VAR_DIM=   16384,         16384,           16384
##UNITS=     HZ,            ARBITRARY UNITS, ARBITRARY UNITS
##FACTOR=    0.220516191357247, 1,           1
##FIRST=     3104.01638213565, 0,            0
##LAST=      -508.700380870135, 0,           0
##MIN=       -508.700380870135, -553779,     0
##MAX=       3104.01638213565, 465127489,    0
$$ Real data points
##PAGE= N=1
##DATA TABLE= (X++(R..R)), XYDATA
$$ [...]
$$ plain form
6115 1427201 1453265 1416637 1343247 1333726 1331682 1330060 1260242 1322075 1374392 1320824 1375166 1492112
6103 1492112 1536295 1614960 1658405 1810763 1896355 2012628 2150444 2340780 2482879 2490588 2565652
6092 2565652 2600891 2743375 2825691 2843046 2732132 2594190 2504895 2436123 2411957 2446934 2509702
6081 2509702 2518458 2458584 2433290 2409555 2431692 2350597 2324749 2398672 2520674 2665242 2684501
6070 2684501 2842041 2938184 3010419 3133059 3172180 2963326 2741143 2545135 2366584 2211752
6060 2211752 1958940 1840312 1745896 1706951 1660383 1641756 1608187 1561531 1589817 1653464 1613620
6049 1613620 1560916 1495047 1471362 1416483 1434120 1461333 1365116 1336576 1396342 1468635 1492228
6038 1492228 1521961 1461183 1471828 1307848 1224209 1144541 1013727 945201 936986 914232 903827
$$ packed form
6115A427201K6064l6628p3390r521k044j622o9818O1833N2317n3568N4342J16946
6103A492112M4183P8665M3445J52358Q5592J16273J37816J90336J42099P709P5064
6092B565652L5239J42484Q2316J7355j10914j37942q9295o8772k4166L4977O2768
6081B509702Q756n9874k5294k3735K2137q1095k5848P3923J22002J44568J9259
6070B684501J57540R6143P2235J22640L9121k08854k22183j96008j78551j54832
6060B211752k52812j18628r4416l8945m6568j8627l3569m6656K8286O3647l9844
6049A613620n2704o5869k3685n4879J7637K7213r6217k8540N9766P2293K3593
6038A492228K9733o0778J0645j63980q3639p9668j30814o8526q215k2754j0405
$$ plain form
6027 903827 849291 856456 842684 797816 720414 751512 756367 733184 747801 679621 609766 627996
6015 627996 666049 639373 601230 568337 580785 576869 578372 514732 532780 533381 538141 523679 541922
6002 541922 525914 483165 485557 420604 378281 422912 436668 433890 412178 420216 413872 376928
5990 376928 386187 381776 401399 390114 349262 396128 405591 408454 327030 392061 438758 426767
5978 426767 506525 508796 424447 422556 479577 428324 385403 383261 439003 395852 352454 409675
5966 409675 486667 471763 464971 435593 361695 341674 384830 369046 384161 386257 334181 335267
5954 335267 388090 460296 455217 425425 437963 481881 469597 468986 442909 489027 471211 422652
5942 422652 403246 421595 446507 439042 449700 482021 406167 364293 410324 410564 435641 449416
$$ packed form
6027I03827n4536P165j3772m4868p7402L1098M855k3183J4617o8180o9855J8230
6015F27996L8053k6676l8143l2893J2448l916J503o3640J8048O01M760j4462J8243
6002E41922j6008m2749K392o4953m2323M4631J3756k778k1712Q038o344l6944
5990C76928R259m411J9623j1285m0852M6866R463K863q1424O5031M6697j1991
5978D26767P9758K271q4349j891N7021n1253m2921k142N5742m3151m3398N7221
5966D09675P6992j4904o792k9378p3898k0021M3156j5784J5115K096n2076J086
5954C35267N2823P2206n079k9792J2538M3918j2284o11k6077M6118j7816m8559
5942D22652j9406J8349K4912p465J0658L2321p5854m1874M6031K40K5077J3775
$$ plain form
5930 449416 371308 353275 385011 396086 392787 329590 339445 335961 376225 345201 330894 364625
5918 364625 362083 344845 312758 314871 332050 277236 227793 217384 237988 250431 258796 237917
5906 237917 287442 298372 275930 295780 279288 254600 218371 200178 254771 247400 204345 279842
5894 279842 240911 189139 231551 226017 218204 196101 199119 228641 236631 189092 185742 195557 204907
5881 204907 199756 191238 210807 218627 205775 192884 221820 190886 143960 92699 91215 152306
5869 152306 142654 185341 225600 247855 260209 135496 141061 152075 75643 97402 214920 138146
5857 138146 101718 145449 177189 158242 173021 151708 215589 165932 129459 186716 134838 123628
5845 123628 145568 167691 199049 235455 166050 118994 161090 154656 148281 154595 125986 146138
$$ packed form
5930D49416p8108j8033L1736J1075l299o3197R855l484M0264l1024j4307L3731
5918C64625k542j7238l2087K113J7179n4814m9443j0409K0604J2443Q365k0879
5906B37917M9525J0930k2442J9850j6492k4688l6229j8193N4593p371m3055P5497
5894B79842l8931n1772M2412n534p813k2103L018K9522P990m7539l350R815R350
5881B04907n151q518J9569P820j2852j2891K8936l0934m6926n1261j484O1091
5869A52306r652M2687M0259K2255J2354j24713N565J1014p6432K1759J17518p6774
5857A38146l6428M3731L1740j8947J4779k1313O3881m9657l6473N7257n1878j1210
5845A23628K1940K2123L1358L6406o9405m7056M2096o434o375O314k8609K0152
$$ plain form
5833 146138 131675 129734 100075 77994 113209 152658 142620 140748 177868 166676 124208 105107
5821 105107 161564 159985 137930 139055 144614 113808 169907 181972 134531 105495 133293 134167 111098
5808 111098 182690 145119 109375 131191 230778 234967 257127 212030 182158 160260 191259 124775
5796 124775 154776 199295 226024 196494 194169 157476 56479 106109 88309 88718 103887 107587
5784 107587 100892 126838 120997 86824 102708 103541 156356 167698 114159 82141 49983 85735
5772 85735 175291 153043 76053 86575 103936 149343 105229 120820 92003 62904 116373 184147
5760 184147 221936 219364 236133 164976 146793 231717 157232 88180 85515 160590 155884 100567
5748 100567 94562 113693 174976 226050 244133 207651 217921 174762 143979 174261 163079 171370
$$ packed form
5833A46138j4463j941k9659k2081L5215L9449j0038j872L7120j1192m2468j9101
5821A05107N6457j579k2055J125N559l0806N6099J2065m7441k9036K7798Q74k3069
5808A11098P1592l7571l5744K1816R9587M189K2160m5097k9872k1898L0999o6484
5796A24775L0001M4519K6729k9530k325l6693j00997M9630j7800M09J5169L700
5784A07587o695K5946n841l4173J5884Q33N2815J1342n3539l2018l2158L5752
5772H5735Q9556k2248p6990J0522J7361M5407m4114J5591k8817k9099N3469O7774
5760A84147L7789k572J6769p1157j8183Q4924p4485o9052k665P5075m706n5317
5748A00567o005J9131O1283N1074J8083l6482J0270m3159l0783L0282j1182Q291
$$ plain form
5736 171370 230560 222775 213519 184936 171878 177183 216828 262011 268184 258826 191136 133452 202211
5723 202211 196863 167010 172258 156953 151559 205546 207060 232655 275736 249506 312482 278031
5711 278031 248525 221626 153958 140485 165601 160864 162991 182241 207437 264525 164736 159266
5699 159266 226158 218052 228967 215114 236484 180974 182229 175438 166653 215609 158485 172638
5687 172638 186180 229018 262971 287261 260950 216257 215179 269343 270908 261735 237054 147160
5675 147160 266419 280937 259447 249784 153028 218731 253341 275492 181152 164434 224776 212233
5663 212233 229213 262561 293015 275660 295234 305458 339247 217380 182357 220705 307821
5652 307821 257675 280524 296673 270145 354908 322412 325302 377666 367544 373393 362061 407390
$$ packed form
5736A71370N9190p785r256k8583j3058N305L9645M5183O173r358o7690n7684O8759
5723B02211n348k9853N248j5305n394N3987J514K5595M3081k6230O2976l4451
5711B78031k9506k6899o7668j3473K5116m737K127J9250K5196N7088r9789n470
5699A59266O6892q106J0915j3853K1370n5510J255o791q785M8956n7124J4153
5687A72638J3542M2838L3953K4290k6311m4693j078N4164J565r173k4681q9894
5675A47160J19259J4518k1490r663r6756O5703L4610K2151r4340j6718O0342j2543
5663B12233J6980L3348L0454j7355J9574J0224L3789j21867l5023L8348Q7116
5652C07821n0146K2849J6149k6528Q4763l2496K890N2364j0122N849j1332M5329
$$ plain form
5640 407390 359213 346111 359705 370779 424495 439103 476428 437928 510497 503381 429353 408817
5628 408817 374312 380643 434734 463949 488952 485020 411181 494764 555015 580327 604040 563916
5616 563916 629067 666047 715495 756845 679001 663978 663322 722290 724022 758313 822691 871368
5604 871368 832185 847453 883518 997885 1081968 1021132 1014266 1009791 1055708 1156050 1186204 1252958
5592 1252958 1313716 1294596 1276158 1280331 1329462 1337722 1419846 1479517 1552886 1564849 1587522 1652856
5580 1652856 1770297 1812149 1887344 1844608 1860627 1934859 1987765 2012794 1944032 1876001 1821140
5569 1821140 1698883 1619918 1542844 1611617 1680795 1729421 1715252 1646444 1646936 1658896 1726973 1754949
5557 1754949 1797902 1795769 1832295 1882988 1951628 2086421 2132137 2092881 2034188 1932074 1827993
$$ packed form
5640D07390m8177j3102J3594J1074N3716J4608L7325l8500P2569p116p4028k0536
5628D08817l4505O331N4091K9215K5003l932p3839Q3583O0251K5312K3713m0124
5616E63916O5151L6980M9448M1350p7844j5023o56N8968J732L4291O4378M8677
5604H71368l9183J5268L6065J14367Q4083o0836o866m475M5917J00342L0154O6754
5592A252958O0758j9120j8438M173M9131Q260Q2124N9671P3369J1963K2673O5334
5580A652856J17441M1852P5195m2736J6019P4232N2906K5029o8762o8031n4861
5569A821140j22257p8965p7074O8773O9178M8626j4169o8808M92J1960O8077K7976
5557A754949M2953k133L6526N0693O8640J34793M5716l9256n8693j02114j04081
$$ plain form
5546 1827993 1704011 1500164 1347370 1283189 1240470 1259286 1180557 1129089 1094696 1128971 1172094
5535 1172094 1146710 1132172 1114999 1089918 1140598 1237963 1265686 1316618 1356915 1450600 1559095
5524 1559095 1650721 1697667 1707970 1611283 1432656 1282535 1191844 1114106 1032834 979405 986733
5513 986733 914664 886265 788402 800598 857400 783263 816607 843499 817069 836134 832893 913909
5501 913909 999024 1062535 1117127 1180456 1185057 1188474 1235646 1196543 1125176 1051318 922777 847833
5489 847833 814821 759246 785878 681691 658711 651950 651099 622108 628553 660875 677808 687794
5477 687794 669070 608324 639418 704566 727619 717530 778304 823692 927489 939618 925783
5466 925783 898852 853671 912209 881788 854637 875650 851583 835247 883172 910250 970139 989319
$$ packed form
5546A827993j23982k03847j52794o4181m2719J8816p8729n1468l4393L4275M3123
5535A172094k5384j4538j7173k5081N0680R7365K7723N0932M0297R3685J08495
5524A559095R1626M6946J0303r6687j78627j50121r0691p7738q1272n3429P328
5513I86733p2069k8399r7863J2196N6802p4137L3344K6892k6430J9065l241Q1016
5501I13909Q5115O3511N4592O3329M601L417M7172l9103p1367p3858j28541p4944
5489H47833l3012n5575K6632j04187k2980o761q51k8991O445L2322J6933R986
5477F87794j8724o0746L1094O5148K3053j0089O0774M5388J03797J2129j3835
5466I25783k6931m5181N8538l0421k7151K1013k4067j6336M7925K7078N9889J9180
$$ plain form
5454 989319 980952 1050439 1150889 1172646 1251034 1254629 1317212 1483915 1582880 1622073 1638304 1635270
5442 1635270 1548912 1503937 1432426 1398423 1333530 1384618 1457909 1414995 1439768 1432863 1376821 1474466
5430 1474466 1525355 1597624 1659503 1783892 1888775 1937736 1972002 2060918 2161426 2184256 2255075
5419 2255075 2424358 2568960 2759608 2759917 2569492 2326929 2137737 2009666 1925022 1926109 1884704
5408 1884704 1815706 1742751 1789966 1782949 1760380 1796331 1840676 1867332 1950015 2051580 2165850
5397 2165850 2177201 2172539 2139212 2056364 1935290 1873455 1867608 1853621 1848709 1730193 1583077
5386 1583077 1473687 1324479 1260482 1254626 1141993 1104225 1136049 1085014 970335 969209 1023628
5375 1023628 979625 1029110 1035790 1005576 1088314 1128524 1154767 1146966 1053483 946147 840579
$$ packed form
5454I89319q367O9487J00450K1757P8388L595O2583J66703R8965L9193J6231l034
5442A635270q6358m4975p1511l4003o4893N1088P3291m2914K4773o905n6042R7645
5430A474466N0889P2269O1879J24389J04883M8961L4266Q8916J00508K2830P0819
5419B255075J69283J44602J90648L09j90425k42563j89192j28071q4644J087m1405
5408A884704o8998p2955M7215p017k2569L5951M4345K6656Q2683J01565J14270
5397B165850J1351m662l3327q2848j21074o1835n847j3987m912j18516j47116
5386A583077j09390j49208o3997n856j12633l7768L1824n1035j14679j126N4419
5375A023628m4003M9485O680l0214Q2738M0210K6243p801r3483j07336j05568
$$ plain form
5364 840579 809365 725288 696153 645640 677109 572071 546356 564426 509767 510787 480318 508218
5352 508218 480861 455024 526268 571706 496359 421598 385603 407488 403705 364835 430140 411857
5340 411857 398317 380326 415228 440015 367379 327365 298913 290930 291451 289088 319469 286448
5328 286448 364627 406710 391714 355745 333605 338653 291005 296025 300204 321011 347829 324715
5316 324715 295886 313288 307706 358101 395427 320575 290124 319468 337170 350762 343296 325297
5304 325297 301917 306817 268758 333962 330745 336951 312704 302085 276180 312331 346925 300934
5292 300934 337164 318092 287566 272982 262338 329264 311613 330404 329440 285361 293838 237728
5280 237728 198953 177123 167594 163879 272175 300836 273920 297143 347723 322286 267958 286500
$$ packed form
5364H40579l1214q4077k9135n0513L1469j05038k5715J8070n4659J020l0469K7900
5352E08218k7357k5837P1244M5438p5347p4761l5995K1885l783l8870O5305j8283
5340D11857j3540j7991L4902K4787p2636m0014k8452p983N21k363L0381l3021
5328B86448P8179M2083j4996l5969k2140N048m7648N020M179K0807K6818k3114
5316C24715k8829J7402n582N0395L7326p4852l0451K9344J7702J3592p466j7999
5304C25297k3380M900l8059O5204l217O206k4247j0619k5905L6151L4594m5991
5292C00934L6230j9072l0526j4584j0644O6926j7651J8791r64m4079Q477n6110
5280B37728l8775k1830r529l715J08296K8661k6916K3223N0580k5437n4328J8542
$$ plain form
5268 286500 327067 272875 253245 294835 286096 242376 292337 317899 345213 325622 310071 245221
5256 245221 243124 286353 268946 366593 334552 256752 265577 289165 268215 339316 283264 306982
5244 306982 234122 289973 360950 328558 322139 306704 332909 250156 233460 262412 271617 307770
5232 307770 295860 325467 327244 321324 352265 345501 358601 373173 340022 314839 331438 337379
5220 337379 265933 311016 253219 231063 231372 228454 285078 237764 204216 218137 308739 330361
5208 330361 302438 272670 344133 370982 340468 308859 318335 336895 301667 303055 236520 264365
5196 264365 355845 350809 298218 238773 248528 307869 309164 286296 333296 278698 284032 348565
5184 348565 310936 285554 319333 357473 301316 271410 315069 359584 366357 324815 321028 295184
$$ packed form
5268B86500M0567n4192j9630M1590q739m3720M9961K5562K7314j9591j5551o4850
5256B45221k097M3229j7407R7647l2041p7800Q825K3588k0950P1101n6052K3718
5244C06982p2860N5851P0977l2392o419j5435K6205q2753j6696K8952R205L6153
5232C07770j1910K9607J777n920L0941o764J3100J4572l3151k5183J6599N941
5220C37379p1446M5083n7797k2156L09k918N6624m7314l3548J3921R0602K1622
5208C30361k7923k9768P1463K6849l0514l1609R476J8560l5228J388o6535K7845
5196B64365R1480n036n2591n9445R755N9341J295k2868M7000n4598N334O4533
5184C48565l7629k5382L3779L8140n6157k9906M3659M4515O773m1542l787k5844
$$ plain form
5172 295184 328476 351770 380313 279299 229300 250304 255030 257115 252537 282742 233058 324361
5160 324361 349548 317040 327154 284469 319601 361164 323985 347647 349775 339759 383888 307802
5148 307802 297236 341410 337431 402984 334043 321628 362181 360445 407322 408430 380910 339472
5136 339472 330237 362626 434985 410065 371139 317169 395986 415360 374900 382612 440752 455176
5124 455176 447195 424141 436404 463333 438187 385442 465332 481084 477898 516763 475887 476636
5112 476636 474031 548388 540987 504403 492835 466719 531325 537324 495384 527195 567992 564420
5100 564420 639691 662039 653610 687700 693097 764191 819123 838926 834572 775740 802909 866940
5088 866940 906988 968039 1030809 1148001 1185175 1170024 1264611 1359606 1399820 1457733 1592678
$$ packed form
5172B95184L3292K3294K8543j01014m9999K1004M726K085m578L0205m9684R1303
5160C24361K5187l2508J0114m2685L5132M1563l7179K3662K128j0016M4129p6086
5148C07802j0566M4174l979O5553o8941j2415M0553j736M6877J108k7520m1438
5136C39472r235L2389P2359k4920l8926n3970P8817J9374m0460P712N8140J4424
5124D55176p981k3054J2263K6929k5146n2745P9890J5752l186L8865m0876P49
5112D76636k605P4357p401l6584j1568k6116O4606N999m1940L1811M0797l572
5100E64420P5271K2348q429L4090N397P1094N4932J9803m354n8832K7169O4031
5088H66940M0048O1051O2770J17192L7174j5151R4587R4995M0214N7913J34945
$$ plain form
5077 1592678 1724578 1834566 2019168 2151038 2358477 2481562 2616109 2864157 3120212 3475800
5067 3475800 3899085 4328337 4811993 5487584 6345116 7298253 8086618 8294119 8243940 8730862
5057 8730862 9537637 10234438 10261419 9615948 9245659 9412588 10095591 10559157 10045003 8600676
5047 8600676 7062324 6052847 5305028 4795264 4401124 4127756 3925748 3637908 3321655
5038 3321655 3052306 2807476 2557804 2406360 2290094 2255220 2171790 2019973 1946481 1844761
5028 1844761 1775843 1751249 1596030 1493583 1417376 1421953 1404450 1333533 1178462 1201659 1176586
5017 1176586 1142172 1142474 1103363 995309 959300 967113 982703 986233 861247 868288 882350 894002
5005 894002 793642 723312 765070 817735 783251 808836 869271 852023 885691 842516 801908
$$ packed form
5077A592678J31900J09988J84602J31870K07439J23085J34547K48048K56055L55588
5067C475800M23285M29252M83656O75591Q57532R53137P88365K07501n0179M86922
5057H730862Q06775O96801K6981o45471l70289J66929O83003M63566n14154j444327
5047H600676j538352j009477p47819n09764l94140k73368k02008k87840l16253
5038C321655k69349k44830k49672j51444j16266l4874q3430j51817p3492j01720
5028A844761o8918k4594j55219j02447p6207M577j7503p0917j55071K3197k5073
5017A176586l4414L02l9111j08054l6009P813J5590L530j24986P041J4062J1652
5005H94002j00360p0330M1758N2665l4484K5585O0435j7248L3668m3175m0608
$$ plain form
4994 801908 803006 817240 777239 783167 782190 789339 779038 769193 703435 634259 657392 645817 653457
4981 653457 625972 599620 535964 603555 610438 651398 710759 746844 777793 722019 674689 750097
4969 750097 706410 742107 752483 706637 755400 752766 758387 737836 780704 804820 790240 786436
4957 786436 781687 825877 918418 913174 918482 912424 903239 937917 1019241 1083987 1082093 1042729 1010727
4944 1010727 1017768 987662 1035885 1055616 1096845 1042258 1050648 1049957 1001602 1014282 972813 944614
4932 944614 898460 865521 895941 955831 943555 925495 904925 880330 913623 872608 860507 820618
4920 820618 854196 845579 871693 909850 862657 870461 882340 830344 827416 814045 828002 937558
4908 937558 916961 994398 1010701 914970 893339 906278 929087 945431 918134 864016 872324 887047
$$ packed form
4994H01908J098J4234m0001N928r77P149j0301r845o5758o9176K3133j1575P640
4981F53457k7485k6352o3656O7591O883M0960N9361L6085L0949n5774m7330P5408
4969G50097m3687L5697J0376m5846M8763k634N621k0551M2868K4116j4580l804
4957G86436m749M4190R2541n244N308o058r185L4678Q1324O4746j894l9364l2002
4944A010727P041l0106M8223J9731M1229n4587Q390o91m8355J2680m1469k8199
4932I44614m6154l2939L0420N9890j2276j8060k0570k4595L3293m1015j2101l9889
4920H20618L3578q617K6114L8157m7193P804J1879n1996k928j3371J3957J09556
4908I37558k0597P7437J6303r5731k1631J2939K2809J6344k7297n4118Q308J4723
$$ plain form
4896 887047 898595 1016168 1014342 971576 912218 908579 938999 953190 948805 949818 921584 914258
4884 914258 961361 979420 1061518 1093562 1088951 1051295 1123253 1174695 1088230 1046085 1065959 1122221
4872 1122221 1111655 1047815 999471 1041193 1059859 1123418 1178628 1220165 1296998 1278424 1290052
4861 1290052 1368814 1414269 1480030 1501215 1554784 1682665 1809429 1852587 1730754 1644355 1601108
4850 1601108 1578198 1536426 1477496 1432243 1423110 1439559 1509641 1497685 1533076 1518460 1526294 1602089
4838 1602089 1682105 1703950 1656733 1660963 1716271 1787704 1850954 1902520 1916544 1960925 1937942 1961739
4826 1961739 2085118 2154230 2170764 2231108 2246417 2247489 2297177 2376703 2395443 2502172 2520318
4815 2520318 2531252 2583070 2632799 2702170 2823287 2924220 3039953 3108345 3130050 3241296 3368519
$$ packed form
4896H87047J1548J17573j826m2766n9358l639L0420J4191m385J013k8234p326
4884I14258M7103J8059Q2098L2044m611l7656P1958N1442q6465m2145J9874N6262
4872A122221j0566o3840m8344M1722J8666O3559N5210M1537P6833j8574J1628
4861A290052P8762M5455O5761K1185N3569J27881J26764M3158j21833q6399m3247
4850A601108k2910m1772n8930m5253r133J6449P0082j1956L5391j4616P834P5795
4838A602089Q0016K1845m7217M230N5308P1433O3250N1566J4024M4381k2983K3797
4826A961739J23379O9112J6534O0344J5309J072M9688P9526J8740J06729J8146
4815B520318J0934N1818M9729O9371J21117J00933J15733O8392K1705J11246J27223
$$ plain form
4804 3368519 3463222 3608314 3760341 3883996 4031369 4239744 4443964 4632446 4862109 5091411
4794 5091411 5343817 5563071 5822140 6081778 6408663 6795960 7189171 7577946 7962474 8389558
4784 8389558 8858228 9352767 9787876 10348780 10974086 11677665 12396736 13145534 13967067 14743830
4774 14743830 15629476 16619408 17806902 19258526 21004014 23041184 25189333 27206173
4766 27206173 28693890 29365340 29649308 29975978 30556418 31116738 31494254 31674498 31996248
4757 31996248 32553715 33385264 34338459 35239233 36169326 37142241 38375301 39835378 41359695
4748 41359695 42803861 43958763 44999749 46108953 47350420 48805624 50586605 52608297
4740 52608297 54738834 57089844 59570066 61840790 63277279 63111609 61235330 58761252
$$ packed form
4804C368519R4703J45092J52027J23655J47373K08375K04220J88482K29663K29302
4794E091411K52406K19254K59069K59638L26885L87297L93211L88775L84528M27084
4784H389558M68670M94539M35109N60904O25306P03579P19071P48798Q21533P76763
4774A4743830Q85646R89932J187494J451624J745488K037170K148149K016840
4766B7206173J487717O71450K83968L26670N80440N60320L77516J80244L21750
4757C1996248N57467Q31549R53195R00774R30093R72915J233060J460077J524317
4748D1359695J444166J154902J040986J109204J241467J455204J780981K021692
4740E2608297K130537K351010K480222K270724J436489j65670j876279k474078
$$ plain form
4732 58761252 56492060 54513523 52739485 51201033 49770254 48664525 47687155 46645650
4724 46645650 45306755 43677203 41880724 40345458 39134673 38067360 37340530 36627092
4716 36627092 35945817 35241406 34692935 34470103 34501160 34573423 34366292 33968225 33470571 33043616
4706 33043616 32523208 31510024 29608985 26945623 24336998 22135588 20451650 19173232
4698 19173232 18202315 17351036 16640997 15871887 15146756 14411344 13730247 13171992 12593632
4689 12593632 12084786 11585990 11041027 10642617 10236430 9818580 9425023 9061621 8697260
4680 8697260 8303819 7966253 7650644 7440805 7139026 6853487 6659748 6401535 6170645 5927103
4670 5927103 5781969 5661480 5501468 5395178 5278709 5166619 5025107 4971112 4938321 4845947
$$ packed form
4732E8761252k269192j978537j774038j538452j430779j105729r77370j041505
4724D6645650j338895j629552j796479j535266j210785j067313p26830p13438
4716C6627092o81275p04411n48471k22832L1057P2263k07131l98067m97654m26955
4706C3043616n20408j013184j901039k663362k608625k201410j683938j278418
4698A9173232r70917q51279p10039p69110p25131p35412o81097n58255n78360
4689A2593632n08846m98796n44963l98410m06187m17850l93557l63402l64361
4680H697260l93441l37566l15609k09839l01779k85539j93739k58213k30890k43542
4670E927103j45134j20489j60012j06290j16469j12090j41512n3995l2791r2374
$$ plain form
4660 4845947 4771998 4801848 4725907 4673863 4639485 4589819 4533881 4531978 4470303 4454090 4417643 4374313
4648 4374313 4323553 4216039 4204968 4062812 3893349 3746022 3576824 3487604 3350525 3246356
4638 3246356 3143358 3083268 3021405 2935010 2914318 2894537 2845479 2744202 2614228 2634963 2597330
4627 2597330 2500213 2516206 2552645 2466798 2473896 2459302 2414630 2435023 2395058 2340422 2278762 2292072
4615 2292072 2186277 2135698 2065916 1946372 1851773 1784589 1737695 1728430 1679027 1639338 1527281
4604 1527281 1477320 1431248 1428630 1343266 1283573 1297010 1299492 1266855 1263705 1283790 1293482 1303028
4592 1303028 1274728 1275140 1228271 1222199 1280695 1193614 1065361 1061602 1060593 1061208 1054964 1025997 937781
4579 937781 903441 977941 998798 980876 1062471 1027503 952900 990263 968855 1000843 975097 956356
$$ packed form
4660D845947p3949K9850p5941n2044l4378m9666n5938j903o1675j6213l6447m3330
4648D374313n0760j07514j1071j42156j69463j47327j69198q9220j37079j04169
4638C246356j02998o0090o1863q6395k0692j9781m9058j01277j29974K0735l7633
4627B597330r7117J5993L6439q5847P098j4594m4672K0393l9965n4636o1660J3310
4615B292072j05795n0579o9782j19544r4599o7184m6894r265m9403l9689j12057
4604A527281m9961m6072k618q5364n9693J3437K482l2637l150K0085R692R546
4592A303028k8300M12m6869o072N8496q7081j28253l759j009O15o244k8967q8216
4579I37781l4340P4500K0857j7922Q1595l4968p4603L7363k1408L1988k5746j8741
$$ plain form
4567 956356 897999 866229 864470 883230 948146 937889 912016 873923 886468 946186 934960 921731
4555 921731 937987 935775 929004 949958 978061 949530 963452 889523 847447 893283 886381 881010
4543 881010 917350 836139 850772 940920 910769 841770 815987 867097 873280 808731 813238 826184
4531 826184 924800 896048 818759 746595 791841 761655 767530 797321 839472 792683 772634 756781
4519 756781 773372 828917 804101 776191 760410 782180 797440 800917 690683 724947 761725 766340
4507 766340 716859 657328 655848 664166 706263 747450 723068 697536 665195 658891 683682 759295
4495 759295 755400 760610 736833 735328 792207 747465 725603 676294 594799 641603 709459 709182 692089
4482 692089 679266 703468 603620 552390 604250 640953 683260 706638 671867 613560 646958 669334
$$ packed form
4567I56356n8357l1770j759J8760O4916j0257k5873l8093J2545N9718j1226j3229
4555I21731J6256k212o771K0954K8103k8531J3922p3929m2076M5836o902n371
4543H81010L6340q1211J4633R0148l0151o8999k5783N1110O183o4549M507J2946
4531H26184R8616k8752p7289p2164M5246l0186N875K9791M2151m6789k0049j5853
4519G56781J6591N5545k4816k7910j5781K1770J5260L477j10234L4264L6778M615
4507G66340m9481n9531j480Q318M2097M1187k4382k5532l2341o304K4791P5613
4495G59295l895N210k3777j505N6879m4742k1862m9309q1495M6804O7856k77j7093
4482F92089j2823K4202r9848n1230N1860L6703M2307K3378l4771n8307L3398K2376
$$ plain form
4470 669334 644698 659074 647588 673884 724397 702958 749923 726048 727990 726473 753317 732224
4458 732224 718453 779558 793625 788635 786446 785136 792138 799094 827882 801262 792511 768551 796409
4445 796409 828324 881346 862169 839633 851473 797152 848379 834071 799597 838793 916762 897540
4433 897540 944392 933430 901247 856328 916109 1067239 1005099 948187 968346 977791 934767 961959
4421 961959 1013828 1012211 1009698 1029228 1058083 962559 916581 934920 966163 1003926 1008044 994848
4409 994848 1006080 1002537 951565 918232 929269 998669 977136 961125 899053 972697 978772 971192
4397 971192 1034736 945676 964854 997309 916978 872492 861933 900959 951022 867652 836065 875803
4385 875803 871787 887374 898068 974695 958679 875559 911990 937630 872655 862377 916260 912583
$$ packed form
4470F69334k4636J4376j1486K6296N0513k1439M6965k3875J942j517K6844k1093
4458G32224j3771O1105J4067m990k189j310P002O956K8788k6620q751k3960K7858
4445G96409L1915N3022j9177k2536J1840n4321N1227j4308l4474L9196P7969j9222
4433H97540M6852j0962l2183m4919N9781J51130o2140n6912K0159R445m3024K7192
4421I61959N1869j617k513J9530K8855r5524m5978J8339L1243L7763M118j3196
4409I94848J1232l543n0972l3333J1037O9400k1533j6011o2072P3644O075p580
4397I71192O3544q9060J9178L2455q0331m4486j0559L9026N0063q3370l1587L9738
4385H75803m016J5587J0694P6627j6016q3120L6431K5640o4975j0278N3883l677
$$ plain form
4373 912583 923672 908198 898450 950088 958486 949318 943817 923148 968107 964440 972226 1042759 1071134
4360 1071134 1052793 1057008 1036930 993296 979204 990447 973093 1067459 1099020 1014818 984240 974395
4348 974395 997942 1039568 1034532 1083822 1031578 1037554 1053350 1017229 1033576 1057516 1092065 1066295
4336 1066295 1060169 1122219 1091328 1059901 1114857 1125559 1141043 1148586 1213399 1246300 1259299 1261613
4324 1261613 1294096 1290546 1315813 1286299 1255308 1370932 1463992 1448327 1423608 1490454 1555298
4313 1555298 1610837 1635001 1686459 1673141 1701866 1797083 1897582 1937476 1946218 2003235 2102944
4302 2102944 2130484 2221114 2330914 2443187 2556728 2721397 2856359 2980842 3208394 3313187
4292 3313187 3512022 3750276 3958016 4099875 4329421 4630347 4833115 4991853 5265608 5627206
$$ packed form
4373I12583J1089j5474r748N1638Q398r168n501k0669M4959l667P786P0533K8375
4360A071134j8341M215k0078m3634j4092J1243j7354R4366L1561q4202l0578r845
4348I74395K3547M1626n036M9290n2244N976J5796l6121J6347K3940L4549k5770
4336A066295o126O2050l0891l1427N4956J0702J5484P543O4813L2901J2999K314
4324A261613L2483l550K5267k9514l0991J15624R3060j5665k4719O6846O4844
4313A555298N5539K4164N1458j3318K8725R5217J00499L9894Q742N7017R9709
4302B102944K7540R0630J09800J12273J13541J64669J34962J24483K27552J04793
4292C313187J98835K38254K07740J41859K29546L00926K02768J58738K73755L61598
$$ plain form
4282 5627206 6033811 6355286 6777021 7257797 7757532 8332085 8883537 9378022 9731314 10014480
4272 10014480 10290464 10588479 10994051 11477323 12056607 12774780 13648554 14560952 15600554
4263 15600554 16739894 17767686 18689653 19450478 20009207 20333993 20513776 20650835 20808040
4254 20808040 21125302 21585742 22355273 23380079 24432905 25608128 26904287 28107790 29067499
4245 29067499 29766263 30022097 29883014 29407586 28880532 28244674 27788166 27664895 27722255 27976246
4235 27976246 28513221 29165883 29911118 30621894 31151877 31377760 31191743 30553101 29450754
4226 29450754 28066310 26658898 25432336 24417409 23729839 23224886 23047843 23104402 23155628
4217 23155628 23318554 23378284 23160327 22651983 21693790 20471355 19119760 17734949 16458084
$$ packed form
4282E627206M06605L21475M21735M80776M99735N74553N51452M94485L53292K83166
4272A0014480K75984K98015M05572M83272N79284P18173Q73774R12398J039602
4263A5600554J139340J027792R21967P60825N58729L24786J79783J37059J57205
4254B0808040L17262M60440P69531J024806J052826J175223J296159J203503R59709
4245B9067499O98764K55834j39083m75428n27054o35858m56508j23271N7360K53991
4235B7976246N36975O52662P45235P10776N29983K25883j86017o38642j102347
4226B9450754j384444j407412j226562j014927o87570n04953j77043N6559N1226
4217B3155628J62926N9730k17957n08344r58193j222435j351595j384811j276865
$$ plain form
4208 16458084 15421248 14549872 13897272 13405878 13072100 12892888 12695892 12446774 12138083
4199 12138083 11694195 11051322 10319105 9515869 8831032 8211440 7676576 7126140 6716218
4190 6716218 6486001 6232672 6052352 5908499 5749757 5542396 5356860 5077135 4808643 4531364
4180 4531364 4373369 4167918 4009963 3860664 3676610 3507469 3379020 3353207 3246147 3161285
4170 3161285 3084550 2990972 2919111 2832340 2859486 2772188 2715174 2687839 2588819 2528437 2441824
4159 2441824 2420106 2361406 2319890 2299247 2254122 2263424 2256679 2213932 2184265 2205681 2202925 2148605
4147 2148605 2152768 2138030 2071107 2116493 2130213 2053903 2020621 1965654 2026093 1965028 1929206 1940031
4135 1940031 1922419 1890617 1870527 1850336 1860187 1919776 1972743 1899048 1823436 1790368 1753639 1710575
$$ packed form
4208A6458084j036836q71376o52600m91394l33778j79212j96996k49118l08691
4199A2138083m43888o42873p32217q03236o84837o19592n34864n50436m09922
4190F716218k30217k53329j80320j43853j58742k07361j85536k79725k68492k77279
4180D531364j57995k05451j57955j49299j84054j69141j28449k5813j07060q4862
4170C161285p6735r3578p1861q6771K7146q7298n7014k7335r9020o0382q6613
4159B441824k1718n8700m1516k0643m5125R302o745m2747k9667K1416k756n4320
4147B148605M163j4738o6923M5386J3720p6310l3282n4967O0439o1065l5822J0825
4135A940031j7612l1802k0090k0191R851N9589N2967p3695p5612l3068l6729m3064
$$ plain form
4123 1710575 1724485 1830558 1842583 1860099 1801582 1768400 1759568 1769241 1861677 1872645 1841101 1870058
4111 1870058 1827211 1817944 1839658 1867995 1901470 1897055 1891298 1881026 1939641 1885181 1876051 1967821
4099 1967821 1969571 2049358 2136432 2145144 2136423 2225464 2369545 2424720 2521395 2630554 2574038 2522531
4087 2522531 2551477 2513850 2605089 2810164 2885497 2928001 3087623 3140808 3250866 3394136 3505138
4076 3505138 3524614 3468049 3453835 3536631 3568943 3608510 3640909 3714281 3788569 3857648 4053358
4065 4053358 4224835 4345329 4419008 4373618 4274992 4186436 4073132 4013217 3922141 3951740 4014826
4054 4014826 4062760 4086734 4147578 4195568 4220331 4230630 4219625 4123496 4025121 3974714 3847464
4043 3847464 3684031 3631212 3544672 3510703 3564981 3705722 3737438 3748446 3733888 3608948 3535313
$$ packed form
4123A710575J3910J06073J2025J7516n8517l3182q832R673R2436J0968l1544K8957
4111A870058m2847r267K1714K8337L3475m415n757j0272N8615n4460r130R1770
4099A967821J750P9787Q7074Q712q721Q9041J44081N5175R6675J09159n6516n1507
4087B522531K8946l7627R1239K05075P5333M2504J59622N3185J10058J43270J11002
4076C505138J9476n6565j4214Q2796L2312L9567L2399P3372P4288O9079J95710
4065D053358J71477J20494P3679m5390r8626q8556j13304n9915r1076K9599O3086
4054D014826M7934K3974O0844M7990K4763J0299j1005r6129r8375n0407j27250
4043C847464j63433n2819q6540l3969N4278J40741L1716J1008j4558j24940p3635
$$ plain form
4032 3535313 3498198 3461552 3427371 3473914 3427779 3377403 3413759 3481872 3470208 3457966 3511680
4021 3511680 3524650 3563988 3580325 3623817 3690450 3692637 3751814 3787942 3769902 3784588 3872600 3858143
4009 3858143 3862287 3887403 3965265 4000764 4069113 4150547 4220159 4271307 4319875 4362876 4378440 4408331
3997 4408331 4489625 4517085 4514333 4621607 4683643 4680857 4683567 4722212 4723877 4837505 4914354 4936531
3985 4936531 4999944 5042960 5104101 5106558 5154328 5191716 5242529 5250950 5208348 5166711 5240310 5265531
3973 5265531 5327306 5413077 5521546 5611436 5641865 5755380 5775004 5832322 5874203 6011912 6015942
3962 6015942 6016297 6024339 6075840 6016490 5998332 6006010 6036238 6074597 6165236 6269472 6350302 6485271
3950 6485271 6669941 6891795 7129591 7465530 7716711 8000641 8226546 8385022 8378548 8434560
$$ packed form
4032C535313l7115l6646l4181M6543m6135n0376L6356O8113j1664j2242N3714
4021C511680J2970L9338J6337M3492O6633K187N9177L6128j8040J4686Q8012j4457
4009C858143M144K5116P7862L5499O8349Q1434O9612N1148M8568M3001J5564K9891
3997D408331Q1294K7460k752J07274O2036k786K710L8645J665J13628P6849K2177
3985D936531O3413M3016O1141K457M7770L7388N0813Q421m2602m1637P3599K5221
3973E265531O1775Q5771J08469Q9890L0429J13515J9624N7318M1881J37709M030
3962F015942L55Q042N1501n9350j8158P678L0228L8359R0639J04236Q0830J34969
3950F485271J84670K21854K37796L35939K51181K83930K25905J58476o474N6012
$$ plain form
3940 8434560 8444123 8380979 8469025 8571827 8699509 8898899 9150447 9338640 9629280 9944689
3930 9944689 10345921 10811574 11342772 11904096 12521740 13210196 14015797 14895983 15805227 16779184
3920 16779184 17625891 18524789 19519179 20752044 22238194 23953145 25899434 28099142 30453268
3911 30453268 32592764 33933250 34334641 34190384 34108281 34376075 34747544 35255991 35941959
3902 35941959 36944146 38326289 40099830 42050086 43872329 45455437 46536667 47080626
3894 47080626 47344975 47506616 47664259 47889312 48340385 49108339 50220658 51776467 53895252
3885 53895252 56532404 59478398 62679963 65925006 68812519 70213221 68985777 65333956
3877 65333956 60706164 56461894 53224827 50865032 49165772 47954862 47059447 46434058
$$ packed form
3940H434560R563o3144Q8046J02802J27682J99390K51548J88193K90640L15409
3930I944689M01232M65653N31198N61324O17644O88456Q05601Q80186R09244R73957
3920A6779184Q46707Q98898R94390J232865J486150J714951J946289K199708K354126
3911C0453268K139496J340486M01391j44257q2103K67794L71469N08447O85968
3902C5941959J002187J382143J773541J950256J822243J583108J081230N43959
3894D7080626K64349J61641J57643K25053M51073P67954J112319J555809K118785
3885E3895252K637152K945994L201565L245043K887513J400702j227444l651821
3877F5333956m627792m244270l237067k359795j699260j210910q95415o25389
$$ plain form
3869 46434058 45942773 45738878 45669617 45569573 45405533 44899238 43774989 41969063 39765215
3860 39765215 37595385 35673828 34335381 33509708 33054619 32805042 32481883 32212654 32024847
3851 32024847 31940974 31489250 30382919 28517552 26255140 24115377 22277782 20857846 19716420
3842 19716420 18724068 17911190 17221957 16576076 15856607 15181529 14449320 13885725 13416049
3833 13416049 12921827 12547482 12142576 11878291 11555044 11376945 11232515 11042444 10983704 10921241
3823 10921241 10880771 10775472 10717865 10672923 10601120 10504821 10316192 10097243 9839481 9561452
3813 9561452 9271236 9041786 8873951 8678549 8551733 8502886 8473024 8430341 8391681 8336410
3803 8336410 8327674 8320656 8244199 8151116 8141652 8131615 8167329 8168663 8085633 8055818 8062761 8016731
$$ packed form
3869D6434058m91285k03895o9261j00044j64040n06295j124249j805926k203848
3860C9765215k169830j921557j338447q25673m55089k49577l23159k69229j87807
3851C2024847q3873m51724j106331j865367k262412k139763j837595j419936j141426
3842A9716420r92352q12878o89233o45881p19469o75078p32209n63595m69676
3833A3416049m94222l74345m04906k64285l23247j78099j44430j90071n8740o2463
3823A0921241m0470j05299n7607m4942p1803r6299j88629k18949k57762k78029
3813I561452k90216k29450j67835j95402j26816m8847k9862m2683l8660n5271
3803H336410q736p018p6457r3083r464j0037L5714J334q3030k9815O943m6030
$$ plain form
3791 8016731 7959387 7880217 7884386 7935315 7873272 7854552 7783262 7784180 7805085 7803012 7814955 7862875
3779 7862875 7925055 8040926 8158695 8243192 8329501 8430350 8488849 8587410 8750929 8843530 9017031
3768 9017031 9218935 9454124 9728691 9928086 10183721 10510437 10835889 11086385 11502947 11934970
3758 11934970 12419656 12924832 13479213 14170438 14828823 15601078 16410460 17332279 18418768
3749 18418768 19530441 20871673 22364094 23995766 25906710 28089471 30582198 33301077
3741 33301077 36121495 38975046 41722847 44212144 46231604 47697860 48658500 49100765
3733 49100765 48993369 48427122 47646489 46796956 46193998 45822909 45841270 46083434 46512053 47037781
3723 47037781 47390062 47469922 47071823 46228519 44879850 43047542 40860184 38293418 35685792
$$ packed form
3791H016731n7344p9170M169N0929o2043j8720p1290R18K0905k073J1943M7920
3779G862875O2180J15871J17769Q4497Q6309J00849N8499R8561J63519R2601J73501
3768I017031K01904K35189K74567J99395K55635L26716L25452K50496M16562M32023
3758A1934970M84686N05176N54381O91225O58385P72255Q09382R21819J086489
3749A8418768J111673J341232J492421J631672J910944K182761K492727K718879
3741C3301077K820418K853551K747801K489297K019460J466256R60640M42265
3733D9100765j07396n66247p80633q49533o02958l71089J8361K42164M28619N25728
3723D7037781L52281P9860l98099q43304j348669j832308k187358k566766k607626
$$ plain form
3714 35685792 33031265 30466732 28117482 26007654 24183047 22668584 21291368 20070036
3706 20070036 19114608 18191106 17402947 16735984 16167455 15512245 14914873 14420521 13956907
3697 13956907 13597268 13276917 12950351 12714662 12521741 12321170 12093506 11929191 11760529
3688 11760529 11663965 11560669 11438058 11287195 11216767 11143055 11008178 10880205 10844042 10799494
3678 10799494 10714827 10638985 10521992 10416302 10374543 10311268 10224079 10242268 10211335 10205793 10186539
3667 10186539 10169269 10237370 10280750 10281241 10336644 10382897 10410467 10479548 10538482 10594203 10730955
3656 10730955 10811059 10941876 11020409 11081834 11221066 11313079 11403350 11581343 11702189 11796142
3646 11796142 12021046 12229612 12425702 12568101 12854198 13131522 13310065 13509012 13741057
$$ packed form
3714C5685792k654527k564533k349250k109828j824607j514463j377216j221332
3706B0070036r55428r23502p88159o66963n68529o55210n97372m94352m63614
3697A3956907l59639l20351l26566k35689j92921k00571k27664j64315j68662
3688A1760529r6564j03296j22611j50863p0428p3712j34877j27973l6163m4548
3678A0799494q4667p5842j16993j05690m1759o3275q7189J8189l0933n542j9254
3667A0186539j7270O8101M3380M91N5403M6253K7570O9081N8934N5721J36752
3656A0730955Q0104J30817P8533O1425J39232R2013R0271J77993J20846R3953
3646A1796142K24904K08566J96090J42399K86097K77324J78543J98947K32045
$$ plain form
3637 13741057 13932602 14197674 14478599 14631099 14817889 15011829 15213123 15519787 15794263
3628 15794263 16061739 16414416 16857698 17279700 17710366 18198553 18702201 19315606 19938735
3619 19938735 20574530 21336105 22229507 23200245 24243259 25446265 26774785 28249931 30011702
3610 30011702 32003954 34360264 37139337 40212782 43579925 47069317 50572001 53989726
3602 53989726 56979938 59462241 61437034 62855505 63749773 64132433 64044371 63862080 63650015
3593 63650015 63688866 63885506 64350244 64993664 65695897 66291974 66444191 66066003 65205501 63783242
3583 63783242 61843124 59310978 56418324 53161053 49864456 46739144 43866885 41259779
3575 41259779 38890303 36942978 35289181 33975606 32969833 32120206 31393184 30775717 30238023
$$ packed form
3637A3741057J91545K65072K80925J52500J86790J93940K01294L06664K74476
3628A5794263K67476L52677M43282M22002M30666M88187N03648O13405O23129
3619A9938735O35795P61575Q93402R70738J043014J203006J328520J475146J761771
3610C0011702J992252K356310K779073L073445L367143L489392L502684L417725
3602E3989726K990212K482303J974793J418471Q94268L82660q8062j82291k12065
3593F3650015L8851J96640M64738O43420P02233N96077J52217l78188q60502j422259
3583F3783242j940118k532146k892654l257271l296597l125312k872259k607106
3575D1259779k369476j947325j653797j313575j005773q49627p27022o17467n37694
$$ plain form
3566 30238023 29831755 29603781 29558874 29634985 29806653 30034513 30358731 30744571 31398307 32260912
3556 32260912 33141985 34191217 35343385 36735161 38255958 39976205 41919422 44078633
3548 44078633 46666639 49483674 52725957 56251358 60192880 64466971 68851619 73256137
3540 73256137 77552005 81605856 85345432 88950750 92446488 95687591 98500727 100814065
3532 100814065 102555994 103729138 104215899 104165743 103633983 102699633 101461729 99955525 98222592
3523 98222592 96277885 94100028 91768534 89357615 86731686 83920339 80999195 78160387
3515 78160387 75302614 72686477 70275003 68109600 66352558 65136531 64248786 63890387
3507 63890387 64171827 65106467 66383892 67392727 67762748 68292990 69581045 71739734 74497732
$$ packed form
3566C0238023m06268k27974m4907P6111J71668K27860L24218L85840O53736Q62605
3556C2260912Q81073J049232J152168J391776J520797J720247J943217K159211
3548D4078633K588006K817035L242283L525401L941522M274091M384648M404518
3540G3256137M295868M053851L739576L605318L495738L241103K813136K313338
3532A00814065J741929J173144M86761n0156n31760r34350j237904j506204j732933
3523I8222592j944707k177857k331494k410919k625929k811347k921144k838808
3515G8160387k857773k616137k411474k165403j757042j216027q87745l58399
3507F3890387K81440R34640J277425J008835L70021N30242J288055K158689K757998
$$ plain form
3498 74497732 77453368 80041809 82484408 85633860 89780930 94657955 99838835 105165431
3490 105165431 110439916 115465845 120034193 124230413 127896594 131119555 134055227 136878600
3482 136878600 139985620 143601388 148236684 153715215 160276921 167664808 175219537 182084119
3474 182084119 188050604 193457239 198037776 201236704 202201585 200482333 195909936 189695938
3466 189695938 182631150 175465797 168633522 162370852 157215775 153086030 149856870 147230897
3458 147230897 144819781 142513896 140116146 137391587 134049230 129846198 124771859 118943856
3450 118943856 112611925 106051977 99379502 93022024 87131214 81769559 76917224 72512893
3442 72512893 68718084 65518594 62777139 60549392 58771042 57341731 56211327 55455753
$$ packed form
3498G4497732K955636K588441K442599L149452M147070M877025N180880N326596
3490A05165431N274485N025929M568348M196220L666181L222961K935672K823373
3482A36878600L107020L615768M635296N478531O561706P387887P554729O864582
3474A82084119N966485N406635M580537L198928R64881j719252m572397o213998
3466A89695938p064788p165353o832275o262670n155077m129745l229160k625973
3458A47230897k411116k305885k397750k724559l342357m203032n074339n828003
3450A18943856o331931o559948o672475o357478n890810n361655m852335m404331
3442G2512893l794809l199490k741455k227747j778350j429311j130404p55574
$$ plain form
3434 55455753 54965983 54742186 54832046 55254041 56004216 57122937 58642388 60657176 63098920
3425 63098920 66039628 69510115 73487397 77612071 81625791 85317710 88596401 91628560
3417 91628560 94453982 96996880 99241085 101076008 102103532 102310608 101712769 100454758
3409 100454758 98969246 97414153 95887281 94432514 93062474 91799251 90767613 89807069
3401 89807069 88863514 87849713 86706387 85167424 83206917 80860755 78116488 75039406
3393 75039406 71559364 67832447 63930684 60157826 56528878 53046840 49893063 47064815
3385 47064815 44374611 41952603 39786953 37930738 36329958 34913326 33630854 32574695
3377 32574695 31702134 30922043 30284080 29736886 29351023 28983702 28781809 28746752 28870664 29027319
$$ packed form
3434E5455753m89770k23797Q9860M21995P50175J118721J519451K014788K441744
3425F3098920K940708L470487L977282M124674M013720L691919L278691L032159
3417I1628560K825422K542898K244205J834923J027524K07076n97839j258011
3409A00454758j485512j555093j526872j454767j370040j263223j031638r60544
3401H9807069r43555j013801j143326j538963j960507k346162k744267l077082
3393G5039406l480042l726917l901763l772858l628948l482038l153777k828248
3385D7064815k690204k422008k165650j856215j600780j416632j282472j056159
3377C2574695q72561p80091o37963n47194l85863l67321k01893l5057J23912J56655
$$ plain form
3367 29027319 29410682 30016470 30800816 31816813 32865932 33826852 34604013 34665878 34165032
3358 34165032 33073741 31819228 31007166 30551517 30503148 30557460 30652229 30789566 30934251 31163829
3348 31163829 31525973 31871921 32129102 32224745 32166114 32077393 32046066 32160284 32499299 32943095
3338 32943095 33606122 34484649 35539332 36678121 37904149 38972475 39528887 39629689 39382000
3329 39382000 39352586 39954183 41203900 42911955 45008134 47521158 50162682 52843769 55568490
3320 55568490 58388264 61320725 64417959 67437905 70452270 73165666 75667604 77820743
3312 77820743 79794412 81753926 83720334 85638801 87413205 88920175 89924235 90516229
3304 90516229 90778889 90829983 90844694 90831523 90527081 89579781 87960163 85780568 83105966
$$ packed form
3367B9027319L83363O05788P84346J015997J049119R60920P77161O1865n00846
3358C4165032j091291j254513q12062m55649m8369N4312R4769J37337J44685K29578
3348C1163829L62144L45948K57181R5643n8631q8721l1327J14218L39015M43796
3338C2943095O63027Q78527J054683J138789J226028J068326N56412J00802k47689
3329C9382000k9414O01597J249717J708055K096179K513024K641524K681087K724721
3320E5568490K819774K932461L097234L019946L014365K713396K501938K153139
3312G7820743J973669J959514J966408J918467J774404J506970J004060N91994
3304I0516229K62660N1094J4711j3171l04442r47300j619618k179595k674602
$$ plain form
3295 83105966 80301838 77250644 73832833 70164865 66232383 61983674 57599770 53329439
3287 53329439 49230112 45304434 41679415 38385198 35294274 32620046 30308850 28217314
3279 28217314 26392827 24784402 23398315 22191592 21073844 20051610 19161660 18327630
3271 18327630 17581751 16956658 16317837 15801265 15294184 14803140 14414089 14082420 13789569
3262 13789569 13478132 13270137 13145817 12988657 12873393 12731861 12686177 12610681 12518336 12512218
3252 12512218 12397279 12248309 12048427 11912516 11798110 11616874 11492888 11328560 11161160
3243 11161160 11071334 11002433 10895947 10717292 10634593 10584623 10490422 10351980 10187289 10017009
3233 10017009 9796454 9529129 9346219 9139421 8898736 8660536 8410922 8190425 8006336
$$ packed form
3295H3105966k804128l051194l417811l667968l932482m248709m383904m270331
3287E3329439m099327l925678l625019l294217l090924k674228k311196k091536
3279B8217314j824487j608425j386087j206723j117748j022234q89950q34030
3271A8327630p45879o25093o38821n16572n07081m91044l89051l31669k92851
3262A3789569l11437k07995j24320j57160j15264j41532m5684p5496r2345o118
3252A2512218j14939j48970j99882j35911j14406j81236j23986j64328j67400
3243A1161160q9826o8901j06486j78655q2699m9970r4201j38442j64691j70280
3233A0017009k20555k67325j82910k06798k40685k38200k49614k20497j84089
$$ plain form
3224 8006336 7850805 7708837 7544200 7412184 7363568 7283499 7200931 7053502 6947660 6914122
3214 6914122 6814079 6716630 6685476 6624622 6533846 6558203 6544054 6487019 6453304 6394515 6377165
3203 6377165 6353435 6230886 6334685 6399128 6351315 6306049 6282307 6335047 6401010 6340821 6313103
3192 6313103 6341750 6342997 6365611 6362200 6375811 6375778 6421653 6514695 6581837 6520239 6493622 6435403
3180 6435403 6380083 6326142 6341883 6371269 6354532 6385248 6324196 6308787 6257050 6348867 6382514
3169 6382514 6460227 6395266 6485910 6523194 6517603 6492995 6479786 6432450 6393618 6378332 6359194 6303925
3157 6303925 6288234 6400906 6455250 6533060 6594992 6631109 6724342 6798635 6858294 7036693 7109610
3146 7109610 7127599 7154912 7386660 7522445 7679638 7856845 7971393 8060148 8235330 8479159
$$ packed form
3224H006336j55531j41968j64637j32016m8616q0069q2568j47429j05842l3538
3214F914122j00043r7449l1154o0854r0776K4357j4149n7035l3715n8789j7350
3203F377165k3730j22549J03799O4443m7813m5266k3742N2740O5963o0189k7718
3192F313103K8647J247K2614l411J3611l3M5875R3042O7142o1598k6617n8219
3180F435403n5320n3941J5741K9386j6737L0716o1052j5409n1737R1817L3647
3169F382514P7713o4961R0644L7284n591k4608j3209m7336l8832j5286j9138n5269
3157F303925j5691J12672N4344P7810O1932L6117R3233P4293N9659J78399P2917
3146G109610J7989K7313K31748J35785J57193J77207J14548Q8755J75182K43829
$$ plain form
3136 8479159 8619353 8841842 8981472 9206296 9471741 9664514 9933199 10190058 10503020 10815722
3126 10815722 11159120 11474861 11819765 12189412 12605943 13096781 13492922 13946795 14423962
3117 14423962 14926641 15460758 16066029 16776179 17425041 18160723 18980871 19784439 20640082
3108 20640082 21568887 22626860 23807221 25009889 26357077 27725576 29252563 30876727
3100 30876727 32749980 34793856 37111859 39571648 42298277 45296391 48598160 52355093
3092 52355093 56599784 61431133 66847288 72839487 79457229 87005719 95517645 104891290
3084 104891290 115350814 126924817 140035693 155037477 172511421 193312173 217954084
3077 217954084 246399198 278979319 317020870 360919140 405177574 437887170 449644829
$$ packed form
3136H479159J40194K22489J39630K24824K65445J92773K68685K56859L12962L12702
3126A0815722L43398L15741L44904L69647M16531M90838L96141M53873M77167
3117A4423962N02679N34117O05271P10150O48862P35682Q20148Q03568Q55643
3108B0640082R28805J057973J180361J202668J347188J368499J526987J624164
3100C0876727J873253K043876K318003K459789K726629K998114L301769L756933
3092E2355093M244691M831349N416155N992199O617742P548490Q511926R373645
3084A04891290J0459524J1574003J3110876J5001784J7473944K0800752K4641911
3077B17954084K8445114L2580121L8041551M3898270M4258434L2709596J1757659
$$ plain form
3070 449644829 447168034 447618704 457602258 465127489 449514363 403465727 342743179 287238617
3062 287238617 243904028 211172048 186229809 166739741 151036215 137937098 126604097
3055 126604097 116163759 106613653 98124575 90611095 84127637 78385378 73391134 68827264
3047 68827264 64571518 60596526 56964392 53613116 50632439 47954853 45517905 43331098
3039 43331098 41258938 39243559 37371292 35486607 33758520 32187810 30667278 29209104
3031 29209104 27830437 26541918 25387361 24306306 23263042 22392445 21620028 20847388 20130256
3022 20130256 19464704 18863606 18325984 17723543 17216794 16737529 16233657 15799086 15367296
3013 15367296 15010013 14606856 14224067 13926838 13559959 13156425 12840572 12484753 12153172
$$ packed form
3070D49644829k476795M50670R983554P525231j5613126m6048636o0722548n5504562
3062B87238617m3334589l2731980k4942239j9490068j5703526j3099117j1333001
3055A26604097j0440338r550106q489078p513480o483458n742259m994244m563870
3047F8827264m255746l974992l632134l351276k980677k677586k436948k186807
3039D3331098k072160k015379j872267j884685j728087j570710j520532j458174
3031B9209104j378667j288519j154557j081055j043264q70597p72417p72640p17132
3022B0130256o65552o01098n37622o02441n06749m79265n03872m34571m31790
3013A5367296l57283m03157l82789k97229l66879m03534l15853l55819l31581
$$ plain form
3004 12153172 11866766 11587474 11326465 11044835 10700057 10380719 10099771 9842197 9628438
2995 9628438 9443595 9294047 9124949 8887993 8633196 8447368 8324784 8164131 8049996 7853239
2985 7853239 7670273 7481422 7342042 7223473 7123244 7054170 6909238 6782678 6632492 6424594
2975 6424594 6327505 6230872 6105136 5982473 5855425 5724721 5671965 5642705 5551095 5451226 5313975
2964 5313975 5192281 5212266 5161494 5074386 4947151 4845643 4791484 4721829 4656247 4562230 4474499
2953 4474499 4445856 4380935 4341601 4281899 4200510 4117629 4037139 3883853 3783036 3759181 3725759
2942 3725759 3687752 3619301 3539101 3479767 3435061 3365829 3320150 3206865 3211090 3123219 3060155
2931 3060155 2978443 2852057 2832591 2784779 2668584 2619925 2565422 2495427 2415501 2369565 2294683
$$ packed form
3004A2153172k86406k79292k61009k81630l44778l19338k80948k57574k13759
2995I628438j84843j49548j69098k36956k54797j85828j22584j60653j14135j96757
2985G853239j82966j88851j39380j18569j00229o9074j44932j26560j50186k07898
2975F424594r7089r6633j25736j22663j27048j30704n2756k9260r1610r9869j37251
2964E313975j21694J9985n0772q7108j27235j01508n4159o9655o5582r4017q7731
2953D474499k8643o4921l9334n9702q1389q2881q0490j53286j00817k3855l3422
2942C725759l8007o8451q0200n9334m4706o9232m5679j13285M225q7871o3064
2931C060155q1712j26386j9466m7812j16195m8659n4503o9995p9926m5936p4882
$$ plain form
2920 2294683 2259737 2161222 2124663 2141931 2147137 2182745 2144430 2050029 2041902 1989840 1947250 1933111
2908 1933111 1854167 1859225 1863045 1798536 1831663 1828306 1847649 1846011 1855041 1897442 1970159 1943195
2896 1943195 1987692 1952524 1841714 1896160 1909324 1860592 1813849 1690742 1649971 1611113 1534770
2885 1534770 1577582 1644233 1696050 1661421 1616717 1568140 1571231 1631085 1609288 1552043 1633857 1604363
2873 1604363 1446395 1477025 1430732 1425006 1492864 1519902 1481117 1441662 1411566 1344119 1287728
2862 1287728 1218381 1245927 1274281 1227445 1177287 1147456 1133641 1181199 1284860 1293939 1278045
2851 1278045 1201667 1120575 1173920 1122411 1143283 1187958 1186211 1173027 1148624 1146249 1159474 1090557
2839 1090557 1066472 1079310 1110431 1081642 1055614 1025910 991362 974297 1035085 1069262 1076789 1076919
$$ packed form
2920B294683l4946r8515l6559J7268N206L5608l8315r4401q127n2062m2590j4139
2908A933111p8944N058L820o4509L3127l357J9343j638R030M2401P2717k6964
2896A943195M4497l5168j10810N4446J3164m8732m6743j23107m0771l8858p6343
2885A534770M2812O6651N1817l4629m4704m8577L091N9854k1797n7245Q1814k9494
2873A604363j57968L0630m6293n726O7858K7038l8785l9455l0096o7447n6391
2862A287728o9347K7546K8354m6836n0158k9831j3815M7558J03661R079j5894
2851A278045p6378q1092N3345n1509K0872M4675j747j3184k4403k375J3225o8917
2839A090557k4085J2838L1121k8789k6028k9704l4548j7065O0788L4177P527J30
$$ plain form
2827 1076919 1082107 1049970 970180 1047950 1049991 1070871 1057631 988197 1071886 1111562 1095900 1026646
2815 1026646 1051181 1065512 1070330 1042420 1079090 1113755 1126361 1103919 1119737 1078821 1103977 1244252
2803 1244252 1291283 1340908 1410635 1522224 1547976 1623292 1702226 1778882 1914750 2085852 2241828
2792 2241828 2459112 2732392 2927051 3093882 3043260 3049897 3155962 3126783 3181401 3129758 2972607
2781 2972607 2604851 2278959 2041364 1788432 1636526 1615070 1516531 1430335 1392008 1301835
2771 1301835 1293641 1231297 1190190 1149161 1051144 987892 887440 838560 920003 944095 830050
2760 830050 814488 794923 795405 856195 854317 821633 819291 803846 718625 731500 762140 727309
2748 727309 697748 713857 654560 669485 679603 641887 700365 696333 694523 660899 576217 625804
$$ packed form
2827A076919N188l2137p9790P7770K041K0880j3240o9434Q3689L9676j5662o9254
2815A026646K4535J4331M818k7910L6670L4665J2606k2442J5818m0916K5156J40275
2803A244252M7031M9625O9727J11589K5752P5316P8934P6656J35868J71102J55976
2792B241828K17284K73280J94659J66831n0622O637J06065k9179N4618n1643j57151
2781B972607l67756l25892k37595k52932j51906k1456r8539q6196l8327r0173
2771A301835q194o2344m1107m1029r8017o3252j00452m8880Q1443K4092j14045
2760H30050j5562j9565M82O0790j878l2684k342j5445q5221J2875L0640l4831
2748G27309k9561J6109n9297J4925J0118l7716N8478m032j810l3624q4682M9587
$$ plain form
2736 625804 652380 651295 663034 579079 502373 526342 551404 472485 464779 493272 524200 481186
2724 481186 438517 434249 425035 418372 474352 485364 479501 459019 422448 457888 479237 462892
2712 462892 410859 455564 414360 377584 315806 295289 310312 330937 293324 292736 353219 382918
2700 382918 397335 416592 419929 437498 482754 430321 395833 370296 356493 341047 324024 315482
2688 315482 341884 391149 399221 292767 302048 388706 380821 426274 493394 503351 419212 438238
2676 438238 475709 471386 402914 323447 328650 310150 338077 319367 280727 340125 376549 361874
2664 361874 306138 352117 303741 298659 288412 267228 316898 348469 311345 254932 224291 265242
2652 265242 228148 182263 165952 190997 203018 156304 142010 222861 251050 210560 252491 280695
$$ packed form
2736F25804K6576j085J1739q3955p6706K3969K5062p8919p706K8493L0928m3014
2724D81186m2669m268r214o663N5980J1012n863k0482l6571L5440K1349j6345
2712D62892n2033M4705m1204l6776o1778k0517J5023K0625l7613n88O0483K9699
2700C82918J4417J9257L337J7569M5256n2433l4488k5537j3803j5446j7023q542
2688C15482K6402M9265Q072j06454R281Q6658p885M5453O7120R957q4139J9026
2676D38238L7471m323o8472p9467N203j8500K7927j8710l8640N9398L6424j4675
2664C61874n5736M5979m8376n082j0247k1184M9670L1571l7124n6413l0641M0951
2652B65242l7094m5885j6311K5045J2021m6714j4294Q0851K8189m0490M1931K8204
$$ plain form
2640 280695 274869 249519 274426 256316 180346 198049 280450 237346 201205 199584 235637 214426
2628 214426 197684 230907 325015 208631 154827 196171 181845 138896 175589 215924 245503
2617 245503 288494 296976 239620 260211 241180 198701 198883 173846 194858 187559 180671 190301 182862
2604 182862 249128 222000 237908 202077 161634 143166 231552 223767 198937 156239 144164 190663
2592 190663 150082 132260 218712 209541 177248 184809 142519 109899 134133 207681 200193 146080
2580 146080 146505 214715 155967 113988 151896 223307 286527 277708 258477 216537 184618 192832
2568 192832 169093 210743 213045 144637 102431 112138 89714 134438 164118 176761 86971 67775
2556 67775 86825 87226 153831 132355 115026 166498 166919 173511 111005 91832 199740 249378 173230
$$ packed form
2640B80695n826k5350K4907j8110p5970J7703Q2401m3104l6141j621L6053k1211
2628B14426j6742L3223R4108j16384n3804M1344j4326m2949L6693M0335K9579
2617B45503M2991Q482n7356K0591j9031m2479J82k5037K1012p299o888R630p439
2604A82862O6266k7128J5908l5831m0443j8468Q8386p785k4830m2698j2075M6499
2592A90663m0581j7822Q6452r171l2293P561m2290l2620K4234P3548p488n4113
2580A46080M25O8210n8748m1979L7908P1411O3220q819j9231m1940l1919Q214
2568A92832k3739M1650K302o8408m2206R707k2424M4724K9680J2643q9790j9196
2556F7775J9050M01O6605k1476j7329N1472M21O592o2506j9173J07908M9638p6148
$$ plain form
2543 173230 140525 112778 142474 90962 136059 147146 109897 126513 141318 166434 179418 99197
2531 99197 102392 128958 99582 153719 119382 99871 78729 -17063 62593 95406 109061 104299
2519 104299 73459 90213 160380 138288 135269 155792 127064 163187 149458 83270 116134 159565
2507 159565 162391 136315 106683 166959 92073 21843 15657 -26552 32667 62408 120 61413
2495 61413 115475 46949 68384 135695 71991 68621 136494 113334 75321 30606 25059 29519
2483 29519 86764 121084 159251 199365 181317 116793 92656 116138 92085 166642 152473 148723
2471 148723 163811 196285 229495 202957 162429 150780 188544 185120 132697 52586 85220 126934
2459 126934 116996 128581 96102 64904 30350 125743 172664 138011 155045 99803 115750 124613
$$ packed form
2543A73230l2705k7747K9696n1512M5097J1087l7249J6616J4805K5116J2984q0221
2531I9197L195K6566k9376N4137l4337j9511k1142r5792P9656L2813J3655m762
2519A04299l0840J6754P0167k2092l019K0523k8728L6123j3729o6188L2864M3431
2507A59565K826k6076k9632O0276p4886p0230o186m2209N9219K9741o2288O1293
2495F1413N4062o8526K1435O7311o3704l370O7873k3160l8013m4715n547M460
2483B9519N7245L4320L8167M0114j8048o4524k4137K3482k4053P4557j4169l750
2471A48723J5088L2474L3210k6538m0528j1649L7764l424n2423q0111L2634M1714
2459A26934r938J1585l2479l1198l4554R5393M6921l4653J7034n5242J5947Q863
$$ plain form
2447 124613 64145 128535 83752 79125 173477 144812 94894 123411 134525 119464 146547 205621
2435 205621 167090 166775 153613 116803 83705 76041 128211 156305 33981 102936 158173 200275
2423 200275 150972 99275 160582 114335 80162 53332 113573 163018 137228 115918 98130 157459
2411 157459 226987 223682 184727 185916 171976 208868 198580 211629 259135 187352 157708 172682
2399 172682 186610 175432 184218 119450 195278 272811 244123 227006 170460 185699 161113 177357
2387 177357 225930 182188 213218 206017 247500 254198 232954 238858 230077 221151 214402 261224 221596
2374 221596 232366 300873 332366 346402 323225 286385 302032 324787 354625 399865 402671 384841
2362 384841 375779 385283 458363 546699 587513 585085 608567 631395 689417 613002 651227 731348
$$ packed form
2447A24613o0468O4390m4783m627R4352k8665m9918K8517J1114j5061K7083N9074
2435B05621l8531l15j3162l6810l3098p664N2170K8094j22324O8955N5237M2102
2423B00275m9303n1697O1307m6247l4173k6830O0241M9445k5790k1310j7788N9329
2411A57459O9528l305l8955J189j3940L6892j0288J3049M7506p1783k9644J4974
2399A72682J3928j1178Q786o4768P5828P7533k8688j7117n6546J5239k4586J6244
2387A77357M8573m3742L1030p201M1483O698k1244N904q781q926o749M6822l9628
2374B21596J0770O8507L1493J4036k3177l6840J5647K2755K9838M5240K806j7830
2362C84841r062R504P3080Q8336M0814k428K3482K2828N8022p6415L8225Q0121
$$ plain form
2350 731348 746984 691508 725384 838791 851838 893679 982165 1016659 1029079 1119632 1275128
2339 1275128 1388100 1447570 1513176 1616462 1717804 1851178 1982011 2094933 2244934 2432808
2329 2432808 2645676 2958649 3268349 3576983 3955061 4431567 4889902 5411969 5821025 6168705
2319 6168705 6611251 7139182 7912787 8798325 9932330 11528631 13638089 15945852 18388897
2310 18388897 21716465 26598187 31173121 32364078 26808016 20315809 16105535 13250921
2302 13250921 11271085 9792082 8695138 7800162 7081742 6410060 5917185 5532996 5338712
2293 5338712 5063050 4841651 4431932 4090085 3717678 3486125 3251564 2953904 2719813 2565022
2283 2565022 2448135 2307568 2142448 2111741 2005784 1931749 1721546 1638999 1580129 1489850
$$ packed form
2350G31348J5636n5476L3876J13407J3047M1841Q8486L4494J2420R0553J55496
2339A275128J12972N9470O5606J03286J01342J33374J30833J12922J50001J87874
2329B432808K12868L12973L09700L08634L78078M76506M58335N22067M09056L47680
2319F168705M42546N27931P73605Q85538J134005J596301K109458K307763K443045
2310A8388897L327568M881722M574934J190957n556062o492207m210274k854614
2302A3250921j979836j479003j096944q94976p18420o71682m92875l84189j94284
2293E338712k75662k21399m09719l41847l72407k31553k34561k97660k34091j54791
2283B565022j16887j40567j65120l0707j05957p4035k10203q2547n8870r0279
$$ plain form
2273 1489850 1439726 1324363 1225965 1187148 1131755 1153617 1082833 1031318 1013360 1016059 955106
2262 955106 974009 888885 822082 752290 739828 767398 743774 681846 720756 731196 655659 634297
2250 634297 613661 634456 695831 645812 570350 535294 588588 506156 430268 411335 439332 464270
2238 464270 414442 441616 463896 444444 429774 432177 429614 408822 339367 338828 348015 369472 346926
2225 346926 321532 352219 276196 309934 327316 308057 303352 271725 273607 316470 329028 276495
2213 276495 258449 258001 194958 235985 253495 211724 225544 265759 240776 253427 279915 234862
2201 234862 155523 136025 170448 200620 221766 169183 147872 120724 149766 175256 121424 134265
2189 134265 99161 66159 101573 102017 91497 113860 140587 132790 186509 186463 230055 194600 221810
$$ packed form
2273A489850n0124j15363r8398l8817n5393K1862p0784n1515j7958K699o0953
2262I55106J8903q5124o6803o9792j2462K7570k3624o1928L8910J0440p5537k1362
2250F34297k0636K0795O1375n0019p5462l5056N3294q2432p5888j8933K7997K4938
2238D64270m9828K7174K2280j9452j4670K403k563k0792o9455n39R187K1457k2546
2225C46926k5394L0687p6023L3738J7382j9259m705l1627J882M2863J2558n2533
2213B76495j8046m48o3043M1027J7510m1771J3820M0215k4983J2651K6488m5053
2201B34862p9339j9498L4423L0172K1146n2583k1311k7148K9042K5490n3832J2841
2189A34265l5104l3002L5414M44j0520K2363K6727p797N3719m6M3592l5455K7210
$$ plain form
2176 221810 181793 194416 218083 160671 134176 134440 109544 96691 40653 67737 77603 83782
2164 83782 77290 48070 73972 49761 71963 96940 84861 29721 60704 98430 96173 108190
2152 108190 106412 75238 14847 11014 -24892 32640 71239 91115 87439 40433 28620 75167
2140 75167 67620 60637 82685 86953 60000 -21526 -825 84102 83366 110005 129655 56183 49314
2127 49314 38921 -12331 49319 38188 53449 99810 69206 73703 29068 149571 168994 118198
2115 118198 73764 104069 96441 63091 98185 59152 58950 57100 72309 95932 97967 93157 10130
2102 10130 -5288 -8080 -4464 14213 35116 73262 100132 71741 73337 62598 69096 32442 20792
2089 20792 20697 -19325 -17756 -45296 18410 87529 79837 49417 76127 5618 -36467 31293 97510
$$ packed form
2176B21810m0017J2623K3667n7412k6495K64k4896j2853n6038K7084R866O179
2164H3782o492k9220K5902k4211K2202K4977j2079n5140L0983L7726k257J2017
2152A08190j778l1174o0391l833l5906N7532L8599J9876l676m7006j1813M6547
2140G5167p547o983K2048M268k6953q1526K0701Q4927p36K6639J9650p3472o869
2127D9314j0393n1252O1650j1131J5261M6361l0604M497m4635J20503J9423n0796
2115A18198m4434L0305p628l3350L5094l9033k02j850J5209K3623K035m810q3027
2102A0130j5418k792L616J8677K0903L8146K6870k8391J596j0739O498l6654j1650
2089B0792r5m0022J569k7540O3706O9119p692l0420K6710p0509m2085O7760O6217
$$ plain form
2076 97510 126422 87185 68706 37955 -30294 4498 46710 60371 35415 77091 36805 11078
2064 11078 24264 81399 56648 84654 69241 6754 -14629 21161 26341 43398 132206 102129
2052 102129 51383 25402 70397 101298 165001 154367 108385 177380 143736 70088 99984 118250
2040 118250 130171 143414 145730 167966 100697 60956 59867 67628 87727 81935 103643 128865
2028 128865 85723 16160 60096 3031 13627 45759 88132 79867 43211 19371 19762 -49517
2016 -49517 -32788 -15219 6510 -105674 -111335 -17533 -25236 34785 7156 -32922 -37852 24382
2004 24382 -20521 -20322 14958 39024 -38221 -70526 -68485 -58545 20361 -4515 -6014 17839 70967
1991 70967 73190 120875 10686 -39292 14120 -17467 -9511 12660 -23809 5957 11413 -23855
$$ packed form
2076I7510K8912l9237j8479l0751o8249L4792M2212J3661k4956M1676m0286k5727
2064A1078J3186N7135k4751K8006j5413o2487k1383L5790N180J7057Q8808l0077
2052A02129n0746k5981M4995L0901O3703j0634m5982O8995l3644p3648K9896J8266
2040A18250J1921J3243K316K2236o7269l9741j089P761K0099n792K1708K5222
2028A28865m3142o9563M3936n7065J0596L2132M2373q265l6656k3840L91o9279
2016d9517J6729J7569K1729j12184n661R3802p703O0021k7629m0078m930O2234
2004B4382m4903J99L5280K4066p7245l2305K041R940P8906k4876j499K3853N3128
1991G0967K223M7685j10189m9978N3412l1587P956K2171l6469K9766N456l5268
$$ plain form
1979 -23855 -14225 24126 -7482 -33283 -47390 8891 70956 37391 -40896 -12614 85042 100657
1967 100657 47146 36172 -4362 -3808 -6500 -90565 -29670 -38796 -31818 -63078 -61489 -32846 -10181
1954 -10181 -50737 -21250 5745 -68573 -28223 -35638 17446 62266 74382 113102 86991 19471
1942 19471 18724 59041 75841 7024 14910 48326 6791 -412 12086 74703 14155 -35857 7472
1929 7472 -15849 -10443 -3236 -21674 -4563 22871 28162 -46357 -63566 23257 54670 50462 58338
1916 58338 43323 57877 45825 84497 -24161 -7367 15469 -41137 -44929 -73767 -86241 -21075
1904 -21075 19743 -34000 -105539 -15620 -28037 8110 -15646 -29993 -35585 -20505 66634 54641
1892 54641 -23423 -21844 -1241 42550 -2451 -16980 -24298 -27114 -2619 16317 45933 -5530
$$ packed form
1979b3855R630L8351l1608k5801j4107N6281O2065l3565p8287K8282R7656J5615
1967A00657n3511j0974m0534N54k692q4065O0895r126O978l1260J589K8643K2665
1954a0181m0556K9487K6995p4318M0350p415N3084M4820J2116L8720k6111o7520
1942A9471p47M0317J6800o8817P886L3416m1535p203J2498O2617o0548n0012M3329
1929G472k3321N406P207j8438J7111K7434N291p4519j7209Q6823L1413m208P876
1916E8338j5015J4554j2052L8672j08658J6794K2836n6606l792k8838j2474O5166
1904b1075M0818n3743p1539Q9919j2417L6147k3756j4347n592J5080Q7139j1993
1892E4641p8064J579K0603M3791m5001j4529p318k816K4495J8936K9616n1463
$$ plain form
1880 -5530 -39361 -35724 -120 19742 47300 -49097 -22226 -27432 -31609 12019 32982 -251 -37935
1867 -37935 -67285 -29968 -4669 34508 -13923 -59167 -98191 -17505 3913 -64936 -16725 36888
1855 36888 26685 55196 9422 34404 44111 -12835 -40317 -63442 -121880 -40333 31078 -34171
1843 -34171 -35231 -22702 -33878 -32448 -20556 -66445 -17289 -46010 -41589 -17450 11909 11411 -20251
1830 -20251 -28982 -39962 -34176 -4855 -54257 -69227 -81298 -43775 5571 -13853 30329 79709
1818 79709 99179 77565 40454 43926 69104 17597 19293 43156 22690 3021 -5491 3861 25417
1805 25417 45468 58183 125440 67253 37510 38551 6699 -25844 -54118 -43614 11688 1122
1793 1122 42802 29298 32710 -376 -78886 6182 35790 44600 -6799 -16421 31641 -3883 10476
$$ packed form
1880e530l3831L637L5604J9862K7558r6397K6871n206m177M3628K0963l3233l7684
1867c7935k9350L7317K5299L9177m8431m5244l9024Q0686K1418o8849M8211N3613
1855C6888j0203K8511m5774K4982R707n6946k7482k3125n8438Q1547P1411o5249
1843c4171j060J2529j1176J430J1892m5889M9156k8721M421K4139K9359m98l1662
1830b0251q731j0980N786K9321m9402j4970j2071L7523M9346j9424M4182M9380
1818G9709J9470k1614l7111L472K5178n1507J696K3863k0466j9669q512R352K1556
1805B5417K0051J2715O7257n8187k9743J041l1852l2543k8274J0504N5302j0566
1793A122M1680j3504L412l3086p8510Q5068K9608Q810n1399r622M8062l5524J4359
$$ plain form
1780 10476 36727 -7152 -28044 -15579 6514 -9850 39351 -6631 9943 23662 45106 31957
1768 31957 -8223 -23896 -3671 35438 29383 27779 41310 -25967 -87953 -44988 3566 19147
1756 19147 -39233 -72027 12470 -19322 12570 14478 -3106 -6128 -34799 -2870 76190 23250
1744 23250 -41966 23806 45428 11322 23450 -18865 -39402 -66789 -45882 -70957 -110274 -60465
1732 -60465 -88765 1033 -24991 -37386 19631 38757 -11713 -83581 -47756 47839 74596 3131
1720 3131 13928 45527 2884 20395 -55566 -62253 -73057 -59524 -26673 -5883 -27494 4183
1708 4183 27383 -36832 1967 63453 51885 14714 -32079 -22137 -17047 -56115 -69356 -33398
1696 -33398 -35595 -59835 18768 7877 -11276 -33159 -86746 -44588 -33769 23928 11405 -11324
$$ packed form
1780A0476K6251m3879k0892J2465K2093j6364M9201m5982J6574J3719K1444j3149
1768C1957m0180j5673K0225L9109o055j604J3531o7277o1986M2965M8554J5581
1756A9147n8380l2794Q4497l1792L1892J908j7584l022k8671L1929P9060n2940
1744B3250o5216O5772K1622l4106J2128m2315k0537k7387K0907k5075l9317M9809
1732f0465k8300Q9798k6024j2395N7017J9126n0470p1868L5825R5595K6757p1465
1720C131J0797L1599m2643J7511p5961o687j0804J3533L2851K0790k1611L1677
1708D183K3200o4215L8799O1486j1568l7171m6793R942N090l9068j3241L5958
1696c3398k197k4240P8603j0891j9153k1883n3587M2158J0819N7697j2523k2729
$$ plain form
1684 -11324 19554 -45091 -73259 -87471 -98639 -29632 -55 1603 39427 34331 -5143 -69857
1672 -69857 -68153 -105110 -124540 18469 2477 3339 30043 15589 -16591 -113426 -116525 -21927
1660 -21927 -3423 -20324 -16439 -21759 -25133 -23695 4887 -83986 -81408 -82101 -61539 -33462 16173
1647 16173 82459 46998 45803 41015 38382 27522 -13351 -13235 -32295 -57140 -7176 -36781 -31944
1634 -31944 -15944 -18388 -66089 -911 19562 -34216 -40727 13672 -39578 -47910 -33651 -18813
1622 -18813 -12517 24386 38791 28679 43172 21757 -37249 -22464 17917 -12095 -8954 40121
1610 40121 68440 -774 -36607 -36727 -20095 -108993 -49926 -67367 -45058 -11569 7030 -21103
1598 -21103 16132 58833 20478 -41688 -45854 -17121 -22975 -27076 19118 19568 -10269 -14275 21416
$$ packed form
1684a1324L0878o4645k8168j4212j1168O9007K9577J658L7824n096l9474o4714
1672f9857J704l6957j9430J43009j5992Q62K6704j4454l2180r6835l099R4598
1660b1927J8504j6901L885n320l374J438K8582q8873K578o93K0562K8077M9635
1647A6173O6286l5461j195m788k633j0860m0873J16j9060k4845M9964k9605M837
1634c1944J6000k444m7701O5178K0473n3778o511N4399n3250q332J4259J4838
1622a8813O296L6903J4405j0112J4493k1415n9006J4785M0381l0012L141M9075
1610D0121K8319o9214l5833j20J6632q8898N9067j7441K2309L3489J8599k8133
1598b1103L7235M2701l8355o2166m166K8733n854m101M6194M50k9837m006L5691
$$ plain form
1585 21416 2493 -92335 -86961 -62618 -66647 -112877 -82160 -36684 -46827 -31555 -58312 -41429
1573 -41429 54985 75723 31490 -70701 -61477 14305 -25293 5558 36689 -46821 -72024 -79313
1561 -79313 -18024 48268 -31900 -1230 1210 -21839 -59226 -114791 -68088 -36817 19586 4243
1549 4243 -4376 -12529 -3579 -19719 -71791 -93031 -28390 -32021 -65228 -76381 -109875 -13277 -23466
1536 -23466 -20143 -51284 -85445 -61331 -31491 -23089 -23467 10367 -24943 -50976 -40929 -93 -20376
1523 -20376 -19842 46987 3538 -22729 -17441 -3521 -21132 -46538 -46666 -30343 -3523 51783 20093
1510 20093 17778 -19699 -42799 -71360 -64948 -41519 -5621 -42058 -64316 -27417 -57295 -87128
1498 -87128 -127629 -19861 54406 50109 -12949 -48665 21518 18884 -4350 -16245 -46319 18481
$$ packed form
1585B1416j8923r4828N374K4343m029m6230L0717M5476j0143J5272k6757J6883
1573d1429R6414K0738m4233j02191R224P5782l9598L0851L1131q3510k5203p289
1561g9313O1289O6292q0168L0670K440k3049l7387n5565M6703L1271N6403j5343
1549D243q619q153Q950j6140n2072k1240O4641l631l3207j1153l3494R6598j0189
1536b3466L323l1141l4161K4114K9840Q402l78L3834l5310k6033J0047M0836k0283
1523b0376N34O6829m3449k6267N288J3920j7611k5406j28J6323K6820N5306l1690
1510B0093k315l7477k3100k8561O412K3429L5898l6437k2258L6899k9878k9833
1498h7128m0501J07768P4267m297o3058l5716P0183k634k3234j1895l0074O4800
$$ plain form
1486 18481 -13299 -67234 -88205 -127968 -112880 -21597 -9784 -4351 -45890 -75467 -85439 -55523
1474 -55523 -87968 -95978 -89208 -86330 -105047 -103492 -50765 23701 41280 51290 -8379 12812 89210
1461 89210 -3304 -28369 -28840 -74573 -42985 -51012 -16976 423 -34812 -70480 -33638 -57901
1449 -57901 -14985 29426 30624 -7577 -26981 18170 16113 -8266 -19309 3705 16059 49743
1437 49743 -2367 -16975 34668 8750 -19097 -37364 -33013 8691 74914 102347 26034 -2131
1425 -2131 -37645 -35036 33153 32694 2479 467 -43632 -63366 5168 57071 -50195 -81379 -32835
1412 -32835 23736 43728 30625 32357 -10172 -20696 -1987 -8371 14810 -27927 -53723 21898
1400 21898 45830 -31246 34055 -11040 -32937 -29520 -85372 -48461 -40175 36888 3409 2133
$$ packed form
1486A8481l1780n3935k0971l9763J5088R1283J1813N433m1539k9577r972K9916
1474e5523l2445q010O770K878j8717J555N2727P4466J7579J0010n9669K1191P6398
1461H9210r2514k5065m71m5733L1588q027L4036J7399l5235l5668L6842k4263
1449e7901M2916M4411J198l8201j9404M5151k057k4379j1043K3014J2354L3684
1437D9743n2110j4608N1643k5918k7847j8267M351M1704O6223K7433p6313k8165
1425b131l5514K609O8189m59l0215k012m4099j9734O8534N1903j07266l1184M8544
1412c2835N6571J9992j3103J732m2529j0524J8709o384K3181m2737k5796P5621
1400B1898K3932p7076O5301m5095k1897L417n5852L6911Q286P7063l3479j276
$$ plain form
1388 2133 69861 8781 -31411 -85093 -91850 -23519 -28228 -5482 -9154 -6673 7040 -34395 10342
1375 10342 -7180 3106 402 -8794 -4684 -27102 -62749 -44455 -88651 -29076 18491 26088 -21395
1362 -21395 -23360 74425 6177 -52525 -43606 -25601 63851 63199 -1110 -8219 37439 57447 -4479
1349 -4479 -6597 16049 -9698 -18877 19408 31977 3787 -19511 -59886 1377 63224 -1220
1337 -1220 -32307 -26625 -40078 -12086 -44004 -135807 -63607 -80180 -120500 -70245 2777 -25889
1325 -25889 -73079 -95716 -45817 -23217 -32783 -21836 -43700 -48923 -68127 -50262 -97637 -50835
1313 -50835 -79727 -50523 -8355 22292 51352 -3778 -2048 36830 59934 29560 69899 78892
1301 78892 63752 -15367 8537 -23716 -22058 19017 35517 -43608 -35623 -11188 -83830 -132010
$$ packed form
1388B133O7728o1080m0192n3682o757O8331m709K2746l672K481J3713m1435M4737
1375A0342j7522J0286k704r196M110k2418l5647J8294m4196N9575M7567P597m7483
1362b1395j965R7785o8248n8702Q919J8005Q9452o52o4309p109M5658K0008o1926
1349d479k118K2646k5747r179L8285J2569k8190k3298m0375O1263O1847o4444
1337a220l1087N682j3453K7992l1918r1803P2200j6573m0320N0255P3022k8666
1325b5889m7190k2637M9899K2600r566J0947k1864n223j9204J7865m7375M6802
1313e0835k8892K9204M2168L0647K9060n5130J730L8878K3104l0374M0339Q993
1301G8892j5140p9119K3904l2253J658M1075J6500p9125P985K4435p2642m8180
$$ plain form
1289 -132010 -67820 -27315 29908 29224 -21576 -68531 -46328 -58095 -57605 -25130 -4482 -36954
1277 -36954 -88708 -58632 2079 13156 14887 40471 -2273 -53515 -52608 -4235 -38045 -61692
1265 -61692 -35491 6863 -55781 -28893 -19361 -65304 -51579 -22405 -78510 -66271 -30873 42701
1253 42701 88789 9103 -21402 -29481 36107 -3961 21892 70406 -9707 13039 16637 32276
1241 32276 3850 -11977 37740 25149 3084 -997 -19936 19222 21011 11676 14486 -1373 -6352
1228 -6352 10991 -15343 -22058 -52772 -69007 -53196 -15067 -24411 3344 -77970 -30294 48986
1216 48986 -40840 -83043 -80233 -26594 -13455 -13790 -26988 17108 -29097 -34824 -14190 -50517 -32243
1203 -32243 -33504 -37833 4110 20238 -46076 3948 -10919 -21471 -40844 -43056 20467 -260
$$ packed form
1289a32010O4190M0505N7223o84n0800m6955K2203j1767M90L2475K0648l2472
1277c6954n1754L0076O0711J1077J731K5584m2744n1242R07M8373l3810k3647
1265f1692K6201M2354o2644K6888R532m5943J3725K9174n6105J2239L5398P3574
1253D2701M6088p9686l0505q079O5588m0068K5853M8514q0113K2746L598J5639
1241C2276k8426j5827M9717j2591k2065m081j8939L9158J789r335K810j5859m979
1228f352J7343k6334o715l0714j6235J5811L8129r344K7755q1314M7676P9280
1216D8986q9826m2203K810N3639J3139l35j3198M4096m6205n727K0634l6327J8274
1203c2243j261m329M1943J6128o6314N0024j4867j0552j9373k212O3523k0727
$$ plain form
1191 -260 70508 73003 29206 -1644 -31688 4880 68408 58168 13969 -30404 -13129 -74317
1179 -74317 -56762 -33076 -37978 -48707 -34275 -29891 -11961 -17336 -37842 -9934 25508 11704
1167 11704 29065 -34967 -4981 2395 -38271 29383 36726 31582 10915 -18014 24239 54616
1155 54616 49614 59504 36587 -1519 -30480 -24419 -8447 12948 -24606 78925 76969 -28960
1143 -28960 -69497 -71095 -73354 -63576 -35022 -24332 20977 -3887 -44786 7709 13520 -30741 18026
1130 18026 10718 12750 40760 28610 25368 7124 -9997 -44139 -33780 18194 56767 27837
1118 27837 45247 24206 7271 10915 11104 -33633 -12054 1027 -57841 -44529 5462 31707
1106 31707 25357 30119 -8332 -47632 4618 -47179 -51544 -20899 -27938 3851 2247 -19299 -7668
$$ packed form
1191b60P0768K495m3797l0850l0044L6568O3528j0240m4199m4373J7275o1188
1179g4317J7555K3686m902j0729J4432M384J7930n375k0506K7908L5442j3804
1167A1704J7361o4032K9986P376m0666O7654P343n144k0667k8929M2253L0377
1155E4616n002R890k2917l8106k8961O061J5972K1395l7554J03531j956j05929
1143b8960m0537j598k259R778K8554J0690M5309k4864m0899N2495N811m4261M8767
1130A8026p308K032K8010j2150l242j8244j7121l4142J0359N1974L8573k8930
1118B7837J7410k1041j6935L644J89m4737K1579J3081n8868J3312M9991K6245
1106C1707o350M762l8451l9300N2250n1797m365L0645p039L1789j604k1546J1631
$$ plain form
1093 -7668 25011 16739 27794 -5726 -37075 -46202 -52925 16237 8135 -24709 -58684 33 2148
1080 2148 -56084 -52991 22487 79754 10268 -22524 -9091 -4098 -5911 -47052 -18767 -72226 -5572
1067 -5572 48249 44542 40939 11209 16164 -48592 -27949 -48896 -12727 -84282 -53326 -40663 13351
1054 13351 30685 11157 -12742 -42380 -30192 9921 -20944 -34376 -4999 1609 3501 -48606
1042 -48606 -12133 36253 -9679 -97796 8724 75706 48990 -134 740 10681 -9758 -15233
1030 -15233 -21665 -35963 -44479 -21206 28129 37197 19658 76796 33486 49246 6269 -80157
1018 -80157 -81246 -70085 -75583 -50551 -47496 44408 68470 -16122 -36995 -61498 40920 26965
1006 26965 33480 17837 -36338 8915 56461 87552 39644 57934 81475 49353 -4477 -22113
$$ packed form
1093g668L2679q272J1055l3520l1349r127o723O9162q102l2844l3975N8717K115
1080B148n8232L093P5478N7267o9486l2792J3433M993j813m1141K8285n3459O6654
1067e572N3821l707l603k9730M955o4756K0643k0947L6169p1555L0956J2663N4014
1054A3351J7334j9528k3899k9638J2188M0113l0865j3432K9377O608J892n2107
1042d8606L6473M8386m5932q8117J06520O6982k6716m9124Q74R941k0439n475
1030a5233o432j4298q516K3273M9335R068j7539N7138m3310J5760m2977q6426
1018h0157j089J1161n498K5032L055R1904K4062q4592k0873k4503J02418j3955
1006B6965O515j5643n4175M5253M7546L1091m7908J8290K3541l2122n3830j7636
$$ plain form
994 -22113 -37789 -38494 -37009 -64532 -133459 -86334 -4003 2975 5559 -53539 -2220 14902 3446
981 3446 13511 -35896 -28513 -39699 -61884 -18137 24786 -16490 -3296 120386 68540 -37522
969 -37522 -29136 7817 72119 87621 62084 108 -13708 -94085 -64160 16160 -38102 -17098
957 -17098 19394 5926 -30420 -51544 -87256 -61828 -33398 -120577 -105448 -76692 -71653 14004
945 14004 -62117 -32390 -8593 -860 15674 72072 70600 88433 91455 -318 11065 4989 30952
932 30952 66070 62953 -21267 10438 -22155 -2035 2898 -39573 -50444 9618 40477 12317
920 12317 12789 12226 51096 47635 60008 7855 -60005 -50856 -25889 -74455 -8442 -18364 -54449
907 -54449 -75480 -9765 -9718 -36099 1512 46089 38236 -4734 -43761 -35895 -6311 46908 39195
$$ packed form
994b2113j5676p05J485k7523o8927M7125Q2331O978K584n9098N1319J7122j1456
981C446J0065m9407P383j1186k2185M3747M2923m1276J3194J23682n1846j06062
969c7522Q386L6953O4302J5502k5537o1976j3816q0377K9925Q0320n4262K1004
957a7098L6492j3468l6346k1124l5712K5428K8430q7179J5129K8756N039Q5657
945A4004p6121K9727K3797P733J6534N6398j472J7833L022r1773J1383o076K5963
932C0952L5118l117q4220L1705l2593K0120M933m2471j0871O0062L0859k8160
920A2317M72n63L8870l461J2373n2153o7860R149K4967m8566O6013r922l6085
907e4449k1031O5715M7k6381L7611M4577p853m2970l9027P866K9584N3219p713
$$ plain form
894 39195 29028 81623 -20470 -60276 7403 77274 -5355 -11187 -23854 -68287 -50662 -68309
882 -68309 -11740 28612 89044 15902 27182 63443 72957 80604 6789 -29961 7339 65926
870 65926 28824 7938 1661 8727 10180 -18388 25087 44164 46680 69061 26855 70420 22440
857 22440 -1631 -18184 3795 -18520 -33641 16738 6235 5105 18128 18865 61663 42582 35840
844 35840 40086 35571 41991 53733 -20758 -47597 28984 -19775 1132 -20355 -28053 -8453 -31218
831 -31218 -75719 -21440 5431 -48826 -102338 -65113 -56985 -30889 -18393 -12604 -24333 -27241 -3955
818 -3955 16292 51942 32078 -56878 -6407 71686 34410 24116 -36914 -37594 -21193 -2243 29853
805 29853 5155 -37479 -7203 18866 4598 9054 60228 57998 66641 37630 30759 -13941 -28305
$$ packed form
894C9195j0167N2595j02093l9806O7679O9871q2629n832j2667m4433J7625j7647
882f8309N6569M0352O0432p3142J1280L6261R514P647p3815l6750L7300N8587
870F5926l7102k0886o277P066J453k8568M3475J9077K516K2381m2206M3565m7980
857B2440k4071j6553K1979k2315j5121N0379j0503j130J3023P37M2798j9081o742
844C5840M246m515O420J1742p4491k6839P6581m8759K0907k1487p698J9600k2765
831c1218m4501N4279K6871n4257n3512L7225Q128K6096J2496N789j1729k908K3286
818c955K0247L5650j9864q8956N0471P8093l7276j0294o1030o80J6401J8950L2096
805B9853k4698m2634L0276K6069j4268M456N1174k230Q643k9011o871m4700j4364
$$ plain form
792 -28305 -25415 -10943 -14566 -60314 13464 4697 2411 36608 71186 109456 13278 -34941 -20975
779 -20975 16537 -13247 -968 -29640 -11038 53204 68471 50563 4268 -10717 38295 15013
767 15013 -34892 8612 78430 78823 29008 45318 72939 -13485 -4755 25487 26996 20918 33802
754 33802 27474 -8544 -26270 -27089 -10463 21454 23608 41493 -3052 -15731 -12411 -63439 -83969
741 -83969 -29983 53791 -11046 -990 43182 38125 -36978 -78452 -128663 30264 84684 41222
729 41222 20283 21345 4200 -49578 -39514 18614 20642 -8984 11527 94760 9095 -67361
717 -67361 -45651 -30616 50717 23326 23364 51221 42968 46773 52093 51472 120740 42849 -54145 -63426
703 -63426 -39113 -36865 -59240 -7698 -13025 10271 3496 22263 -11002 -3073 51070 70172 44334
$$ packed form
792b8305K890J4472l623m5748P3778q767k286L4197L4578L8270r6178m8219J3966
779b0975L7512k9784J2279k8672J8602O4242J5267j7908m6295j4985M9012k3282
767A5013m9905M3504O9818L93m9815J6310K7621q6424Q730L0242J509o078J2884
754C3802o328l6018j7726q19J6626L1917K154J7885m4545j2679L320n1028k0530
741h3969N3986Q3774o4837J0056M4172n057p5103m1474n0211J58927N4420m3462
729D1222k0939J062j7145n3778J0064N8128K028k9626K0511Q3233q5665p6456
717f7361K1710J5035Q1333k7391L8K7857q253L805N320o21O9268p7891r6994r281
703f3426K4313K248k2375N1542n327K3296o775J8767l3265P929N4143J9102k5838
$$ plain form
690 44334 60647 132030 141066 73459 6052 21276 24807 31465 -12723 23721 21790 -60140 -47729
677 -47729 -45183 39536 412 -40132 -46698 -1807 11786 -52112 -7158 7514 4084 -68381 -65398
664 -65398 71922 52462 92993 59155 25247 78620 104564 65094 13179 -20556 15712 60631
652 60631 27197 -11028 -17307 1603 -30733 -11892 -39135 -20374 81237 60877 25326 35342
640 35342 14873 -19833 -32321 -18393 -93670 -63825 4040 35818 3109 2437 16605 790
628 790 -21866 -26911 16299 -10802 -3408 89201 69859 39561 36953 -18651 -37066 -36300 21516
615 21516 12237 -62042 -51258 -52936 68939 105812 100272 66607 88973 60331 28353 -474
603 -474 3894 -14200 7431 109219 130603 62464 34421 34449 18234 26145 79955 59677 10237
$$ packed form
690D4334J6313P1383R036o7607o7407J5224L531O658m4188L6444j931q1930J2411
677d7729K546Q4719l9124m0544o566M4891J3593o3898M4954J4672l430p2465K983
664f5398J37320j9460M0531l3838l3908N3373K5944l9470n1915l3735L6268M4919
652F0631l3434l8225o279J8910l2336J8841k7243J8761J01611k0360l5551J0016
640C5342k0469l4706j2488J3928p5277K9845O7865L1778l2709o72J4168j5815
628G90k2656n045M3210k7101P394R2609j9342l0298k608n5604j8415P66N7816
615B1516r279p4279J0784j678J21875L6873n540l3665K2366k8642l1978k8827
603d74M368j8094K1631J01788K1384o8139k8043K8j6215P911N3810k0278m9440
$$ plain form
590 10237 -42782 -22217 29257 46244 80606 23209 -7043 -14818 34200 21294 -26048 43606
578 43606 107896 77207 28113 88878 43526 -49541 -25125 -62809 -88930 -51106 -15549 10638
566 10638 28811 -11430 49183 15895 19594 45532 13760 16863 55193 25280 -26845 20457
554 20457 34823 6052 -27443 -57303 -58394 -34397 20146 43867 65100 63487 62202 48975 51224
541 51224 6176 34629 14898 -18928 -51426 19313 46342 -10568 1003 -67184 -32595 2004
529 2004 49724 54221 17720 45142 74744 16249 47545 43481 -6780 -13486 6149 -12931 -27954
516 -27954 -43682 5308 39365 7114 38197 92276 7149 52347 -29261 -53109 -23852 -16550
504 -16550 62388 -19493 -15217 42231 83779 46920 58540 22790 3066 -2023 2100 -2433 -13114
$$ packed form
590A0237n3019K0565N1474J6987L4362n7397l0252p775M9018j2906m7342O9654
578D3606O4290l0689m9094O0765m5352r3067K4416l7684k6121L7824L5557K6187
566A0638J8173m0241O0613l3288L699K5938l1772L103L8330k9913n2125M7302
554B0457J4366k8771l3495k9860j091K3997N4543K3721K1233j613j285j3227K249
541E1224m5048K8453j9731l3826l2498P0739K7029n6910J1571o8187L4589L4599
529B004M7720M497l6501K7422K9602n8495L1296m064n0261o706J9635j9080j5023
516b7954j5728M8990L4057l2251L1083N4079q5127M5198q1608k3848K9257P302
504a6550P8938q1881M276N7448M1548l6859J1620l5750j9724n089M123m533j0681
$$ plain form
491 -13114 -2091 13184 15789 5139 -68242 6852 55799 -52525 -73119 -49977 -82248 -33281
479 -33281 14201 44428 11882 29624 -7873 3946 -40605 -70607 -67144 -32611 26453 -16176
467 -16176 29916 -2511 -5528 6385 19915 -16012 -59580 3080 56485 57380 24495 -14525 5429
454 5429 -49647 -2138 80817 93275 -5585 -24206 19622 71013 119669 37807 -24396 -53903
442 -53903 -35605 -83957 -14778 34136 67512 67116 38122 -23186 -58114 -39455 -80164 -61029
430 -61029 8364 2750 25631 57154 77366 48163 -26347 -15991 -18481 -4835 -19739 -35731
418 -35731 -16485 1628 73494 21456 25764 39690 -40936 -107263 -32825 -1030 -8489 -23022
406 -23022 -14975 65370 13597 66028 29041 20263 -14323 12259 48162 74866 31601 -14332
$$ packed form
491a3114J1023J5275K605j0650p3381P5094M8947j08324k0594K3142l2271M8967
479c3281M7482L0227l2546J7742l7497J1819m4551l0002L463L4533N9064m2629
467a6176M6092l2427l017J1913J3530l5927m3568O2660N3405Q95l2885l9020J9954
454E429n5076M7509Q2955J2458r8860j8621M3828N1391M8656q1862o2203k9507
442e3903J8298m8352O9179M8914L3376l96k8994o1308l4928J8659m0709J9135
430f1029O9393n614K2881L1523K0212k9203p4510J0356k490J3646j4904j5992
418c5731J9246J8113P1866n2038M308J3926q0626o6327P4438L1795p459j4533
406b3022Q047Q0345n1773N2431l6987q778l4586K6582L5903K6704m3265m5933
$$ plain form
394 -14332 -27913 -36440 8456 22254 28872 28040 37191 12508 -84609 -89681 -76165 -27164 6159
381 6159 3934 19444 55273 24398 -29259 -15155 39554 70133 44152 3549 76436 94318
369 94318 61327 62758 26983 -24323 22211 50632 28811 74689 66714 49238 -16834 -2595
357 -2595 12927 -48337 -97236 2264 77949 59878 34210 -41827 -9318 2800 73336 65613
345 65613 10405 12687 18181 75164 -13668 -55782 -21037 15491 18321 -7602 -35966 -6659 69174
332 69174 7722 20945 43759 42284 603 -54195 -73549 -106199 -56394 579 -25580 -39385
320 -39385 -17437 -7113 1831 16919 987 -9488 15877 -20572 -25384 -59802 1346 39189
308 39189 21311 6905 -29750 33720 69063 14732 -40173 -44918 1433 432 88252 79735 60482
$$ packed form
394a4332j3581q527M4896J3798O618q32R151k4683r7117n072J3516M9001L3323
381F159k225J5510L5829l0875n3657J4104N4709L0579k5981m0603P2887J7882
369I4318l2991J431l5775n1306M6534K8421k1821M5878p975j7476o6072J4239
357b595J5522o1264m8899R9500P5685j8071k5668p6037L2509J2118P0536p723
345F5613n5208K282N494N6983q8832m2114L4745L6528K830k5923k8364K9307P5833
332F9174o1452J3223K2814j475m1681n4798j9354l2650M9805N6973k6159j3805
320c9385K1948J0324Q944J5088j5932j0475K5365l6449m812l4418O1148L7843
308C9189j7878j4406l6655O3470L5343n4331n4905m745M6351j001Q7820q517j9253
$$ plain form
295 60482 59447 59852 107026 86616 112108 95606 65922 14530 -32749 18185 -37443 -2707 50331
282 50331 -3796 -74375 -56819 -11725 9889 3664 -12341 64604 49688 -3681 45319 23095
270 23095 -33188 -73221 -2558 75223 22563 -3329 -63832 -56862 -19026 17129 -7407 26814
258 26814 76219 22014 87870 37082 35598 80619 13748 -14948 1563 -21209 49045 68974
246 68974 -12612 1318 41991 39052 25911 -18581 24942 40758 12421 55925 64822 49743
234 49743 6901 -19558 -15592 -17386 -17156 3784 -3213 6382 -15889 -29554 -25922 -8297 -36582
221 -36582 23133 38124 104 -45001 -62377 -18802 -11876 -26884 20315 47471 65181 59961
209 59961 30250 28856 60877 44056 74240 106521 14739 -9046 -43157 -35394 -8240 6946
$$ packed form
295F0482j035M05M7174k0410K5492j6502k9684n1392m7279N0934n5628L4736N3038
282E0331n4127p0579J7556M5094K1614o225j6005P6945j4916n3369M9000k2224
270B3095n6283m0033P0663P7781n2660k5892o0503O970L7836L6155k4536L4221
258B6814M9405n4205O5856n0788j484M5021o6871k8696J6511k2772P0254J9929
246F8974q1586J3930M0673k939j3141m4492M3523J5816k8337M3504Q897j5079
234D9743m2842k6459L966j794K30K0940o997R595k2271j3665L632J7625k8285
221c6582N9715J4991l8020m5105j7376M3575O926j5008M7199K7156J7710n220
209E9961k9711j394L2021j6821L0184L2281r1782k3785l4111P763K7154J5186
$$ plain form
197 6946 -8439 36225 41866 -5773 -9925 -18804 11321 10116 53046 69655 39768 37255 -37370
184 -37370 -47546 20039 22870 -22484 13758 7331 -11495 -30773 -71424 -48706 16046 6492 -82176
171 -82176 -93984 -63013 -20662 44880 -41959 -54873 4115 -31449 -15044 14789 62503 -562
159 -562 -21549 342 14816 33806 84320 89281 60347 41417 37172 -18859 3874 1901 -1986
146 -1986 52133 85629 32612 -27126 -58241 7826 -20071 -23558 -9926 44776 46528 41570 61978
133 61978 55836 71006 55518 -18741 9894 -5729 -9248 -1436 -39145 -50324 -27478 4460 945
120 945 24989 29727 -12499 -33388 6241 -10547 -62708 -53498 30097 48906 62128 45233 50754
107 50754 -1469 35137 1340 19985 15740 19698 -16902 15395 24075 68972 65382 -16509 -14229
$$ packed form
197F946j5385M4664N641m7639m152q879L0125j205M2930J6609k9887k513p4625
184c7370j0176O7585K831m5354L6242o427j8826j9278m0651K2718O4752r554q8668
171h2176j1808L0971M2351O5542q6839j2914N8988l5564J6405K9833M7714o3065
159e62k0987K1891J4474J8990N0514M961k8934j8930m245n6031K2733j973l887
146a986N4119L3496n3017n9738l1115O6067k7897l487J3632N4702J752m958K0408
133F1978o142J5170j5488p4259K8635j5623l519P812l7709j1179K2846L1938l515
120I45K4044M738m2226k0889L9629j6788n2161R210Q3595J8809J3222j6895N521
107E0754n2223L6606l3797J8645m245L958l6600L2297Q680M4897l590q1891K280
$$ plain form
94 -14229 -2706 -16383 -8691 14535 -30457 -34026 -17177 46158 58090 60072 57127 46605 32671
81 32671 -12650 13400 -24796 19262 7906 4070 35179 54562 46159 24559 -24437 12786 80642
68 80642 49882 6054 -5125 -14248 -23600 15376 33849 20255 -939 -59156 -61096 -37579 -15767
55 -15767 -96729 -110166 -35003 -57401 12007 56156 61500 17308 4315 29892 -9960 -16056 2331
42 2331 26627 35894 49400 62122 3205 26055 -28693 -59115 -17695 12002 32318 -33549 -41424
29 -41424 -31547 12190 -17187 12553 5351 -2790 -3719 12734 36283 -12965 11569 5113 20111
16 20111 24817 22485 -21071 -29225 -29037 46170 38229 16801 -6060 17403 12351 29868 10279 -4347
2 -4347 25932 18984
$$ packed form
94a4229J1523j3677P692K3226m4992l569J6849O3335J1932J982k945j0522j3934
81C2671m5321K6050l8196M4058j1356l836L1109J9383q403k1600m8996L7223O7856
68H0642l0760m3828j1179r123r352L8976J8473j3594k1194n8217j940K3517K1812
55a5767q0962j3437P5163k2398O9408M4149N344m4192j2993K5577l9852o096J8387
42B331K4296R267J3506J2722n8917K2850n4748l0422M1420K9697K0316o5867p875
29d1424R877M3737k9377K9740p202q141r29J6453K3549m9248K4534o456J4998
16B0111M706k332m3556q154J88P5207p941k1428k2861K3463n052J7517j9589j4626
2d347L0279o948
$$ plain form
0 18984
$$ packed form
0A8984
$$ Imaginary data points
##PAGE= N=2
##DATA TABLE= (X++(I..I)), XYDATA
$$ plain form
16383 -1657379 -1631349 -1657538 -1670755 -1633217 -1525931 -1558285 -1564654 -1547180 -1554669 -1460339 -1404920
16372 -1404920 -1360134 -1358096 -1347927 -1330629 -1329378 -1357058 -1304842 -1258545 -1251958 -1250172 -1224619 -1253652
16360 -1253652 -1225474 -1201373 -1142748 -1128542 -1066450 -1015124 -1051003 -1071146 -1062780 -1003461 -1020201
16349 -1020201 -1006400 -1013769 -1031643 -1013282 -1001911 -969284 -856849 -812049 -777102 -767995 -800568
16338 -800568 -790107 -755957 -789661 -735326 -705078 -726142 -676908 -666304 -652143 -631674 -577203
16327 -577203 -593513 -580474 -572241 -531750 -438054 -460297 -422240 -417727 -422771 -418560 -427399 -436763 -396401
16314 -396401 -304640 -250443 -261142 -271479 -265908 -232082 -235505 -231162 -288924 -242680 -163112 -126138
16302 -126138 -139141 -115738 -75528 -57921 -49839 -46653 -22281 -35030 -32697 -18236 -3185 44432
$$ packed form
16383a657379K6030k6189j3217L7538J07286l2354o369J7474p489R4330N5419
16372a404920M4786K038J0169J7298J251k7680N2216M6297O587J786K5553k9033
16360a253652K8178K4101N8625J4206O2092N1326l5879k0143Q366N9319j6740
16349a020201J3801p369j7874J8361J1371L2627J12435M4800L4947R107l2573
16338h00568J0461L4150l3704N4335L0248k1064M9234J0604J4161K0469N4471
16327e77203j6310J3039Q233M0491R3696k2243L8057M513n044M211q839r364M0362
16314c96401R1761N4197j0699j0337N571L3826l423M343n7762M6244P9568L6974
16302a26138j3003K3403M0210J7607Q082L186K4372j2749K333J4461J5051M7617
$$ plain form
16290 44432 86683 67486 116466 154297 141779 159186 166906 152199 179625 218855 222117 247742
16278 247742 241520 234091 255371 264913 194902 233530 274546 335324 358259 332357 365372 405826
16266 405826 338438 351715 415424 409201 443158 533259 500306 464583 462786 525134 520322 512182
16254 512182 573725 578471 614860 607439 630949 624100 606431 640195 685561 654719 673506 630036
16242 630036 589524 625856 657491 688005 719496 691743 776459 822218 762764 769491 773365 696764
16230 696764 763583 781606 831550 907428 903571 887236 820044 725488 795038 874620 861965 896185
16218 896185 916480 956552 965978 898223 900884 982504 992799 946739 978781 1026196 1016705 1000397
16206 1000397 980274 893404 929364 1010330 969190 1017943 1039923 1000642 1008361 1094813 1091013 1105519
$$ packed form
16290D4432M2251j9197M8980L7831j2518J7407P720j4707K7426L9230L262K5625
16278B47742o222p429K1280R542p0011L8628M1016O0778K2935k5902L3015M0454
16266D05826o7388J3277O3709o223L3957R0101l2953l5723j797O2348m812q140
16254E12182O1543M746L6389p421K3510o849j7669L3764M5366l0842J8787m3470
16242F30036m0512L6332L1635L0514L1491k7753Q4716M5759n9454O727L874p6601
16230F96764O6819J8023M9944P5878l857j6335o7192r4556O9550P9582j2655L4220
16218H96185K0295M0072R426o7755K661Q1620J0295m6060L2042M7415r491j6308
16206A000397k0123q6870L5960Q0966m1140M8753K1980l9281P719Q6452l800J4506
$$ plain form
16194 1105519 1093827 983816 1014507 1009865 1063574 1054205 1133336 1157360 1153034 1141310 1155206 1142918
16182 1142918 1146200 1161480 1199328 1208476 1163592 1118187 1173263 1258117 1253705 1226724 1247674 1187683
16170 1187683 1169757 1191528 1203120 1186867 1156933 1223147 1210269 1225677 1229132 1234944 1265938 1193528
16158 1193528 1244912 1270138 1207641 1225433 1243485 1329498 1260181 1245996 1299516 1360983 1381722
16147 1381722 1353127 1312636 1363032 1351642 1299571 1244559 1329406 1255594 1274673 1277935 1264136
16136 1264136 1327096 1354937 1338325 1364279 1310589 1343162 1380855 1358218 1343575 1300591 1307212
16125 1307212 1332571 1378789 1398573 1410276 1319121 1306745 1459609 1464208 1431903 1456707 1468111
16114 1468111 1419934 1359935 1400312 1407240 1428815 1369329 1323632 1350437 1323538 1386565 1464272
$$ packed form
16194A105519j1692j10011L0691m642N3709r369P9131K4024m326j1724J3896j2288
16182A142918L282J5280L7848R148m4884m5405N5076Q4854m412k6981K0950n9991
16170A187683j7926K1771J1592j6253k9934O6214j2878J5408L455N812L0994p2410
16158A193528N1384K5226o2497J7792J8052Q6013o9317j4185N3520O1467K0739
16147A381722k8595m0491N0396j1390n2071n5012Q4847p3812J9079L262j3799
16136A264136O2960K7841j6612K5954n3690L2573L7693k2637j4643m2984O621
16125A307212K5359M6218J9784J1703r1155j2376J52864M599l2305K4804J1404
16114A468111m8177n9999M0377O928K1575n9486m5697K6805k6899O3027P7707
$$ plain form
16103 1464272 1451211 1447159 1437142 1439334 1469101 1498589 1474361 1462618 1436308 1436228 1448018 1460898
16091 1460898 1479046 1508907 1531902 1531175 1431688 1421160 1400935 1456146 1529523 1460582 1471564 1494546
16079 1494546 1471887 1428462 1452821 1417393 1435358 1457279 1456147 1423381 1449144 1505723 1515115 1523051
16067 1523051 1531389 1487943 1507302 1506257 1554381 1518424 1449913 1469670 1463719 1462266 1437318 1483646
16055 1483646 1451970 1434299 1420295 1477060 1452915 1426573 1384139 1425085 1488379 1478377 1437339
$$ packed form
16103A464272j3061m052j0017K192K9767K9488k4228j1743k6310q0J1790J2880
16091A460898J8148K9861K2995p27r9487j0528k0225N5211P3377o8941J0982K2982
16079A494546k2659m3425K4359l5428J7965K1921j132l2766K5763N6579R392P936
16067A523051Q338m3446J9359j045M8124l5957o8511J9757n951j453k4948M6328
16055A483646l1676j7671j4004N6765k4145k6342m2434M0946O3294j0002m1038
$$ [...]
##END NTUPLES=NMR SPECTRUM
##END=
