##TITLE=1H_DE-80H_X3
 200.13MHz, d2o
 8 sc
 
 19ns.26.2.2025
##JCAMPDX= 6.0         $$ Bruker NMR JCAMP-DX V2.0
##DATA TYPE= NMR SPECTRUM
##DATA CLASS= NTUPLES
##ORIGIN= UXNMR, Bruker Analytische Messtechnik GmbH
##OWNER= pz
$$ XWIN-NMR		Version 3.5
$$ Fri Jul  4 10:35:57 2025 Russian Standard Time (UT+4h)  Yarkov@DPX200
##.OBSERVE FREQUENCY= 200.1313
##.OBSERVE NUCLEUS= ^1H
##.ACQUISITION MODE= SIMULTANEOUS
##.ACQUISITION SCHEME= undefined
##.AVERAGES= 8
##.DIGITISER RES= 18
##SPECTROMETER/DATA SYSTEM= spect
##.PULSE SEQUENCE= zg30
##.SOLVENT NAME= CDCl3
##.SHIFT REFERENCE= (INTERNAL, CDCl3, 0, 15.5188)
##AUDIT TRAIL= $$ (NUMBER, WHEN, WHO, WHERE, WHAT)
$$ ##TITLE= Audit trail, XWIN-NMR		Version 3.5
$$ ##JCAMPDX= 5.01
$$ ##ORIGIN= Bruker BioSpin GmbH
$$ ##OWNER= Yarkov
$$ C:/Bruker/XWIN-NMR/data/yarkov2/nmr/H-C/1/pdata/1/auditp.txt
$$ ##AUDIT TRAIL=  $$ (NUMBER, WHEN, WHO, WHERE, WHAT)
(   1,<2025-07-04 10:34:56.06 +0400>,<Yarkov>,<DPX200>,
      <created by zg, POWCHK disabled, PULCHK disabled
       configuration hash MD5:
       00 E9 B6 7A A2 85 ED C7 34 08 36 98 17 FE 4E 26
       data hash MD5: 16K
       2E 03 2D 04 79 6D 0B C6 5D 36 21 D2 BB D5 DF 5C>)
(   2,<2025-07-04 10:35:03.25 +0400>,<Yarkov>,<DPX200>,
      <Start of raw data processing
       efp BC_mod = 2 LB = 0.25 FT_mod = 6 PKNL = 1 PHC0 = -1365.687 PHC1 = 16.24948 SI = 16K 
       data hash MD5: 16K
       6B 9E 2C D3 D6 4A 22 41 4D 41 A5 EC BA BF 33 26>)
(   3,<2025-07-04 10:35:14.56 +0400>,<Yarkov>,<DPX200>,
      <abs ABSG = 5 
       data hash MD5: 16K
       95 93 E7 86 2E A1 80 ED 82 F3 F2 9E 37 E4 5B C3>)
$$ ##END=
$$ 
$$ hash MD5
$$ E6 F3 A5 B9 25 37 72 3C E4 C7 1F 69 2C 77 30 B2
##$RELAX= 
##$RELAX= 
##$RELAX= 
##$RELAX= 
##$RELAX= 
##$RELAX= 
$$ Bruker specific parameters
$$ --------------------------
##$DU= <C:/Bruker/XWIN-NMR>
##$EXPNO= 1
##$NAME= <H-C>
##$PROCNO= 1
##$TYPE= <nmr>
##$USER= <yarkov2>
##$AMP= (0..31)
100 100 100 100 100 100 100 100 100 100 100 100 100 100 100 100 100 100 
100 100 100 100 100 100 100 100 100 100 100 100 100 100 
##$AQSEQ= 0
##$AQ_mod= 1
##$AUNM= <au_zg>
##$AUTOPOS= <>
##$BF1= 200.13
##$BF2= 200.13
##$BF3= 200.13
##$BF4= 200.13
##$BF5= 200.13
##$BF6= 200.13
##$BF7= 200.13
##$BF8= 200.13
##$BYTORDA= 1
##$CFDGTYP= 0
##$CFRGTYP= 5
##$CHEMSTR= <none>
##$CNST= (0..31)
1 1 145 1 1 1 1 1 1 1 1 1 1 1 1 1 1 1 1 1 1 1 1 1 1 1 1 1 1 1 1 1 
##$CPDPRG= <>
##$CPDPRG1= <>
##$CPDPRG2= <>
##$CPDPRG3= <>
##$CPDPRG4= <mlev>
##$CPDPRG5= <mlev>
##$CPDPRG6= <mlev>
##$CPDPRG7= <mlev>
##$CPDPRG8= <mlev>
##$CPDPRGB= <>
##$CPDPRGT= <>
##$D= (0..31)
0 0.7 0 0 0 0 0 0 0 0 0 0.03 0 0 0 0 0 0 0 0 0 0 0 0 0 0 0 0 0 0 0 0 
##$DATE= 1751610895
##$DBL= (0..7)
120 120 120 120 120 120 120 120 
##$DBP= (0..7)
150 150 150 150 150 150 150 150 
##$DBP07= 0
##$DBPNAM0= <>
##$DBPNAM1= <>
##$DBPNAM2= <>
##$DBPNAM3= <>
##$DBPNAM4= <>
##$DBPNAM5= <>
##$DBPNAM6= <>
##$DBPNAM7= <>
##$DBPOAL= (0..7)
0.5 0.5 0.5 0.5 0.5 0.5 0.5 0.5 
##$DBPOFFS= (0..7)
0 0 0 0 0 0 0 0 
##$DE= 6
$$ [...]
##$SUBNAM3= <"">
##$SUBNAM4= <"">
##$SUBNAM5= <"">
##$SUBNAM6= <"">
##$SUBNAM7= <"">
##$SUBNAM8= <"">
##$SUBNAM9= <"">
##$SW= 18.0517328524113
##$SWIBOX= (0..15)
0 0 2 0 0 0 0 0 0 0 0 0 0 0 0 0 
##$SW_h= 3612.71676300578
##$TD= 16384
##$TD0= 1
##$TE= 0
##$TE2= 300
##$TE3= 300
##$TEG= 300
##$TL= (0..7)
0 120 120 120 120 120 120 120 
##$TP= (0..7)
150 150 150 150 150 150 150 150 
##$TP07= 0
##$TPNAME0= <>
##$TPNAME1= <>
##$TPNAME2= <>
##$TPNAME3= <>
##$TPNAME4= <>
##$TPNAME5= <>
##$TPNAME6= <>
##$TPNAME7= <>
##$TPOAL= (0..7)
0.5 0.5 0.5 0.5 0.5 0.5 0.5 0.5 
##$TPOFFS= (0..7)
0 0 0 0 0 0 0 0 
##$TUNHIN= 0
##$TUNHOUT= 0
##$TUNXOUT= 0
##$USERA1= <user>
##$USERA2= <user>
##$USERA3= <user>
##$USERA4= <user>
##$USERA5= <user>
##$V9= 5
##$VALIST= <valist>
##$VCLIST= <CCCCCCCCCCCCCCC>
##$VD= 0
##$VDLIST= <DDDDDDDDDDDDDDD>
##$VPLIST= <PPPPPPPPPPPPPPP>
##$VTLIST= <TTTTTTTTTTTTTTT>
##$WBST= 1024
##$WBSW= 4
##$XGAIN= (0..3)
0 0 0 0 
##$XL= 0
##$YL= 0
##$YMAX_a= 174412
##$YMIN_a= -181555
##$ZGOPTNS= <>
##$ZL1= 120
##$ZL2= 120
##$ZL3= 120
##$ZL4= 120
##$ABSF1= 15.49347
##$ABSF2= -2.558379
##$ABSG= 5
##$ABSL= 3
##$ALPHA= 0
##$AQORDER= 0
##$ASSFAC= 0
##$ASSFACI= 0
##$ASSFACX= 0
##$ASSWID= 0
##$AUNMP= <proc_1d>
##$AZFE= 0.1
##$AZFW= 0.1
##$BCFW= 0
##$BC_mod= 2
##$BYTORDP= 0
##$COROFFS= 0
##$CY= -3
##$DATMOD= 1
##$DC= 0
##$DFILT= <>
##$DTYPP= 0
##$F1P= 0
##$F2P= 0
##$FCOR= 1
##$FTSIZE= 16384
##$FT_mod= 6
##$GAMMA= 0
##$GB= 0
##$INTBC= 1
##$INTSCL= 3.241238e-09
##$ISEN= 128
##$LB= 0.25
##$LEV0= 0
##$LPBIN= 0
##$MAXI= 10000
##$MC2= 0
##$MEAN= 0
##$ME_mod= 0
##$MI= 1.114404
##$NCOEF= 0
##$NC_proc= -7
##$NLEV= 6
##$NOISF1= 3.799351
##$NOISF2= 2.8
##$NSP= 0
##$NTH_PI= 0
##$NZP= 0
##$OFFSET= 15.51882
##$PC= 1
##$PHC0= -1365.687
##$PHC1= 16.24948
##$PH_mod= 1
##$PKNL= yes
##$PPARMOD= 0
##$PSCAL= 0
##$PSIGN= 0
##$REVERSE= no
##$SF= 200.130000576881
##$SI= 16384
##$SIGF1= 3
##$SIGF2= 2
##$SINO= 0.751879
##$SIOLD= 32768
##$SREGLST= <19F.Aceton>
##$SSB= 0
##$STSI= 16384
##$STSR= 0
##$SW_p= 3612.71676300578
##$SYMM= 0
##$S_DEV= 0
##$TDeff= 16384
##$TDoff= 0
##$TI= <>
##$TILT= no
##$TM1= 0
##$TM2= 0
##$TOPLEV= 0
##$USERP1= <user>
##$USERP2= <user>
##$USERP3= <user>
##$USERP4= <user>
##$USERP5= <user>
##$WDW= 1
##$XDIM= 16384
##$YMAX_p= 388656455
##$YMIN_p= -415831
$$ End of Bruker specific parameters
$$ ---------------------------------
##NTUPLES= NMR SPECTRUM
##VAR_NAME=  FREQUENCY,     SPECTRUM/REAL,   SPECTRUM/IMAG
##SYMBOL=    X,             R,               I
##VAR_TYPE=  INDEPENDENT,   DEPENDENT,       DEPENDENT
##VAR_FORM=  AFFN,          ASDF,            ASDF
##VAR_DIM=   16384,         16384,           16384
##UNITS=     HZ,            ARBITRARY UNITS, ARBITRARY UNITS
##FACTOR=    0.220516191357247, 1,           1
##FIRST=     3105.78141731967, 0,            0
##LAST=      -506.935345686111, 0,           0
##MIN=       -506.935345686111, -415831,     0
##MAX=       3105.78141731967, 388656455,    0
$$ Real data points
##PAGE= N=1
##DATA TABLE= (X++(R..R)), XYDATA
$$ [...]
6083G86396K7502J58322N8319n2796j74962j11906Q8035l6440j8019q4880J72817
6072H12388L7366l513K0878q1711n6250M3615K2901k736J8249N8170J37236j07655
6060H98938j44145J87810R4679l0881J41638O3220J39651r2393j83055p8304q8140
6049I09018R3078m708q2686k04901J23407J8585o0644q1998N5519m7042R756J72938
6037I00322r8226q0577O0432R766M614K464P4127q601L6708p9880k3566k4342
6025G73241J02925J01340N0786n5836m8960p9211j79501n4338j25704q198k2208
6014D54336r0168r1621J17068J10690J25551k91806n5891Q5699n2709m9072J5785
6003B77862K1827p1755j03714R9828P2003J5495p9497k7348L04829j8503p8494
$$ plain form
6083 786396 813898 972220 1030539 977743 802781 690875 778910 742470 724451 639571 812388
6072 812388 849754 846241 867119 785408 729158 772773 795674 792938 811187 869357 1006593 898938
6060 898938 754793 942603 1037282 1006401 1148039 1211259 1350910 1258517 1075462 997158 909018
6049 909018 1002096 997388 914702 709801 833208 851793 791149 709151 764670 717628 727384 900322
6037 900322 802096 721519 781951 791717 796331 798795 872922 864321 901029 821149 797583 773241
6025 773241 876166 977506 1028292 972456 923496 844285 664784 610446 484742 476544 454336
6014 454336 364168 272547 389615 500305 625856 334050 278159 363858 311149 262077 277862
6003 277862 299689 227934 124220 224048 296051 311546 232049 204701 509530 491027 412533
5992D12533p1610p2240k550o6266O7252J829K8110j56639O4291J88385K2675l1604
5980C84166j96321p035n9521L0676J6624M09j6827N1558k9401J86795o7191q9180
5968B04752P7098J30007J22101l6259P2759j60271j2099N3255p8845r4974m0058
5957B37466J30603r6181j75766J151K20014J35472r0452l5124l8040K2314Q7653
5946C99110O3631l9531J5372j08973j22436J01681J17460n1211j60734K4523k3438
5935B15454J38553O0547o772j6354j789j20780j5028J54352p5286j6944O3981
5924C79934M9429p5635r0732j4096J52079P9410q7578j2903k8674n2301j3586
5913B85347P826P6354K5646l7268l1969j76775o760Q7577k9660q0008L9581K0606
$$ plain form
5992 412533 340923 268683 266133 199867 267119 268948 297058 140419 204710 393095 415770 384166
5980 384166 187845 180810 121289 151965 168589 168998 152171 203729 174328 361123 293932 204752
5968 204752 281850 411857 533958 497699 570458 410187 398088 451343 372498 277524 237466
5957 237466 368069 271888 96122 97273 317287 452759 362307 327183 289143 311457 399110
5946 399110 462741 423210 438582 329609 207173 308854 426314 375103 214369 238892 215454
5935 215454 354007 414554 407782 391428 389639 268859 253831 408183 332897 315953 379934
5924 379934 429363 353728 262996 248900 400979 480389 392811 379908 351234 298933 285347
5913 285347 293173 369527 395173 357905 325936 149161 142401 229978 200318 120310 159891 180497
5901A80497P6412Q5419J11016J810j32540m3637l8952J41128j7075J06744m8092
5890D22730n9589n2310q7180J71318m5434r215J20376r7310m3860l7810O0957
5879C42673N5343O6615k2672j24095L0175j31761m2607P7636R8488P9376j55962
5868B73209L3128P7299J6390j28420j14507M115R3241j2497J7744o7467M5407
5857B37642L2250J58463J9896Q2237j8769j20998j27822J8249N6663M7553K0993
5846D06357k24310J97153J40611k8492Q418L1810Q5623j18210r0572J33892r4382
5835D47898k8683L7262M3910L6905O0140j29502Q411Q6818j51686J25112R6852
5824F33437p0608k9453J607K0491j20900n2779l0564K7191k8812J3948n4167J62917
$$ plain form
5901 180497 256909 342328 453344 455154 322614 278977 240025 381153 364078 470822 422730
5890 422730 363141 310831 223651 394969 349535 340320 460696 363386 319526 281716 342673
5879 342673 398016 464631 441959 317864 348039 216278 173671 251307 349795 429171 273209
5868 273209 306337 383636 400026 271606 157099 161214 254455 241958 259702 192235 237642
5857 237642 269892 428355 448251 530488 511719 390721 262899 281148 337811 385364 406357
5846 406357 182047 379200 519811 491319 499737 531547 617170 498960 408388 542280 447898
5835 447898 419215 456477 500387 537292 597432 467930 476341 563159 411473 536585 633437
5824 633437 562829 533376 534983 555474 434574 381795 351231 378422 349610 363558 309391 472308
5812D72308P2920r560Q6195O091j52602o2171J4743L3817p7683l2085J62447j31999
5800C82421o3340p832J3570Q8689Q9980P3788m8566J1371o192j55k2623j01925
5788D09186K4283P6704k4468J13454P4162j13091J9061m9273p21P4606L940j03544
5776E04299p237k1391j37251J04512J48076J41078j37110j34440j5252k1825M6410
5765D69869L8607L3740N4620J3552q8365n6580N8031K8509J35709M1249p7980
5754F50961L9306j9979J8134m2323M3508O0516m8036J06014L1879j10539o5208
5743F64233n2171l9004J49113L4902n8171O8023L4588p6480j29428M9371J13962
5732G58938R6959n0061j50788r22J18474O8264L9417O5936K3240o5451J5557O0855
$$ plain form
5812 472308 545228 535668 621863 627954 475352 413181 427924 461741 384058 351973 514420 382421
5800 382421 319081 311249 324819 413508 503488 577276 528710 540081 533889 533734 511111 409186
5788 409186 433469 510173 485705 599159 673321 560230 579291 530018 529297 603903 607843 504299
5776 504299 497062 475671 338420 442932 591008 732086 594976 460536 445284 423459 469869
5765 469869 508476 542216 596836 610388 522023 465443 523474 551983 687692 728941 650961
5754 650961 690267 670288 688422 646099 689607 750123 702087 808101 839980 729441 664233
5743 664233 612062 573058 722171 757073 698902 766925 801513 725033 595605 644976 758938
5732 758938 855897 805836 655048 654126 772600 840864 880281 946217 969457 904006 919563 980418
5720I80418k4056k058k11140p0650K9609L3415R1630M8315P4808j31430O2234
5709H81095q5661l6609J82852j3943O5581L0035p8218P7156j3745l6531j2889
5698I59123O689J12770P5466M801M4532l1087P9223N67j85613p8403J64189P3047
5686A225304N9876m976l2129o8546L5506j38968j9947q440L4899J52362k6143
5675A208798J3248m4879N0431O2469N7721j7014P514j7665O3519J7813j05053
5664A296902q4248K05172o496M9190r183j23601J38684P5327m2477j31123L7056
5653A405203K3292j4141k4471J7234j2097J3076L5523L5339K078O0880J11347
5642A653263K8579j4622j5511L0650k0621Q1057J59957M6541o7979o0962k2503
$$ plain form
5720 980418 956362 954304 743164 672514 702123 735538 827168 875483 950291 818861 881095
5709 881095 795434 758825 941677 927734 993315 1023350 945132 1022288 1008543 972012 959123
5698 959123 965812 1078582 1154048 1158849 1203381 1172294 1251517 1252084 1066471 988068 1152257 1225304
5686 1225304 1285180 1280204 1248075 1179529 1215035 1076067 1056120 1047680 1082579 1234941 1208798
5675 1208798 1222046 1177167 1227598 1290067 1347788 1330774 1338288 1320623 1384142 1401955 1296902
5664 1296902 1212654 1417826 1411330 1460520 1451337 1327736 1466420 1541747 1499270 1368147 1405203
5653 1405203 1428495 1414354 1389883 1407117 1395020 1408096 1443619 1478958 1481036 1541916 1653263
5642 1653263 1681842 1667220 1651709 1682359 1661738 1742795 1902752 1949293 1881314 1820352 1797849
5631A797849J15419Q492l9879N5556J70361o9440L481L9841P9747O3272J23345
5620B348044M4105J41755j32192j29540Q9395J383J10135P7220l0204J3603J71713
5609B705417k1227l8379m7591J59343P565J89414J11327q8435J4579j661R3506
5598C083858J85028l3245K6109N9461J98299J43567o7904J96287j00564N2716
5588C743612J44079N4325M555J21797J66271L9435N8257J45503J95138L22987
5578D995959R0471m8041J29602J03857L4914J73697J33759J30248J63576O1109
5568E969151K00667J20835L6404J40335L22043J33898R9756J95709K13613O5803
5558G498214L28408J08674J44556O7436K00319L94280J22049J02999K29588L09983
$$ plain form
5631 1797849 1913268 1921760 1881881 1937437 2107798 2038358 2041839 2081680 2161427 2224699 2348044
5620 2348044 2392149 2533904 2401712 2272172 2361567 2362950 2473085 2550305 2520101 2533704 2705417
5609 2705417 2684190 2645811 2598220 2757563 2765128 2954542 3065869 2977434 2992013 2990352 3083858
5598 3083858 3268886 3235641 3261750 3321211 3519510 3663077 3595173 3791460 3690896 3743612
5588 3743612 3887691 3942016 3946571 4068368 4234639 4274074 4332331 4477834 4672972 4995959
5578 4995959 5086430 5038389 5167991 5271848 5306762 5480459 5614218 5744466 5908042 5969151
5568 5969151 6169818 6290653 6327057 6467392 6789435 6923333 7023089 7218798 7432411 7498214
5558 7498214 7826622 7935296 8079852 8147288 8347607 8741887 8863936 8966935 9196523 9506506
5548I506506J54157J91952K19829K68946Q7840L2388J65088L09422l0371K11179
5538A1116936L29828J32076R8146J78900K09276K29012J72220J81218K32614J80609
5528A3060835L02622J21199J80347K64178L06836J67839K17448p454K56005L03190
5518A5173045K30688J74165N4574L4086J44151K14906K39940J22611R6526K80812
5508A6765504J19946J55391K66429J15347L4180R0521L94311J58281o0955K20304
5498A8259259K35196J00422K320J04600J27508K33254o254l062K3591J78671J01427
5487A9356932P3722p60J57824P3007l3716L9583J22595j22239L0499J58953M2502
5476A9898902K2149L5985M984p9475m169P0992p9011j33301K0842o1980n1058
$$ plain form
5548 9506506 9660663 9852615 10072444 10341390 10429230 10461618 10626706 10936128 10905757 11116936
5538 11116936 11446764 11578840 11676986 11855886 12065162 12294174 12466394 12647612 12880226 13060835
5528 13060835 13363457 13484656 13665003 13929181 14236017 14403856 14621304 14613850 14869855 15173045
5518 15173045 15403733 15577898 15632472 15666558 15810709 16025615 16265555 16388166 16484692 16765504
5508 16765504 16885450 17040841 17307270 17422617 17456797 17547318 17941629 18099910 18038955 18259259
5498 18259259 18494455 18594877 18597197 18701797 18829305 19062559 19056305 19053243 19076834 19255505 19356932
5487 19356932 19430654 19429894 19587718 19660725 19627009 19666592 19789187 19666948 19697447 19856400 19898902
5476 19898902 19921051 19957036 19962020 19882545 19878376 19949368 19870357 19737056 19757898 19695918 19644860
5465A9644860j4111J15028l9638q7059j57937l441O468k56006k80246j79217k15246
5454A8533455k54442k20306k83004l05268k42314j10830r0951j53736l67619l49375
5444A6155610n6797j21513k38373k42914q6841r6062l45655l44373k76265j23075
5434A4223742j69559k37915l59998l02216k22080k66413j01935j34435l16743
5425A2112448j55413j15042k80484k66797k98229j09507k11897l09302k48172
5416A0117605j31651j94168k36621r1556p7687j15432j33052j43128j74755j89149
5406H630406k55810j69464k14442j71119j25704o1854j26549m0097m9596k46330
5396G169441k61679p3854m931j58153k33727j15266r349j78617o225p8152j29464
$$ plain form
5465 19644860 19630749 19745777 19706139 19619080 19461143 19457702 19464170 19208164 18927918 18748701 18533455
5454 18533455 18279013 18058707 17775703 17470435 17228121 17117291 17026340 16872604 16504985 16155610
5444 16155610 16098813 15977300 15738927 15496013 15409172 15313110 14967455 14623082 14346817 14223742
5434 14223742 14054183 13816268 13456270 13154054 12931974 12665561 12563626 12429191 12112448
5425 12112448 11957035 11841993 11561509 11294712 10996483 10886976 10675079 10365777 10117605
5416 10117605 9985954 9791786 9555165 9463609 9385922 9270490 9137438 8994310 8819555 8630406
5406 8630406 8374596 8205132 7990690 7819571 7693867 7632013 7505464 7465367 7415771 7169441
5396 7169441 6907762 6833908 6828977 6670824 6437097 6321831 6312482 6133865 6127640 6049488 5920024
5385E920024m5675q3822j34410j2179j06786p4648J9365m4136q1028j04989q1128
5374E170588j42854k51754j03673O2342J11284O1968J6331j54912q6406q3805
5364D599109p1573j1682n0012r3317j40022l9255O4948k4152j10156N8229q3124
5353D098993j91186J933p7043M8749M5890r3674j29540j52688J17244m126k55131
5342C409421P51J9062O4202P2967N7203m8008l4410j75285j38584M2948n6340
5331C213927J34232o8709N4399r5191k2493n7439j22409l7511J16732l134R1378
5320C203782k5114q5089M7154J5769L3538j730n1597j08821q5226L7007J99648
5309C179321n5249j15636l0067p3747l8920j19198N1778J03502R8l1259K584k208
$$ plain form
5385 5920024 5874349 5790527 5656117 5643938 5537152 5462504 5481869 5437733 5356705 5251716 5170588
5374 5170588 5027734 4775980 4672307 4734649 4845933 4907901 4924232 4769320 4682914 4599109
5364 4599109 4527536 4515854 4465842 4372525 4232503 4193248 4258196 4234044 4123888 4182117 4098993
5353 4098993 3907807 3909740 3832697 3881446 3927336 3833662 3704122 3551434 3668678 3664552 3409421
5342 3409421 3410172 3429234 3493436 3566403 3623606 3575598 3541188 3365903 3227319 3270267 3213927
5331 3213927 3348159 3279450 3333849 3238658 3216165 3158726 3036317 2998806 3115538 3112404 3203782
5320 3203782 3178668 3093579 3140733 3156502 3190040 3188310 3136713 3027892 2942666 2979673 3179321
5309 3179321 3124072 3008436 2978369 2904622 2865702 2746504 2798282 2901784 2901882 2870623 2873207 2870999
5297B870999P1814k1712m9770o4536m6297J64151j23405l5979k5671M2529k7470
5286B754653j10066P9074R5355M8827J18959l2199o1257j31212m8592P8105r453
5275B782194j17924k3525M5628k4430J29285O0566j22534K50k7015k4159R9531
5264B777867q4861P9623L717k6572N1404K5404j44932k8360J47158J0018K2178
5253B832644j16453J47555l8670M0158P2890j9740m9305l8102l1617p3581K01979
5242B927758J4093k10099J24724j06654K1991N4782p8168r93J45471M8383j82876
5231B758412J2640R1014J36602K5115P4376o2252N6348l6505N6105O8031O321
5220C186207L8168K0565M1890P5418j70312p8781M7457J5049R0246K3809r8560
$$ plain form
5297 2870999 2942813 2921101 2871331 2806795 2760498 2924649 2801244 2765265 2739594 2782123 2754653
5286 2754653 2644587 2723661 2819016 2867843 2986802 2954603 2893346 2762134 2713542 2791647 2782194
5275 2782194 2664270 2640745 2686373 2661943 2791228 2851794 2729260 2729510 2702495 2678336 2777867
5264 2777867 2693006 2772629 2776346 2749774 2801178 2826582 2681650 2653290 2800448 2810466 2832644
5253 2832644 2716191 2863746 2825076 2865234 2938124 2918384 2869079 2830977 2799360 2725779 2927758
5242 2927758 2941851 2731752 2856476 2749822 2771813 2826595 2748427 2747434 2892905 2941288 2758412
5231 2758412 2771052 2862066 2998668 3023783 3098159 3035907 3092255 3055750 3111855 3179886 3186207
5220 3186207 3224375 3244940 3286830 3362248 3191936 3113155 3160612 3175661 3265907 3289716 3191156
5209C191156m6262J90173l7899M4061J45586j13689m9564l1363J62643J21914
5199C576756P4867j2707L0937k801p5356N6753J96613r7906Q7187j3005Q596N8002
5187C887936J51647o788J6111M7000L8328K9201m6306M0412K125K15214J34538
5176D509418O004n7309J01132J06211J11264j19751L7845R4346K41766N2638K0569
5165E104133P1514k4876J61013R1869J53143R1902N6179J60592p2256N107N1969
5154E850289J88504R3128m3934J51618J41972J04435K27051R5039P2389k3993
5144F856498J42138K33160J71374N6937J68606J80298J23273J46017J66744N9617
5134H304662J42319J63966J62341J87885K53336J79611J45796J21921J04434J39179
$$ plain form
5209 3191156 3144894 3335067 3297168 3341229 3486815 3373126 3323562 3292199 3454842 3576756
5199 3576756 3651623 3638916 3669853 3667052 3591696 3648449 3845062 3747156 3834343 3821338 3829934 3887936
5187 3887936 4039583 4032795 4048906 4095906 4134234 4163435 4117129 4157541 4159666 4374880 4509418
5176 4509418 4515422 4458113 4559245 4665456 4776720 4656969 4694814 4789160 5030926 5083564 5104133
5165 5104133 5175647 5150771 5311784 5403653 5556796 5648698 5704877 5865469 5793213 5798320 5850289
5154 5850289 6038793 6131921 6087987 6239605 6381577 6486012 6713063 6808102 6880491 6856498
5144 6856498 6998636 7231796 7403170 7460107 7628713 7809011 7932284 8078301 8245045 8304662
5134 8304662 8446981 8610947 8773288 8961173 9214509 9394120 9539916 9661837 9766271 9905450
5124I905450K11222J09798J3473P3509L42854J51065Q6018K23648L00495K14512
5114A1632044K50674J94089J57665L61624R272J65523L04653J60543J47827K24577
5104A3608491J05514R0046J32303K44353J88765J94371J46814K56865L00267J20238
5094A5388027R2454J26166k456J40740J53746K02832J55479J20574Q9897K57798
5084A6725257J78888J06412J02217R2074J71811K05658p465N7526J11770J04727
5074A7848875k5384N3250K37425K5240J04258J55624M3268Q4700n721O6846J6745
5063A8605126j53970k4748k6485P7266J88190p4488p6526j10969k3530K4408k80327
5052A8123947M5606l2413J04546R9199k30957q3961m8686K6763j61092k65375
$$ plain form
5124 9905450 10116672 10226470 10239943 10313452 10656306 10807371 10893389 11117037 11417532 11632044
5114 11632044 11882718 12076807 12234472 12596096 12605368 12770891 13075544 13236087 13383914 13608491
5104 13608491 13714005 13804051 13936354 14180707 14369472 14563843 14710657 14967522 15267789 15388027
5094 15388027 15480481 15606647 15604191 15744931 15898677 16101509 16256988 16377562 16467459 16725257
5084 16725257 16904145 17010557 17112774 17204848 17376659 17582317 17574852 17632378 17744148 17848875
5074 17848875 17823491 17876741 18114166 18139406 18243664 18399288 18442556 18527256 18521535 18588381 18605126
5063 18605126 18451156 18426408 18399923 18477189 18665379 18590891 18514365 18403396 18379866 18404274 18123947
5052 18123947 18169553 18137140 18241686 18340885 18109928 18025967 17977281 18004044 17842952 17577577
5042A7577577q2650k133o1663j14547k37467K442j24976j32494l6526k18175l2244
5031A6537144j34014k60214j94075o8790j92269j76776o3377j27062j58446p6552
5021A5085569j27991j28624k63874j15143q7959j83536l61700m6021j16958k44382
5011A3409381k20610k00698q4678k02675j82701r4074o4172l25898j15231j71176
5001A1747468k11364o0004j24580k60495k08659j78886j51327j07656j53035j67211
4991A0124251r8240r9683o9577k88343l69011j32938j61085j57592q4579k72027
4981H391176j54304n8950o6290j72711k23617j90888j83263K3462j40834j78748
4971G045033k1147j25089k18927k08497j0155n5315j47436p3634j67294L2513
$$ plain form
5042 17577577 17494927 17492794 17431131 17316584 17079117 17081559 16956583 16824089 16787563 16569388 16537144
5031 16537144 16403130 16142916 15948841 15880051 15687782 15511006 15447629 15320567 15162121 15085569
5021 15085569 14957578 14828954 14565080 14449937 14361978 14178442 13816742 13770721 13653763 13409381
5011 13409381 13188771 12988073 12903395 12700720 12518019 12423945 12359773 12033875 11918644 11747468
5001 11747468 11536104 11476100 11351520 11091025 10882366 10703480 10552153 10444497 10291462 10124251
4991 10124251 10026011 9926328 9856751 9568408 9199397 9066459 8905374 8747782 8663203 8391176
4981 8391176 8236872 8177922 8111632 7938921 7715304 7524416 7341153 7364615 7223781 7045033
4971 7045033 7023886 6898797 6679870 6471373 6461218 6405903 6258467 6184833 6017539 6050052
4961F050052j77522j08763J2704j02132r748j52144j19747O0365k62347j13775
4951E076943l8912j10762j07345j5537J5302m2463m1501J0014q1666k97422r684
4940D356967m5901j5897r9622j01368j60307L0530K9993j44046k33129j50116
4930C467104j24557m2521P8720M162l6387k10255j05539j31610p7803J04490P6695
4919C002499p6227j30948j09148M9140n5096j4340p622o660j40155m2091p2278
4908B397074n8035J03932l6253o1126j00869L6394J8174j35002p0409M4955O2728
4897B201563r8262j69714m5919O9203j3184j9467o7931p4712j17250j0878L6054
4886A689503M9610J03233j62066n2488l4925r0481k4832N3337M0014p0999l7771
$$ plain form
4961 6050052 5872530 5763767 5776471 5674339 5664591 5512447 5392700 5453065 5190718 5076943
4951 5076943 5038031 4927269 4819924 4804387 4819689 4777226 4735725 4745739 4664073 4366651 4356967
4940 4356967 4311066 4295169 4195547 4094179 3933872 3964402 3994395 3850349 3617220 3467104
4930 3467104 3342547 3300026 3378746 3382908 3346521 3136266 3030727 2899117 2821314 2925804 3002499
4919 3002499 2926272 2795324 2686176 2735316 2680220 2665880 2658258 2651598 2511443 2469352 2397074
4908 2397074 2339039 2442971 2406718 2345592 2244723 2281117 2299291 2164289 2093880 2138835 2201563
4897 2201563 2103301 1933587 1887668 1956871 1943687 1924220 1856289 1781577 1664327 1653449 1689503
4886 1689503 1739113 1842346 1680280 1627792 1592867 1502386 1477554 1530891 1570905 1499906 1462135
4875A462135M5926n1703Q0122L9310J4237l2885r5277o0798K1597L1737q8762
4864A365639J07613J57518J0588j31761j1769M2669l1512J53502R0118q166L2267
4853A776706j2238r4771R3350R7808J94463J85945J86877K32354J92840L99788
4843C253122M05029N3568l25054m48679m95702k45514k35620m8478k20191j54516
4833A537965R6591j24136q6038J1153R7360j03620j64336j23234p285M3824P5431
4822A253675q4123l8098J57212N844j03879q6878K4869k4828q5675p5553J76363
4811A118929m6374j4264p2542k4722k6299R2904q2950r6891R2399k7996Q6159
4800I98353j10874j4439O4828L2262K7195O1369k31403o6668K13942n8594j23057
$$ plain form
4875 1462135 1508061 1456358 1536480 1575790 1590027 1557142 1461865 1401067 1422664 1454401 1365639
4864 1365639 1473252 1630770 1641358 1509597 1497828 1540497 1508985 1662487 1752605 1744439 1776706
4853 1776706 1764468 1669697 1763047 1860855 2055318 2241263 2428140 2660494 2853334 3253122
4843 3253122 3658151 3711719 3386665 2937986 2442284 2196770 1961150 1912672 1692481 1537965
4833 1537965 1634556 1510420 1424382 1435535 1532895 1429275 1264939 1141705 1134420 1178244 1253675
4822 1253675 1169552 1131454 1288666 1294510 1190631 1103753 1128622 1103794 1018119 942566 1118929
4811 1118929 1072555 1058291 985749 961027 934728 1027632 944682 847791 940190 912194 998353
4800 998353 887479 873040 937868 970130 997325 1058694 827291 760623 974565 915971 792914
4789G92914K6072j4501j32348m402m3890N5282J05999k1085J22929j01323J13437
4778H99084o7163r228M4647M2536K1337K8167k01637J0190O3041J5558j5944j25660
4766G04928m7540J02268l4466m7373M6330p4575J26789Q3843P0916q7040k56582
4755E87498k67J92338M5822p5909j8000k8014K6414J89560K3648k14207l6939
4744F91944j2991q1375J12161K3714J23393r3288J5656L4769j8338j29040k7065
4733F39540r90q7674R2361J7198J69174l6658m8807J72578m3761j6829j39980
4722G16152J4888l6348J2143o01K7075j6597K8509K4483Q0730J16329m7550J6982
4710I36195L7319n407l3356m4398n9002r7655m5661J29366R786o3296j2501K0934
$$ plain form
4789 792914 818986 804485 672137 667735 623845 679127 785126 764041 886970 785647 899084
4778 899084 831921 822693 867340 909876 931213 959380 757743 767933 830974 846532 830588 704928
4766 704928 657388 759656 725190 677817 724147 649572 776361 860204 931120 844080 587498
4755 587498 587231 779569 825391 749482 731482 703468 729882 919442 943090 728883 691944
4744 691944 678953 597578 709739 733453 856846 763558 779214 813983 795645 666605 639540
4733 639540 638550 550876 643237 660435 829609 792951 744144 916722 872961 856132 716152
4722 716152 731040 694692 706835 706234 733309 716712 745221 769704 850434 966763 919213 936195
4710 936195 973514 968107 934751 890353 831351 733696 688035 817401 827187 763891 751390 772324
4698G72324Q9568J52660j52840p2316N4888J19109L35K5798J16950r7556L9841
4687A048761j15150p0585L5702J08004O5751Q6425m3137P3830k9922j45955m8225
4676I65499J06844o9545k0462j1496m2052k0638J13022o2169l1378m3263n1005
4665H33357J69125K0154K6573J3732R2397k7939j9938q8145R1469M2820j12974
4654A040631K3297P5598o5594Q5904L4628j53602p0536P4589N0391n3176q731
4643A033399J303l0558J04939n5129p5231P7754J51901j03900K504Q6041K4612
4632A217635m47N2192l3224j7383l7284J08188j06747N2885J7398j47513M6129
4621A151829q376J46958O05n8008j8783o3237l5949p4712k5602N3534J07051n0383
$$ plain form
4698 772324 861892 1014552 861712 789396 844284 963393 963728 989526 1106476 1008920 1048761
4687 1048761 933611 863026 898728 1006732 1072483 1158908 1115771 1189601 1159679 1013724 965499
4676 965499 1072343 1002798 982336 970840 928788 908150 1021172 959003 927625 884362 833357
4665 833357 1002482 1022636 1049209 1062941 1155338 1127399 1107461 1019316 1110785 1153605 1040631
4654 1040631 1063928 1139526 1073932 1159836 1194464 1040862 970326 1044915 1095306 1042130 1033399
4643 1033399 1034702 1004144 1109083 1053954 978723 1056477 1208378 1104478 1106982 1193023 1217635
4632 1217635 1217188 1269380 1236156 1218773 1181489 1289677 1182930 1235815 1253213 1105700 1151829
4621 1151829 1143453 1290411 1291016 1233008 1214225 1150988 1115039 1040327 1014725 1068259 1175310 1124927
4609A124927Q6301J03028q5481M1080n478q6066M0896J0919j57208R697Q0513
4598A163128o2312L4994P8094j29270J9762J30884M1884n3407j6551k7664N865
4587A185407m3183r0163R9072M553l0867J641m1010J2189N9381Q3066l5986j56053
4575A048047L9198Q8465m4265m0293n2218J79027J834m0684k2126p0234R9937
4564A186688O0086j3353m797m0796n6856J22548N5939j5760k4599J19550r7188
4553A291462m3730j18700r4791O4388J9309K48705R7476p1173j5272R4168k2875
4542A448967k8847k09822j01540J5713J79061N9902k2137K0327L6005Q2154M2654
4531A522437K837j6154l6258o2979J0766M1217R7927P8314j35972p4474O941M412
$$ plain form
4609 1124927 1211228 1314256 1228775 1269855 1264377 1178311 1219207 1230126 1072918 1082615 1163128
4598 1163128 1100816 1135810 1213904 1084634 1104396 1235280 1277164 1223757 1207206 1179542 1185407
4587 1185407 1142224 1052061 1151133 1155686 1124819 1126460 1085450 1097639 1157020 1240086 1204100 1048047
4575 1048047 1087245 1175710 1131445 1091152 1038934 1217961 1219795 1179111 1156985 1086751 1186688
4564 1186688 1246774 1233421 1228624 1187828 1130972 1253520 1309459 1293699 1269100 1388650 1291462
4553 1291462 1247732 1129032 1034241 1098629 1117938 1366643 1464119 1392946 1377674 1471842 1448967
4542 1448967 1420120 1210298 1108758 1124471 1303532 1363434 1341297 1361624 1397629 1479783 1522437
4531 1522437 1525274 1509120 1472862 1409883 1420649 1461866 1559793 1638107 1502135 1427661 1434602 1439014
4519A439014J20501J0330j09384j07680J12726J91722k5434M8754J55415k4315
4509A811649j24784m9382N9060j7678P7939J1274J38136K3559M8084J738j69758
4498A809837O261J96828M9855j2504J8466j6200K4915j04724P0438k7436J15573
4487B131309J9976J6789K3962J27557K5491j96992P1360J80986j26129P1812n4001
4476B292120J39288J09769Q3470j2207j96m9298Q3379R0747M7283R5804j09796
4465B770363Q5209J6850n6680P3960R2018o9112J15474R8670J8488L7121J3869
4454C196230k8286O0401K3116L7641J02909L6025J48088K02496r6034J15784J02664
4443C901034P8294l7885J30858N8880J63425J22895K16226M0073J23640J38767
$$ plain form
4519 1439014 1559515 1569845 1460461 1352781 1465507 1657229 1631795 1680549 1835964 1811649
4509 1811649 1686865 1637483 1696543 1678865 1756804 1768078 1906214 1929773 1977857 1979595 1809837
4498 1809837 1816098 2012926 2062781 2050277 2068743 2052543 2077458 1972734 2043172 2015736 2131309
4487 2131309 2151285 2168074 2192036 2319593 2345084 2148092 2219452 2400438 2274309 2346121 2292120
4476 2292120 2431408 2541177 2624647 2612440 2612244 2562946 2646325 2737072 2784355 2880159 2770363
4465 2770363 2855572 2872422 2815742 2889702 2981720 2912608 3028082 3126752 3145240 3182361 3196230
4454 3196230 3167944 3228345 3251461 3289102 3392011 3428036 3576124 3778620 3682586 3798370 3901034
4443 3901034 3979328 3941443 4072301 4131181 4294606 4417501 4633727 4673800 4797440 4936207
4433D936207P9861L56814J83797Q6175O8089K39751K07468K94241L07126K93477
4423G053006M14746J94031L26435M31348J79200K80077L58152N08532O02352N30395
4413A0878274O59733P09985O25055N19363O64541P54044N53504L72908K29863
4404A5967270K22973M06103M87224N59953R24313J082847R83918J056022J198228
4395B2888851J094663J108270Q23613K14938K7073k89519k18622l4683K98289
4386B5912873M41305O74774Q60836J084471J177232J200780J037976N80365P9008
4377C3049620m10495r72224r69650o23104o14053m98424j57620K00622K50483
4368B9255155N68155N88715O64099L23584k3389m55053r16791j120818r96583
$$ plain form
4433 4936207 5016068 5372882 5556679 5642854 5710943 5950694 6158162 6452403 6759529 7053006
4423 7053006 7467752 7661783 7988218 8419566 8598766 8878843 9236995 9745527 10347879 10878274
4413 10878274 11538007 12247992 12873047 13392410 14056951 14810995 15364499 15737407 15967270
4404 15967270 16190243 16596346 17083570 17643523 18567836 19650683 20634601 21690623 22888851
4395 22888851 23983514 25091784 25915397 26130335 26157408 25867889 25649267 25614584 25912873
4386 25912873 26354178 27028952 27889788 28974259 30151491 31352271 32390247 32970612 33049620
4377 33049620 32639125 31666901 30697251 30074147 29460094 28961670 28804050 29004672 29255155
4368 29255155 29823310 30412025 31076124 31399708 31376319 30921266 30004475 28883657 27887074
4359B7887074r69393p07256n79993k96543j57625j46525m8548J60444J3841o3308
4349B5092168k05204l46576n23833m77790m64317l75268l24069r9200j12506j09031
4339B2054374Q5194M5782r234j43408J06717j9488J67241L275K4565J10122l3394
4328B2391746j7814J65081K79726Q6304M0163R6484J82324K81995L9199J09601
4318B3654809J20354J99454K29475K79704k5083J1166J85800Q6312J88998Q9956
4308B5020945J35836R0095J20576J44966J05969J2744j1706M3303J05248m0057
4298B5727919j04249P9409o1560j59324n7544j2608n2284j22371j52205j06925
4288B4978258l4407O998j90675l30318j4942k6533k98959j07843j12905k21105
$$ plain form
4359 27887074 26917681 26210425 25630432 25333889 25176264 25029739 24981191 25141635 25155476 25092168
4349 25092168 24886964 24540388 24016555 23538765 23074448 22699180 22375111 22275911 22163405 22054374
4339 22054374 22139568 22185350 22176116 22032708 22139425 22119937 22287178 22290453 22315018 22425140 22391746
4328 22391746 22373932 22539013 22818739 22905043 22945206 23041690 23224014 23506009 23545208 23654809
4318 23654809 23775163 23974617 24204092 24483796 24458713 24469879 24655679 24741991 24930989 25020945
4308 25020945 25156781 25246876 25367452 25512418 25618387 25631131 25619425 25662728 25767976 25727919
4298 25727919 25623670 25703079 25641519 25482195 25424651 25412043 25359759 25237388 25085183 24978258
4288 24978258 24943851 24950849 24760174 24429856 24414914 24388381 24089422 23981579 23868674 23647569
4278B3647569j54917r7776j57854k93187k11102j48175j42267k68200q5924k53372
4268B1834795l24937k08291k51035k50095k72497j33736j18151k24365j70502
4259A9881186k85216k31992j99929k64201r8027j94828k21675j19302p8064k63914
4249A7924038k35015j31219o6738j47697j23097j33320j25185k00200j89853k7080
4239A6544634j33064j80802k14506r3796j87887j82696j51857r3014p7392k08908
4229A5020712j41896j72830p2339J3219k58426j61095k5831j52172j85648k24215
4219A3639479m5343m4280n4545k11510j16047j6089K0018l5156j43440j31988
4209A2861099j31711k28105j49142q5067m7368m3511p0745J20682k01110j47777
$$ plain form
4278 23647569 23492652 23394876 23237022 22943835 22732733 22584558 22442291 22174091 22088167 21834795
4268 21834795 21509858 21301567 21050532 20800437 20527940 20394204 20276053 20051688 19881186
4259 19881186 19595970 19363978 19164049 18899848 18801821 18606993 18385318 18266016 18187952 17924038
4249 17924038 17689023 17557804 17491066 17343369 17220272 17086952 16961767 16761567 16571714 16544634
4239 16544634 16411570 16230768 16016262 15922466 15734579 15551883 15400026 15307012 15229620 15020712
4229 15020712 14878816 14705986 14633647 14646866 14388440 14227345 14201514 14049342 13863694 13639479
4219 13639479 13594136 13549856 13495311 13283801 13167754 13151665 13171683 13136527 12993087 12861099
4209 12861099 12729388 12501283 12352141 12267074 12219706 12176195 12105450 12226132 12025022 11877245
4199A1877245j00650n5599j06461p5201o0639j13269R7221J40186n7673j10126
4189A1435034M2146j1912j1088L5562j29377K1370M0309O8213K8521J32002q1327
4178A1569453q0419J08181j98351R1173J31617M5235n6572N3011J09024N0719
4168A1823071j30245j53458J15214L3329P0755N3321K0140j7338M9087r696K6627
4157A1880807M2658n8626N9256o7489L3091m4068j46138j2664K1286J80882N2406
4146A1941401q1560J97399R5346P5383l2594J020J46644J45329J7496J55167J02576
4135A2763607J61680J00413J87366Q5766L4391P3376R2619K17673K73640J6162
4125A4006693J14305K18239P564K58707J93406J23935K09051K93453Q0442N625
$$ plain form
4199 11877245 11776595 11720996 11614535 11539334 11478695 11365426 11462647 11602833 11545160 11435034
4189 11435034 11477180 11465268 11454180 11489742 11360365 11381735 11422044 11490257 11518778 11650780 11569453
4178 11569453 11489034 11597215 11398864 11490037 11621654 11666889 11610317 11663328 11772352 11823071
4168 11823071 11692826 11539368 11654582 11687911 11758666 11811987 11832127 11814789 11863876 11854180 11880807
4157 11880807 11923465 11864839 11924095 11856606 11889697 11845629 11699491 11686827 11708113 11888995 11941401
4146 11941401 11859841 12057240 12152586 12227969 12195375 12196395 12343039 12488368 12505864 12661031 12763607
4135 12763607 12925287 13025700 13213066 13298832 13333223 13406599 13499218 13716891 13990531 14006693
4125 14006693 14120998 14339237 14346801 14605508 14798914 14922849 15131900 15425353 15505795 15511420
4115A5511420K25113K67508K01206J88424K64532J93882K47436K61016J59923
4106A7520460K68508P4732K35505K35162K53167J64028J71182K30798K36687K14060
4096A9604289L68498M52821K16853O4815L00202M03930J53023K01401M14984K69286
4086B2450102L32506L16858L31017K92190K52257J35593K38711K54191L48092
4077B4951517J44725R6608J77864K82289K38250L09926J09429J65277J65095o512
4067B6634468J78492J11547J29656J0138K69694L94290K46053K8584J6700N5391
4057B8075013J50439J28828J99352J26854Q9946J79945J86418K67563L42389K69309
4047C0016056K52593K55741L74181L57882L74640M12462N74931N89740N18979
$$ plain form
4115 15511420 15736533 16004041 16205247 16393671 16658203 16852085 17099521 17360537 17520460
4106 17520460 17788968 17863700 18099205 18334367 18587534 18751562 18922744 19153542 19390229 19604289
4096 19604289 19972787 20425608 20642461 20707276 21007478 21411408 21564431 21765832 22180816 22450102
4086 22450102 22782608 23099466 23430483 23722673 23974930 24110523 24349234 24603425 24951517
4077 24951517 25096242 25192850 25370714 25653003 25891253 26201179 26310608 26475885 26640980 26634468
4067 26634468 26812960 26924507 27054163 27064301 27333995 27728285 27974338 28002922 28019622 28075013
4057 28075013 28225452 28354280 28553632 28680486 28770432 28950377 29136795 29404358 29746747 30016056
4047 30016056 30268649 30524390 30898571 31256453 31631093 32043555 32618486 33208226 33727205
4038C3727205N84205O10290Q42282J048871Q46251J055046J102602J269107J310616
4029D2396475J500654J523435J590387J759806K081509K108823K424323K667083
4021E8052495K791065L250742L402400L554104L516327L334611K740423K343691
4013H2985858J566244Q25878L88250l62332r00462j088768j193263j144269p41282
4004H0335854m83342k98668k34232j60222l86729p82671j128711j395296k091954
3995G3374029k756006k985003l501571l616537l752319l647081l618744l432912
3987D6063856k853080k711718k569660k112911j893127j640235j681747j553583
3979B9047795j204301j276001j325913j091163j020093r02148p06355o57402p19127
$$ plain form
4038 33727205 34311410 34921700 35763982 36812853 37659104 38714150 39816752 41085859 42396475
4029 42396475 43897129 45420564 47010951 48770757 50852266 52961089 55385412 58052495
4021 58052495 60843560 64094302 67496702 71050806 74567133 77901744 80642167 82985858
4013 82985858 84552102 85377980 85766230 85403898 84503436 83414668 82221405 81077136 80335854
4004 80335854 79852512 79553844 79319612 79159390 78772661 77989990 76861279 75465983 73374029
3995 73374029 70618023 67633020 64131449 60514912 56762593 53115512 49496768 46063856
3987 46063856 43210776 40499058 37929398 35816487 33923360 32283125 30601378 29047795
3979 29047795 27843494 26567493 25241580 24150417 23130324 22228176 21521821 20864419 20145292
3970B0145292o64769o43926n14021n85522m67171l46777k23824l71994m69054
3961A5858234j94367k51255l51394n60378l21261j91135k40105k88130k66827
3952A3193382R353k37342k55656r2851j17366j31010j43111o3089q9301k44947
3942A1828062j30488j74331n8402j68564j55328k4757m3335l15456k85556M596
3932A0476441k39021J5162K6023k33075j26842q6704j18437M6301K6339j69295
3922I616892j52703K6340J29829L032q2422p2585l3580J35695Q3836M7786N0311
3911I752431L7769M3396K29200J55006j2375l2839K12708M9240j4511J39380P1015
3900A0630420O9439J02679M2219L2703M3826K15872K05794R9613J08797K66609
$$ plain form
3970 20145292 19480523 18836597 18322576 17737054 17269883 16923106 16699282 16327288 15858234
3961 15858234 15663867 15412612 15061218 14500840 14179579 13988444 13748339 13460209 13193382
3952 13193382 13202735 12965393 12709737 12616886 12499520 12368510 12225399 12162310 12073009 11828062
3942 11828062 11697574 11523243 11464841 11296277 11140949 11116192 11072857 10757401 10471845 10476441
3932 10476441 10237420 10252582 10278605 10045530 9918688 9831984 9713547 9759848 9786187 9616892
3922 9616892 9464189 9490529 9620358 9623390 9540968 9468383 9434803 9570498 9654334 9702120 9752431
3911 9752431 9790200 9833596 10062796 10217802 10205427 10172588 10385296 10434536 10420025 10559405 10630420
3900 10630420 10699859 10802538 10844757 10877460 10921286 11137158 11342952 11442565 11551362 11817971
3890A1817971K40781O8790K09220J95004K91317J82090K77480J96269K88747J98549
3880A3966218J04497J46913L53123L83475L33054M14206O30886O10047L19217
3871A7261636O93765P98371Q44592P32044R87475J043965Q42501R74989J170142
3862B5349480R49870R76106P34988N76146N57879J96014k717q7888K920k17898
3852B9034900j97917k13226j83131j26607k35307m8111j73562R7479j0142N3489
3842B7997865K25536J17528J76937L12043M00802L52507K86552M79218P00068
3833C1049056N34363N34687P65478Q04989R81139J097998J238562J261735J465563
3824C9733570J889867K063208K510374K598156L139289L503881L992704M763930
$$ plain form
3890 11817971 12058752 12127542 12336762 12531766 12823083 13005173 13282653 13478922 13767669 13966218
3880 13966218 14070715 14217628 14570751 14954226 15287280 15701486 16332372 16942419 17261636
3871 17261636 17955401 18753772 19598364 20330408 21317883 22361848 23204349 24179338 25349480
3862 25349480 26299350 27275456 28010444 28586590 29144469 29340483 29337766 29249878 29252798 29034900
3852 29034900 28836983 28623757 28440626 28314019 28078712 28030601 27857039 27954518 27944376 27997865
3842 27997865 28223401 28340929 28517866 28829909 29230711 29583218 29869770 30348988 31049056
3833 31049056 31583419 32118106 32883584 33688573 34669712 35767710 37006272 38268007 39733570
3824 39733570 41623437 43686645 46197019 48795175 51934464 55438345 59431049 64194979
3816F4194979N278260N862485O313712O594759O664492O436198N825064N361871
3808A12531820M651233L622081K988353K429842J404929N76791q3351r74765j080653
3799A26066280j745344k173487k350108k589618k620009k717367k999309l365708
3791A05505330l750359l958214m330873m796285n072716n040250m910298n044620
3783F8601715m888111m317678m291474l928704l595590l383596k959457k618638
3775C8618467k407501k138319j899240j911619j657726j486949j271809j056576
3767B4788728j078265j184394q56822p22080p88296o17567n18505l96873n05479
3758A8120447l94301k72097m09685j63575r4707L23r7626J25898J72178J96088
$$ plain form
3816 64194979 69473239 75335724 81649436 88244195 94908687 101344885 107169949 112531820
3808 112531820 117183053 120805134 123793487 126223329 127628258 128205049 128121698 127146933 126066280
3799 126066280 124320936 122147449 119797341 117207723 114587714 111870347 108871038 105505330
3791 105505330 101754971 97796757 93465884 88669599 83596883 78556633 73646335 68601715
3783 68601715 63713604 59395926 55104452 51175748 47580158 44196562 41237105 38618467
3775 38618467 36210966 34072647 32173407 30261788 28604062 27117113 25845304 24788728
3767 24788728 23710463 22526069 21669247 20947167 20158871 19541304 19022799 18625926 18120447
3758 18120447 17726146 17454049 17044364 16880789 16786082 16786405 16688779 16814677 16986855 17182943
3748A7182943L11440J68396J03720L67571K73001J75262K20030J18515j00617
3739A8820261k25433j72678m26876m32543m66914n48672o15575n36066n40789
3730A4854715o81074o72566n05517n91018n93291n11382m67935m02169k98527
3721A0131236l16881l01116k14070l31724k47306k03434j32399k92906k25767
3712G865633q8189n9292K670j18069j20413q4332k84994j42528p5889R4812l2273
3701F957136l9449k6774r2376q1194j88911j60994p4138l500k8248o2461Q111
3690F207202o860m3548o0422m0144l4290j71613o8442p9317j01855j24380Q2460
3679E558791J7540l9638r4477R1699K0004j06799j33434l3643o340K5891J16208
$$ plain form
3748 17182943 17494383 17662779 17766499 18134070 18407071 18582333 18802363 18920878 18820261
3739 18820261 18594828 18422150 17995274 17562731 17095817 16547145 15931570 15395504 14854715
3730 14854715 14173641 13501075 12995558 12404540 11811249 11299867 10831932 10429763 10131236
3721 10131236 9814355 9513239 9299169 8967445 8720139 8516705 8384306 8091400 7865633
3712 7865633 7777444 7718152 7720822 7602753 7482340 7398008 7113014 6970486 6894597 6989409 6957136
3701 6957136 6917687 6890913 6798537 6717343 6528432 6367438 6293300 6289800 6261552 6199091 6207202
3690 6207202 6200342 6156794 6096372 6056228 6021938 5850325 5781883 5702566 5600711 5476331 5558791
3679 5558791 5576331 5536693 5442216 5533915 5553919 5447120 5313686 5280043 5273703 5299594 5415802
3668E415802O468m1060q5941O5832o0954N1679n4157l2608J37124N75K6706P696
3656E437162k9422m1864M0264J27974J459L9219O0347K9756K4036J25539L17305
3645F131775Q9297l9547K53622R703P713K12347J68869L27954J45940J13432L32033
3634G753138K36851L46594M32426L75284L70718K21084M06921N28849L06637M14621
3624A1393123K68595K65497J56618J77694J08810O9292K63982J76355O9845L29456
3614A3279267K75784K02598L28524J59984K75826J22960m6263m7069R0059R0617
3604A4732287K3825j7021J62997J9387R8984J36506L13486L34464K45078N57528
3594A6607521L90708L62439O56762P64568Q07680Q42782Q33345J040308J203967
$$ plain form
3668 5415802 5422270 5381210 5295269 5361101 5300147 5351826 5297669 5265061 5402185 5402760 5429466 5437162
3656 5437162 5407740 5365876 5406140 5534114 5535573 5574792 5635139 5664895 5688931 5814470 6131775
3645 6131775 6221072 6181525 6435147 6444850 6452563 6664910 6833779 7161733 7307673 7421105 7753138
3634 7753138 7989989 8336583 8769009 9144293 9515011 9736095 10143016 10671865 10978502 11393123
3624 11393123 11661718 11927215 12083833 12261527 12370337 12439629 12703611 12879966 12949811 13279267
3614 13279267 13555051 13757649 14086173 14246157 14521983 14644943 14598680 14551611 14641670 14732287
3604 14732287 14756112 14739091 14902088 14921475 15020459 15156965 15470451 15804915 16049993 16607521
3594 16607521 16998229 17360668 18017430 18781998 19589678 20432460 21265805 22306113 23510080
3585B3510080J358540J639836J650924J772780K012291K286428K511683K859933
3577C9602495L189211L565614M007571M471537M771305N106450N670969N703223
3569G6088375N896877N950683N444462N134463M843241M400708L827328L639554
3561A15225691L328071L195860K667526K504661K083987J694391J439975P12292
3553A32852454n3696o97179j220860j951445k679833k962643l113923l563629
3545A16609246l813509m047127m340072m591899m890343n139290n173869n170357
3537G9442780n113290m989368m686448m583569m158648l752425l234042k905807
3529D6019183k562969k394004j988410j649772j644088j324657j310831j129573
$$ plain form
3585 23510080 24868620 26508456 28159380 29932160 31944451 34230879 36742562 39602495
3577 39602495 42791706 46357320 50364891 54836428 59607733 64714183 70385152 76088375
3569 76088375 81985252 87935935 93380397 98514860 103358101 107758809 111586137 115225691
3561 115225691 118553762 121749622 124417148 126921809 129005796 130700187 132140162 132852454
3553 132852454 132798758 132101579 130880719 128929274 126249441 123286798 120172875 116609246
3545 116609246 112795737 108748610 104408538 99816639 94926296 89787006 84613137 79442780
3537 79442780 74329490 69340122 64653674 60070105 55911457 52159032 48924990 46019183
3529 46019183 43456214 41062210 39073800 37424028 35779940 34455283 33144452 32014879
3521C2014879q36953q88383o88790o67381n63682n67272l60996k74113k52560
3512B6914749l03904m84035k10930k26729k69930j03576j59412j30149j59523
3503B4866561k49847j24569j01832L440p6329k28417l10902k88549k25775k21991
3493B3041790m0413k68780j95079m9033j01120n24399p44901o73870n77757n63287
3483A9303151m64137n12817l28997l34785l74703m32939l59387r3388j80430r0873
3473A6130695k23525L9880J00354r476J5456J44101K77967J83700K93336M86457
3463A7438945M67133M97754N02280J13489k22299k0328j60098J73407J54928M4520
3453A8989731J25576J40177l6550j72941j0271j14919j0156p4342k05371k30433
$$ plain form
3521 32014879 31177926 30289543 29600753 28933372 28369690 27802418 27441422 27167309 26914749
3512 26914749 26610845 26126810 25915880 25689151 25419221 25315645 25156233 25026084 24866561
3503 24866561 24616714 24492145 24390313 24393753 24317424 24089007 23778105 23489556 23263781 23041790
3493 23041790 23001377 22732597 22537518 22488485 22387365 21862966 21118065 20444195 19866438 19303151
3483 19303151 18839014 18326197 17997200 17662415 17287712 16854773 16495386 16401998 16221568 16130695
3473 16130695 15907170 15947050 16047404 16037928 16053384 16197485 16475452 16659152 16952488 17438945
3463 17438945 17906078 18403832 18906112 19019601 18797302 18776974 18616876 18790283 18945211 18989731
3453 18989731 19115307 19255484 19218934 19045993 19035722 18920803 18910647 18836305 18630934 18400501
3443A8400501p6447r8875n7992M8161J0478K769J05705J46474K5949K73001K56397
3432A9036121K00255K51262K79363N89789N46259L70961O18679P14240J062317
3423B3669246J093511J157892J411869J597456J764193K156196K316455K259796
3415C7426614K562042K726073L310936L625616L921903M332019M848597N449341
3407F8203141N448201N295149N039376M520261L695412K780851J740365K30950
3399I6953706j077419k308591l514431m589593n244683n423259n473011n303478
3391F4019241n059545m351464m036764l579013l174749k873192k494599k212592
3383C6237323j703826j664315j601280j366978j225035j088210j050968p68435
$$ plain form
3443 18400501 18324054 18225179 18167187 18215348 18225826 18228595 18334300 18480774 18506723 18779724 19036121
3432 19036121 19236376 19487638 19767001 20356790 20903049 21274010 21892689 22606929 23669246
3423 23669246 24762757 25920649 27332518 28929974 30694167 32850363 35166818 37426614
3415 37426614 39988656 42714729 46025665 49651281 53573184 57905203 62753800 68203141
3407 68203141 73651342 78946491 83985867 88506128 92201540 94982391 96722756 96953706
3399 96953706 95876287 93567696 90053265 85463672 80218989 74795730 69322719 64019241
3391 64019241 58959696 54608232 50571468 46992455 43817706 40944514 38449915 36237323
3383 36237323 34533497 32869182 31267902 29900924 28675889 27587679 26536711 25768276
3375B5768276p98735q32415o58140l84990m39324o15697q12182q27684n40586
3366A9858523p35638n52867o92472n04732m85378o68310m53800n14218m92183
3357A4758925n34762n52182m57842m09958l35736m11851l02957k82541j42076
3348A1329020j65871j88279r1740o2137j8889j48648j42597k79000m21997l89655
3338I420207k68657k93067k53771j51804k69283k69382l35578k44216k65595N5465
3328G124319j67638j60036n2346j21154j77624k07981M160n6343q2259j39429
3318E963669j54681j80814q6141k7908O9734P734k5312j35946N6359N322o6783
3307E425233n6072k079k45844j68838L5539j13228k20306p8901l6503q4998N2688
$$ plain form
3375 25768276 24969541 24137126 23478986 23093996 22654672 22038975 21226793 20399109 19858523
3366 19858523 19122885 18570018 17877546 17372814 16887436 16219126 15765326 15251108 14758925
3357 14758925 14224163 13671981 13214139 12804181 12468445 12056594 11753637 11471096 11329020
3348 11329020 11163149 10974870 10883130 10820993 10802104 10653456 10510859 10231859 9809862 9420207
3338 9420207 9151550 8858483 8604712 8452908 8183625 7914243 7578665 7334449 7068854 7124319
3328 7124319 6956681 6796645 6744299 6623145 6445521 6237540 6241700 6185357 6103098 5963669
3318 5963669 5808988 5628174 5542033 5514125 5583859 5591593 5566281 5430335 5486694 5492016 5425233
3307 5425233 5369161 5367082 5121238 4952400 4987939 4874711 4654405 4575504 4539001 4454003 4506691
3296D506691o5056p6972m8709J20176Q263j00204j28839l2103J2556J3524J06067
3285D315394m4199n2933J2413L8719n5889j1670q8180J84883M841p0725J0054
3274D242708o6941n2361l3548J13464j45548n5231o862K07813R1399j48009O7137
3263D214021j31094O866Q1004j10322Q030L913k4793m6416J6682K45496l605j96692
3251D063090q1307k4292J9839K17571N5280m6337K1636P3259J01887j32878j7305
3240D250443Q5208j21864M928l5519J72941J00420j16262l2260Q2805J52852M0089
3229D583781J53797m2129k9858j02163J05151J04995K38355J24820m4924Q9287
3219E181112J03153J71901O2059J85116R0966L7389O9176m4906R1217J19007J75437
$$ plain form
3296 4506691 4441635 4364663 4315954 4436130 4444393 4344189 4215350 4183247 4195803 4209327 4315394
3285 4315394 4271195 4218262 4230675 4269394 4213505 4201835 4113655 4298538 4303379 4232654 4242708
3274 4242708 4175767 4123406 4089858 4203322 4057774 4002543 3995681 4203494 4294893 4146884 4214021
3263 4214021 4082927 4089793 4170797 4060475 4068505 4072418 4047625 4001209 4017891 4263387 4259782 4063090
3251 4063090 3981783 3957491 3977330 4194901 4250181 4203844 4225480 4298739 4400626 4267748 4250443
3240 4250443 4335651 4213787 4218715 4183196 4356137 4456557 4340295 4308035 4390840 4543692 4583781
3229 4583781 4737578 4695449 4665591 4563428 4668579 4773574 5011929 5136749 5091825 5181112
3219 5181112 5284265 5456166 5518225 5703341 5794307 5831696 5900872 5855966 5947183 6066190 6241627
3208F241627J37387L02748J95945j32662O5184J53275O8566J67397K12178L07957
3198G719602K37555K48330K71793K58749K76800K95786K76555L53412L62765K75749
3188A0577096L32493M79672N17989N59297O25995O48656O22343Q79722R58756
3179A6202019R35705R62383J139007J150010R72406P46530N03588L06771N06032
3170B3424451P62675R08798R51334J222549J323138J434476J591245J664907J863273
3161C5146846J836528K282014K498936K920463L373001L762297M079662M664522
3153F0564269N204283N967634O492499P302292Q156189Q881028R913262J0401537
3145A22882993J1324072J2766661J4627178J7600259K1717969K6671138L1238309
$$ plain form
3208 6241627 6379014 6681762 6877707 6745045 6810229 6963504 7032070 7199467 7411645 7719602
3198 7719602 7957157 8205487 8477280 8736029 9012829 9308615 9585170 9938582 10301347 10577096
3188 10577096 10909589 11389261 11907250 12466547 13092542 13741198 14363541 15243263 16202019
3179 16202019 17137724 18100107 19239114 20389124 21361530 22108060 22611648 22918419 23424451
3170 23424451 24187126 25095924 26047258 27269807 28592945 30027421 31618666 33283573 35146846
3161 35146846 36983374 39265388 41764324 44684787 48057788 51820085 55899747 60564269
3153 60564269 65768552 71736186 78228685 85530977 93687166 102568194 112481456 122882993
3145 122882993 134207065 146973726 161600904 179201163 200919132 227590270 258828579
3138B58828579L5223102L8303199L6097392K0204183q721526l4461338m4213488
3131C01260103m1965506l4847281k7807469k1750459j6997724j3657710j1377297
3124A32856657r771731q716298q077557p544216o836564o082392n247646m459715
3116G6120538l958788l364140k791441k385320k023365j698005j610955j135631
3108E7152893j101334r37584q22429p72028n24295n62254o42976m61930p77320
3099E0550743j084104r41673p08692m03232R1970M04317P18772Q95280R77840
3090E0501221J370889J406302J097582M37828k23370j112421k056485k713040
3082D8708506k900853k915059k744109k497164k270594j863704j764582j656689
$$ plain form
3138 258828579 294051681 332354880 368452272 388656455 379934929 345473591 301260103
3131 301260103 259294597 224447316 196639847 174889388 157891664 144233954 132856657
3124 132856657 123084926 114368628 106291071 98746855 91910291 85827899 80580253 76120538
3116 76120538 72161750 68797610 66006169 63620849 61597484 59899479 58288524 57152893
3108 57152893 56051559 55113975 54291546 53519518 52995223 52432969 51789993 51328063 50550743
3099 50550743 49466639 48524966 47816274 47413042 47505012 47909329 48628101 49523381 50501221
3090 50501221 51872110 53278412 54375994 54813822 54590452 53478031 51421546 48708506
3082 48708506 45807653 42892594 40148485 37651321 35380727 33517023 31752441 30095752
3074C0095752j521379j228503j139953j038102q58850r58186j082834q47226r32592
3065B0488127j200156j058559q37952p31285o70179m94687n92753n35668n00817
3056A3866071n62601l54457m53822l66859n22860l94637k26892k48777l80858
3047A0354308l92042l47357k13415j90113k21684j81211k68345j51306k93453
3038H095382k81290j20343k43999k60379n1756o9383j86237j18884j45536j42652
3028F474923j27034k09526j74613m6587j72513k0661j6065k5872j56363j81181
3018E344508j37656p829o0173n5280j14726m1554j3729r8235J18251j47651n1045
3007D734881j42231p8933j82959n2255j17928m9287N5240N382j21843j12881p9954
$$ plain form
3074 30095752 28574373 27345870 26205917 25167815 24308965 23350779 22267945 21420719 20488127
3065 20488127 19287971 18229412 17391460 16660175 15989996 15495309 14902556 14366888 13866071
3056 13866071 13303470 12949013 12495191 12128332 11605472 11210835 10983943 10735166 10354308
3047 10354308 9962266 9614909 9401494 9211381 8989697 8808486 8540141 8388835 8095382
3038 8095382 7814092 7693749 7449750 7189371 7137615 7068232 6881995 6763111 6617575 6474923
3028 6474923 6347889 6138363 5963750 5917163 5744650 5723989 5707924 5682052 5525689 5344508
3018 5344508 5206852 5199023 5138850 5083570 4968844 4927290 4913561 4815326 4933577 4785926 4734881
3007 4734881 4592650 4513717 4330758 4278503 4160575 4111288 4166528 4171910 4050067 3937186 3857232
2996C857232k5851q8250j8163j0196j85421o3144j37606j23351q8212o9123P28
2985C048643j5917P5396K5221j18462m1605j66801l7659l8625j57718j2206L1428
2974B591695k6303l7638L01M200j3305K8210k16599k4424J3231k13221j25416
2963A980731J4721k24532J43346L5479k11879J13402q5401j4295J1485k4223J30770
2952A869604p4139q6363L0972M292q6750n6506q908n8599k6375N9809L9028l5005
2940A571060l26n0800Q2123j32216o7116L901N3882L2819R9651j13178l0972j67381
2928A281447j8382J12161n8683p3183Q3027q1375L4011k6740k9417K8117j5456
2917A235527j26304k682M0149M8632R4578j99218j4932K8119K1286N6667n8168
$$ plain form
2996 3857232 3831381 3743131 3724968 3714772 3529351 3466207 3328601 3205250 3117038 3047915 3048643
2985 3048643 3032726 3108122 3133343 3014881 2973276 2806475 2768816 2730191 2572473 2560267 2591695
2974 2591695 2565392 2527754 2528055 2532255 2518950 2547160 2330561 2306137 2319368 2106147 1980731
2963 1980731 1995452 1770920 1914266 1949745 1737866 1851268 1765867 1751572 1763057 1738834 1869604
2952 1869604 1795465 1709102 1740074 1744366 1657616 1601110 1592202 1533603 1507228 1567037 1606065 1571060
2940 1571060 1570734 1519934 1602057 1469841 1402725 1406626 1460508 1493327 1592978 1479800 1448828 1281447
2928 1281447 1263065 1375226 1316543 1243360 1326387 1245012 1279023 1252283 1222866 1250983 1235527
2917 1235527 1109223 1106541 1146690 1195322 1289900 1090682 1075750 1103869 1125155 1181822 1123654
2906A123654O8229N6239k57785M5807r297J24693q9297M0686Q3086J9618o827
2895A198806k1404j10706j55847m0062M6273o2154J77062J04111L9316j39597
2885A035798j6946k7831l2760K0431P0445K0625l3495N9589K5545k450j16893
2874A002058Q9750k2686R6459q7943L548O6275q4771l5578P6978M4081r306L4554
2862A173419J05463R709J36136K963J79020j8309m6056J15894K21014K88479J94114
2851B361846J0075L8195Q107n4383j11266k15693j88460j49791j78173m4264j89829
2840A286364r7001m1793n4597O7000j16110j8950J41111j6156j49599p8759K6248
2829I47758P3856j68801N0369L3223O9499k9462M139j21171j3936k8013O5299
$$ plain form
2906 1123654 1191883 1248122 990337 1036144 1026847 1151540 1062243 1102929 1186015 1205633 1198806
2895 1198806 1177402 1066696 910849 870787 917060 854906 1031968 1136079 1175395 1035798
2885 1035798 1018852 991021 958261 978692 1049137 1069762 1036267 1095856 1121401 1118951 1002058
2874 1002058 1091808 1069122 1165581 1077638 1081186 1147461 1062690 1027112 1104090 1148171 1138865 1173419
2862 1173419 1278882 1288591 1424727 1427690 1606710 1588401 1542345 1658239 1879253 2167732 2361846
2851 2361846 2371921 2410116 2418223 2363840 2252574 2036881 1848421 1698630 1520457 1476193 1286364
2840 1286364 1189363 1147570 1092973 1159973 1043863 1024913 1166024 1149868 1000269 921510 947758
2829 947758 1021614 852813 903182 936405 1005904 976442 980581 859410 845474 817461 882760
2818H82760n4958n396k2983r2628j1003K3756m5279o9047J23965k4501m6799r1223
2806E66664p5628P9856Q1604p8710M8486J26701l3606j8194n3778j07820Q1912
2795F17487j0910q8797J09771j11114k0489M3058O231j07100M2381j4805M9358
2784E15071j63819j0281J06385Q3026q7564r7714L0276P3532J64051j04138l578
2773E05247j54544o5758L3004N6822l3330J365M4066n052l3241m3203J5391N8924
2761C79691p7482j06002j10552n1733J36977J63217j7482J16285j06512j7830
2751C08577L7419p8376l145r0864K206n1982R6421O3019p1644l0579j53887J2826
2739C9991N5965L31503l5180p1610P8024j27632L2964Q5090l6895r3206m5851
$$ plain form
2818 882760 827802 822406 799423 706795 695792 719548 674269 605222 729187 704686 657887 566664
2806 566664 491036 570892 652496 573786 622272 748973 715367 697173 643395 535575 617487
2795 617487 606577 517780 627551 516437 495948 539006 545237 438137 480518 465713 515071
2784 515071 351252 340971 447356 530382 442818 345104 375380 448912 612963 508825 505247
2773 505247 350703 284945 317949 374771 341441 342806 386872 381820 348579 305376 320767 379691
2761 379691 302209 196207 85655 33922 170899 334116 316634 432919 326407 308577
2751 308577 345996 267620 264475 173611 175817 123835 220256 283275 211631 181052 27165 39991
2739 39991 95956 427459 392279 320669 398693 271061 304025 389115 352220 259014 213163
2728B13163K87122M6676q1077q4031Q4399K5337j48439r8427l097O4357k9420
2717B76563J82540o4915j11543j80041p6014J56356O7219O7729j17055p2070K9209
2706A57978M8808k2947j50354R0268J30095J4357j1219k8305L012R6314j07115
2695B20892q9311q5575m1176j8625R7129J02075l0838p9697r6059R6887n896J10505
2683A80311q3775j3938M8292M7587r4187N2894Q1446j07975m7223L9104P4666
2672A77202k427j3237L76O6150p6824K373M5359n0445k2559J23212J8121j37741
2660A29560O6490K5683N274o9259L5351j07394n7835O9608L6887P5164j50127
2649E9402J09537k10735J5700J31174J37305m2192K4966n0116J1187m6819O097
$$ plain form
2728 213163 500285 546961 465884 381853 466252 491589 343150 244723 241626 305983 276563
2717 276563 459103 394188 282645 102604 26590 182946 250165 317894 200839 128769 157978
2706 157978 206786 183839 33485 123753 253848 268205 256986 228681 231693 328007 220892
2695 220892 131581 46006 4830 -13795 83334 185409 154571 74874 -21185 75702 69806 180311
2683 180311 96536 82598 130890 178477 84290 137184 218630 110655 63432 102536 177202
2672 177202 174775 161538 161914 228064 151240 153613 198972 148527 125968 249180 267301 129560
2660 129560 196050 221733 227007 157748 193099 85705 27870 97478 134365 209529 59402
2649 59402 168939 -41796 -26096 105078 242383 200191 225157 175041 186228 139409 145506
2638A45506L4179M0855L4979P582q4704Q1680o0508j01577j3591q2930p1824l5447
2626a05800n0200J08499P2723k11137Q2264J70600M3051J222l743j1804o6052
2615B9623P0382O1576j8432o1002j08861J39191j10140o16o0487J40002J09280
2604A90516o7670J4598j32207n575R3334m3290r850n486Q5159O5317q5609k6060
2592G3177j83466o3155K24991J29409k20117K5184M4300J82776J1288k04635K6783
2581D6535j6834Q9837l7421J32290j29389j7297Q6770p076R9322J0706J5997Q1020
2569C54460L6186N9776j29038L9043p8575j02701N7550j62056r8551O9584Q3960
2558A29638J011q369J06694m7257L4067j46313N3040k0013j624L5163Q3735J149
$$ plain form
2638 145506 179685 220540 255519 263101 178397 260077 199569 97992 84401 1471 -70353 -105800
2626 -105800 -156000 -47501 25222 -185915 -103651 66949 110000 111222 107479 95675 29623
2615 29623 100005 161581 143149 82147 -26714 112477 2337 1721 -58766 81236 190516
2604 190516 122846 137444 5237 -338 92996 49706 39856 34370 119529 184846 99237 73177
2592 73177 -110289 -173444 51547 180956 -39161 -13977 30323 213099 224387 19752 46535
2581 46535 29701 119538 82117 214407 85018 67721 154491 147415 246737 257443 273440 354460
2569 354460 390646 450422 321384 360427 281852 179151 236701 74645 -23906 45678 129638
2558 129638 130649 122280 228974 181717 215784 69471 122511 102498 100874 136037 219772 220921
2546B20921p9231N7054n1151J39732j80173r2100M0134n760P9138o4425p3907
2535i768N276M3804J71075o9768j19175k4096k2443m38k4805J19665q3526m4129
2523e8328J18467p8730J71613J3907o4550J0847m9087m3367k1692j33220N5038
2512g9102R8456m9963M0018n961j4202L7977j3627n280J64811k5040j34129K2825
2500C6783j0644L0313l4400N514J13027m4126n8076K6527j4944q660m8122J37509
2488A30701k117j15041L6262j01760N1129J40527p1631J22775P2084n3750L7088
2477B46267p9930j38592j53543k5236J94434P5702j5461k6269K7791m5376L2413
2466I2200O360M418Q6617r864j19586q3614J14555J2004o0003Q6815M3168p4724
$$ plain form
2546 220921 141690 198744 147593 287325 107152 15052 55186 49426 128564 64139 -9768
2535 -9768 -4492 39312 210387 140619 21444 -2652 -25095 -25533 -50338 69327 -14199 -58328
2523 -58328 60139 -18591 153022 166929 102379 113226 64139 20772 -920 -134140 -79102
2512 -79102 19354 -30609 9409 3448 -10754 27223 13596 8316 173127 148087 13958 36783
2500 36783 26139 56452 22052 27566 140593 96467 38391 64918 49974 41314 -6808 130701
2488 130701 128584 13543 49805 -51955 -826 139701 68070 190845 262929 209179 246267
2477 246267 166337 27745 -125798 -151034 43400 119102 103641 77372 105163 59787 92200
2466 92200 98560 102978 189595 179731 60145 -23469 91086 103090 43087 129902 173070 98346
2454I8346R4172J3627p8734p0529q1605L4282P1352J2220N1966k3819m5501p9480
2442c703P9965J3933N2346N9737p0661O587O9248o3321o5147j04718r5092J30194
2430I368J1195n0807R4900J24085n3784j23002K7105O4179L6452Q2597M1967r8959
2418A65296P9980L3311p0499R4337j05072j11752J61892l0155q7436n4957N5813
2407A30758N594L014j1317p4947j1745o665L7643N918J02797M9248K00283n9267
2395C71314o7775M6000R3995j09798l1187j52834r6286J42999K7913J42845n0235
2384C16951j39881J38420O5859O1754l6175N1911O2641j00681j00245l5667K07771
2373D92658k4121p9615J41957P4427r8083j43542Q3173r8724n4988P1138L1862
$$ plain form
2454 98346 192518 206145 127411 56882 -24723 9559 80911 93131 145097 121278 75777 -3703
2442 -3703 76262 90195 142541 202278 131617 138204 207452 144131 78984 -25734 -120826 9368
2430 9368 20563 -30244 64656 188741 134957 11955 39060 103239 139691 222288 264255 165296
2418 165296 245276 278587 208088 302425 197353 85601 247493 217338 129902 74945 130758
2407 130758 136352 139366 128049 53102 41357 34692 72335 78253 181050 230298 430581 371314
2395 371314 303539 349539 443534 333736 302549 149715 53429 196428 224341 367186 316951
2384 316951 177070 315490 381349 443103 406928 458839 521480 420799 320554 284887 492658
2373 492658 468537 388922 530879 605306 507223 363681 446854 348130 293142 364280 396142
2362C96142J0029O8107J61102q7892L7161P6146r999l5220q7048K00422J35143
2351H64093n4431n4842l6026k572P4890L1601N2700p8790K0304K03422J84322
2340A204671O5762o0189Q3375M6516J17074K20163J72176J3900J50458P6468J72104
2329B262478K4126K20544J68392J03007R9794K78719K59666M04141J73616M34158
2319D428641M93559M72961M66642O56672P97766Q17067O80175O01154O71731Q59375
2309A0945743J021967J237614J487621J688373K265019L296451L819834L999248
2301B9761870N107108Q631534O219876n134934r338597p186559n108909l484178
2293A9467211k567063k087488j638349j180035q62270q01791q25633n88824l30467
$$ plain form
2362 396142 406171 474278 635380 547488 584649 660795 650796 615576 528528 728950 864093
2351 864093 809662 754820 718794 716222 791112 822713 875413 796623 816927 1020349 1204671
2340 1204671 1270433 1210244 1293619 1340135 1457209 1677372 1849548 1863448 2013906 2090374 2262478
2329 2262478 2286604 2507148 2675540 2778547 2878341 3157060 3416726 3820867 3994483 4428641
2319 4428641 4922200 5395161 5861803 6518475 7316241 8133308 8813483 9414637 10086368 10945743
2309 10945743 11967710 13205324 14692945 16381318 18646337 21942788 25762622 29761870
2301 29761870 34868978 43500512 49720388 44585454 35246857 28060298 22951389 19467211
2293 19467211 16900148 14812660 13174311 11994276 11132006 10330215 9504582 8915758 8585291
2284H585291m79966o38864p66528o03040m10050k79322l63287m41876l61920k38945
2274D001493j53358j00966k84344k78273p6464j43898k22730o0797r7444j69928
2264B413291j01176j25564j67525p9500k7719j12927n6916q894j6360n3477j62431
2253A500802p7109n4266p7899J07553j3252q6993q2226K5389m5330j28824j19189
2242I48656n6319P0967n0463j42947Q1855J42417l308J9935k19639q2550j957
2231G06647J9190o2616J2002n3360O2151k7048K7704o3679n5697O9283J6781l4450
2219F16908j0017K4643j6890N7401m4323j88716K3789O7537o8930m3682j9558
2208C98162K1986M5048K6514j24822Q377l6534k0746n8704Q0189J5343P9141n6140
$$ plain form
2284 8585291 8105325 7466461 6699933 6096893 5686843 5407521 5044234 4602358 4240438 4001493
2274 4001493 3848135 3747169 3462825 3184552 3108088 2964190 2741460 2680663 2583219 2413291
2264 2413291 2312115 2186551 2019026 1939526 1911807 1798880 1741964 1733070 1716710 1663233 1500802
2253 1500802 1423693 1369427 1291528 1399081 1385829 1298836 1216610 1241999 1196669 1067845 948656
2242 948656 892337 963304 912841 769894 851749 994166 990858 1010793 791154 708604 706647
2231 706647 725837 663221 675223 621863 684014 656966 684670 620991 565294 634577 651358 616908
2219 616908 606891 631534 614644 672045 627722 439006 462795 530332 461402 417720 398162
2208 398162 420148 465196 491710 366888 375265 338731 317985 259281 339470 354813 433954 377814
2196C77814k2050j953J25918k15691l7485M3622O3609q2176k09023L610O2535
2185A08730J02917P7827N8486o9693J2615J10517j1869j09522o2071L3284N5941
2174C07162j00519R1806J73307m5118r3970l6701J30438Q0215l2363j23384O1038
2163D11911k3161j09439n5933l2911N5286Q7979K4127p0999q2114K1483R2751
2152C18980j98568m1788j325J51903k345M7972n5601l2952j4147N0692n1406k0734
2140A50681J40481k02657n223j7962L797M7694j32758l5741J21725P4359m1824
2129A02572K7196P9616j60999L4399j9094n1576P6327M4294M960N6625j65850
2118B8470O726K16903p0041J7257J0946l5405J4963m9943r8574Q6974j01468J119
$$ plain form
2196 377814 355764 353811 479729 264038 226553 270175 333784 251608 42585 46195 108730
2185 108730 211647 289474 347960 278267 290882 401399 389530 280008 217937 251221 307162
2174 307162 206643 298449 471756 426638 332668 295967 426405 506620 474257 350873 411911
2163 411911 388750 279311 223378 190467 245753 333732 357859 286860 204746 226229 318980
2152 318980 120412 78624 77299 229202 226857 274829 219228 186276 172129 222821 171415 150681
2140 150681 291162 88505 83282 65320 69117 116811 -15947 -51688 70037 144396 102572
2129 102572 129768 209384 48385 82784 63690 12114 88441 132735 137695 194320 28470
2118 28470 35196 252099 182058 199315 210261 174856 189819 139876 41302 128276 26808 27927
2106B7927l0724R206P1675J5167o5025Q7461J400M568p2036q4129o8198L3730
2094f8978Q822o961J50023J46191M4623n1910r4670L2277L0577j02556O7975n4123
2082A01290l6389n1721Q402K8966J47385j01532J05035j09081N3257j07672P4502
2071A12442R4308n1532p0324J310J31712O6414j24984j82400P6117J17191m5271
2060A24983n6398K4963j16038M2074j05467M91k3612J34061J6927K3932K7726
2049I3642L4876Q9904n554J4656j00541n2691j2667K9523O6324j06868L4069j07679
2037b3006J47260M9310k9998K3833O8205J5522J036R39Q5349O2475p4780L0916
2025C57061j51416J692J4109p4848m531j25004q5367M4414N7436j08429J12555
$$ plain form
2106 27927 -2797 6409 78084 93251 28226 115687 117087 121655 49619 -34510 -102708 -68978
2094 -68978 -60156 -67117 82906 229097 273720 221810 127140 159417 189994 87438 155413 101290
2082 101290 64901 13180 21582 50548 197933 96401 201436 92355 145612 37940 112442
2071 112442 206750 155218 84894 86204 217916 284330 159346 -23054 53063 170254 124983
2060 124983 68585 93548 -22490 19584 -85883 -85392 -109004 25057 41984 65916 93642
2049 93642 128518 218422 212868 227524 126983 74292 61625 91148 157472 50604 84673 -23006
2037 -23006 124254 173564 143566 167399 235604 251126 252162 253101 338450 400925 326145 357061
2025 357061 205645 207337 221446 146598 142067 17063 -68304 -23890 33546 -74883 37672
2014C7672N6602j19320N0706O9445L6786l0773j17534j5913l4879l378L385J29550
2002F2349l0217m5962K494M716j04932N1081J13314q7184N1889m9526J43405j20863
1990i436J11200O601n7368n4869n4021M0809j9990Q6749k6693j5494o2695k0703
1978g5910Q8472L5517r2609n9922L8075J5951J8009l7443J46572q8455r2645P2792
1966c1596o1612n7776K0430K8080Q1102n8149r0121K6136J47761M9419p1998l0533
1954d8857o4442q367P5706p8478M2587l0575Q8424J2911m0426K5788q9242Q6654
1942b8317J5803k8984m8387r9240M0929J31874J03502P6256k02012j54153J62707
1931c0022k7927r3660O691J19752k4062j08769R4656P2103j640q208k3438l3439
$$ plain form
2014 37672 94274 -25046 25660 95105 131891 101118 -16416 -32329 -67208 -70586 -67201 62349
2002 62349 32132 -13830 -11336 -6620 -111552 -60471 52843 -34341 17548 -31978 111427 -9436
1990 -9436 101764 108365 50997 -3872 -57893 -17084 -37074 49675 22982 7488 -55207 -75910
1978 -75910 12562 48079 -44530 -104452 -66377 -50426 -32417 -69860 76712 -11743 -104388 -31596
1966 -31596 -93208 -150984 -130554 -102474 -21372 -79521 -169642 -143506 4255 53674 -18324 -48857
1954 -48857 -113299 -121666 -45960 -124438 -81851 -112426 -24002 -11091 -51517 -25729 -114971 -28317
1942 -28317 -12514 -41498 -89885 -189125 -148196 -16322 87180 163436 -38576 -192729 -30022
1931 -30022 -57949 -151609 -144918 -25166 -49228 -157997 -63341 8762 7122 -1086 -24524 -57963
1919e7963p1585N9628J41883N3260j8334j18286L2068p997K464Q018k12642N8217
1907a31269J75074j2521J03455l7953r3813p4665J01035p0391j1896K0958k8357
1896f0343j1212J45371q4840p7398N0585m860l7272k992J16195m5570n192j95625
1884b13153J53571Q0738M3845k2254j89282N319J39203L9846j28405q1295M4578
1873a27289J93841L5256O3212j15784o9929m1244P0164j57403j39824J13282N005
1862a70713j3051O6429Q0376r0678j1979J09267o2659p2298J62434m3284o9467
1851a15623J5054N1206Q0054J2776O0307N9397R4792j46802j37549J10854j17998
1840c3532j1334R9466j02485j6717J8238m7651K6968J67824j12627P0226o3177
$$ plain form
1919 -57963 -129548 -69920 71963 125223 106889 -11397 20671 12674 15138 23156 -189486 -131269
1907 -131269 43805 31284 134739 96786 2973 -71692 29343 -41048 -52944 -31986 -60343
1896 -60343 -71555 73816 -11024 -88422 -37837 -42697 -79969 -82961 33234 -12336 -17528 -213153
1884 -213153 -59582 21156 65001 42747 -146535 -141216 -2013 37833 -90572 -171867 -127289
1873 -127289 66552 101808 165020 49236 -20693 -61937 8227 -149176 -289000 -175718 -170713
1862 -170713 -183764 -117335 -36959 -127637 -139616 -30349 -93008 -165306 -2872 -46156 -115623
1851 -115623 -100569 -49363 30691 43467 103774 163171 257963 111161 -26388 84466 -33532
1840 -33532 -44866 54600 -47885 -64602 -46364 -94015 -67047 100777 -11850 58376 -4801
1829d801j9477L014O0144L0111k15703R538o626P3103J4483O7224m2226k9387
1817f0603P1226j4691j68204r9235J57146o7469m3153M1792J72713K7555q9263
1806g2186J8029Q251k1030j1058M4255o950L7491j24636M8694N936k0709J3517
1794h0396l5662O6493N0463n027R2633j14831J56778m9680q9304j0904r5998j06736
1782b22171R0253K8897Q9126R3651j45474q7179K4272K05777M991j4826m3821
1771B3496K5540k648M7028M8180m2316k4041n9679M6232K9384J13698j26630q5376
1759g132j23754n720M6221j05473p5469J60965K17223m1209o1455j2192J97158
1748A89163p8741q0978q0015m4301J3710l8758J11231K5282q3520l4179j6599
$$ plain form
1829 -4801 -24278 -21264 38880 68991 -146712 -137174 -143800 -70697 -56214 11010 -31216 -60603
1817 -60603 10623 -4068 -172272 -271507 -114361 -181830 -224983 -183191 -10478 17077 -72186
1806 -72186 -54157 -45906 -66936 -77994 -33739 -40689 -3198 -127834 -79140 -73204 -93913 -80396
1794 -80396 -116058 -49565 898 -4129 88504 -26327 130451 80771 -8533 -19437 -115435 -222171
1782 -222171 -131918 -103021 -13895 79756 -65718 -152897 -128625 77152 82143 67317 23496
1771 23496 49036 46388 93416 141596 99280 75239 15560 61792 91176 204874 78244 -7132
1759 -7132 -130886 -136606 -90385 -195858 -271327 -110362 106861 65652 4197 -7995 189163
1748 189163 110422 29444 -50571 -94872 -81162 -119920 -8689 16593 -66927 -101106 -117705
1737a17705n1401o2748K28163j02391J05954P2550j14512M0736l3986p1929k6052
1726a33321L3392J06932j7934o0183J25665L2672p4346j15264o3771J6686K5353
1715a24119Q6310L7060m3170j08345l4741J17730Q7670m9498P2657M1890j13010
1704b9566P21q3550p417l5830n9743J30737Q6244m2346L6331J6299J3740M6880
1692G2500n2219n8752N3787m8735o6576O3192J5466o1104P226N352Q1495n4276
1680d2644o138n0982k6047J44042J66086j36500p2555K8255m5543l1528J9853
1669e3701J96463p9796j51429j8099Q914j4715j6876N3353N9656p2233m458J8257
1657g4664p5404n6304J09015J02155j24036N0134M9400m8163M7809l5872j038
$$ plain form
1737 -117705 -169106 -231854 -3691 -106082 -128 72422 -42090 -1354 -35340 -107269 -133321
1726 -133321 -99929 7003 -10931 -71114 54551 87223 12877 -102387 -166158 -149472 -124119
1715 -124119 -37809 -749 -43919 -152264 -187005 -69275 18395 -31103 41554 83444 -29566
1704 -29566 -28845 -112395 -119812 -155642 -215385 -84648 1596 -40750 -4419 11880 25620 72500
1692 72500 20281 -38471 15316 -33419 -99995 -36803 -21337 -82441 -75215 -69863 11632 -42644
1680 -42644 -48782 -99764 -125811 18231 184317 47817 -24738 3517 -42026 -73554 -53701
1669 -53701 142762 62966 -88463 -106562 -97648 -112363 -129239 -75886 -16230 -88463 -92921 -74664
1657 -74664 -150068 -206372 -97357 4798 -119238 -69104 -19704 -67867 -20058 -55930 -56968
1646e6968J11680n0144o1493R6636J22910r025j95118k5547o1522l6441P408O5855
1634i1769K733j9696Q5838Q7867J13849j2992j34860n9728n7797Q4432R1540j26387
1622c6970j30442j73M4993M5535J16931N5417k36336j4873J58388L8908j17777
1611g6399N8347O7013j54037l3365M1544J0105n9269P0400R2214N8491l789O9380
1599A40635M8253j35449j79895J05700O2359o1294J63483n3128j28820R4608J07223
1588A63675j2884J8328n4060o0689L0247M8002m7921q5158j39367O7330P3201
1577G04q0500N2055M8976N9102K852n7421J3933J7825n349N5430O1753N004q8807
1564H5557r9150L3989J01218j03619j31815M7382R7971j0760M1054j05388l622
$$ plain form
1646 -56968 54712 4568 -56925 39711 162621 153596 -41522 -67069 -128591 -165032 -157624 -91769
1634 -91769 -89036 -108732 -22894 64973 178822 165830 30970 -28758 -86555 -2123 89417 -36970
1622 -36970 -167412 -167585 -122592 -77057 39874 95291 -141045 -155918 2470 41378 -76399
1611 -76399 -18052 48961 -105076 -138441 -96897 -86792 -146061 -75661 16553 75044 71255 140635
1599 140635 188888 53439 -126456 -20756 41603 -19691 143792 90664 -38156 56452 163675
1588 163675 150791 169119 115059 54370 84617 132619 84698 -460 -139827 -72497 704
1577 704 -79796 -27741 21235 80337 83189 25768 39701 57526 52177 107607 169360 174364 85557
1564 85557 -13593 20396 121614 17995 -113820 -66438 31533 20773 61827 -43561 -47183
1553d7183K7287l6809l4941p5948j6547j2850M3899J03582R205l5460j23164P2145
1541a26784J89345P1285j43636P4985r044k6181m6846o6053J1710L5668j67817
1530b03368M6757J82651J850j6095q3167O2889l2411J5739j36959P7893J31571
1519D7350J6809M928p7205j09195J22872J8940n6016m7200n1143k4598m3708J46171
1507e1995O4821p405q6853l996K10689j00838q5638M269N0913n8942p997K5063
1495d7909L8691m4946M0806N4745M4311P7445q2897r2429n91J1896j13113P7098
1483c6893n1392J09126l0825j686N4858j19288L2777o1542j19836O4125J41893
1472a8683J13410n6569p126n9236O4248q3727N1096j2072o9710K30642n3806P3488
$$ plain form
1553 -47183 -19896 -56705 -91646 -167594 -184141 -196991 -153092 -49510 -40305 -75765 -198929 -126784
1541 -126784 62561 133846 -9790 65195 56151 29970 -16876 -82929 -71219 -35551 -203368
1530 -203368 -156611 26040 27890 11795 -71372 -8483 -40894 -25155 -162114 -84221 47350
1519 47350 64159 69087 -8118 -117313 5559 24499 -31517 -78717 -129860 -154458 -198166 -51995
1507 -51995 12826 5421 -81432 -85428 125261 24423 -61215 -56946 -6033 -64975 -72972 -47909
1495 -47909 -9218 -54164 -13358 41387 85698 163143 80246 -12183 -12774 -878 -113991 -36893
1483 -36893 -88285 20841 -9984 -11670 43188 -76100 -43323 -104865 -224701 -160576 -18683
1472 -18683 94727 38158 31032 -28204 36044 -47683 3413 -8659 -78369 152273 98467 171955
1460A71955j10948O7030M408j01281j03380r5487J21706o6752j00125m2882J30872
1449a24884O3714P225M1532n2922L5441J13113K2311j1269r3652q2804n2172Q46
1437a33521J50690r5407k5553O4333q3785J12376k0660j5614O1286L6233j8164
1426C2214O3058l3034l0660P2905j73606P6554R4004j46930O9228J75677j17588
1415H1822L7869J8547j09313j55031N5160P3325p9900K0410n3502j04912J21471
1404i4054m6886j11362J37862Q4278j2124o6505K1849P9156l7357J2949q3273
1393a15467M9339m8175j14974L9210J04797N6259K6432m3750k8971m8932K4062
1382a00170J18854P4896j12413J120M6761q5032j60382K1043J58357n5985M9053
$$ plain form
1460 171955 61007 128037 132445 31164 -72216 -167703 -45997 -112749 -212874 -255756 -124884
1449 -124884 -61170 -53945 -12413 -65335 -29894 83219 105530 94261 609 -82195 -134367 -133521
1437 -133521 17169 -78238 -103791 -39458 -123243 -10867 -31527 -47141 14145 50378 32214
1426 32214 95272 62238 31578 104483 -69123 7431 101435 -45495 23733 199410 81822
1415 81822 119691 138238 28925 -126106 -70946 2379 -77521 -57111 -110613 -215525 -94054
1404 -94054 -140940 -252302 -114440 -30162 -42286 -108791 -86942 -7786 -45143 -32194 -115467
1393 -115467 -66128 -114303 -229277 -190067 -85270 -29011 -2579 -46329 -75300 -124232 -100170
1382 -100170 18684 93580 -18833 -17713 29048 -55984 -216366 -195323 -36966 -92951 -43898
1371d3898q1672K03071j17461j40758l8302j9301K06144K6062J01427P6326m3079
1360A28559k9211o7822K8528p1161P1857N6635j64853p4349J88900p5511m398
1349a2826pj41908L9671M2612L8198O7580l7252o2451P0454j2121l524P4756j5786
1336D7396K8432r3950k3593K9349j07906l3958l2215K51060n7366l6169Q022n4645
1324g5543J44807L1023p0441o9139m2008j29522R7777j5147R0823J92962p8642
1313G6950K8628q2708j29616n6911O8544J4244J8725Q9381j2343J08092Q5718
1302B08704p3902j35788q2149M7989O2559n3974Q8548n3634j3109J0974o5689
1291e9471M7227p6413J09638N0032M637q8824J39932R1588k11336k5984j53773
$$ plain form
1371 -43898 -125570 77501 -39960 -180718 -219020 -238321 -32177 -6115 95312 171638 128559
1360 128559 99348 31526 60054 -11107 60750 117385 -47468 -121817 67083 -8428 -12826
1349 -12826 -12833 -154741 -115070 -72458 -34260 33320 -3932 -66383 4071 -8050 -11574 63182 47396
1336 47396 75828 -18122 -41715 -12366 -120272 -154230 -186445 64615 7249 -28920 -20898 -75543
1324 -75543 69264 100287 29846 -39293 -81301 -210823 -113046 -128193 -37370 155592 76950
1313 76950 105578 22870 -106746 -163657 -95113 -80869 -62144 27237 14894 122986 208704
1302 208704 134802 -986 -83135 -35146 27413 -26561 61987 8353 -4756 6218 -59471
1291 -59471 -12244 -88657 20981 71013 75650 -13174 126758 218346 7010 -18974 -172747
1280a72747O9087J13230j611p5946n1874l7048R7809J2391r4230O5877k8156k143
1268a05361J12888r8006n9999O6316Q3717q0404o1680K8096J52773O7655j67940
1257f1945L100K8387n0065r739P7706m3863L236n9375O5792n567L4705j3693J19333
1244H8012J0045N6734n4749K3809K8852j23570J3513q3601m4191p4851N7535P2730
1232b9732M2154j8736m1813O9654j3412J00441j1496r6967O7909M6733P6545j45548
1220D5732q9175l3583M6920K5867J50449K8108k0425j04621O3879P8686j41826
1209E0011q1845j1768Q0776p9610o6686P2129J53262j12053J7112O5554p4444
1198A2438q5697p7162q8551J64164J26745k3043P114k601r8613Q490J5474j5481
$$ plain form
1280 -172747 -103660 9570 7959 -67987 -119861 -156909 -59100 -46709 -140939 -75062 -103218 -105361
1268 -105361 7527 -90479 -150478 -84162 -445 -80849 -142529 -114433 38340 105995 -61945
1257 -61945 -58845 -30458 -80523 -90262 -12556 -56419 -53183 -112558 -46766 -52333 -17628 -31321 88012
1244 88012 98057 154791 100042 123851 152703 29133 42646 -40955 -85146 -159997 -102462 -29732
1232 -29732 12422 -6314 -48127 21527 8115 108556 97060 93 68002 114735 191280 45732
1220 45732 -43443 -77026 -30106 -4239 146210 174318 153893 49272 113151 191837 50011
1209 50011 -31834 -43602 37174 -42436 -109122 -36993 116269 4216 21328 86882 12438
1198 12438 -73259 -150421 -238972 -74808 51937 28894 36008 33407 -65206 -56716 -41242 -56723
1186e6723M404J55685R9438k30555q1832N5465K1356P0934J0794l3079p5140L9268
1174a9985J8044j1836J45935o2875p6012j14054J29933j6141r6947M8674L2668
1163b2596N8738l5884q9780N7911q068m602j33859J0336J67250o1982j2008j6471
1151i1015Q8691R0099o1473o7953J11346j30880q1709N6091N7723k4255M7953
1140e382l6952N876Q0550J34124p3486p8246K4931j67003J44893o6944j4526P5240
1128B3075o975K8627L7146L3811r3145o7430K5255j0138p5805J09151N4231J5519
1116G3322p7819j36968J212L4642Q7361J19985j18651j67291R0193J93200J5266
1105A14452q4712l1306q9137O8727O6722n4432n7871M8336j09219M3300j190p477
$$ plain form
1186 -56723 -52319 103366 202804 -27751 -109583 -54118 -32762 38172 48966 15887 -59253 -19985
1174 -19985 -1941 -13777 132158 69283 -6729 -120783 9150 -6991 -103938 -55264 -22596
1163 -22596 36142 258 -89522 -31611 -39679 -44281 -178140 -167804 -554 -62536 -74544 -91015
1151 -91015 -2324 87775 26302 -41651 69695 -61185 -142894 -86803 -29080 -53335 -5382
1140 -5382 -42334 -36458 44092 178216 104730 26484 51415 -115588 29305 -37639 -52165 23075
1128 23075 16100 44727 81873 115684 22539 -44891 -19636 -29774 -105579 3572 57803 73322
1116 73322 -4497 -141465 -140253 -105611 -18250 101735 -16916 -184207 -94014 99186 114452
1105 114452 29740 -1566 -90703 -21976 44746 -9686 -67557 -19221 -128440 -85140 -86330 -93807
1093i3807O3373M9548n9712o6901O1311O8686j54937k2959Q865m107N2857M1573
1081e6210J6036O4390K28124m7507m9013j35770j98431k9387j8088J78980l9486
1070h6362j5540N2807L0238O8656K0005q1269J53022j2294j61231J31922N7492
1059A57446q3755l5152j14280n9890K7507P6883R5509o9728k7674J5687J74244
1048A56797n3611j36253P7437k5930O473M3021J209o4820p0795K4552P201q3502
1036a18221j072J49808q1074m5164m5123Q9610o4297l4619P8962N3103M0570j7050
1024E433j69920O4800R0641O6726R5414k8205j69631j12480K7387P5562M2396
1013a1877J49465j51975M7696n0610k6047J21948r584k4825n2323p2336J00497
$$ plain form
1093 -93807 -30434 19114 -40598 -107499 -46188 22498 -132439 -155398 -146533 -150640 -97783 -56210
1081 -56210 -40174 24216 252340 204833 155820 20050 -178381 -207768 -225856 -46876 -86362
1070 -86362 -101902 -49095 -18857 49799 69804 -11465 141557 129263 -31968 99954 157446
1059 157446 73691 38539 -75741 -135631 -108124 -31241 64268 -5460 -33134 -17447 156797
1048 156797 103186 -33067 44370 18440 24913 67934 69143 4323 -66472 -41920 -34719 -118221
1036 -118221 -119293 30515 -50559 -95723 -140846 -51236 -115533 -150152 -71190 -18087 22483 5433
1024 5433 -164487 -99687 -9046 57680 153094 124889 -44742 -157222 -129835 -54273 -11877
1013 -11877 137588 -14387 33309 -17301 -43348 78600 69016 44191 -8132 -80468 20029
1002B0029Q8871j32700j4032J6175J34327J00931k13645j86461R4595J54863j08570
991d5617n780R6381o8692m1550j8144O9114O9781k8155j79667P9223l4011J01385
979e732J14187l0643n5870n9987l9248J19146p5173o1975P10J17783P5074o4851
967C3421o7077J19231j65725o6915P6496J9036l131l9171J4611N700R9392L1223
955E7091J3258j02541N1969j83789M3437P6455K923J03784L4626o5938k2014L5207
943D4468k3666K4121j11293j03833N1171K0018M75P998l8181M4688K3720j05383
931a65697P0794J12328L6768j10792o0715j3163M6478N4068l6465P3263n0527
920d3660q6128R5807L275k6906M7431M046J4160R1423j00616j94341m7859J99650
$$ plain form
1002 20029 108900 -23800 -37832 -21657 112670 213601 -44 -186505 -91910 62953 -45617
991 -45617 -51397 44984 -23708 -65258 -83402 -14288 55493 27338 -152329 -73106 -107117 -5732
979 -5732 108455 77812 21942 -38045 -77293 41853 -33320 -95295 -94585 23198 98272 33421
967 33421 -33656 85575 -80150 -147065 -70569 -51533 -54664 -93835 -79224 -73524 25868 57091
955 57091 70349 -32192 19777 -164012 -120575 -44120 -41197 62587 97213 31275 9261 44468
943 44468 20802 44923 -66370 -170203 -119032 -99014 -98539 -90541 -128722 -84034 -60314 -165697
931 -165697 -94903 17425 54193 -56599 -117314 -130477 -83999 -29931 -66396 6867 -43660
920 -43660 -129788 -33981 -30706 -57612 -10181 -6135 8025 99448 -1168 -195509 -243368 -43718
908d3718J36048r0637r5639J5471R7776j10353N5119n5873J29096l0025j00419
897i3154J56508r133j20627l7532Q8348Q362j24763Q8219n645J25737l5607j75089
885a34376j15005J1351Q7823K7017j05678J03988J76821o1639N0102O7139o746
874A00797j7450r3099P2760j07472j25351P1324R8741Q9010l7770p758k6191J09814
862A27355p3301o3884k1555M7622j2425N3966J22583n4513r9957j19139K9500
851f3748R5235k121L6856j00487L7330N5901N2102n7313n8292O1932J0663N6548
839A24606j29677k7200o200L2860M7199l7682m513p5166Q7869l0375k4672n2691
827i5642M2393O1198J1098J17421q3477j44988J44951L5916q9786n5752Q5708
$$ plain form
908 -43718 92330 1693 -93946 -78475 19301 -91052 -35933 -91806 37290 7265 -93154
897 -93154 63354 54221 -66406 -103938 -15590 -7228 -131991 -43772 -49417 76320 40713 -134376
885 -134376 -249381 -238030 -150207 -123190 -228868 -124880 51941 -9698 40404 107543 100797
874 100797 83347 -9752 63008 -44464 -169815 -98491 250 89260 51490 43732 17541 127355
862 127355 54054 -9830 -31385 16237 3812 57778 180361 125848 25891 -93248 -63748
851 -63748 31487 29366 66222 -34265 3065 58966 111068 53755 -4537 57395 68058 124606
839 124606 -5071 -32271 -38471 -5611 41588 3906 -607 -75773 12096 -18279 -42951 -95642
827 -95642 -53249 7949 19047 136468 52991 -91997 52954 88870 -916 -56668 29040
816B9040O8476L8554j81882r9824K7977R7463l0646K9577K1908j0125M054p7674
804h3102J64558l0751R878m6084j4480j00081n277J52779l3484N8713k9392K2575
792F5852o7198N031J22791j36675r3706L3708J17243M3868r2855m2598M342M3231
780C034j26810P4884J00495l6962l8727r4668Q8347L3372J88338L7732j45830
769H3205n2379j22209P4359J41741J2249j36198j1344m843j12363J15976K3923
758A2117m0488m3094P6659j07731n2203O9978P8802J5517r4899r43Q8194l0038
746b8129K6390k02057J05316J65230j696L2545j61768L1786J17741Q5499j62401
735H456K0663n904q2264Q6413l0723P2040l8912n972K4502R7007j48521k10927
$$ plain form
816 29040 97516 136070 -45812 -145636 -117659 -20196 -50842 -21265 643 -9482 -5428 -83102
804 -83102 81456 50705 60583 14499 19 -100062 -105339 47440 13956 72669 43277 65852
792 65852 -1346 3685 126476 -10199 -103905 -70197 47046 90914 -1941 -44539 -40197 3034
780 3034 -123776 -48892 51603 14641 -24086 -118754 -30407 2965 191303 229035 83205
769 83205 30826 -91383 -17024 124717 136966 768 -10576 -15419 -127782 -11806 12117
758 12117 -28371 -71465 5194 -102537 -154740 -84762 -5960 9557 -85342 -86285 1909 -28129
746 -28129 -1739 -203796 -98480 66750 65054 97599 -64169 -32383 85358 170857 8456
735 8456 29119 23215 -59049 27364 -3359 68681 29769 23797 48299 145306 -3215 -214142
723b14142P0112K08094L497p8080O0545q2398l3106k2512M9568L4121N1226j39376
711i2451R1967m5660O4326J6158L1115m0143q87N7576j29826k2454l378J51856
699G8199Q3094o3470o6875O9517l173j40073p7945Q3482L8563k7720N6070R4867
687A24536K1416Q9146j25480q1998P1313J17j06570q1735K0789p437k7230k3862
675a26995P8119J04046l5399M6548J25975q8015k00624k3880N0625J2960J65009
664A08369K9482m8853q6774J18071j59106M192O5950j23387N4751p4009J88479
653G7165n4732J4066J08293K5387j35190k9693P1967J25868j11687j64342K1466
642e1432J62101n0350m4462L6922j4794K0221R9323l6760n5445o3172L684P6076
$$ plain form
723 -214142 -144030 64064 67561 -10519 50026 -32372 -65478 -87990 -38422 -4301 46925 -92451
711 -92451 -484 -46144 18182 34340 65455 25312 24425 82001 -47825 -70279 -73657 78199
699 78199 161293 97823 30948 100465 97292 -42781 -120726 -37244 1319 -26401 29669 124536
687 124536 145952 235098 109618 27620 98933 99050 -7520 -89255 -68466 -75903 -103133 -126995
675 -126995 -48876 55170 19771 66319 192294 104279 -96345 -120225 -69600 -56640 108369
664 108369 137851 88998 2224 120295 -38811 -34619 31331 -92056 -37305 -111314 77165
653 77165 22433 36499 144792 170179 34989 5296 77263 203131 91444 -72898 -51432
642 -51432 110669 60319 15857 52779 37985 58206 157529 120769 65324 2152 5836 81912
630H1912L6548p1920j05630J36582J236J8142m9387m2582k3488K052n3386O1855
618h066N5724Q734J0978n772k6144q2727p2558P4512M8948P836n8503L1561n87
605a6064R2670l6216k32752J26663O6612M4353P433o6346K1880L6174k3083L1057
593E2381j8589K5149j846l3737M524n7459J82410j09691o5262K0461O2401Q87
581F1629J08837l3350n0701l1828o2060K2451j38740J27586r0463j7398L5790
570f8247l7224J28180l7574o6863M7560J46804R866m4329j15238M2196M7188N4583
558A06902O874q9522l1710P8170j32805q0255Q2814k1522p6140J25518K0319N6805
546D5448j03136M8843K6139j9213J09484o6277L6864p7926j1204M5902N1488j53370
$$ plain form
630 81912 118460 46540 -59090 77492 78728 96870 47483 4901 -18587 -16535 -69921 -8066
618 -8066 47658 56392 67370 61598 35454 -47273 -119831 -45319 3629 11465 -47038 -15477 -16064
605 -16064 76606 40390 -192362 -65699 913 45266 52699 -13647 8233 44407 21324 52381
593 52381 33792 58941 57095 23358 27882 -29577 152833 43142 -22120 -1659 60742 61629
581 61629 170466 137116 86415 54587 -7473 14978 -123762 3824 -86639 -104037 -68247
570 -68247 -105471 22709 -14865 -81728 -34168 112636 122502 78173 -37065 5131 52319 106902
558 106902 113776 24254 -7456 70714 -62091 -142346 -59532 -81054 -157194 -31676 -11357 45448
546 45448 -57688 -8845 17294 -1919 107565 41288 78152 226 -10978 34924 86412 -66958
534f6958L7314M5087m1699Q4538J2734j6582k3005N4521r7834O246J50055r749
522A34668r8866J0180N75N3349J24204j73511L7988l7854p9426J6692J27482j03592
510A1889o5734Q2339j73543n4096K20614P480P1876j32312j15152J24503L7588
499A5452j28238J22484l8377p5990N2731N0112P5975p6311N0097j2557l8864J04923
487A01437p3342n4920k3476N9538j55552P3897M3890J51127Q913k13128O92n9590
475a40514P6509J51009K5413r4496r9034P5249O2650O1496k3285l0559J3223j5713
463F1948J0053j22093Q7081j30495O7410N8836N792j24676L8794N9173K3161p481
451B7503k430j4782K2316O3074j34569j868j0149J04628J20837n3965m319O8850
$$ plain form
534 -66958 -29644 15443 -26256 58282 71016 54434 31429 85950 -11884 -5638 144417 134668
522 134668 35802 45982 46557 99906 224110 50599 88587 50733 -28693 -12001 115481 11889
510 11889 -53845 28494 -145049 -199145 21469 28949 100825 -31487 -146639 -22136 15452
499 15452 -112786 9698 -28679 -104669 -51938 -1826 74149 -2162 47935 35378 -3486 101437
487 101437 28095 -26825 -50301 9237 -146315 -72418 -28528 122599 131512 -81616 -80924 -140514
475 -140514 -64005 87004 112417 17921 -81113 -5864 56786 118282 94997 64438 77661 61948
463 61948 72001 -50092 36989 -93506 -26096 32740 38532 -86144 -47350 11823 34984 27503
451 27503 25073 10291 32607 95681 -38888 -40756 -50905 53723 174560 120595 116276 185126
439A85126k9054j03266q2637K8402j5453J68769n3568K7561j04608k07766J26264
428f0230Q4511J50061k4760J7855m1922o8198l0472J14785j20193k2340Q2200
417H1297j5717o0848m6630K7624Q0787q2738P3446O5046n5983J8320L358L5610
405A23572J07901p7908p2118N115l5676P1456J7126q3279q864p4496M8527J24534
393A45890O1058r2514j03381k2076Q1465r142o4742J5000p3709K6256O8194m6316
381a4017k2952N6590R8808O503M9016j04305Q1820O8218q6167N7787J10922Q3041
369C85264j12621n9927k11318n7375R6217P4939o0517m8354L2625m2166l7942
358d1175k9156R0342J52677j11155q564P8358L6946J3515L473p1961l6399k1308
$$ plain form
439 185126 156072 52806 -29831 -1429 -16882 151887 98319 125880 21272 -186494 -60230
428 -60230 24281 174342 149582 167437 125515 57317 26845 141630 21437 -903 81297
417 81297 65580 4732 -41898 -14274 66513 -16225 57221 122267 66284 84604 87962 123572
405 123572 231473 153565 81447 86562 50886 122342 139468 56189 47325 -27171 21356 145890
393 145890 206948 114434 11053 -11023 70442 61300 -3442 11558 -62151 -35895 32299 -14017
381 -14017 -36969 19621 118429 124932 173948 69643 151463 219681 133514 191301 302223 385264
369 385264 272643 212716 1398 -55977 40240 115179 54662 6308 38933 -3233 -41175
358 -41175 -70331 20011 172688 61533 52969 131327 168273 181788 185261 113300 76901 55593
346E5593J08016L9903j4678m6976J01165K7286o80j46539j00370N3626N5887L6047
334A68280j00969Q889l3389K7829m7485Q9981M5655n7370M2751j64732J39400
323A18840K4489j07471Q1901J16574J15340j20432j92818l1926R619O4871j29884
312e0897N4673R7579j1241K5570j7181l4873M5344Q4293q3454j22498k5326J02073
300F4062o8641k472L2539k484K6276j6156j103J5325L9700m6082N9053N1586j16579
287C5024J7694N8551M5025p0173J08860r5520j13038j03760R2400Q3184j1892
276D6355J51452L6476j36978L8915o5974l3485J50148q6380N6367j31826L8848
265F3918M0891j6234l2483Q8173l7418l2911N7538J4617n0599j15331J2552R3727
$$ plain form
346 55593 163609 203512 188834 141858 243023 270309 269629 123090 22720 76346 132233 168280
334 168280 67311 76200 42811 70640 23155 113136 158791 101421 144172 -20560 118840
323 118840 143329 35858 117759 234333 349673 229241 36423 4497 14116 78987 -50897
312 -50897 3776 101355 90114 115684 98503 63630 108974 193267 109813 -12685 -38011 64062
300 64062 -4579 -7051 25488 23004 49280 33124 32021 47346 87046 40964 100017 151603 35024
287 35024 52718 111269 156294 86121 194981 99461 -13577 -117337 -24937 58247 46355
276 46355 197807 234283 97305 136220 70246 36761 186909 100529 156896 25070 63918
265 63918 104809 88575 56092 144265 106847 73936 131474 146091 95492 -19839 -7287 86440
253H6440M133R375J4668o9048l0854O0966p845Q7148L0554j44876j8779p8909
241e7027Q2352P2094Q717l0216k2505J53601O1484q0366L5332j4733j22473o0811
229B5449Q3470J14884r7721l5190Q7790P4404m6945k7103o0130m4120J10895o0613
217A25070J7095j19971J82006K0253k4347n8207J7960J1243q9848P6302p341j41
205A50074N471j50164J6878Q200k3044L6929J3980J01295r4450N297Q0974q5104
193F6336P5952N2119k1733M323k9664K1276L5724r2190K765j02529P353P5775
181I5507l3880j8570J34812j69527o7071K62641o840j09402l4755M4865K27P494
169A05501j07127N9664o7685O7357P4342P6667p230j12350K7055O4535j26110
$$ plain form
253 86440 90573 99948 114616 45568 14714 75680 67835 154983 185537 40661 21882 -57027
241 -57027 25325 97419 106136 75920 53415 207016 268500 188134 223466 208733 86260 25449
229 25449 108919 223803 126082 90892 178682 253086 206141 179038 118908 74788 185683 125070
217 125070 142165 22194 204200 224453 200106 141899 159859 171102 81254 157556 150215 150074
205 150074 155545 5381 22259 30459 7415 44344 58324 159619 65169 70466 151440 66336
193 66336 142288 194407 172674 176997 147333 168609 204333 112143 114908 12379 19732 95507
181 95507 61627 43057 177869 8342 -58729 203912 197072 87670 52915 97780 98007 105501
169 105501 -1626 58038 -9647 57710 132052 208719 201489 89139 116194 180729 54619
158E4619m7279M1035r1518M5094L5028P2800J20036j16626k2316L6392j03379
147B3886j11051L2398O1744J19115j8009L2420n8185O6269L8921m4688p8757Q1561
135A45624l0392k9891L156m1320R6394N2634J1131n1767m3362J4137m1494l6201
123D8649J63045j6706o4871M2070k0040j0156N952n321m7066j40848l904J24075
111G4879P8747P7330o2310k7427O4670l8965j05282k4576N6258p2409O6382o1962
99B5335J0915M8492Q9871l5177m3948Q572l8770o3613N0572m4926M7849J14129
87A69301j0579Q1817j18337n0004o7237J26137K3010M849j1007n4915o7553O5985
75I1467Q4528m6431N8556l0594P2563n040r4012o8466J05569o7867j23031K9146
$$ plain form
158 54619 7340 48375 -43143 1951 36979 109779 229815 113189 90873 127265 23886
147 23886 -87165 -54767 6977 126092 108083 140503 82318 148587 187508 142820 64063 145624
135 145624 115232 85341 88497 47177 143571 196205 207336 155569 112207 126344 84850 48649
123 48649 211694 194988 130117 172187 152147 141991 147943 142622 95556 -45292 -49196 74879
111 74879 153626 230956 168646 141219 205889 166924 61642 37066 93324 20915 87297 25335
99 25335 36250 84742 174613 139436 95488 104060 65290 1677 52249 7323 55172 169301
87 169301 158722 240539 122202 72198 4961 131098 154108 158957 147950 93035 25482 91467
75 91467 175995 129564 188120 157526 230089 225049 131037 62571 168140 100273 -22758 6388
63F388R8630k7387P4185K8184k0437J5990k8820L1331J8754l0349l4816k6606
51A05047J54J32637j79841J3328Q7949j0563k1315R96l4175o4187L7081q3781
39a6670J6703J30712R498K2392k8618o163M354j01784M7980n7953J03102L4271
27A57824n9739k8211J03429M4018r276p0873p075K0879r6694L7377L813J801k9912
14F7361N9335L0144J0774R092J4636L8163j8800p4659k1730k5905j8423K859p8216
1e369O2191
0E6822
$$ plain form
63 6388 105018 77631 151816 180000 159563 175553 146733 178064 196818 166469 131653 105047
51 105047 105201 237838 57997 71325 159274 148711 127396 128392 94217 30030 67111 -16670
39 -16670 33 130745 140243 162635 134017 127854 132208 30424 78404 20451 123553 157824
27 157824 98085 69874 173303 217321 208045 137172 130097 150976 54282 91659 95472 97273 67361
14 67361 126696 156840 167614 176706 191342 229505 210705 136046 114316 88411 69988 72847 -5369
1 -5369 56822
0 56822
$$ Imaginary data points
##PAGE= N=2
##DATA TABLE= (X++(I..I)), XYDATA
16383a360874Q7231q073l2236Q5486K9955l5176K2308l3108K5588M6668k1924
16372a194155O5335J46000j25015O4677P7561P9031o179K0263J4491j12878O9804
16361i01065M150k1799O0982J6641O4026N1809Q1533n746q8744p0843p399O2780
16349g53675M6150n414m9680O1250l9850J05988k5621N1070M6741J6545M5403
16338e01093k7212M1417j0349k1156N307R7485J38127P3059j11623r1120Q254
16327c98904m7610O2577J22252n698O6628n0711k9196R7220L4467n7405J5480
16316a90900o137J7104M4034J82992J8472m7967M2308r3427J04965L1266J7647
16305A20357j1922o6889Q3835M4141P73m2839K0345k7646O5979Q6260n3903J44274
$$ plain form
16383 -1360874 -1273643 -1281716 -1313952 -1228466 -1198511 -1233687 -1211379 -1244487 -1218899 -1172231 -1194155
16372 -1194155 -1128820 -982820 -1107835 -1043158 -965597 -886566 -892745 -872482 -857991 -970869 -901065
16361 -901065 -896915 -918714 -857732 -841091 -777065 -725256 -643723 -649469 -738213 -809056 -816455 -753675
16349 -753675 -707525 -712939 -762619 -701369 -741219 -635231 -660852 -609782 -563041 -546496 -501093
16338 -501093 -528305 -486888 -497237 -518393 -513086 -415601 -277474 -204415 -316038 -407158 -398904
16327 -398904 -446514 -383937 -261685 -267383 -200755 -251466 -280662 -183442 -148975 -206380 -190900
16316 -190900 -197037 -179933 -135899 47093 65565 17598 59906 -33521 71444 102710 120357
16305 120357 108435 41546 125381 169522 170295 127456 147801 120155 186134 272394 218491 362765
16293C62765j42298l7679J9721j6373N9979l320O9742k4277p308L4479o199P1497
16281C80729R433N2712j7193P0994l5397j03934J62361J4530n0809n1694N3496
$$ plain form
16293 362765 220467 182788 202509 186136 246115 242795 312537 288260 280952 315431 309232 380729
16281 380729 390162 442874 425681 496675 461278 357344 519705 534235 483426 431732 485228
$$ [...]
##END NTUPLES=NMR SPECTRUM
##END=
