##TITLE=1H_DE-80H_X3
 200.13MHz, d2o
 8 sc
 
 19ns.26.2.2025
##JCAMPDX= 6.0         $$ Bruker NMR JCAMP-DX V2.0
##DATA TYPE= NMR SPECTRUM
##DATA CLASS= NTUPLES
##ORIGIN= UXNMR, Bruker Analytische Messtechnik GmbH
##OWNER= pz
$$ XWIN-NMR		Version 3.5
$$ Thu Jul  3 10:35:27 2025 Russian Standard Time (UT+4h)  Yarkov@DPX200
##.OBSERVE FREQUENCY= 200.1313
##.OBSERVE NUCLEUS= ^1H
##.ACQUISITION MODE= SIMULTANEOUS
##.ACQUISITION SCHEME= undefined
##.AVERAGES= 8
##.DIGITISER RES= 18
##SPECTROMETER/DATA SYSTEM= spect
##.PULSE SEQUENCE= zg30
##.SOLVENT NAME= CDCl3
##.SHIFT REFERENCE= (INTERNAL, CDCl3, 0, 15.5408)
##AUDIT TRAIL= $$ (NUMBER, WHEN, WHO, WHERE, WHAT)
$$ ##TITLE= Audit trail, XWIN-NMR		Version 3.5
$$ ##JCAMPDX= 5.01
$$ ##ORIGIN= Bruker BioSpin GmbH
$$ ##OWNER= Yarkov
$$ C:/Bruker/XWIN-NMR/data/yarkov2/nmr/H-C/1/pdata/1/auditp.txt
$$ ##AUDIT TRAIL=  $$ (NUMBER, WHEN, WHO, WHERE, WHAT)
(   1,<2025-07-03 10:34:29.68 +0400>,<Yarkov>,<DPX200>,
      <created by zg, POWCHK disabled, PULCHK disabled
       configuration hash MD5:
       00 E9 B6 7A A2 85 ED C7 34 08 36 98 17 FE 4E 26
       data hash MD5: 16K
       40 FA B4 0D D2 BB 6B F7 96 99 FE 99 75 E6 E9 84>)
(   2,<2025-07-03 10:34:34.20 +0400>,<Yarkov>,<DPX200>,
      <Start of raw data processing
       efp BC_mod = 2 LB = 0.25 FT_mod = 6 PKNL = 1 PHC0 = -1343.07 PHC1 = -12.35052 SI = 16K 
       data hash MD5: 16K
       DB D7 53 BF DB 15 86 BE 17 AD 8F 69 0E 23 A4 0D>)
(   3,<2025-07-03 10:34:39.95 +0400>,<Yarkov>,<DPX200>,
      <abs ABSG = 5 
       data hash MD5: 16K
       E3 B2 C9 8C 83 6F 94 54 09 13 FE 08 92 FD AD FE>)
$$ ##END=
$$ 
$$ hash MD5
$$ 60 F0 9C 67 6F 73 8B 5B 29 4F 7D 60 BA 5D 41 EA
##$RELAX= 
##$RELAX= 
##$RELAX= 
##$RELAX= 
##$RELAX= 
##$RELAX= 
$$ Bruker specific parameters
$$ --------------------------
##$DU= <C:/Bruker/XWIN-NMR>
##$EXPNO= 1
##$NAME= <H-C>
##$PROCNO= 1
##$TYPE= <nmr>
##$USER= <yarkov2>
##$AMP= (0..31)
100 100 100 100 100 100 100 100 100 100 100 100 100 100 100 100 100 100 
100 100 100 100 100 100 100 100 100 100 100 100 100 100 
##$AQSEQ= 0
##$AQ_mod= 1
##$AUNM= <au_zg>
##$AUTOPOS= <>
##$BF1= 200.13
##$BF2= 200.13
##$BF3= 200.13
##$BF4= 200.13
##$BF5= 200.13
##$BF6= 200.13
##$BF7= 200.13
##$BF8= 200.13
##$BYTORDA= 1
##$CFDGTYP= 0
##$CFRGTYP= 5
##$CHEMSTR= <none>
##$CNST= (0..31)
1 1 145 1 1 1 1 1 1 1 1 1 1 1 1 1 1 1 1 1 1 1 1 1 1 1 1 1 1 1 1 1 
##$CPDPRG= <>
##$CPDPRG1= <>
##$CPDPRG2= <>
##$CPDPRG3= <>
##$CPDPRG4= <mlev>
##$CPDPRG5= <mlev>
##$CPDPRG6= <mlev>
##$CPDPRG7= <mlev>
##$CPDPRG8= <mlev>
##$CPDPRGB= <>
##$CPDPRGT= <>
##$D= (0..31)
0 0.7 0 0 0 0 0 0 0 0 0 0.03 0 0 0 0 0 0 0 0 0 0 0 0 0 0 0 0 0 0 0 0 
##$DATE= 1751524469
##$DBL= (0..7)
120 120 120 120 120 120 120 120 
##$DBP= (0..7)
150 150 150 150 150 150 150 150 
##$DBP07= 0
##$DBPNAM0= <>
##$DBPNAM1= <>
##$DBPNAM2= <>
##$DBPNAM3= <>
##$DBPNAM4= <>
##$DBPNAM5= <>
##$DBPNAM6= <>
##$DBPNAM7= <>
##$DBPOAL= (0..7)
0.5 0.5 0.5 0.5 0.5 0.5 0.5 0.5 
##$DBPOFFS= (0..7)
0 0 0 0 0 0 0 0 
##$DE= 6
$$ [...]
##$SUBNAM3= <"">
##$SUBNAM4= <"">
##$SUBNAM5= <"">
##$SUBNAM6= <"">
##$SUBNAM7= <"">
##$SUBNAM8= <"">
##$SUBNAM9= <"">
##$SW= 18.0517328524113
##$SWIBOX= (0..15)
0 0 2 0 0 0 0 0 0 0 0 0 0 0 0 0 
##$SW_h= 3612.71676300578
##$TD= 16384
##$TD0= 1
##$TE= 0
##$TE2= 300
##$TE3= 300
##$TEG= 300
##$TL= (0..7)
0 120 120 120 120 120 120 120 
##$TP= (0..7)
150 150 150 150 150 150 150 150 
##$TP07= 0
##$TPNAME0= <>
##$TPNAME1= <>
##$TPNAME2= <>
##$TPNAME3= <>
##$TPNAME4= <>
##$TPNAME5= <>
##$TPNAME6= <>
##$TPNAME7= <>
##$TPOAL= (0..7)
0.5 0.5 0.5 0.5 0.5 0.5 0.5 0.5 
##$TPOFFS= (0..7)
0 0 0 0 0 0 0 0 
##$TUNHIN= 0
##$TUNHOUT= 0
##$TUNXOUT= 0
##$USERA1= <user>
##$USERA2= <user>
##$USERA3= <user>
##$USERA4= <user>
##$USERA5= <user>
##$V9= 5
##$VALIST= <valist>
##$VCLIST= <CCCCCCCCCCCCCCC>
##$VD= 0
##$VDLIST= <DDDDDDDDDDDDDDD>
##$VPLIST= <PPPPPPPPPPPPPPP>
##$VTLIST= <TTTTTTTTTTTTTTT>
##$WBST= 1024
##$WBSW= 4
##$XGAIN= (0..3)
0 0 0 0 
##$XL= 0
##$YL= 0
##$YMAX_a= 275001
##$YMIN_a= -288563
##$ZGOPTNS= <>
##$ZL1= 120
##$ZL2= 120
##$ZL3= 120
##$ZL4= 120
##$ABSF1= 15.43729
##$ABSF2= -2.614559
##$ABSG= 5
##$ABSL= 3
##$ALPHA= 0
##$AQORDER= 0
##$ASSFAC= 0
##$ASSFACI= 0
##$ASSFACX= 0
##$ASSWID= 0
##$AUNMP= <proc_1d>
##$AZFE= 0.1
##$AZFW= 0.1
##$BCFW= 0
##$BC_mod= 2
##$BYTORDP= 0
##$COROFFS= 0
##$CY= -3
##$DATMOD= 1
##$DC= 0
##$DFILT= <>
##$DTYPP= 0
##$F1P= 0
##$F2P= 0
##$FCOR= 1
##$FTSIZE= 16384
##$FT_mod= 6
##$GAMMA= 0
##$GB= 0
##$INTBC= 1
##$INTSCL= 3.241238e-09
##$ISEN= 128
##$LB= 0.25
##$LEV0= 0
##$LPBIN= 0
##$MAXI= 10000
##$MC2= 0
##$MEAN= 0
##$ME_mod= 0
##$MI= 1.114404
##$NCOEF= 0
##$NC_proc= -6
##$NLEV= 6
##$NOISF1= 3.799351
##$NOISF2= 2.8
##$NSP= 0
##$NTH_PI= 0
##$NZP= 0
##$OFFSET= 15.54085
##$PC= 1
##$PHC0= -1343.07
##$PHC1= -12.35052
##$PH_mod= 1
##$PKNL= yes
##$PPARMOD= 0
##$PSCAL= 0
##$PSIGN= 0
##$REVERSE= no
##$SF= 200.129996167917
##$SI= 16384
##$SIGF1= 3
##$SIGF2= 2
##$SINO= 0.751879
##$SIOLD= 32768
##$SREGLST= <19F.Aceton>
##$SSB= 0
##$STSI= 16384
##$STSR= 0
##$SW_p= 3612.71676300578
##$SYMM= 0
##$S_DEV= 0
##$TDeff= 16384
##$TDoff= 0
##$TI= <>
##$TILT= no
##$TM1= 0
##$TM2= 0
##$TOPLEV= 0
##$USERP1= <user>
##$USERP2= <user>
##$USERP3= <user>
##$USERP4= <user>
##$USERP5= <user>
##$WDW= 1
##$XDIM= 16384
##$YMAX_p= 298319293
##$YMIN_p= -648348
$$ End of Bruker specific parameters
$$ ---------------------------------
##NTUPLES= NMR SPECTRUM
##VAR_NAME=  FREQUENCY,     SPECTRUM/REAL,   SPECTRUM/IMAG
##SYMBOL=    X,             R,               I
##VAR_TYPE=  INDEPENDENT,   DEPENDENT,       DEPENDENT
##VAR_FORM=  AFFN,          ASDF,            ASDF
##VAR_DIM=   16384,         16384,           16384
##UNITS=     HZ,            ARBITRARY UNITS, ARBITRARY UNITS
##FACTOR=    0.220516191357247, 1,           1
##FIRST=     3110.1901880391, 0,             0
##LAST=      -502.52657496668, 0,            0
##MIN=       -502.52657496668, -648348,      0
##MAX=       3110.1901880391, 298319293,     0
$$ Real data points
##PAGE= N=1
##DATA TABLE= (X++(R..R)), XYDATA
$$ [...]
$$ plain form
6129 79342 78148 52448 108810 166115 185762 232727 211008 155696 169752 188563 194087 145677
6117 145677 176726 214182 243643 217662 248904 274404 282067 267818 235002 247196 272168 286263
6105 286263 304576 332583 315829 303021 257229 191309 219311 280787 346012 375222 351034 416792
6093 416792 459919 423584 390495 383357 322556 353973 369025 425072 414158 415912 422566 441045
6081 441045 435470 488427 535307 540906 502969 550504 582164 556188 548633 601843 643293 656622
6069 656622 684753 699102 793823 797202 904535 943824 942807 924977 911690 905160 853941 797496
6057 797496 805991 812882 767535 792359 751825 738448 835823 827333 787305 790009 780687 810026 828778
6044 828778 899428 887641 828579 859420 912681 1014461 1104741 1113301 1179001 1280994 1291521
$$ packed form
6129G9342j194k5700N6362N7305J9647M6965k1719n5312J4056J8811N524m8410
6117A45677L1049L7456K9461k5981L1242K5500P663j4249l2816J2194K4972J4095
6105B86263J8313K8007j6754j2808m5792o5920K8002O1476O5225K9210k4188O5758
6093D16792M3127l6335l3089p138o0801L1417J5052N6047j0914J754O654J8479
6081D41045n575N2957M6880N599l7937M7535L1660k5976p555N3210M1450J3329
6069F56622K8131J4349R4721L379J07333L9289j017j7830j3287o530n1219n6445
6057G97496Q495O891m5347K4824m0534j3377R7375q490m0028K704r322K9339J8752
6044H28778P0650j1787n9062L0841N3261J01780R0280Q560O5700J01993J0527
$$ plain form
6033 1291521 1303965 1339084 1277855 1151818 1126500 948979 983611 982082 947990 907649 888884
6022 888884 822226 796330 828597 795326 752537 702902 724886 738095 687942 704911 812513
6011 812513 858200 820791 825919 832706 849748 822250 801002 809169 816773 741499 709878 691325
5999 691325 622514 657854 629503 550555 486954 461053 382477 399186 366868 380481 396804 363244
5987 363244 376657 390007 317049 350819 362364 322892 359146 344177 277993 294342 254683 246608
5975 246608 258224 311873 319610 261276 293360 294575 289346 266921 314681 289966 221679 226269
5963 226269 260114 275853 208321 243501 301904 321100 318263 237745 219519 254565 159482 153692
5951 153692 196502 257643 278848 289140 304876 266656 265981 213899 169963 221495 244536 238899
$$ packed form
6033A291521J2444L5119o1229j26037k5318j77521L4632j529l4092m0341j8765
6022H88884o6658k5896L2267l3271m2789m9635K1984J3209n0153J6969J07602
6011H12513M5687l7409N128O787J7042k7498k1248Q167P604p5274l1621j8553
5999F91325o8811L5340k8351p8948o3601k5901p8576J6709l2318J3613J6323l3560
5987C63244J3413J3350p2958L3770J1545l9472L6254j4969o6184J6349l9659q075
5975B46608J1616N3649P737n8334L2084J215n229k2425M7760k4715o8287M590
5963B26269L3845J5739o7532L5180N8403J9196k837q0518j8226L5046r5083n790
5951A53692M2810O1141K1205J0292J5736l8220o75n2082m3936N1532K3041n637
$$ plain form
5939 238899 288232 296496 302962 261516 313635 231421 231023 254532 300419 309792 273821 243010 207255
5926 207255 252674 209187 221437 297786 275603 263825 291537 317908 292929 282112 246530 256915
5914 256915 264655 264491 286167 282310 241790 260724 325668 326536 339514 339758 275812 275339 297701 309706
5900 309706 298674 277580 293773 288361 322067 286054 313946 325180 266694 262745 327821 342633
5888 342633 276287 256977 316398 263377 284099 265083 296866 288156 232692 315221 330688 296571
5876 296571 274376 262080 239023 273372 277281 290177 244149 203381 236961 215838 333106 339225
5864 339225 300279 299489 347282 282060 243670 268290 306252 291267 293793 289874 297722 237846 222862
5851 222862 248300 279205 278481 275682 293204 278436 247256 226712 233648 202558 248954 218837
$$ packed form
5939B38899M9333Q264O466m1446N2119q2214l98K3509M5887R373l5971l0811l5755
5926B07255M5419m3487J2250P6349k2183j1778K7712K6371k4979j0817l5582J0385
5914B56915P740j64K1676l857m0520J8934O4944Q68J2978K44o3946m73K2362J2005
5900C09706j1032k1094J6193n412L3706l6013K7892J1234n8486l949O5076J4812
5888C42633o6346j9310N9421n3021K0722j9016L1783q710n5464Q2529J5467l4117
5876B96571k2195j2296k3057L4349L909J2896m6028m0768L3580k1123J17268O119
5864C39225l8946p90M7793o5222l8390K4620L7962j4985K526l919P848n9876j4984
5851B22862K5438L0905p24k799J7522j4768l1180k0544O936l1090M6396l0117
$$ plain form
5839 218837 224531 203087 275565 337347 314052 318465 346226 344464 338818 302977 317618 308320 257626
5826 257626 219596 283197 301416 281968 261871 252848 301252 297063 320410 276949 248584 225353
5814 225353 275044 353975 269361 281549 271265 304392 288993 291305 287619 245110 286022 290721
5802 290721 251076 287163 282953 274909 282883 296761 287188 283238 313792 344539 324985 293837 306517
5789 306517 332855 346762 382711 336908 311427 295474 333074 380653 305446 302219 320859 351701
5777 351701 333746 298093 273821 298665 348027 337581 279959 232687 279664 346291 392646 367076
5765 367076 312423 273891 308195 333839 307565 344284 349249 347140 342913 368265 313897 272271
5753 272271 280134 292654 313980 400014 326223 306383 305362 339546 343004 264629 344424 342746
$$ packed form
5839B18837N694k1444P2478O1782k3295M413K7761j762n646l5841J4641r298n0694
5826B57626l8030O3601J8219j9448k0097r023M8404m189K3347m3461k8365k3231
5814B25353M9691P8931q4614J2188j0284L3127j5399K312l686m2509M0912M699
5802B90721l9645L6087m210q044P974J3878r573l950L0554L0747j9554l1148J2680
5789C06517K6338J3907L5949m5803k5481j5953L7600M7579p5207l227J8640L0842
5777C51701j7955l5653k4272K4844M9362j0446n7622m7272M6977O6627M6355k5570
5765C67076n4653l8532L4304K5644k6274L6719M965k109m227K5352n4368m1626
5753B72271P863J2520K1326Q6034p3791j9840j021L4184L458p8375P9795j678
$$ plain form
5741 342746 370058 415508 288860 313313 409242 412093 428929 422883 406465 418539 379501 348018
5729 348018 385176 407590 465214 523365 457991 425676 408781 383152 333138 386917 413791 430463
5717 430463 411451 412898 469743 420484 489649 527646 524479 552540 578485 567387 602271 623416
5705 623416 579987 568509 494721 535841 541710 466019 439856 388840 334310 415924 450352 403426
5693 403426 429468 435921 435676 433776 412246 417050 433074 457924 517376 490121 573113 598307 579595
5680 579595 567807 617271 638847 674559 762108 825834 825421 816375 738594 693829 753294 759168
5668 759168 639249 632487 591234 659612 630811 600993 633122 635895 598559 566667 538351 502756
5656 502756 505183 506812 598049 641777 598810 577351 631439 669581 711697 748320 801037 832222
$$ packed form
5741C42746K7312M5450j26648K4453R5929K851J6836o046j6418J2074l9038l1483
5729C48018L7158K2414N7624N8151o5374l2315j6895k5629n0014N3779K6874J6672
5717D30463j9012J447N6845m9259O9165L7997l167K8061K5945j1098L4884K1145
5705F23416m3429j1478p3788M1120N869p5691k6163n1016n4530Q1614L4428m6926
5693D03426K6042O453k45j900k1530M804J6024K4850N9452k7255Q2992K5194j8712
5680E79595j1788M9464K1576L5712Q7549O3726m13r046p7781m4765N9465N874
5668G59168j19919o762m1253O8378k8801k9818L2129K773l7336l1892k8316l5595
5656E02756K427J629R1237M3728m2967k1459N4088L8142M2116L6623N2717L1185
$$ plain form
5644 832222 876817 917028 911971 941677 967894 955521 904079 832519 778044 687844 753067 706291
5632 706291 724355 737186 732243 735430 769157 781152 704562 623971 646432 806421 833346 789388
5620 789388 723359 749681 800864 785552 805608 832741 862573 817260 817239 759347 806352 885945
5608 885945 889980 829941 832339 788060 789122 822942 824992 826613 805016 835903 880579 863508 849679
5595 849679 865194 868882 914555 902291 931241 941582 946671 957220 962338 969949 998612 1086320
5583 1086320 1124681 1105346 1118816 1119329 1167926 1190549 1218785 1251568 1283229 1386603 1409061 1506670
5571 1506670 1558702 1556695 1569091 1600410 1635127 1727552 1707438 1702784 1794752 1927594 2014291 2151631
5559 2151631 2167552 2272340 2396207 2416360 2506436 2586999 2804057 2961855 3157762 3390841
$$ packed form
5644H32222M4595M0211n057K9706K6217j2373n1442p1560n4475r0200O5223m6776
5632G06291J8064J2831m943L187L3727J1995p6590q0591K2461J59989K6925m3958
5620G89388o6029K6322N1183j5312K0056K7133K9832m5313k1n7892M7005P9593
5608H85945M035o0039K398m4279J062L3820K050J621k1597L0887M4676j7071j3829
5595H49679J5515L688M5673j2264K8950J0341N089J0549N118P611K8663Q7708
5583A086320L8361j9335J3470N13M8597K2623K8236L2783L1661J03374K2458R7609
5571A506670N2032k007J2396L1319L4717R2425k0114m654R1968J32842Q6697J37340
5559B151631J5921J04788J23867K0153R0076Q0563K17058J57798J95907K33079
$$ plain form
5549 3390841 3586752 3810664 4125812 4454477 4828746 5157692 5476888 5767757 6190054 6404693
5539 6404693 6648967 6734714 6818897 6881722 6944600 6969659 6989873 7017755 7183257 7362360 7461199
5528 7461199 7691010 7907899 8224825 8519286 8774246 9113462 9512050 10018721 10445886 10889218
5518 10889218 11365846 11812420 12228195 12693513 13166230 13638042 14037697 14283377 14454319
5509 14454319 14486471 14526379 14445252 14364912 14283502 14151456 14173194 14266813 14379600 14566072 14884914
5498 14884914 15195791 15433261 15996365 16588006 17207650 17856972 18544642 19135656 19635461
5489 19635461 20063681 20243782 20408001 20653022 20648737 20531582 20374201 20153219 19839161 19569597
5479 19569597 19280661 19083772 18905916 18857591 18802678 18890008 18987013 19175850 19481688 19775944
$$ packed form
5549C390841J95911K23912L15148L28665L74269L28946L19196K90869M22297K14639
5539F404693K44274Q5747Q4183O2825O2878K5059K0214K7882J65502J79103R8839
5528G461199K29811K16889L16926K94461K54960L39216L98588N06671M27165M43332
5518A0889218M76628M46574M15775M65318M72717M71812L99655K45680J70942
5509A4454319L2152L9908q1127q0340q1410j32046K1738R3619J12787J86472L18842
5498A4884914L10877K37470N63104N91641O19644O49322O87670N91014M99805
5489A9635461M28220J80101J64219K45021m285j17155j57381k20982l14058k69564
5479A9569597k88936j96889j77856m8325n4913Q7330R7005J88837L05838K94256
$$ plain form
5469 19775944 20121975 20415163 20686687 20984465 21420888 21771656 22094666 22362062 22423015 22333480
5459 22333480 22131464 21872164 21644308 21321780 20990820 20492213 19938233 19304885 18870031
5450 18870031 18443674 18169149 18032851 17924043 17955562 18029427 18119529 18301506 18518036 18732477
5440 18732477 18908734 18944221 18853568 18768803 18615235 18446930 18169380 17682360 17151665 16560540
5430 16560540 15935877 15258653 14689864 14164456 13687775 13206884 12771565 12363737 12037326
5421 12037326 11675925 11348262 11133890 10950674 10800488 10728828 10654547 10642668 10542467 10469312
5411 10469312 10434881 10293833 10226615 10080437 9821926 9508084 9172190 8832472 8361822 7876155
5401 7876155 7432094 6927884 6580885 6250670 5859144 5529167 5350623 5104510 4856651 4664037
$$ packed form
5469A9775944L46031K93188K71524K97778M36423L50768L23010K67396O0953q9535
5459B2333480k02016k59300k27856l22528l30960m98607n53980o33348m34854
5450A8870031m26357k74525j36298j08808L1519P3865R0102J81977K16530K14441
5440A8732477J76257L5487r0653q4765j53568j68305k77550m87020n30695n91125
5430A6560540o24663o77224n68789n25408m76681m80891m35319m07828l26411
5421A2037326l61401l27663k14372j83216j50186p1660p4281j1879j00201p3155
5411A0469312l4431j41048o7218j46178k58511l13842l35894l39718m70650m85667
5401G876155m44061n04210l46999l30215l91526l29977j78544k46113k47859j92614
$$ plain form
5391 4664037 4485935 4311374 4166693 4000841 3846154 3846203 3737138 3641622 3524040 3394514
5381 3394514 3269501 3185764 3093537 3036725 2919891 2802081 2717416 2590050 2572526 2529541 2511351
5370 2511351 2460056 2412058 2291408 2253797 2252002 2165744 2166416 2161050 2012900 1967487 1914012 1971810
5358 1971810 1864693 1790412 1832835 1743409 1734433 1658450 1621151 1654905 1658754 1610226 1541859 1520079
5346 1520079 1502746 1481437 1507798 1489824 1443891 1370761 1378567 1360504 1298963 1293593 1236345 1238074
5334 1238074 1279662 1262401 1297669 1291112 1254860 1258753 1318743 1303179 1309629 1267139 1247536 1215254
5322 1215254 1260083 1207177 1203377 1192442 1218071 1262481 1284204 1225267 1136432 1110165 1099616 1116838
5310 1116838 1129104 1114673 1068796 1106746 1119773 1057646 1033805 1056776 1020348 977405 893213
$$ packed form
5391D664037j78102j74561j44681j65852j54687M9j09065r5516j17582j29526
5381C394514j25013q3737r2227n6812j16834j17810q4665j27366j7524m2985j8190
5370B511351n1295m7998j20650l7611j795q6258O72n366j48150m5413n3475N7798
5358A971810j07117p4281M2423q9426q976p5983l7299L3754L849m8528o8367k1780
5346A520079j7333k1309K6361j7974m5933p3130P806j8063o1541n370n7248J729
5334A238074M1588j7261L5268o557l6252L893N9990j5564O450m2490j9603l2282
5322A215254M4829n2906l800j0935K5629M4410K1723n8937q8835k6267j0549J7222
5310A116838J2266j4431m5877L7950J3027o2127k3841K2971l6428m2943q4192
$$ plain form
5299 893213 890440 945737 904961 949314 945039 904178 942218 873095 876737 918839 1028336 961872
5287 961872 934019 951546 892672 860329 864706 901985 921796 911182 892069 912196 928327 927070
5275 927070 909835 868922 869385 813730 792442 761001 722289 762792 787545 689812 746498 760324
5263 760324 810150 875171 864562 828453 853462 763166 689612 690884 705078 721803 739459 749864
5251 749864 723189 787797 804909 822267 748843 769798 823667 835187 827119 821649 827787 827577 816308
5238 816308 785357 798123 771829 801196 834146 776638 764688 752554 780345 748843 726527 734019
5226 734019 725669 712193 689079 701558 762767 753603 701458 736857 763122 742379 767915 770893
5214 770893 770393 724395 734964 783105 797870 790043 721185 761147 822928 784673 771440 748897
$$ packed form
5299H93213k773N5297m0776M4353m275m0861L8040o9123L642M2102J09497o6464
5287I61872k7853J7527n8874l2343M377L7279J9811j0614j9113K0127J6131j257
5275I27070j7235m0913M63n5655k1288l1441l8712M0503K4753r7733N6686J3826
5263G60324M9826O5021j0609l6109K5009r0296p3554J272J4194J6725J7656J0405
5251G49864k6675O4608J7112J7358p3424K0955N3869J1520q068n470O138k10j1269
5238H16308l0951J2766k6294K9367L2950n7508j1950j2134K7791l1502k2316P492
5226G34019q350j3476k3114J2479O1209r164n2145L5399K6265k0743K5536K978
5214G70893n00m5998J0569M8141J4765p827o8858L9962O1781l8255j3233k2543
$$ plain form
5202 748897 700440 715169 735636 743356 793363 895293 907773 823399 848089 846461 836216 857677
5190 857677 869883 916081 849066 833823 842617 846974 880455 832600 900707 959703 932241 882798
5178 882798 921211 969513 1028699 1032810 1048195 1032747 990645 989678 1083792 1087656 1065382 1072923 1083951
5165 1083951 1080292 1060328 1065314 1150339 1249143 1221006 1245675 1272640 1274079 1314346 1341087 1299756
5153 1299756 1304897 1357045 1411201 1489196 1604451 1697219 1701018 1653518 1680959 1778831 1783549 1797099
5141 1797099 1892425 1942167 2001236 2076612 2124873 2164482 2292346 2357949 2453346 2626598 2736212
5130 2736212 2801113 2908372 3056082 3230741 3370781 3512139 3748538 3966819 4209065 4523937
5120 4523937 4922080 5173991 5479199 5774960 6055880 6309408 6471857 6713789 6886497 6955704
$$ packed form
5202G48897m8457J4729K0467P720N0007J01930J2480q4374K4690j628j0245K1461
5190H57677J2206M6198o7015j5243Q794M357L3481m7855O8107N8996k7462m9443
5178H82798L8413M8302N9186M111J5385j5448m2102r67R4114L864k2274P541J1028
5165A083951l659j9964M986Q5025R8804k8137K4669K6965J439M0267K6741m1331
5153A299756N141N2148N4156P7995J15255R2768L799m7500K7441R7872M718J3550
5141A797099R5326M9742N9069P5376M8261L9609J27864O5603R5397J73252J09614
5130B736212O4901J07259J47710J74659J40040J41358K36399K18281K42246L14872
5120D523937L98143K51911L05208K95761K80920K53528J62449K41932J72708O9207
$$ plain form
5110 6955704 6947799 6985134 7002218 7076105 7108460 7166180 7183477 7252028 7267080 7334918 7426832 7606384
5098 7606384 7721776 7840852 8159121 8474214 8844403 9171873 9535187 9907029 10369848 10854590
5088 10854590 11401822 12072475 12755482 13439291 14137317 14855853 15489881 15976803 16275072
5079 16275072 16390845 16473452 16429916 16206649 16044458 15878661 15706467 15591197 15519150 15452368
5069 15452368 15445204 15412313 15440126 15588453 15706247 15792050 15908890 16083531 16257998 16400963
5059 16400963 16618292 16898537 17197925 17498124 17862750 18250137 18696306 19120402 19550223
5050 19550223 20004360 20409829 20639763 20806846 20934894 20868505 20732879 20507478 20167191 19850969
5040 19850969 19537039 19293783 19246738 19245471 19253796 19340115 19439150 19555077 19646026 19684012 19628701
$$ packed form
5110F955704p905L7335J7084P3887L2355N7720J7297O8551J5052O7838R1914J79552
5098G606384J15392J19076L18269L15093L70189L27470L63314L71842M62819M84742
5088A0854590N47232O70653O83007O83809O98026P18536O34028M86922K98269
5079A6275072J15773Q2607m3536k23267j62191j65797j72194j15270p2047o6782
5069A5452368p164l2891K7813J48327J17794Q5803J16840J74641J74467J42965
5059A6400963K17329K80245K99388L00199L64626L87387M46169M24096M29821
5050A9550223M54137M05469K29934J67083J28048o6389j35626k25401l40287l16222
5040A9850969l13930k43256m7045j267Q325Q6319R9035J15927R0949L7986n5311
$$ plain form
5029 19628701 19477562 19272759 18986010 18697193 18344535 18029797 17712766 17446052 17248174
5020 17248174 17172852 17009993 16852579 16658765 16479070 16298873 16176511 16099906 15980016 15799391
5010 15799391 15625420 15382584 15205771 15050259 14995280 15012194 15033675 15211940 15388817 15466439
5000 15466439 15625328 15673969 15656531 15539317 15245053 14838970 14298140 13782725 13172644 12503839
4990 12503839 11938733 11493762 11026625 10630997 10240826 9843720 9479500 9181562 8921387
4981 8921387 8642424 8476976 8305195 8179248 8100369 8001908 8016104 7942633 7932669 7916810 7857112
4970 7857112 7819137 7830864 7839216 7774556 7741070 7663500 7578278 7402932 7215414 6892077 6581623
4959 6581623 6273215 5987054 5700881 5399259 5199642 4942942 4701465 4505184 4380949 4294547
$$ packed form
5029A9628701j51139k04803k86749k88817l52658l14738l17031k66714j97878
5020A7248174p5322j62859j57414j93814j79695j80197j22362p6605j19890j80625
5010A5799391j73971k42836j76813j55512n4979J6914K1481J78265J76877P7622
5000A5466439J58889M8641j7438j17214k94264m06083n40830n15415o10081o68805
4990A2503839n65106m44971m67137l95628l90171l97106l64220k97938k60175
4981H921387k78963j65448j71781j25947p8879r8461J4196p3471r964j5859n9698
4970G857112l7975J1727Q352o4660l3486p7570q5222j75346j87518l23337l10454
4959F581623l08408k86161k86173l01622j99617k56700k41477j96281j24235q6402
$$ plain form
4949 4294547 4224616 4059413 3942964 3775375 3698012 3641066 3602422 3472862 3316923 3252066
4939 3252066 3247899 3183177 3181498 3122907 3096423 3008312 2982576 3037439 2949219 2856270 2819556 2819306
4927 2819306 2803145 2801660 2761519 2773133 2740963 2780007 2701317 2585736 2525791 2404281 2360656
4916 2360656 2302710 2236562 2223806 2240289 2186162 2219077 2215973 2195382 2190373 2143854 2053966 1981399
4904 1981399 1953802 1933810 1940255 1842639 1867242 1940046 1886020 1828989 1781821 1792837 1810849 1788651
4892 1788651 1747111 1683721 1643246 1664483 1705638 1690962 1681127 1618107 1609176 1586887 1564982 1536726
4880 1536726 1521770 1519395 1560785 1554857 1552951 1447044 1428737 1429356 1425758 1358907 1223800 1216397
4868 1216397 1279161 1365812 1384701 1326006 1302535 1283650 1388922 1387837 1357355 1360533 1344370 1385026
$$ packed form
4949D294547o9931j65203j16449j67589p7363n6946l8644j29560j55939o4857
4939C252066m167o4722j679n8591k6484q8111k5736N4863q8220r2949l6714k50
4927B819306j6161j485m0141J1614l2170L9044p8690j15581n9945j21510m3625
4916B360656n7946o6148j2756J6483n4127L2915l104k0591n009m6519q9888p2567
4904A981399k7597j9992O445r7616K4603P2804n4026n7031m7168J1016J8012k2198
4892A788651m1540o3390m0475K1237M1155j4676r835o3020q931k2289k1905k8256
4880A536726j4956k375M1390n928j906j05907j8307O19l598o6851j35107p403
4868A216397O2764Q6651J8889n8695k3471j8885J05272j085l0482L178j6163M0656
$$ plain form
4856 1385026 1330048 1406132 1434380 1356389 1408521 1445057 1455700 1430377 1384397 1462408 1522447
4845 1522447 1472729 1500382 1556737 1587122 1647744 1673947 1683481 1772605 1924871 1963365 2091823
4834 2091823 2268910 2405020 2559660 2767452 3063292 3384275 3829393 4375909 4959431 5674946
4824 5674946 6415892 7063720 7304278 6665016 5624508 4746065 4059975 3606719 3232512
4815 3232512 2966828 2749070 2528711 2375648 2213344 2064545 1969266 1886102 1792714 1727849
4805 1727849 1709042 1584807 1527318 1463895 1418151 1392441 1314911 1259273 1242635 1205603 1180186
4794 1180186 1176694 1139726 1080130 1119246 1022109 1025576 1106637 1057626 993026 973758 956612 931988
4782 931988 1011214 1095816 1079287 1000599 941930 927131 877166 895165 893402 883001 839217 818996
$$ packed form
4856A385026n4978P6084K8248p7991N2132L6536J0643k5323m5980P8011O0039
4845A522447m9718K7653N6355L0385O0622K6203R534Q9124J52266L8494J28458
4834B091823J77087J36110J54640K07792K95840L20983M45118N46516N83522P15515
4824E674946P40946O47828K40558o39262j040508q78443o86090m53256l74207
4815C232512k65684k17758k20359j53063j62304j48799r5279q3164r3388o4865
4805A727849j8807j24235n7489o3423m5744k5710p7530n5638j6638l7032k5417
4794A180186l492l6968n9596L9116r7137L467Q1061m9011o4600j9268j7146k4624
4782I31988P9226Q4602j6529p8688n8669j4799m9965J7999j763j0401m3784k0221
$$ plain form
4770 818996 866504 880275 905215 885713 876313 852149 854175 814873 839397 853485 815569 825342
4758 825342 798969 775004 850451 883585 890850 906404 864239 818590 798490 753419 798166 857825
4746 857825 857197 874086 805682 786881 734617 743689 783304 819985 804919 804935 823985 814425 762273
4733 762273 705462 731912 730833 749683 758294 799347 815106 806747 845890 814980 745268 755126
4721 755126 757396 778486 774005 825104 765953 791591 810190 809848 766366 748086 777189 871096
4709 871096 820347 757232 739129 763911 816447 834908 854200 835709 858022 807314 707786 785193
4697 785193 837570 811315 794311 787145 830468 834957 870627 895998 869210 886504 886511 854249 925272
4684 925272 892543 848920 861035 884038 912283 904746 922545 930571 970594 977798 949959 899131
$$ packed form
4770H18996M7508J3771K4940j9502r400k4164K026l9302K4524J4088l7916R773
4758H25342k6373k3965P5447L3134P265J5554m2165m5649k0100m5071M4747N9659
4746H57825o28J6889o8404j8801n2264R072L9615L6681j5066J6J9050r560n2152
4733G62273n6811K6450j079J8850Q611M1053J5759q359L9143l0910o9712R858
4721G55126K270K1090m481N1099n9151K5638J8599l42m3482j8280K9103R3907
4709H71096n0749o3115j8103K4782N2536J8461J9292j8491K2313n0708r9528P7407
4697G85193N2377k6255j7004p166M3323M489L5670K5371k6788J7294Pl2262P1023
4684I25272l2729m3623J2115K3003K8245p537J7799Q026M0023P204k7839n0828
$$ plain form
4672 899131 922743 966763 987485 1011205 1000588 1018982 995600 949586 995310 1009387 1011497 986079
4660 986079 987241 1014695 967620 1040715 1010993 971953 996059 988442 985720 1026903 1026806 994210 994075
4647 994075 1051915 1069137 1034662 1037031 1069483 1092139 1116250 1081509 1094250 1071963 1021579 1056450
4635 1056450 1151923 1090838 1038337 1080605 1082872 1085786 1101210 1100774 1126348 1084725 1128314 1161600
4623 1161600 1189715 1119235 1063505 1158182 1183481 1118410 1110538 1142135 1171042 1176984 1114670 1036623
4611 1036623 1045036 1128475 1152345 1120390 1085498 1098719 1112818 1125605 1149289 1169905 1139890 1194145
4599 1194145 1186620 1176040 1152911 1166444 1277321 1279534 1201715 1205393 1171614 1165458 1184087 1132311
4587 1132311 1188039 1107484 1073930 1148700 1095955 1130559 1162352 1124674 1050966 1071492 1089798
$$ packed form
4672H99131K3612M4020K0722K3720j0617J8394k3382m6014M5724J4077K110k5418
4660I86079J162K7454m7075P3095k9722l9040K4106p617k722M1183r7l2596j35
4647I94075N7840J7222l4475K369L2452K2656K4111l4741J2741k2287n0384L4871
4635A056450R5473o1085n2501M2268K267K914J5424m36K5574m1623M3589L3286
4623A161600K8115p0480n5730R4677K5299o5071p872L1597K8907N942o2314p8047
4611A036623Q413Q3439K3870l1955l4892J3221J4099J2787K3684K0616l0015N4255
4599A194145p525j0580k3129J3533J10877K213p7819L678l3779o156J8629n1776
4587A132311N5728q0555l3554P4770n2745L4604L1793l7678p3708K0526J8306
$$ plain form
4576 1089798 1153947 1158817 1132480 1121419 1101754 1167238 1228513 1293118 1223715 1222108 1178959 1141756
4564 1141756 1103951 1135639 1095331 1068345 1115973 1099779 1121631 1123597 1049122 1069594 1178417
4553 1178417 1123898 1095451 1087966 1145345 1141668 1139083 1121813 1007408 1044993 1056876 1113260 1114171
4541 1114171 1089672 1167997 1171633 1143964 1036622 1081276 1050980 1031138 1044912 1094946 1104808 1127646
4529 1127646 1110924 1142018 1118793 1165954 1097837 1073373 1097510 1141104 1225167 1165673 1253257
4518 1253257 1221044 1177453 1159653 1115610 1090012 1158613 1202966 1174260 1164007 1178179 1205630
4507 1205630 1165029 1133936 1150422 1197088 1251331 1168746 1136962 1173876 1205239 1190948 1208734
4496 1208734 1204088 1245744 1243504 1287256 1302118 1312634 1351725 1314722 1319485 1294035 1355726 1391930
$$ packed form
4576A089798O4149M870k6337j1061j9665O5484O1275O4605o9403j607m3149l7203
4564A141756l7805L1688m0308k6986M7628j6194K1852J966p4475K0472J08823
4553A178417n4519k8447p485N7379l677k585j7270j14405L7585J1883N6384R11
4541A114171k4499P8325L636k7669j07342M4654l0296j9842J3774N0034R862K2838
4529A127646j6722L1094k3225M7161o8117k4464K4137M3594Q4063n9494Q7584
4518A253257l2213m3591j7800m4043k5598O8601M4353k8706j0253J4172K7451
4507A205630m0601l1093J6486M6666N4243q2585l1784L6914L1363j4291J7786
4496A208734m646M1656k240M3752J4862J0516L9091l7003M763k5450O1691L6204
$$ plain form
4484 1391930 1419863 1477516 1515290 1496060 1503293 1500185 1490285 1574774 1609621 1645867 1590279 1604075
4472 1604075 1650929 1655316 1650575 1662028 1623963 1581264 1609648 1658728 1760469 1746412 1716457 1755851
4460 1755851 1783547 1814611 1846001 1846198 1813593 1814474 1822724 1812890 1872156 1933344 1955340 2008912 2011260
4447 2011260 1969695 2019767 1997270 2130317 2091538 2077669 2159647 2156067 2170983 2163208 2097901 2147827
4435 2147827 2222512 2210677 2206942 2313954 2332390 2350579 2417350 2463234 2535138 2546450 2610643
4424 2610643 2645164 2661255 2711394 2865157 2925433 3002620 3068771 3106619 3235574 3387421 3467642
4413 3467642 3630936 3770805 3919487 4086399 4283153 4359062 4528955 4727910 4926300 5115118
4403 5115118 5339133 5491276 5818205 6133611 6402899 6699840 7110082 7485079 7926593 8428676
$$ packed form
4484A391930K7933N7653L7774j9230P233l108r900Q4489L4847L6246n5588J3796
4472A604075M6854M387m741J1453l8065m2699K8384M9080J01741j4057k9955L9394
4460A755851K7696L1064L1390J97l2605Q81Q250r834N9266O1188K1996N3572K348
4447B011260m1565N0072k2497J33047l8779j3869Q1978l580J4916p775o5307M9926
4435B147827P4685j1835l735J07012J8436J8189O6771M5884P1904J1312O4193
4424B610643L4521J6091N0139J53763O0276P7187O6151L7848J28955J51847Q0221
4413C467642J63294J39869J48682J66912J96754P5909J69893J98955J98390J88818
4403E115118K24015J52143L26929L15406K69288K96941M10242L74997M41514N02083
$$ plain form
4393 8428676 8955112 9572511 10184647 10858968 11390778 11844224 12205156 12486027 12748404 12992605
4383 12992605 13387533 13963752 14638861 15399255 16203046 17147676 18028956 19012627 19791964
4374 19791964 20259429 20424575 20380962 20316286 20291810 20341355 20551373 21074223 21738688 22618906
4364 22618906 23568439 24520478 25461331 26136702 26564908 26506408 26149706 25557665 24934532 24360906
4354 24360906 23983904 23843583 23910907 24139620 24515951 25015102 25583059 26091150 26473791 26669878
4344 26669878 26559044 26279946 25915982 25482937 25192268 24964480 24865947 24811877 24739051 24835602
4334 24835602 24959040 25078163 25303276 25573333 25758359 25790141 25828413 25764065 25677082 25609018
4324 25609018 25564950 25529042 25494824 25615998 25838952 26119327 26401832 26751820 27007980 27310726
$$ packed form
4393H428676N26436O17399O12136O74321N31810M53446L60932K80871K62377K44201
4383A2992605L94928N76219O75109P60394Q03791R44630Q81280R83671P79337
4374A9791964M67465J65146m3613o4676k4476M9545K10018N22850O64465Q80218
4364B2618906R49533R52039R40853O75371M28206n8500l56702n92041o23133n73626
4354B4360906l77002j40321O7324K28713L76331M99151N67957N08091L82641J96087
4344B6669878j10834k79098l63964m33045k90669k27788r8533n4070p2826R6551
4334B4835602J23438J19123K25113K70057J85026L1782L8272o4348q6983o8064
4324B5609018m4068l5908l4218J21174K22954K80375K82505L49988K56160L02746
$$ plain form
4314 27310726 27758345 28185136 28731371 29312242 29727054 30146459 30387974 30448283 30407912 30273729
4304 30273729 29962563 29581220 29152083 28600949 28094489 27684470 27334463 27119619 27062384 27134209
4294 27134209 27263287 27365766 27475669 27676565 27927333 28267198 28620513 29087602 29416345
4285 29416345 29583909 29482180 29168369 28730576 28112585 27621564 27099847 26724690 26408128
4276 26408128 26159019 25979175 25743126 25442367 25038856 24619854 24111120 23681512 23322059
4267 23322059 22887439 22474025 22012209 21554805 21185192 20918205 20717872 20576216 20555526 20593974
4257 20593974 20722879 20888217 21132249 21311636 21353057 21273992 20921731 20346407 19658093 18855590
4247 18855590 17998567 17165397 16328042 15631257 15140545 14685305 14347369 14009299 13699769
$$ packed form
4314B7310726M47619M26791N46235N80871M14812M19405K41515O0309m0371j34183
4304C0273729l11166l81343m29137n51134n06460m10019l50007k14844n7235P1825
4294B7134209J29078J02479J09903K00896K50768L39865L53315M67089L28743
4285B9416345J67564j01729l13811m37793o17991m91021n21717l75157l16562
4276B6408128k49109j79844k36049l00759m03511m19002n08734m29608l59453
4267B3322059m34620m13414m61816m57404l69613k66987k00333j41656k0690L8448
4257B0593974J28905J65338K44032J79387M1421p9065l52261n75324o88314q02503
4247A8855590q57023q33170q37355o96785m90712m55240l37936l38070l09530
$$ plain form
4238 13699769 13466332 13163367 12865694 12619720 12337693 12007026 11709186 11421322 11152749
4229 11152749 10907663 10640060 10434263 10228385 10053052 9965027 9756268 9633814 9529528 9445201
4219 9445201 9473142 9480887 9415180 9503333 9510345 9411828 9231829 9033939 8858515 8634790 8492433
4208 8492433 8406935 8368060 8337180 8321869 8282893 8206666 8199421 8125625 8040841 7868729 7553547
4197 7553547 7322881 7051894 6731383 6524676 6376481 6255012 6075004 5872212 5807871 5633720
4187 5633720 5476390 5344714 5345733 5282744 5255029 5186402 5080075 5005065 4923842 4919484 4851441
4176 4851441 4783267 4749601 4795432 4824676 4797160 4778461 4711415 4777863 4818568 4863590 4962393
4165 4962393 4982871 5033744 5106058 5229289 5206904 5337705 5302796 5280720 5266430 5248875 5246479
$$ packed form
4238A3699769k33437l02965k97673k45974k82027l30667k97840k87864k68573
4229A1152749k45086k67603k05797k05878j75333q8025k08759j22454j04286q4327
4219I445201K7941P745o5707Q8153P012r8517j79999j97890j75424k23725j42357
4208H492433q5498l8875l0880j5311l8976p6227p245p3796q4784j72112l15182
4197G553547k30666k70987l20511k06707j48195j21469j80008k02792o4341j74151
4187E633720j57330j31676J019o2989k7715o8627j06327p5010q1223m358o8043
4176D851441o8174l3666M5831K9244k7516j8699o7046O6448M0705M5022R8803
4165D962393K0478N0873P2314J23231k2385J30801l4909k2076j4290j7555k396
$$ plain form
4154 5246479 5219043 5224318 5193188 5139026 5116452 5170930 5211395 5252649 5207585 5244038 5263311 5360385
4142 5360385 5425652 5404977 5330657 5288350 5208243 5102697 5037083 5073288 5000139 5000347 5015448 4995075
4130 4995075 5024459 5095621 5162437 5246001 5311622 5354585 5496128 5542048 5654091 5805443 5894454
4119 5894454 6089223 6187472 6291169 6555169 6654639 6749937 6994770 7274228 7441150 7664357
4109 7664357 7859190 8134001 8406443 8566935 8702589 8754289 8752030 8700363 8780645 8785350 8766193
4098 8766193 8894022 9049986 9226440 9454260 9709946 10000901 10317207 10573382 10828685 11005105
4088 11005105 11164471 11373816 11578950 11789397 11880849 11936288 12077061 12149923 12303910 12435257
4078 12435257 12714661 13048321 13417087 13742372 14105649 14629986 15106872 15619069 16166403
$$ packed form
4154E246479k7436N275l1130n4162k2574N4478M0465M1254m5064L6453J9273R7074
4142E360385O5267k0675p4320m2307q0107j05546o5614L6205p3149K08J5101k0373
4130D995075K9384P1162O6816Q3564O5621M2963J41543M5920J12043J51352Q9011
4119E894454J94769R8249J03697K64000R9470R5298K44833K79458J66922K23207
4109G664357J94833K74811K72442J60492J35654N1700k259n1667Q0282M705j9157
4098H766193J27829J55964J76454K27820K55686K90955L16306K56175K55303J76420
4088A1005105J59366K09345K05134K10447R1452N5439J40773P2862J53987J31347
4078A2435257K79404L33660L68766L25285L63277N24337M76886N12197N47334
$$ plain form
4069 16166403 16753943 17226863 17729067 18262306 18795450 19345971 19979006 20626384 21169534
4060 21169534 21695833 22094404 22386594 22630050 22829165 22895871 22891578 22857326 22744154 22717861
4050 22717861 22743217 22772580 22802304 22885441 22964900 23050466 23227093 23419539 23696479 24068984
4040 24068984 24523627 25030880 25689276 26219452 26706088 27250419 27788680 28388486 28972855
4031 28972855 29485164 29986275 30517528 30968547 31256560 31567128 31939747 32252496 32477533
4022 32477533 32590876 32753242 33066770 33346080 33722236 34267303 34995898 35843199 36726884
4013 36726884 37656389 38556962 39575002 40564495 41562791 42586034 43749902 44938397 46231083
4004 46231083 47798641 49549472 51471830 53573266 55884270 58262335 60666141 63074770
$$ packed form
4069A6166403N87540M72920N02204N33239N33144N50521O33035O47378N43150
4060B1169534N26299L98571K92190K43456J99115O6706m293l4252j13172k6293
4050B2717861K5356K9363K9724Q3137P9459Q5566J76627J92446K76940L72505
4040B4068984M54643N07253O58396N30176M86636N44331N38261N99806N84369
4031B8972855N12309N01111N31253M51019K88013L10568L72619L12749K25037
4022C2477533J13343J62366L13528K79310L76156N45067P28595Q47301Q83685
4013C6726884R29505R00573J018040R89493R98296J023243J163868J188495J292686
4004D6231083J567558J750831J922358K101436K311004K378065K403806K408629
$$ plain form
3996 63074770 65209411 66979014 68265456 69133093 69565395 69527065 69084197 68323133 67341819
3987 67341819 66317362 65480627 64800362 64313667 63882820 63541325 63191893 62628562 61864988
3978 61864988 60668651 58997051 56888594 54500016 51778003 48796553 45711330 42609345
3970 42609345 39559824 36764731 34224358 31893180 29760035 27913515 26238607 24754295
3962 24754295 23486099 22323631 21246782 20319960 19460014 18693358 17993127 17344448 16646035
3953 16646035 16031038 15492890 14948384 14473316 14045516 13576055 13142397 12786847 12416196
3944 12416196 12132873 11852251 11605080 11299989 11097401 10859883 10694536 10507954 10374045
3935 10374045 10229102 10111193 10053096 9930133 9817873 9660180 9457958 9263594 9206654 9109138
$$ packed form
3996F3074770K134641J769603J286442Q67637M32302l8330m42868p61064r81314
3987F7341819j024457q36735o80265m86695m30847l41495l49432n63331p63574
3978F1864988j196337j671600k108457k388578k722013k981450l085223l101985
3970D2609345l049521k795093k540373k331178k133145j846520j674908j484312
3962B4754295j268196j162468j076849r26822q59946p66656p00231o48679o98413
3953A6646035o14997n38148n44506m75068m27800m69461m33658l55550l70651
3944A2416196k83323k80622k47171l05091k02588k37518j65347j86582j33909
3935A0374045j44943j17909n8097j22963j12260j57693k02222j94364n6940r7516
$$ plain form
3925 9109138 9029847 8951862 8854442 8745683 8639124 8529960 8398769 8251239 8220296 8130100
3915 8130100 7970587 7918064 7818612 7783219 7663158 7574929 7550400 7547955 7513049 7413743 7384606
3904 7384606 7462699 7457444 7434736 7444761 7500589 7520535 7634472 7742325 7836794 7984371 8133924
3893 8133924 8218979 8346645 8502737 8583503 8653960 8765348 8847568 8898755 8903349 8880919 8965647
3882 8965647 8981542 9101038 9160395 9271847 9420543 9485628 9633889 9729151 9868370 10048767
3872 10048767 10102994 10277492 10523732 10670647 10861702 11046009 11289616 11495691 11724933 12022674
3862 12022674 12286437 12540531 12713341 13014088 13384140 13829103 14229126 14601830 15026791
3853 15026791 15564960 16184344 16778132 17539804 18316378 19091494 20005985 20970108 21930535
$$ packed form
3925I109138p9291p7985r7420j08759j06559j09164j31191j47530l0943r0196
3915H130100j59513n2523r9452l5393j20061q8229k4529k445l4906r9306k9137
3904G384606P8093n255k2708J0025N5828J9946J13937J07853R4469J47577J49553
3893H133924Q5055J27666J56092Q0766P0457J11388Q2220N1187M594k2430Q4728
3882H965647J5895J19496N9357J11452J48696O5085J48261R5262J39219J80397
3872A0048767N4227J74498K46240J46915J91055J84307K43607K06075K29242K97741
3862A2022674K63763K54094J72810L00747L70052M44963M00023L72704M24961
3853A5026791N38169O19384N93788P61672P76574P75116R14491R64123R60427
$$ plain form
3844 21930535 22872602 23832460 24825221 25567133 26198430 26656839 26923003 27068480 26998094 26856870
3834 26856870 26733940 26504237 26251106 25991170 25758320 25559342 25447657 25385201 25339149 25330750
3824 25330750 25348537 25402390 25504627 25691212 25847011 26022162 26293360 26556034 26772842 27026843
3814 27026843 27284853 27554348 27874968 28265767 28801375 29428487 30161089 30993613 32006332
3805 32006332 33199882 34632461 36312416 38266258 40533751 43232416 46409324 49925821
3797 49925821 53950595 58578507 63550717 68740848 74029815 79090216 83995951 88385066
3789 88385066 92229851 95552156 98205579 100205459 101565431 102139897 102139698 101602953 100592688
3780 100592688 99114868 97362647 95444979 93257041 90891515 88435294 85701315 82722553
$$ packed form
3844B1930535R42067R59858R92761P41912O31297M58409K66164J45477p0386j41224
3834B6856870j22930k29703k53131k59936k32850j98978j11685o2456m6052q399
3824B5330750J7787N3853J02237J86585J55799J75151K71198K62674K16808K54001
3814B7026843K58010K69495L20620L90799N35608O27112P32602Q32524J012719
3805C2006332J193550J432579J679955J953842K267493K698665L176908L516497
3797D9925821M024774M627912M972210N190131N288967N060401M905735M389115
3789H8385066L844785L322305K653423J999880J359972N74466j99n36745j010265
3780A00592688j477820j752221j917668k187938k365526k456221k733979k978762
$$ plain form
3772 82722553 79533864 76065383 72398557 68532926 64490399 60516857 56493144 52581578
3764 52581578 48889503 45386765 42105285 39111850 36390165 33830489 31502385 29461346
3756 29461346 27608937 25906370 24359889 23004554 21848905 20736145 19664541 18681572
3748 18681572 17836459 17093215 16406008 15797295 15227243 14763946 14359714 14014403 13646547
3739 13646547 13400319 13233753 12974009 12896116 12873541 12796336 12799271 12881014 12958445 13080028 13317166
3728 13317166 13556511 13748710 13907418 14032428 14172253 14269510 14328659 14292059 14151987 13988810
3718 13988810 13797063 13523878 13076632 12621747 12218577 11733680 11332375 10852344 10314392
3709 10314392 9877748 9506664 9109275 8761722 8453795 8123379 7784232 7594024 7319360
$$ packed form
3772H2722553l188689l468481l666826l865631m042527l973542m023713l911566
3764E2581578l692075l502738l281480k993435k721685k559676k328104k041039
3756B9461346j852409j702567j546481j355335j155649j112760j071604r82969
3748A8681572q45113p43244o87207o08713n70052m63297m04232l45311l67856
3739A3646547k46228j66566k59744p7893k2575p7205K935Q1743P7431J21583K37138
3728A3317166K39345J92199J58708J25010J39825R7257N9149l6600j40072j63177
3718A3988810j91747k73185m47246m54885m03170m84897m01305m80031n37952
3709A0314392m36644l71084l97389l47553l07927l30416l39147j90208k74664
$$ plain form
3700 7319360 7151245 7017907 6766383 6595482 6473683 6279568 6198551 6086840 6006026 5966750
3690 5966750 5914555 5817719 5746667 5613454 5606605 5612497 5626561 5612085 5590655 5496608 5515929 5527704
3678 5527704 5429455 5429341 5428081 5381524 5308838 5299554 5233355 5203480 5199188 5158369 5162819 5116948 4954842
3665 4954842 4940986 4933645 4969780 4911290 4841380 4879382 4913721 4770776 4647538 4672432 4623646
3654 4623646 4647351 4687201 4693648 4668028 4621476 4602270 4659421 4704808 4680453 4622365 4568971 4607335
3642 4607335 4656427 4670866 4656550 4689444 4758160 4729900 4784051 4858640 4809695 4874828 4983877
3631 4983877 5055727 5147101 5252842 5301266 5438795 5459166 5519722 5663150 5755134 5809038 5975895
3620 5975895 6131598 6319327 6521589 6660255 6831992 7029900 7323938 7718614 8043176 8350375
$$ packed form
3700G319360j68115j33338k51524j70901j21799j94115q1017j11711q0814l9276
3690E966750n2195r6836p1052j33213o849N892J4064j4476k1430r4047J9321J1775
3678E527704r8249j14j260m6557p2686r284o6199k9875m292m0819M450m5871j62106
3665D954842j3856p341L6135n8490o9910L8002L4339j42945j23238K4894m8786
3654D623646K3705L9850O447k5620m6552j9206N7151M5387k4355n8088n3394L8364
3642D607335M9092J4439j4316L2894O8716k8260N4151P4589m8945O5133J09049
3631D983877P1850R1374J05741M8424J37529K0371O0556J43428R1984N3904J66857
3620E975895J55703J87729K02262J38666J71737J97908K94038L94676L24562L07199
$$ plain form
3610 8350375 8669103 9067993 9500460 9823124 10173228 10474292 10721433 10925035 11089835 11312964
3600 11312964 11405510 11475072 11677332 11859269 11977276 12131326 12311803 12542956 12669485 12824503
3590 12824503 12952586 13046334 13082809 13177878 13189426 13109807 13160015 13162930 13213663 13322121 13406833
3579 13406833 13636772 13817350 14001580 14306489 14609943 14999567 15449828 15914739 16399429
3570 16399429 17025829 17606021 18333363 19248648 20283212 21331787 22466050 23800361 25315386
3561 25315386 27005949 28892142 31014039 33475091 36191923 39245533 42599162 46290335
3553 46290335 50334201 54626444 59135467 63667142 68143694 72494822 76616288 80419134
3545 80419134 83940111 87097957 90008631 92781271 95366072 97742851 99979131 101939511
$$ packed form
3610H350375L18728L98890M32467L22664L50104L01064K47141K03602J64800K23129
3600A1312964R2546O9562K02260J81937J18007J54050J80477K31153J26529J55018
3590A2824503J28083R3748L6475R5069J1548p9619N0208K915N0733J08458Q4712
3579A3406833K29939J80578J84230L04909L03454L89624M50261M64911M84690
3570A6399429O26400N80192P27342R15285J034564J048575J134263J334311J515025
3561B5315386J690563J886193K121897K461052K716832L053610L353629L691173
3553D6290335M043866M292243M509023M531675M476552M351128M121466L802846
3545H0419134L520977L157846K910674K772640K584801K376779K236280J960380
$$ plain form
3537 101939511 103581758 104836360 105548822 105768584 105441993 104554499 103093320 101164033 98971582
3528 98971582 96487358 93814246 90913701 87827253 84444075 80900250 77196174 73279676
3520 73279676 69251106 65149623 61059932 57096282 53329563 49642767 46213999 43084894
3512 43084894 40355938 37880297 35715084 33738603 32111265 30674362 29418558 28347981
3504 28347981 27343667 26529250 25826972 25189570 24604350 24232410 23861917 23522627 23283979
3495 23283979 23075340 22817868 22606477 22443612 22273565 22166028 22083866 21995731 21921182 21854723
3485 21854723 21740657 21730928 21720043 21622872 21486036 21434292 21419044 21334414 21073653 20969897 20841335
3474 20841335 20718658 20607072 20456011 20428456 20348863 20101189 19708539 19021059 18351352 17739524
$$ packed form
3537A01939511J642247J254602P12462K19762l26591q87494j461179j929287k192451
3528I8971582k484224k673112k900545l086448l383178l543825l704076l916498
3520G3279676m028570m101483m089691l963650l766719l686796l428768l129105
3512D3084894k728956k475641k165213j976481j627338j436903j255804j070577
3504B8347981j004314q14417p02278o37402n85220l71940l70493l39290k38648
3495B3283979k08639k57472k11391j62865j70047j07537q2162q8135p4549o6459
3485B1854723j14066r729j0885r7171j36836n1744j5248q4630k60761j03756j28562
3474B0841335j22677j11586j51061k7555p9593k47674l92650o87480o69707o11828
$$ plain form
3464 17739524 17252668 16865511 16381539 16026320 15710335 15393719 15071547 14842273 14738784
3455 14738784 14696032 14615564 14531714 14567510 14649456 14839208 15044046 15341034 15678544 16056865
3445 16056865 16516565 16964754 17546182 18174201 18656689 18929539 19001143 18733909 18631034 18612449
3435 18612449 18661116 18754871 18866213 19009714 19147892 19197812 19249543 19162365 18948603 18779122
3425 18779122 18631951 18428431 18128511 17922417 17837782 17705998 17548487 17505143 17477422 17477513 17485192
3414 17485192 17524648 17572088 17759039 18018438 18332439 18767639 19227591 19683620 20019455 20396092
3404 20396092 20943635 21619951 22521911 23643481 24940595 26241233 27783585 29597118 31529801
3395 31529801 33620160 35990753 38740508 41824854 45325820 49145764 53257682 57560539
$$ packed form
3464A7739524m86856l87157m83972l55219l15985l16616l22172k29274j03489
3455A4738784m2752q0468q3850L5796Q1946J89752K04838K96988L37510L78321
3445A6056865M59700M48189N81428O28019M82488K72850P1604k67234j02875j8585
3435A8612449M8667R3755J11342J43501J38178M9920N1731q7178k13762j69481
3425A8779122j47171k03520k99920k06094q4635j31784j57511m3344k7721R1P679
3414A7485192L9456M7440J86951K59399L14001M35200M59952M56029L35835L76637
3404B0396092N47543O76316R01960J121570J297114J300638J542352J813533J932683
3395C1529801K090359K370593K749755L084346L500966L819944M111918M302857
$$ plain form
3387 57560539 61920222 66187173 70023919 73178285 75560792 77101932 77658612 77023115
3379 77023115 75360748 72834023 69452779 65480235 61180894 56839836 52683587 48707284
3371 48707284 45021213 41676002 38712001 36135926 33955891 31988031 30349234 28817982
3363 28817982 27466985 26251965 25096464 24112556 23216748 22336570 21597218 20901021 20277572
3354 20277572 19680557 19177207 18753403 18350574 18033281 17681773 17451273 17322171 17133707
3345 17133707 16912356 16636437 16082992 15377404 14700592 14037628 13475190 13037123 12561123
3336 12561123 12043848 11589163 11198138 10758589 10391188 10059045 9697152 9374968 9133526
3327 9133526 8896992 8726890 8587526 8409277 8327472 8267865 8202407 8225098 8238688 8272317 8295450
$$ packed form
3387E7560539M359683M266951L836746L154366K382507J541140N56680o35497
3379G7023115j662367k526725l381244l972544m299341m341058m156249l976303
3371D8707284l686071l345211k964001k576075k180035j967860j638797j531252
3363B8817982j350997j215020j155501r83908q95808q80178p39352o96197o23449
3354B0277572n97015n03350m23804m02829l17293l51508k30500j29102j88464
3345A7133707k21351k75919n53445p05588o76812o62964n62438m38067m76000
3336A2561123n17275m54685l91025m39549l67401l32143l61893l22184k41442
3327I133526k36534j70102j39364j78249q1805n9607o5458K2691J3590L3629K3133
$$ plain form
3316 8295450 8140003 7859414 7443629 7019199 6733654 6565684 6423268 6217878 6048317 5888948
3306 5888948 5759585 5636157 5503546 5399827 5206028 5023148 4914390 4796573 4685025 4639073
3296 4639073 4552725 4511664 4506837 4443480 4383109 4343950 4341135 4349712 4320607 4264492 4284600 4219012
3284 4219012 4251725 4197428 4148256 4067445 3963423 3858607 3772814 3649140 3567147 3556015 3562926
3273 3562926 3528541 3521571 3533533 3531621 3514632 3458154 3447746 3451504 3482975 3505026 3493277 3502300
3261 3502300 3548555 3585667 3590974 3678113 3689782 3724043 3716186 3742934 3760002 3731717 3838967 3811807
3249 3811807 3759934 3794498 3813303 3809593 3783470 3820074 3822683 3812242 3826604 3807852 3773468 3772735
3237 3772735 3754334 3710233 3737351 3749303 3776636 3780458 3777894 3787529 3768310 3804631 3871977 3884717
$$ packed form
3316H295450j55447k80589m15785m24430k85545j67970j42416k05390j69561j59369
3306E888948j29363j23428j32611j03719j93799j82880j08758j17817j11548m5952
3296D639073q6348m1061m827o3357o0371l9159k815Q577k9105n6115K0108o5588
3284D219012L2713n4297m9172q0811j04022j04816q5793j23674q1993j1132O911
3273C562926l4385o970J1962j912j6989n6478j0408L758L1471K2051j1749R023
3261C502300M6255L7112N307Q7139J1669L4261p857K6748J7068k8285J07250k7160
3249C811807n1873L4564J8805l710k6123L6604K609j0441J4362j8752l4384p33
3237C772735j8401m4101K7118J1952K7333L822k564R635j9219L6321O7346J2740
$$ plain form
3225 3884717 3918821 3950715 3928567 3971032 3962153 4041877 4065182 4071202 4125529 4130755 4139059 4109364
3213 4109364 4136311 4157031 4188750 4204365 4293069 4440059 4496349 4512883 4616037 4627288 4689906
3202 4689906 4814394 4899918 4969670 5049631 5115646 5194775 5288894 5378702 5471497 5616686 5702405
3191 5702405 5777704 5868228 6008809 6068295 6226477 6344876 6517803 6703330 6918009 7109192
3181 7109192 7272503 7488114 7618441 7808278 8058345 8272398 8579891 8773809 9016739 9262470
3171 9262470 9580209 9994890 10402134 10740922 11052684 11488155 12039250 12653536 13317465 14042887
3161 14042887 14880143 15684466 16526003 17414819 18235133 18905271 19361860 19617306 19851936
3152 19851936 20255354 20685019 21294868 22043662 22938905 23955388 25118249 26346583 27642426
$$ packed form
3225C884717L4104L1894k2148M2465q879P9724K3305O020N4327N226Q304k9695
3213D109364K6947K0720L1719J5615Q8704J46990N6290J6534J03154J1251O2618
3202D689906J24488Q5524O9752P9961O6015P9129R4119Q9808R2795J45189Q5719
3191E702405P5299R0524J40581N9486J58182J18399J72927J85527K14679J91183
3181G109192J63311K15611J30327J89837K50067K14053L07493J93918K42930K45731
3171I262470L17739M14681M07244L38788L11762M35471N51095O14286O63929P25422
3161A4042887Q37256Q04323Q41537Q88816Q20314O70138M56589K55446K34630
3152A9851936M03418M29665O09849P48794Q95243J016483J162861J228334J295843
$$ plain form
3143 27642426 29065281 30572974 32217887 33882753 35886642 38142792 40546031 43308325
3135 43308325 46391749 49853942 53775559 58220551 63189560 68780326 75007269 82113278
3127 82113278 90094650 99108963 109407634 121353576 135224492 151766892 171684687
3120 171684687 195099280 221608258 249679295 276089808 294901378 298319293 282333608
3113 282333608 252364201 219059698 189376517 165050831 145593187 130199312 117758978
3106 117758978 107688823 99198626 91770687 85016171 78945309 73477166 68741259 64557095
3098 64557095 60984415 57797731 54920170 52564037 50527445 48839007 47505361 46436086
3090 46436086 45553280 45006773 44607176 44277928 44076123 43954635 43800142 43713683 43525784 43241131
$$ packed form
3143B7642426J422855J507693J644913J664866K003889K256150K403239K762294
3135D3308325L083424L462193L921617M444992M969009N590766O226943P106009
3127H2113278P981372R014313J0298671J1945942J3870916J6542400J9917795
3120A71684687K3414593K6508978K8071037K6410513J8811570L417915j5985685
3113B82333608k9969407l3304503k9683181k4325686j9457644j5393875j2440334
3106A17758978j0070155q490197p427939o754516o070862n468143m735907m184164
3098F4557095l572680l186684k877561k356133k036592j688438j333646j069275
3090D6436086q82806n46507l99597l29248k01805j21488j54493q6459j87899k84653
$$ plain form
3080 43241131 42772894 42142406 41474640 41104882 41094323 41335465 41859692 42768116 43954171
3071 43954171 45398743 46991755 48700253 50162840 51196070 51447266 50761884 49096066
3063 49096066 46587724 43750379 40740695 37923622 35317478 32940363 30771609 28943187
3055 28943187 27336834 25833768 24486674 23322784 22232262 21175932 20120477 19234015
3047 19234015 18240126 17269082 16316875 15375865 14556672 13752166 13042047 12355767 11711787
3038 11711787 11213077 10783124 10354877 9873541 9460213 9114753 8794027 8537425 8136485
3029 8136485 7836554 7507049 7238835 7072564 6882521 6656847 6379536 6220656 6128802 6011396
3019 6011396 5752288 5566750 5422507 5212050 5000056 4846653 4688197 4522449 4444433 4285471
$$ packed form
3080D3241131m68237o30488o67766l69758j0559K41142N24227R08424J186055
3071D3954171J444572J593012J708498J462587J033230K51196o85382j665818
3063D9096066k508342k837345l009684k817073k606144k377115k168754j828422
3055B8943187j606353j503066j347094j163890j090522j056330j055455q86462
3047A9234015r93889r71044r52207r41010q19193q04506p10119o86280o43980
3038A1711787m98710m29953m28247m81336m13328l45460l20726k56602m00940
3029H136485k99931l29505k68214j66271j90043k25674k77311j58880r1854j17406
3019F011396k59108j85538j44243k10457k11994j53403j58456j65748p8016j58962
$$ plain form
3009 4285471 4266574 4166342 4103196 4048339 3914963 3791197 3700099 3665067 3568946 3526935 3493572
2998 3493572 3419215 3318693 3179014 3120920 3032440 2973757 2897139 2856979 2743235 2648101 2611992
2987 2611992 2553968 2482305 2428015 2343359 2283999 2290513 2173776 2127146 2077656 2023134 1980182
2976 1980182 1994443 1973070 1840991 1892689 1887585 1878610 1907116 1908445 1949947 1905919 1825629 1803118
2964 1803118 1788755 1711440 1727810 1675355 1676794 1637982 1580672 1537330 1473992 1436667 1374690 1358045
2952 1358045 1371910 1330645 1269052 1231737 1200077 1212600 1162714 1137822 1120033 1098366 1145602
2941 1145602 1113611 1045149 1053070 1018957 927853 913349 895011 937164 897197 838614 918455 817440
2929 817440 771097 787452 751373 682788 637371 687636 669904 660770 678906 604225 644587 611952
$$ packed form
3009D285471j8897j00232o3146n4857j33376j23766r1098l5032r6121m2011l3363
2998C493572p4357j00522j39679n8094q8480n8683p6618m0160j13744r5134l6109
2987B611992n8024p1663n4290q4656n9360O514j16737m6630m9490n4522m2952
2976A980182J4261k1373j32079N1698n104q975K8506J329M1502m4028q0290k2511
2964A803118j4363p7315J6370n2455J439l8812n7310m3342o3338l7325o1977j6645
2952A358045J3865m1265o1593l7315l1660J2523m9886k4892j7789k1667M7236
2941A145602l1991o8462P921l4113r1104j4504j8338M2153l9967n8583P9841j01015
2929H17440m6343J6355l6079o8585m5417N0265j7732r134J8136p4681M0362l2635
$$ plain form
2917 611952 570680 532391 543737 612379 626207 601662 498962 484511 559747 520057 482097
2906 482097 460373 506616 488970 486590 409129 417063 412950 366391 457893 398357 361375 332919
2894 332919 374927 367088 348437 348264 352358 336771 359694 348225 343649 381196 336825 328663 343807
2881 343807 278176 353111 312869 329809 325205 354260 407384 328104 263779 281425 277174 264859
2869 264859 234996 237588 199976 150044 203335 180340 187878 173171 164696 241298 265368 323084
2857 323084 335958 210779 237968 294485 291345 259277 246018 341706 348012 308094 363738 445155
2845 445155 471570 450785 431048 471259 524712 591795 597544 694231 763858 795201 898437 997121
2833 997121 1124063 1213142 1306181 1407767 1403785 1228754 1047954 844409 785781 652576 554996
$$ packed form
2917F11952m1272l8289J1346O8642J3828k4545j02700j4451P5236l9690l7960
2906D82097k1724M6243j7646k380p7461P934m113m6559R1502n9536l6982k8456
2894C32919M2008p839j8651j73M094j5587K2923j1469m576L7547m4371q162J5144
2881C43807o5631P4935m0242J6940m604K9055N3124p9280o4325J7646m251j2315
2869B64859k9863K592l7612m9932N3291k2995P538j4707q475P6602K4070N7716
2857C23084J2874j25179K7189N6517l140l2068j3259R5688O306l9918N5644Q1417
2845D45155K6415k0785j9737M0211N3453O7083N749R6687O9627L1343J03236R8684
2833I97121J26942Q9079R3039J01586l982j75031j80800k03545n8628j33205r7580
$$ plain form
2822 554996 524537 453585 384022 332308 354866 328203 301222 323655 235190 244757 299365 256649
2810 256649 244788 184528 189864 204323 186502 149952 214601 237295 126187 165388 175956 119457
2798 119457 116940 121518 123165 90591 99433 60276 43445 44511 71917 84293 16754 4237 84649
2785 84649 50076 37542 79722 95636 37581 55573 88889 101306 124069 29645 33688 39468
2773 39468 15458 -44292 -66464 -33641 -55934 -101372 -75586 -70960 -93354 -50095 -21327 -63230
2761 -63230 -45363 -39931 -34692 -131313 -177006 -180740 -180218 -199668 -212150 -130157 -151490 -175579 -130145
2748 -130145 -101097 -191266 -199890 -173987 -181036 -204743 -192226 -150976 -171425 -226275 -296207 -262968
2736 -262968 -253461 -213338 -145618 -96199 -110514 -190758 -194835 -176224 -198798 -210847 -156280 -166817
$$ packed form
2822E54996l0459p0952o9563n1714K2558k6663k6981K2433q8465R567N4608m2716
2810B56649j1861o0260N336J4459j7821l6550O4649K2694j11108L9201J0568n6499
2798A19457k517M578J647l2574Q842l9157j6831J066K7406J2376o7539j2517Q0412
2785H4649l4573j2534M2180J5914n8055J7992L3316J2417K2763r4424M043N780
2773C9468k4010n9750k2172L2823k2293m5438K5786M626k2394M3259K8768m1903
2761f3230J7867N432N239r6621m5693l734N22j9450j2482Q1993k1333k4089M5434
2748a30145K9048r0169q624K5903p049k3707J2517M1250k0449n4850o9932L3239
2736b62968R507M0123O7720M9419j4315q0244m077J8611k2574j2049N4567j0537
$$ plain form
2724 -166817 -182692 -150774 -201009 -261118 -218172 -247697 -230362 -216739 -182014 -160276 -250795 -234152
2712 -234152 -265626 -278755 -254967 -278997 -209893 -163113 -186689 -153814 -228302 -171899 -147972 -191097
2700 -191097 -241020 -228404 -163764 -204759 -239999 -227377 -219934 -217487 -252445 -211103 -189094 -151687
2688 -151687 -137643 -199800 -168419 -181073 -239198 -251385 -266793 -210506 -165668 -183035 -183388 -173074
2676 -173074 -226733 -190907 -153545 -216122 -258132 -182419 -240842 -242750 -199329 -254686 -185028 -149491
2664 -149491 -195007 -241937 -239384 -273453 -205238 -187235 -176448 -191692 -208677 -221640 -207027 -250029
2652 -250029 -283988 -284724 -278567 -260816 -255354 -291768 -280254 -305845 -273538 -261452 -246532 -256921
2640 -256921 -257172 -275304 -284642 -254578 -252862 -220657 -187581 -237705 -265493 -218205 -206098 -218585
$$ packed form
2724a66817j5875L1918n0235o0109M2946k9525J7335J3623L4725K1738r0519J6643
2712b34152l1474j3129K3788k4030O9104M6780k3576L2875p4488N6403K3927m3125
2700a91097m9923J2616O4640m0995l5240J2622P443K447l4958M1342K2009L7407
2688a51687J4044o2157L1381j2654n8125j2187j5408N6287M4838j7367l53J0314
2676a73074n3659L5826L7362o2577m2010P5713n8423j908M3421n5357O9658L5537
2664a49491m5516m6930K553l4069O8215J8003J0787j5244j6985j2963J4613m3002
2652b50029l3959p36O157J7751N462l6414J1514k5591L2307J2086J4920j0389
2640b56921k51j8132r338L0064J716L2205L3076n0124k7788M7288J2107j2487
$$ plain form
2628 -218585 -208112 -197659 -249428 -224065 -228094 -271631 -261781 -219723 -237141 -220726 -230480 -234664
2616 -234664 -230236 -220829 -243325 -275067 -252826 -225086 -206985 -217845 -174579 -244433 -301055 -300961 -290483
2603 -290483 -240368 -146601 -180275 -216796 -242847 -192485 -245045 -217055 -186226 -246329 -203933 -231795
2591 -231795 -241845 -252288 -249196 -176132 -154838 -182788 -156843 -146060 -245904 -247691 -213704 -253830
2579 -253830 -239816 -218556 -187197 -171801 -211192 -230629 -148287 -90411 -82247 -118360 -152403 -159112
2567 -159112 -186236 -240850 -211024 -179107 -135924 -145987 -207251 -137397 -128803 -148236 -171198 -230321
2555 -230321 -157771 -90821 -67562 -70258 -75935 -125132 -90213 -44346 -11335 1612 -20669 -26276
2543 -26276 -79136 -104621 -143502 -148905 -155078 -212086 -200526 -187437 -167874 -175034 -187817 -156556
$$ packed form
2628b18585J0473J0453n1769K5363m029m3537R850M2058j7418J6415r754m184
2616b34664M428R407k2496l1742K2241K7740J8101j0860M3266o9854n6622R4J0478
2603b90483N0115R3767l3674l6521k6051N0362n2560K7990L0829o0103M2396k7862
2591b31795j0050j0443L092P3064K1294k7950K5945J0783r9844j787L3987m0126
2579b53830J4014K1260L1359J5396l9391j9437Q2342N7876Q164l6113l4043o709
2567a59112k7124n4614K9826L1917M3183j0063o1264O9854Q594j9433k2962n9123
2555b30321P2550O6950K3259k696n677m9197L4919M5867L3011J2947k2281n607
2543b6276n2860k5485l8881n403o173n7008J1560J3089J9563p160j2783L1261
$$ plain form
2531 -156556 -113599 -162124 -81874 -138990 -172528 -155029 -120796 -146643 -164507 -100225 -109907 -175570
2519 -175570 -227507 -172247 -110318 -119509 -134848 -163747 -190790 -158681 -163284 -141103 -87858 -111695
2507 -111695 -70346 -84580 -100172 -165753 -107253 -97212 -116142 -84497 -141534 -173125 -191701 -149745
2495 -149745 -211994 -208020 -215270 -121175 -38828 -75854 -115074 -151217 -177400 -203619 -218416 -260913
2483 -260913 -231402 -220758 -204428 -153020 -169080 -192982 -196427 -165517 -159763 -136166 -128504 -133693
2471 -133693 -132448 -131574 -129479 -149910 -160767 -171385 -140259 -166266 -120823 -92785 -127234 -72795
2459 -72795 -150234 -186622 -165207 -40894 -18253 -99813 -104453 -20324 -75519 -58242 -110383 -155506
2447 -155506 -162913 -121472 -88407 -88310 -76382 -69458 -81682 -92644 -66911 -89470 -182713 -152188 -90187
$$ packed form
2531a56556M2957m8525Q0250n7116l3538J7499L4233k5847j7864O4282r682o5663
2519a75570n1937N5260O1929r191j5339k8899k7043L2109m603K2181N3245k3837
2507a11695M1349j4234j5592o5581N8500J0041j8930L1645n7037l1591j8576M1956
2495a49745o2249L974p250R4095Q2347l7026l9220l6143k6183k6219j4797m2497
2483b60913K9511J0644J6330N1408j6060k3902l445L0910N754K3597P662n189
2471a33693J245Q74K095k0431j0857j0618L1126k6007M5443K8038l4449N4439
2459g2795p7439l6388K1415J24313K2641q1560m640Q4129n5195J7277n2141m5123
2447a55506p407M1441L3065R7J1928O924j2224j0962K5733k2559r3243L0525O2001
$$ plain form
2434 -90187 -66810 -45431 -57262 -135325 -150076 -175076 -222101 -144693 -74114 -44169 -13067 21304
2422 21304 -49434 -96027 -67298 -32388 -62336 -26372 -55088 -45278 -31834 -82615 -114648 -146363
2410 -146363 -110021 -13565 -5911 38733 -20030 -28598 -47793 -22089 -10927 -35216 -68207 -70015
2398 -70015 -11971 -37443 -21598 76232 80642 39506 10403 -10246 -49412 -45414 24357 -39711
2386 -39711 -25073 15316 54874 58758 38944 -20434 -14709 -40534 -77605 42745 14248 -20906
2374 -20906 -41170 -35131 1999 50337 54723 31742 68377 55795 64654 14850 -1534 16026
2362 16026 92241 80905 66550 32717 64075 112509 119673 137718 131663 135464 214659 191626
2350 191626 121700 143231 177722 151156 175946 183969 232789 187480 182462 266488 250833 295667
$$ packed form
2434i0187K3377K1379j1831p8063j4751k5000m7025P7408P0579K9945L1102L4371
2422B1304p0738m6593K8729L4910k9948L5964k8716R810J3444n0781l2033l1715
2410a46363L6342R6456P654M4644n8763q568j9195K5704J1162k4289l2991j808
2398g0015N8044k5472J5845R7830M410m1136k9103k0649l9166L998O9771o4068
2386c9711J4638M0389L9558L884j9814n9378N725k5825l7071J20350k8497l5154
2374b0906k0264O039L7130M8338M386k2981L6635j2582Q859m9804j6384J7560
2362A6026P6215j1336j4355l3833L1358M8434P164J8045o055L801P9195k3033
2350A91626o9926K1531L4491k6566K4790Q023M8820m5309n018Q4026j5655M4834
$$ plain form
2338 295667 316628 239645 185580 241584 271500 302646 305864 398560 400220 363447 334870 429046
2326 429046 430615 500247 553379 529847 551138 549777 598989 600229 638211 715288 749167 768486
2314 768486 825827 926887 1018597 1030219 1140574 1243628 1325374 1408217 1481069 1539950 1660667
2303 1660667 1821407 1928264 2050052 2232303 2477218 2711178 2965293 3343169 3678911 4041144
2293 4041144 4276190 4415202 4771820 5293401 5988148 6699108 7615399 8719050 10141563
2284 10141563 11910906 14074265 16513531 19536076 22301435 23738058 20980995 16040168
2276 16040168 12637724 10369220 8791751 7533967 6555360 5805096 5165057 4706258 4447886
2267 4447886 4091221 3865322 3632750 3385056 3038042 2684294 2413023 2155078 1908616 1835788
$$ packed form
2338B95667K0961p6983n4065N6004K9916L1146L218R2696J660l6773k8577R4176
2326D29046J569O9632N3132k3532K1291j361M9212J240L7982P7077L3879J9319
2314G68486N7341J01060R1710J1622J10355J03054Q1746Q2843P2852N8881J20717
2303A660667J60740J06857J21788J82251K44915K33960K54115L77876L35742L62233
2293D041144K35046J39012L56618N21581O94747P10960R16291J103651J422513
2284A0141563J769343K163359K439266L022545K765359J436623k757063m940827
2276A6040168l402444k268504j577469j257784r78607p50264o40039m58799k58372
2267D447886l56665k25899k32572k47694l47014l53748k71271k57945k46462p2828
$$ plain form
2257 1835788 1732194 1566476 1421624 1410820 1268729 1136325 1058302 983573 950078 1015127
2247 1015127 937213 895628 801228 765020 692982 629188 628206 663391 682533 611393 467042 462006
2235 462006 470673 414870 390619 340592 346139 329700 255265 186223 232596 258172 187291 183690
2223 183690 239832 189458 200808 187912 68697 78158 117147 91736 75085 81892 114076 172715
2211 172715 167295 96150 142555 157078 130839 118205 98377 86927 128936 106000 63180 -19965
2199 -19965 11464 55198 87857 76117 78678 48299 36645 63913 68487 61138 8783 -952 -12521
2186 -12521 1305 50947 7724 -21472 8515 -53332 -47588 17799 21975 -43184 -74146 -8463
2174 -8463 16553 -71817 -92856 -89171 -56216 -42157 -55804 -77608 -77080 -42574 -41083 36945 59735
$$ packed form
2257A835788j03594j65718j44852j0804j42091j32404p8023p4729l3495O5049
2247A015127p7914m1585r4400l6208p2038o3794r82L5185J9142p1140j44351n036
2235D62006Q667n5803k4251n0027N547j6439p4435o9042M6373K5576p0881l601
2223A83690N6142n0374J1350j2896j19215R461L8989k5411j6651O807L2184N8639
2211A72715n420p1145M6405J4523k6239j2634j9828j1450M2009k2936m2820q3145
2199a9965L1429M3734L2659j1740K561l0379j1654K7268M574p349n2355r735j1569
2186a2521J3826M9642m3223k9196K9987o1847N744O5387M176o5159l0962O5683
2174h463K5016q8370k1039L685L2955J4059j3647k1804N28L4506J491P8028K2790
$$ plain form
2161 59735 44466 2280 -40726 8253 -16676 -31786 21115 -42325 769 14497 60359 59677
2149 59677 -11675 -28799 -85969 -77046 -7470 17852 -63052 -35103 -25237 -74683 -162449 -127746
2137 -127746 -50113 -18905 -38569 -63359 -60171 -74062 -43578 12639 -85227 -110215 -35923 -4628
2125 -4628 38816 -27323 28484 3650 -45040 -36706 -60938 -72312 -64381 -57196 -57841 -95417 -46717
2112 -46717 3218 -24735 513 -48465 -66847 -148392 -91853 -70860 -101409 -63677 -84351 -126667
2100 -126667 -117121 -122376 -144555 -82789 -75875 -86390 -129320 -135980 -99852 -101804 -44699 -71210 -132966
2087 -132966 -123688 -73703 -73531 -48064 -97812 -171768 -92743 -93147 -156037 -165385 -50722 17989 1611
2074 1611 7947 53573 6579 -2397 -62248 -109855 -100515 -43862 -88472 -83743 -53526 -114395 -108588
$$ packed form
2161E9735j5269m2186m3006M8979k4929j5110N2901o3440M3094J3728M5862o82
2149E9677p1352j7124n7170Q923O9576K5322q0904K7949R866m9446q7766L4703
2137a27746P7633L1208j9664k4790L188j3891L0484N6217r7866k4988P4292L1295
2125d628M3444o6139N5807k4834m8690Q334k4232j1374P931P185o45l7576M8700
2112d6717M9935k7953K5248m8978j8382q1545N6539K0993l0549L7732k0674m2316
2100a26667R546n255k2179O1766O914j0515m2930o660L6128j952N7105k6511o1756
2087a32966R278M9985J72K5467m9748p3956P9025m04o2890r348J14663O8711j6378
2074A611O336M5626m6994q976n9851m7607R340N6653m4610M729L0217o0869N807
$$ plain form
2061 -108588 -111163 -114909 -85224 -73678 -42635 -73278 -114506 -989 -20544 -89541 -94422 -104151
2049 -104151 -95596 -55160 -26720 -84977 -82269 -97460 -47720 10823 26213 39420 -32861 -27924
2037 -27924 -34102 -23028 22674 28908 -64438 -100512 -123667 -138417 -85410 -98005 -83077 -130851
2025 -130851 -160137 -134209 -160466 -71015 -89629 -78177 -45382 -118766 -95950 -64092 -44943 -61249
2013 -61249 25211 14280 48605 39078 -40720 -21195 -71356 -61691 -32075 -2605 -539 -17661
2001 -17661 -26849 -10653 -16390 -54023 12095 8688 -53393 -53079 -58526 5787 -80041 -100372 -92582
1988 -92582 -98986 -100505 -100322 -65126 -97537 -57620 -11031 -86147 -150113 -120618 -120446 -114172 -97111
1975 -97111 -100234 -89829 -83647 -18476 -76400 -104368 -45976 -77272 -108684 -107162 -29094 -22361 -10140
$$ packed form
2061a08588k575l746K9685J1546L1043l0643m1228J13517j9555o8997m881r729
2049a04151Q555M0436K8440n8257K708j5191M9740N8543J5390J3207p2281M937
2037b7924o178J1074M5702O234r3346l6074k3155j4750N3007j2595J4928m7774
2025a30851k9286K5928k6257Q9451j8614J1452L2795p3384K2816L1858J9149j6306
2013f1249Q6460j0931L4325r527p9798J9525n0161R665K9616K9470K066j7122
2001a7661r188J6196n737l7633O6118l407o2081L14n447O4313q5828k0331P790
1988i2582o404j519J83L5196l2411L9917M6589p5116o3966K9495J72O274J7061
1975i7111l123J0405O182O5171n7924k7968N8392l1296l1412J522P8068O733J2221
$$ plain form
1962 -10140 -103549 -93780 -69145 -137460 -152859 -158305 -143143 -100808 -48234 -60642 -31121 -34328
1950 -34328 -4215 -44018 -45733 -115737 -111907 -98030 -186509 -156345 -121216 -98728 -84053 -47668
1938 -47668 -90601 -50704 -34670 -80812 -105218 -72759 -29628 -82489 -78210 -24956 -82546 -108495
1926 -108495 -132140 -91594 -17116 -77447 -139177 -177254 -145223 -95890 -99075 -178624 -193638 -135438
1914 -135438 -108891 -80998 -29093 -3108 -32080 -118783 -113612 -50370 -68011 -86446 -134216 -139488
1902 -139488 -107099 -91174 -57341 -76306 -84677 -20460 -36269 -9619 -19927 -87022 -53884 -31674
1890 -31674 -81005 -26845 -55452 -75982 -5050 -4141 -10605 -38692 -55819 -53430 -39210 -95145 -41129
1877 -41129 18000 27922 -78191 -92986 -114624 -62166 -39221 -45976 -33368 15493 25951 -44977
$$ packed form
1962a0140r3409R769K4635o8315j5399n446J5162M2335N2574j2408K9521l207
1950c4328L0113l9803j715p0004L830J3877q8479L0164L5129K2488J4675L6385
1938d7668m2933L9897J6034m6142k4406L2459M3131n2861M279N3254n7590k5949
1926a08495k3645M0546P4478o0331o1730l8077L2031M9333l185p9549j5014N8200
1914a35438K6547K7893N1905K5985k8972q6703N171O3242j7641j8435m7770n272
1902a39488L2389J5925L3833j8965q371O4217j5809K6650j0308o7095L3138K2210
1890c1674m9331N4160k8607k0530P0932R09o464k8087j7127K389J4220n5935N4016
1877d1129N9129R922j06113j4795k1638N2458K2945o755J2608M8861J0458p0928
$$ plain form
1865 -44977 -77396 -133782 -132910 -57739 -38234 -56350 -64134 -73667 -52151 -29691 -33990 -67093 -77175
1852 -77175 -114090 -91338 -100993 -71964 -39251 -65422 -122575 -85600 -103339 -76037 -94067 -135710
1840 -135710 -93446 -26099 -46785 -120110 -91587 2488 -17292 -33557 -9898 -46238 -20802 5000
1828 5000 -24555 -79792 -110347 -102005 -123486 -124387 -129627 -108177 -72676 -114427 -120113 -57351 -38031
1815 -38031 2241 2958 2766 -44059 -97253 -91837 -108007 -104372 -127428 -71955 -65248 -100599 -84249
1802 -84249 -65255 -73599 -138452 -113021 -93576 -41220 -4729 -63138 -63174 -21032 -88901 -84067 -63824
1789 -63824 -56112 -37368 -92152 -89483 -78568 -96824 -83187 -52673 -32969 -94056 -136982 -38052
1777 -38052 -81711 -111426 -14113 -35483 -68017 -136157 -152600 -120340 -88669 -39989 -4674 42587
$$ packed form
1865d4977l2419n6386Q72P5171J9505j8116p784r533K1516K2460m299l3103j0082
1852g7175l6915K2752r655K9029L2713k6171n7153L6975j7739K7302j8030m1643
1840a35710M2264O7347k0686p3325K8523R4075j9780j6265K3659l6340K5436K5802
1828E000k9555n5237l0555Q342k1481r01n240K1450L5501m1751n686O2762J9320
1815c8031M0272P17j92m6825n3194N416j6170L635k3056N5473O707l5351J6350
1802h4249J8994q344o4853K5431J9445N2356L6491n8409l6M2142o7869M834K0243
1789f3824P712J8744n4784K669J0915j8256J3637L0514J9704o1087m2926R8930
1777c8052m3659k9715R7313k1370l2534o8140j6443L2260L1671M8680L5315M7261
$$ plain form
1765 42587 -87934 -50250 -61144 -68312 -56017 -87673 -106449 -74641 -45530 -55408 -50821 -98762
1753 -98762 -42675 6919 -12609 -21215 -50081 -45753 -85183 -94419 -61182 -22147 -50214 -90661
1741 -90661 -58324 -64641 -146994 -149178 -54237 -63523 -36684 64690 53894 -33923 -50551 -59587
1729 -59587 -56579 -74715 -63658 -16498 -34479 -8137 11095 -56763 -102578 -94131 -73557 -33098
1717 -33098 -151886 -139125 -104919 -87262 -47409 -35600 -34077 -78679 -79261 -109795 -55692 -53233
1705 -53233 -5744 -28072 -55870 -23530 1748 -55229 -60970 37917 38637 -7225 6064 39865
1693 39865 -24150 -42604 13034 14128 -15350 -11858 -11802 -66347 -79586 -56186 -38477 -32651 -75274
1680 -75274 -46957 24542 31863 65214 -6517 -69575 -28382 -92002 -80616 -94039 -120538 -111527
$$ packed form
1765D2587j30521L7684j0894p168J2295l1656j8776L1808K9111r878M587m7941
1753i8762N6087M9594j9528q606k8866M328l9430r236L3237L9035k8067m0447
1741i0661L2337o317q2353k184R4941r286K6839J01374j0796q7817j6628r036
1729e9587L008j8136J1057M7160j7981K6342J9232o7858m5815Q447K0574M0459
1717c3098j18788J2761L4206J7657L9853J1809J523m4602n82l0534N4103K459
1705e3233M7489k2328k7798L2340K5278n6977n741R8887P20m5862J3289L3801
1693C9865o4015j8454N5638J094k9478L492N6n4545j3239K3400J7709N826m2623
1680g5274K8317P1499P321L3351p1731o3058M1193o3620J1386j3423k6499R011
$$ plain form
1668 -111527 -63565 5138 -32021 -98370 -104267 -61490 -14269 8519 -38654 -58337 -147363 -111374
1656 -111374 -86799 -58195 -55909 -40482 -17689 9572 -11051 -19699 6891 -78565 -43229 -72402
1644 -72402 1200 19204 -6710 13463 -10079 -73907 -70192 -37965 -76958 -52681 -55931 -3691
1632 -3691 8917 -68334 -55406 -28245 -70146 -117481 -92167 -91101 -6056 5696 -38676 21518
1620 21518 20994 3357 328 -42212 -24019 -14563 -14789 -37759 -59639 -33043 -8743 -44313 -45086
1607 -45086 -44600 -67795 -59294 -31009 -1873 18979 41811 -22227 -5425 -18660 18623 65441
1595 65441 45438 51013 17145 2234 -9583 -32548 -20963 -10013 14981 -16894 -66453 -29999
1583 -29999 2066 -30420 -37300 -85596 -104287 -48679 -40030 -50092 -67833 -7643 23452 -71444
$$ packed form
1668a11527M7962O8703l7159o6349n897M2777M7221K2788m7173j9683q9026L5989
1656a11374K4575K8604K286J5427K2793K7261k0623q648K6590q5456L5336k9173
1644g2402P3602J8004k5914K0173k3542o3828L715L2227l8993K4277l250N2240
1632c691J2608p7251J2928K7161m1901m7335K5314J066Q5045J1752m4372O0194
1620B1518n24j7637l029m2540J8193R456k26k2970k1880K6596K4300l5570p73
1607d5086M86k3195Q501K8285K9136K0852K2832o4038J6802j3235L7283M6818
1595F5441k0003N575l3868j4911j1817k2965J1585J0950K4994l1875m9559L6454
1583b9999L2065l2486o880m8296j8691N5608Q649j0062j7741O0190L1095r4896
$$ plain form
1571 -71444 -90254 -44488 -1857 50835 121739 75351 24242 1644 -68543 -70542 -77118 -73548
1559 -73548 -14410 -24898 10686 11054 -5951 9569 -26041 -4002 -39500 -49514 -20526 -54393
1547 -54393 -52856 -16087 9096 -35425 -84202 -90820 -53842 -65023 22488 -48367 -60120 -10757
1535 -10757 51897 33937 -37086 -5885 -62450 -53876 75473 35227 36914 5161 -61269 -60291
1523 -60291 -30787 60845 58125 59725 -37182 -84516 -54180 7114 14939 -5301 5365 -49437
1511 -49437 -59187 -14063 29417 67958 6479 -50572 -37258 -11226 -35108 -1727 -36238 7184
1499 7184 -62213 -19966 -12459 -36693 26129 68882 42248 100631 53587 -52012 10757 33566
1487 33566 -33624 -52444 -67208 -51469 -45299 67895 40123 -25245 -10643 10042 20762 -13704
$$ packed form
1571g1444j8810M5766M2631N2692P0904m6388n1109k2598p0187j999o576L570
1559g3548N9138j0488L5584L68j7005J5520l5610K2039l5498j0014K8988l3867
1547e4393J537L6769K5183m4521m8777o618L6978j1181Q7511p0855j1753M9363
1535a0757O2654j7960p1023L1201n6565Q574J29349m0246J687l1753o6430R78
1523f0291K9504R1632k720J600r6907m7334L0336O1294P825k0240J0666n4802
1511d9437r750M5124M3480L8541o1479n7051J3314K6032k3882L3381l4511M3422
1499G184o9397M2247P507k4234O2822M2753k6634N8383m7044j05599O2769K2809
1487C3566o7190j8820j4764J5739O170J13194k7772o5368J4602K0685J0720l4466
$$ plain form
1475 -13704 1139 12037 57720 111955 69667 14783 -244 -39462 -63083 -9447 -20723 -25318
1463 -25318 26573 10216 -47333 -19252 -25445 -39077 -22169 8788 -3727 -78537 -21493 -13055
1451 -13055 15517 4216 -52051 -129392 -94689 -82312 -60441 -49685 -14551 -27122 983 -71803
1439 -71803 -70898 -43165 -6850 -20899 -41890 -74508 -31711 155 -31198 -46892 -44385 -109137
1427 -109137 -94641 -44307 -66951 -57148 -75742 -41759 -31892 19732 37589 56841 63219 50728
1415 50728 3201 -68400 -34419 51457 86308 77829 29116 -39119 -106095 -98126 -54823 745
1403 745 29344 29845 12975 6561 -23349 58548 61091 -7629 -72281 -26953 36770 74422 17353
1390 17353 18734 81533 70611 24100 -56174 74577 166406 129246 79084 80996 67362 14414
$$ packed form
1475a3704J4843J0898M5683N4235m2288n4884j5027l9218k3621N3636j1276m595
1463b5318N1891j6357n7549K8081o193j3632J6908L0957j2515p4810N7044Q438
1451a3055K8572j1301n6267p7341L4703J2377K1871J0756L5134j2571K8105p2786
1439g1803R05K7733L6315j4049k0991l2618M2797L1866l1353j5694K507o4752
1427a09137J4496N0334k2644R803j8594L3983R867N1624J7857J9252O378j2491
1415E0728m7527p1601L3981Q5876L4851q479m8713o8235o6976P969M3303N5568
1403G45K8599N01j6870o414k9910Q1897K543o8720o4652M5328O3723L7652n7069
1390A7353J381O2799j0922m6511q0274J30751R1829l7160n0162J912j3634n2948
$$ plain form
1378 14414 -9876 -1496 13983 10922 14546 -5910 -23484 49837 1389 -37907 -648 25860
1366 25860 -1046 -32295 -5416 -15925 -32348 -6464 -54659 -5883 -19538 -19072 37510 28048
1354 28048 36772 17494 32767 36933 74189 56600 -56906 -27641 -1692 53645 12239 -55470
1342 -55470 -81185 636 34692 2820 -9787 -30872 5461 29648 64080 55006 34695 -1711
1330 -1711 5441 41233 -17450 31689 98537 62753 50527 27326 25355 -656 -4400 1962 -18865
1317 -18865 3017 -2983 -892 7113 31917 46413 -35959 -68644 -45091 -19845 -43488 -24905
1305 -24905 -44857 -19361 37856 62413 -6082 30179 36147 25620 -276 22669 7207 8767
1293 8767 35664 60211 56047 94853 132088 47287 -35980 -5151 -19157 -2613 51681 -10857
$$ packed form
1378A4414k4290Q380J5479l061L624k0456j7574P3321m8448l9296L7259K6508
1366B5860k6906l1249K6879j0509j6423K5884m8195M8776j3655M66N6582r462
1354B8048Q724j9278J5273M166L7256j7589j13506K9265K5949N5337m1406o7709
1342e5470k5715Q1821L4056l1872j2607k1085L6333K4187L4432r074k0311l6406
1330a711P152L5792n8683M9139O6848l5784j2226k3201j971k6011l744O362k0827
1317a8865K1882o000K091Q005K4804J4496q2372l2685K3553K5246k3643J8583
1305b4905j9952K5496N7217K4557o8495L6261N968j0527k5896K2945j5462J560
1293H767K6897K4547m164L8806L7235q4801q3267L0829j4006J6544N4294o2538
$$ plain form
1281 -10857 -66345 -53267 -59441 -40006 7348 26656 27144 -44477 6982 -1169 -71859 -59599 -51513
1268 -51513 -41781 -1951 -24290 -14798 14066 -19711 19664 12203 24938 -1173 -44626 -75780
1256 -75780 -19349 23938 44816 57341 6507 14411 53578 76872 48327 72243 73740 142371
1244 142371 85416 7156 40671 33284 82058 10157 -2521 11465 -13240 27519 9501 -32096
1232 -32096 -49652 -21020 31850 109698 94964 13541 44980 35687 -43559 10937 57957 53937
1220 53937 63883 27603 24216 75885 52762 31549 63925 97507 41351 -36397 -51 39744
1208 39744 34992 32456 31261 40621 182 64763 46009 5160 8223 12113 48151 53202 113184
1195 113184 49237 8785 42260 -14584 14276 75214 90909 54718 98807 93691 39637 45225
$$ packed form
1281a0857n5488J3078o174J9435M7354J9308M88p1621N1459q151p0690J2260Q086
1268e1513R732L9830k2339R492K8864l3777L9375p461J2735k6111m3453l1154
1256g5780N6431M3287K0878J2525n0834P904L9167K3294k8545K3916J497O8631
1244A42371n6955p8260L3515p387M8774p1901j2678J3986k4705M0759j8018m1597
1232c2096j7556K8632N2870P7848j4734q1423L1439r293p9246N4496M7020m020
1220E3937R946l6280l387N1669k3123k1213L2376L3582n6156p7748L6346L9795
1208C9744m752k536j195R360m0439O4581j8754m0849L063L890L6038N051N9982
1195A13184o3947m0452L3475n6844K8860O0938J5695l6191M4089n116n4054N588
$$ plain form
1183 45225 3201 -45004 25154 -5830 9679 -14334 10234 30657 35859 -10277 8545 29074
1171 29074 20729 27586 -5104 -14706 47572 57655 7099 8218 44885 31270 37670 19754 -31394
1158 -31394 -6955 23669 11430 -13683 11033 -42075 -60724 -15311 -15822 7284 60880 54109
1146 54109 72122 9855 -64882 -12340 28946 12003 31249 11491 -30786 -27477 -11082 -1769
1134 -1769 79297 57806 80256 36725 17208 -67726 -73313 -17171 24160 -4711 7483 26575
1122 26575 15923 -15288 -12256 42715 47696 3941 -45487 -55814 -103640 -56856 24958 61721
1110 61721 74589 60664 29213 35534 81378 63424 36174 44149 17590 16888 10767 15430 19699
1097 19699 -23930 -2356 -34270 19540 61704 1428 -32162 49008 57090 48774 31307 13911
$$ packed form
1183D5225m2024m8205P0158l0984J5509k4013K4568K0423N202m6136J8822K0529
1171B9074q345O857l2690r602O2278J0083n0556J119L6667j3615O400j7916n1148
1158c1394K4439L0624j2239k5113K4716n3108j8649M5413n11K3106N3596o771
1146E4109J8013o2267p4737N2542M1286j6943J9246j9758m2277L309J6395R313
1134a769Q1066k1491K2450m3531j9517q4934n587N6142M1331k8871J2194J9092
1122B6575j0652l1211L032N4971M981m3755m9428j0327m7826M6784Q1814L6763
1110F1721J2868j3925l1451O321M5844j7954k7250P975k6559p02o121M663M269
1097A9699m3629K1574l1914N3810M2164o0276l3590Q1170Q082q316j7467j7396
$$ plain form
1085 13911 71954 56432 9339 -44288 17635 72413 72031 60175 41640 27061 51416 26562
1073 26562 9381 -13141 -23755 17712 42343 61460 63428 40797 19816 55094 53813 12729
1061 12729 90886 79370 50593 51487 70456 96000 29708 40347 106445 110016 65089 66556 -1359
1048 -1359 -47365 -16698 2869 89856 48222 57324 51651 107057 85100 23171 -292 2798 40204
1035 40204 -17358 -43292 64629 15518 65599 130315 41166 15635 61369 92922 62765 61037
1023 61037 60030 -20647 -38796 -8985 6739 30715 -30955 -15268 25180 50935 105190 72132
1011 72132 10531 33262 17390 78340 65737 44307 35420 16629 38003 46128 70008 22311
999 22311 -3410 72916 1350 -46899 -3572 40216 -17930 -4763 -34828 29744 68486 29435
$$ packed form
1085A3911N8043j5522m7093n3627O1923N4778l82j1856j8535j4579K4355k4854
1073B6562j7181k2522j0614M1467K4631J9117J968k2631k0981L5278j281m1084
1061A2729P8157j1516k8777Q94J8969K5544o6292J0639O6098L571m4927J467o7915
1048a359m6006L0667J9567Q6987m1634R102n673N5406k1957o1929k3463L090L7406
1035D0204n7562k5934J07921m9111N0081O4716q9149k5531M5734L1553l0157j728
1023F1037j007q0677j8149K9811J5724K3976o1670J5687M0448K5755N4255l3058
1011G2132o1601K2731j5872O0950j2603k1430q887j8791K1374Q125K3880m7697
999B2311k5721P6326p1566m8249M3327M3788n8146J3167l0065O4572L8742l9051
$$ plain form
987 29435 28373 -719 25677 86853 50087 38922 20694 -35756 -20201 28199 64512 56731
975 56731 53588 112107 56761 13003 21559 -61299 -47703 -34085 -13028 26304 -12328 -51461
963 -51461 25659 27038 9765 47039 61349 39408 35435 3261 -25177 13832 -21477 5861
951 5861 -17745 -2853 36334 59218 82420 83424 81641 52657 31720 -39008 -2000 28009 95483
938 95483 47176 55514 53879 37995 -17832 17978 13372 41085 23851 24858 23638 107538 121499
925 121499 100258 51940 -5906 -11644 5338 52617 58420 41910 65431 89081 87307 33522
913 33522 -21132 51023 39315 68010 109394 98340 25165 54916 -2317 -52392 1735 -23258
901 -23258 -7526 3402 -69354 -75310 -52770 68104 31478 6818 -8675 24368 32554 -24864
$$ packed form
987B9435j062k9092K6396O1176l6766j1165j8228n6450J5555M8400L6313p781
975E6731l143N8519n5346m3758Q556q2858J3596J3618K1057L9332l8632l9133
963e1461P7120J379j7273L7274J4310k1941l973l2174k8438L9009l5309K7338
951E861k3606J4892L9187K2884K3202J004j783k8984k0937p0728L7008L0009O7474
938I5483m8307Q338j635j5884n5827L5810m606K7713j7234J007j220Q3900J3961
925A21499k1241m8318n7846n738J6982M7279N803j6510K3521K3650j774n3785
913C3522n4654P2155j1708K8695M1384j1054p3175K9751n7233n0075N4127k4993
901b3258J5732J0928p2756n956K2540J20874l6626k4660j5493L3043Q186n7418
$$ plain form
889 -24864 -18522 -21807 -50452 -45837 -48016 -27655 30953 10451 -5910 47498 23344 40934 44115
876 44115 26014 8072 34553 10961 -4519 -10793 -14522 3252 13891 120 11928 4985 -31797
863 -31797 47613 57257 37429 50615 48349 55400 47007 -2538 32438 50393 13254 -42997 29725
850 29725 85636 18744 -10930 69236 96178 79493 138348 72760 2235 -10408 29103 57676
838 57676 42396 56620 -4463 17831 19353 970 -57347 -11787 -32676 -36970 52763 54259 50149
825 50149 82866 18221 24214 18753 71281 68869 70164 57295 21455 65452 29080 -36796 -23076
812 -23076 76967 71904 75525 104273 108672 47677 98342 13577 36223 60977 57691 68538 62420
799 62420 44628 35345 58641 78920 69862 52846 74542 84371 92426 60249 53710 88064 98492
$$ packed form
889b4864O342l285k8645M615k179K0361N8608k0502j6361N3408k4154J7590L181
876D4115j8101j7942K6481k3592j5480o274l729J7774J0639j3771J1808o943l6782
863c1797P9410R644j9828J3186k266P051q393m9545L4976J7955l7139n6251P2722
850B9725N5911o6892k9674Q0166K6942j6685N8855o5588p0525j2643L9511K8573
838E7676j5280J4224o1083K2294J522j8383n8317M5560k0889m294Q9733J496m110
825E0149L2717o4645N993n461N2528k412J295j2869l5840M3997l6372o5876J3720
812b3076J00043n063L621K8748M399o0995N0665q4765K2646K4754l286J0847o118
799F2420j7792r283K3296K0279r058j7016K1696R829Q055l2177o539L4354J0428
$$ plain form
786 98492 43211 -15420 7908 70386 88325 107334 85043 92211 87755 26321 56891 54157 6900
773 6900 -15392 -79034 -36848 -8220 -4792 24706 16520 64902 73120 52175 36876 79838 67187
760 67187 90318 -1556 14309 55848 11745 34426 15226 3048 25219 33761 68667 70534
748 70534 76830 25415 70528 9721 -30273 21378 -429 12287 -38070 -15297 52856 88425
736 88425 52324 4409 -53461 26890 135981 65726 -24650 -7326 8783 51699 17131 -2338
724 -2338 -61796 -5662 -17116 43793 82139 57869 47312 83024 67262 -8600 16129 33575
712 33575 -348 2657 259 10527 33663 46805 52266 17241 36568 -28449 -2366 80238 41575
699 41575 40075 44729 19068 -35161 71832 59753 12571 -24524 67039 54091 -8450 37541
$$ packed form
786I8492n5281n8631K3328O2478J7939J9009k2291P168m456o1434L0570k734m7257
773F900k2292o3642M2186K8628L428K9498q186M8382Q218k0945j5299M2962j2651
760F7187K3131r1874J5865M1539m4103K2681j9200j2178K2171Q542L4906J867
748G0534O296n1415M5113o0807l9994N1651k1807J2716n0357K2773O8153L5569
736H8425l6101m7915n7870Q0351J09091p0255r0376J7324J6109M2916l4568j9469
724b338n9458N6134j1454O0909L8346k4270j0557L5712j5762p5862K4729J7446
712C3575l3923L005k398J0268K3136J3142N461l5025J9327o5017K6083Q2604l8663
699D1575j500M654k5661n4229J06993j2079m7182l7095R1563j2948o2541M5991
$$ plain form
687 37541 27146 -33943 -25094 54698 7187 26542 19249 59711 66091 42642 32538 3622 -7848
674 -7848 -1352 11719 1255 27016 33888 -24504 -68325 -54683 -23455 -8302 -27997 15289 -4480
661 -4480 -9032 39281 -14855 -10403 23843 -15058 -13274 -42572 9394 15358 18730 47386 30367
648 30367 49771 -14241 19373 73232 45659 62493 80195 34361 51565 1060 61120 -11878
636 -11878 15001 21549 60742 31130 -22402 4021 107849 143178 113973 70500 85379 92239
624 92239 66447 64358 44876 50132 72665 20321 34284 81706 13095 -704 5931 -21718 27879
611 27879 -4 1024 29538 -8415 6772 -12078 -30894 20127 51152 50692 -4875 -49731 12305
598 12305 10178 58183 77364 63787 42313 27220 9455 43548 65388 31326 -2533 -25582
$$ packed form
687C7541j0395o1089Q849P9792m7511J9355p293M0462O380k3449j0104k8916j1470
674g848O496J3071j0464K5761O872n8392m3821J3642L1228J5153j9695M3286j9769
661d480m552M8313n4136M452L4246l8901J784k9298N1966N964L372K8656j7019
648C0367J9404o4012L3614N3859k7573J6834J7702m5834J7204n0505O0060p2998
636a1878K6879O548L9193k9612n3532K6423J03828L5329k9205m3473J4879O860
624I2239k5792k089j9482N256K2533n2344J3963M7422o8611j3799O635k7649M9597
611B7879k7883J028K8514l7953J5187j8850j8816N1021L1025m60n5567m4856O2036
598A2305k127M8005J9181j3577k1474j5093j7765L4093K1840l4062l3859k3049
$$ plain form
586 -25582 -5070 85568 95088 79732 82364 28718 -13244 -38206 1553 -19343 -54600 -33339
574 -33339 -32854 -58621 -72878 -45243 -24751 -34101 -53841 -29861 -20886 35719 -15615 -20421 8011
561 8011 14359 25350 5820 10295 52754 64468 77480 80907 87200 -4023 -54381 -16275 46266
548 46266 -52678 -73884 4665 43606 22258 -40732 -39889 -8142 -7988 64003 2886 -41711 -11753
535 -11753 18506 10007 -37794 456 11686 19288 2333 -12277 -37847 -7408 60029 47142
523 47142 16394 7171 24379 23986 14300 -5011 -555 9894 -11436 56506 65914 66153 -52493
510 -52493 -74601 -38087 -71299 -18217 7657 -76508 -13084 -32650 -68482 -23547 12487 38556
498 38556 -4830 -27997 -57367 -47306 -71793 -60936 -32360 -73429 -33979 5572 -37722 4447
$$ packed form
586b5582K0512R0638R520j5356K632n3646m1962k4962L9759k0896l5257K1261
574c3339M85k5767j4257K7635K0492r350j9740K3980Q975N6605n1334m806K8432
561H011O348J0991j9530M475M2459J1714J3012L427O293r1223n0358L8106O2541
548D6266r8944k1206P8549L8941k1348o2990Q43L1747J54P1991o1117m4597K9958
535a1753L0259q499m7801L8250J1230P602j6955j4610k5570L0439O7437j2887
523D7142l0748r223J7208l93r686j9311M456J0449k1330O7942R408K39j18646
510e2493k2108L6514l3212N3082K5874q4165O3424j9566l5832M4935L6034K6069
498C8556m3386k3167k9370J0061k4487J0857K8576m1069L9450L9551m3294M2169
$$ plain form
486 4447 34497 -41162 13656 67063 38814 -13026 -1955 48694 3055 -41366 10208 64331
474 64331 124978 62205 33303 20923 74373 73635 31112 46969 -80744 -56764 10137 -25620
462 -25620 -13700 38410 76009 111814 27491 -11454 -61459 -42247 8888 14928 -49605 -33185
450 -33185 -60300 -77857 16281 -12051 -27366 49072 53569 -57034 -29550 -35044 -1629 -26489
438 -26489 -11981 -17616 -25798 3735 -4757 38902 36023 47966 25479 -37371 14389 42844 -20783
425 -20783 -21130 27552 67270 37654 73244 83994 14210 -18199 -18382 -39165 -37598 22054 80296
412 80296 10690 547 27356 43824 73153 77162 689 -49887 5672 -54374 -38155 28384
400 28384 48852 -6646 -52197 -142990 -91767 -15127 -57398 -66388 -111327 -103137 -95036 -8529 -17445
$$ packed form
486D447L0050p5659N4818N3407k8249n1840J1071N0649m5639m4421N1574N4123
474F4331O0647o2773k8902j2380N3450p38m2523J5857j27713K3980O6901l5757
462b5620J1920N2110L7599L5805q4323l8945n0005J9212N1135O040o4533J6420
450c3185k7115j7557R4138k8332j5315P6438M497j10603K7484n494L3415k4860
438b6489J4508n635q182K9533q492M3659k879J1943k2487o2850N1760K8455o3627
425b0783l47M8682L9718k9616L5590J0750o9784l2409j83k0783J567N9652N8242
412H0296o9606j0143K6809J6468K9329M009p6473n0576N5559o0046J6219O6539
400B8384K0468n5498m5551r0793N1223P6640m2271q990m4939Q190Q101Q6507q916
$$ plain form
387 -17445 -13747 67990 60612 4453 -5852 -16469 -8977 -92118 -89873 -35956 -35960 50152 27794 -23661
373 -23661 15471 2850 -104411 -120756 -77722 -8485 -9066 -36450 -60223 -39495 -123652 -66970
361 -66970 -7405 -44053 -49956 -11314 70320 6660 33455 7404 -82571 -110487 -37010 -21664
349 -21664 -16746 -47260 -28052 35317 -11227 -11392 -4691 24353 -12485 -100343 -50928 47205 27917
336 27917 18897 7293 11159 -27405 -76867 -46444 -14262 1155 4608 23018 -17643 -20043 -11066
323 -11066 -25433 17085 -13810 -62297 -90161 -39623 -30069 -19448 -36891 -44147 4520 9835 16261
310 16261 -27770 -29115 -57400 11000 -171 -75735 -7685 -21359 -35074 -10668 -24021 -27794
298 -27794 -32146 -56366 -60823 -42766 -76008 -69994 -43391 -15260 -6896 -50137 -46392 -7485 -121103
$$ packed form
387a7445L698Q1737p378n6159j0305j0617P492q3141K245N3917mQ6112k2358n1455
373b3661L9132j2621j07261j6345M3034O9237n81k7384k3773K0728q4157N6682
361f6970N9565l6648n903L8642Q1634o3660K6795k6051q9975k7916P3477J5346
349b1664M918l0514J9208O3369m6544j65O701K9044l6838q7858M9415R8133j9288
336B7917r020j1604L866l8564m9462L0423L2182J5417L453J8410m0661k400Q977
323a1066j4367M2518l0895m8487k7864N0538R554J0621j7443p256M8667N315O426
310A6261m4031j345k8285O8400j1171p5564O8050j3674j3715K4406j3353l773
298b7794m352k4220m457J8057l3242O014K6603K8131Q364m3241L745L8907j13618
$$ plain form
285 -121103 -165099 -65212 -97513 -74059 3112 10414 26414 40813 2991 -27634 25059 934
273 934 24272 58301 40876 24485 39714 -34417 -55142 -50001 -71275 -111550 -49028 -9906 383
260 383 -48957 -45142 -8868 -49778 -8450 -63236 -70722 -137309 -108372 -77243 -67236 -114506 -152221
247 -152221 -101127 11464 71561 32573 -6444 -67203 -61600 -82229 -65112 -34654 -79665 -76856
235 -76856 -101817 -101661 -62513 -27852 -11971 21300 -43749 -53044 -24605 -13891 -13276 -48120 -63688
222 -63688 -75208 -81898 -126467 -99262 -133354 -83331 -81150 -38409 2796 -122460 -95841 -34601
210 -34601 -29072 -4203 -39551 -38409 -38162 -31470 -52071 -6883 45697 -14933 -25645 -63243 -47569
197 -47569 -46228 -66401 -59106 -15946 -2774 38589 17945 -39467 -35701 -18325 -19174 -11693 -44591
$$ packed form
285a21103m3996R9887l2301K3454P7171P302J6000J4399l7822l0625N2693k4125
273I34K3338L4029j7425j6391J5229p4131k0725N141k1274m0275O2522L9122J0289
260C83m9340L815L6274m0910M1328n4786p486o6587K8937L1129J0007m7270l7715
247a52221N1094J12591O0097l8988l9017o0759N603k0629J7117L0458m5011K809
235g6856k4961J56L9148L4661J5881L3271o5049r295K8439J0714O15l4844j5568
222f3688j1520o690m4569K7205l4092N0023K181M2741M1205j25256K6619O1240
210c4601N529K4869l5348J142K47O692k0601M5188N2580o0630j0712l7598J5674
197d7569J341k0173P295M3160J3172M1363k0644n7412L766J7376q49P481l2898
$$ plain form
184 -44591 -99541 -64523 3028 -16797 -43475 -46938 -42890 -65401 -84551 -25463 -7769 17277
172 17277 -56438 -72885 -55845 -71421 -44438 -19977 -10938 -84447 -78898 -46166 -33123 -11969
160 -11969 -92991 -152322 -87103 -27431 12169 -10835 9993 -12232 -86439 -53283 1715 -69066
148 -69066 -95984 -51652 -24562 -35689 -69085 -71972 -109162 -85015 -50167 -70233 -30093 -41461
136 -41461 -79919 -55403 -44843 -50453 -11642 9629 15502 29668 -29878 -77937 -71642 -11044 -685
123 -685 -20237 -32764 -44903 -33558 -35868 -41238 -32575 -46334 -12814 -57110 -76820 -68643 -44199
110 -44199 -70415 -86113 -126095 -83402 -69164 -84130 -60464 -45689 -36162 -95579 -88028 -65605
98 -65605 -84826 -51825 -40788 -72878 -64102 -56698 -46281 -78625 -89090 -51906 -21747 -51117 -47703
$$ packed form
184d4591n4950L5018O7551j9825k6678l463M048k2511j9150N9088J7694K5046
172A7277p3715j6447J7040j5576K6983K4461R039p3509N549L2732J3043K1154
160a1969q1022n9331O5219N9672L9600k3004K0828k2225p4207L3156N4998p0781
148f9066k6918M4332K7090j1127l3396k887l7190K4147L4848k0066M0140j1368
136d1461l8458K4516J0560n610L8811K1271N873J4166n9546m8059O295O0598J0359
123f85j9552j2527j2139J1345k310n370Q663j3759L3520m4296j9710Q177K4444
110d4199k6216j5698l9982M2693J4238j4966K3666J4775R527n9417P551K2423
98f5605j9221L3001J1037l2090Q776P404J0417l2344j0465L7184L0159k9370L414
$$ plain form
85 -47703 -94236 -108666 -112965 -72367 -46866 -62280 -54729 -19078 -11315 -37721 -20530 -53345 -58739
72 -58739 -100492 -85794 -57565 -126651 -102198 -81180 -75032 -28869 -58868 -62183 -14562 -5975 -82057
59 -82057 -118948 -91431 -17165 -48505 -49626 -35467 -96801 -76592 -51647 -73425 -87644 -60363
47 -60363 -80538 -79405 -46579 -13007 -8628 -40261 -61935 -74845 -97842 -103970 -96365 -79497 -69589
34 -69589 -131694 -79006 -43801 -29557 41156 -20617 -88858 -78825 -77260 -53374 -22764 -40150
22 -40150 -75773 -87779 -62912 -62487 -88370 -106095 -71685 -58983 -32157 -45390 -2771 -3104 -7103
9 -7103 -7251 -61490 -88944 -86182 -60351 -86570 -104220 -115602 -126053
0 -126053
$$ packed form
85d7703m6533j4430m299M0598K5501j5414P551L5651P763k6406J7191l2815n394
72e8739m1753J4698K8229o9086K4453K1018O148M6163k9999l315M7621Q587p6082
59h2057l6891K7517P4266l1340j121J4159o1334K0209K4945k1778j4219K7281
47f0363k0175J133L2826L3572M379l1633k1674j2910k2997o128P605J6868R908
34f9589o2105N2688L5205J4244P0713o1773o8241J0033J565K3886L0610j7386
22d0150l5623j2006K4867M25k5883j7725L4410J2702K6826j3233M2619l33l999
9g103j48n4239k7454K762K5831k6219j7650j1382j0451
0a26053
$$ Imaginary data points
##PAGE= N=2
##DATA TABLE= (X++(I..I)), XYDATA
$$ plain form
16383 -1249293 -1221739 -1184325 -1208148 -1183097 -1174911 -1120964 -1049467 -1040068 -1054779 -1031658 -1006599 -970977
16371 -970977 -1002667 -974100 -923921 -966289 -947077 -880840 -907039 -850466 -839412 -852172 -831751
16360 -831751 -813703 -833454 -809911 -774085 -735848 -709971 -735285 -733423 -688361 -675239 -707991 -715239
16348 -715239 -676806 -648018 -640182 -682999 -661589 -585463 -549320 -525857 -554754 -493157 -462415 -472386
16336 -472386 -457573 -494064 -434464 -464856 -428106 -322658 -332397 -307813 -310756 -305195 -320759 -295564
16324 -295564 -255195 -305396 -348446 -299741 -278318 -293052 -259582 -215200 -225555 -164568 -129001
16313 -129001 -96034 -126941 -93591 -63143 -63480 -97224 -93173 -64997 -35705 -65821 -78825 -43759
16301 -43759 -46724 -25633 9323 51349 81946 80200 67689 101151 91222 59024 100740 135300
$$ packed form
16383a249293K7554L7414k3823K5051Q186N3947P1497R399j4711K3121K5059L5622
16371i70977l1690K8567N0179m2368J9212O6237k6199N6573J1054j2760K0421
16360h31751J8048j9751K3543L5826L8237K5877k5314J862M5062J3122l2752p248
16348g15239L8433K8788P836m2817K1410P6126L6143K3463k8897O1597L0742r971
16336d72386J4813l6491N9600l0392L6750J05448r739K4584k943N561j5564K5195
16324b95564M0369n0201m3050M8705K1423j4734L3470M4382j0355O0987L5567
16313a29001L2967l0907L3350L0448l37l3744M051K8176K9292l0116j3004L5066
16301d3759k965K1091L4956M2026L0597j746j2511L3462r929l2198M1716L4560
$$ plain form
16289 135300 139755 178588 192221 225178 226379 174526 160892 159268 206075 253774 238943 279627
16277 279627 241612 250233 309579 324239 323041 382901 388843 359457 358461 366195 424724 467773 450157
16264 450157 386690 389303 397983 433041 404551 396955 443280 460582 478721 510482 493033 512884
16252 512884 541278 554341 584230 615976 600330 565454 528886 537060 573478 600471 652907 610663
16240 610663 656439 652646 596504 586563 593725 590204 643661 690192 721646 771755 761402 779713
16228 779713 731961 716782 736097 713880 773592 758422 721339 745928 795615 772167 752815
16217 752815 736754 768717 787113 836380 818009 844943 831635 796350 850883 890780 887936 848974
16205 848974 852350 868329 860714 893375 891543 912682 921811 902543 937571 922191 947201 953737
$$ packed form
16289A35300M455L8833J3633L2957J201n1853j3634j624M6807M7699j4831M0684
16277B79627l8015Q621N9346J4660j198N9860N942k9386r96P734N8529M3049j7616
16264D50157o3467K613Q680L5058k8490p596M6325J7302J8139L1761j7449J9851
16252E12884K8394J3063K9889L1746j5646l4876l6568Q174L6418K6993N2436m2244
16240F10663M5776l793n6142r941P162l521N3457M6531L1454N0109j0353J8311
16228G79713m7752j5179J9315k2217N9712j5170l7083K4589M9687k3448j9352
16217G52815j6061L1963J8396M9267j8371K6934j3308l5285N4533L9897k844l8962
16205H48974L376J5979p615L2661j832K1139R129j9268L5028j5380K5010O536
$$ plain form
16193 953737 953898 970268 973806 982348 986529 887003 962343 945642 928015 915350 918258 983415 977306
16180 977306 950091 1008876 1036930 1052828 964839 961630 999400 1015444 1018915 999129 1066295 1048787
16168 1048787 1011464 1046481 1009164 1027317 1044032 1031183 1016909 1034817 985582 941867 1077219
16157 1077219 1086101 1138519 1159121 1094282 1086180 1118341 1075692 1066570 1059097 1089576 1080269 1117859
16145 1117859 1088114 1074809 1145677 1135320 1116695 1149771 1127366 1124278 1153047 1112070 1129952
16134 1129952 1168335 1143762 1220338 1217553 1160465 1165789 1115281 1087489 1079194 1096721 1155957 1194034
16122 1194034 1158830 1149395 1197833 1210122 1237955 1296490 1180270 1151322 1081375 1143993 1187500
$$ packed form
16193I53737J61J6370L538Q542M181r9526P5340j6701j7627j2665K908O5157o109
16180I77306k7215N8785K8054J5898q7989l209L7770J6044L471j9786O7166j7508
16168A048787l7323L5017l7317J8153J6715j2849j4274J7908m9235m3715J35352
16157A077219Q882N2418K0602o4839q102L2161m2649r122p473L0479r307L7590
16145A117859k9745j3305P0868j0357j8625L3076k2405l088K8769m0977J7882
16134A129952L8383k4573P6576k785n7088N324n0508k7792q295J7527N9236L8077
16122A194034l5204r435M8438J2289K7833N8535j16220k8948o9947O2618M3507
$$ [...]
##END NTUPLES=NMR SPECTRUM
##END=
