##TITLE=1H_DE-80H_X3
 200.13MHz, d2o
 8 sc
 
 19ns.26.2.2025
##JCAMPDX= 6.0         $$ Bruker NMR JCAMP-DX V2.0
##DATA TYPE= NMR SPECTRUM
##DATA CLASS= NTUPLES
##ORIGIN= UXNMR, Bruker Analytische Messtechnik GmbH
##OWNER= pz
$$ XWIN-NMR		Version 3.5
$$ Thu Jul  3 11:36:06 2025 Russian Standard Time (UT+4h)  Yarkov@DPX200
##.OBSERVE FREQUENCY= 200.1313
##.OBSERVE NUCLEUS= ^1H
##.ACQUISITION MODE= SIMULTANEOUS
##.ACQUISITION SCHEME= undefined
##.AVERAGES= 8
##.DIGITISER RES= 18
##SPECTROMETER/DATA SYSTEM= spect
##.PULSE SEQUENCE= zg30
##.SOLVENT NAME= CDCl3
##.SHIFT REFERENCE= (INTERNAL, CDCl3, 0, 15.5001)
##AUDIT TRAIL= $$ (NUMBER, WHEN, WHO, WHERE, WHAT)
$$ ##TITLE= Audit trail, XWIN-NMR		Version 3.5
$$ ##JCAMPDX= 5.01
$$ ##ORIGIN= Bruker BioSpin GmbH
$$ ##OWNER= Yarkov
$$ C:/Bruker/XWIN-NMR/data/yarkov2/nmr/H-C/1/pdata/1/auditp.txt
$$ ##AUDIT TRAIL=  $$ (NUMBER, WHEN, WHO, WHERE, WHAT)
(   1,<2025-07-03 11:34:15.01 +0400>,<Yarkov>,<DPX200>,
      <created by zg, POWCHK disabled, PULCHK disabled
       configuration hash MD5:
       00 E9 B6 7A A2 85 ED C7 34 08 36 98 17 FE 4E 26
       data hash MD5: 16K
       8C B4 47 91 FF 2E E0 76 CB 07 DE 01 50 49 DD 2A>)
(   2,<2025-07-03 11:34:25.90 +0400>,<Yarkov>,<DPX200>,
      <Start of raw data processing
       efp BC_mod = 2 LB = 0.25 FT_mod = 6 PKNL = 1 PHC0 = -1360.891 PHC1 = 10.04947 SI = 16K 
       data hash MD5: 16K
       88 57 6F E7 1E 76 C3 1A 4D F1 32 71 40 38 6E 8F>)
$$ ##END=
$$ 
$$ hash MD5
$$ 8C 56 0A 64 63 3F B7 CC D0 61 17 2A 4F 4E FE B2
##$RELAX= 
##$RELAX= 
##$RELAX= 
##$RELAX= 
##$RELAX= 
##$RELAX= 
$$ Bruker specific parameters
$$ --------------------------
##$DU= <C:/Bruker/XWIN-NMR>
##$EXPNO= 1
##$NAME= <H-C>
##$PROCNO= 1
##$TYPE= <nmr>
##$USER= <yarkov2>
##$AMP= (0..31)
100 100 100 100 100 100 100 100 100 100 100 100 100 100 100 100 100 100 
100 100 100 100 100 100 100 100 100 100 100 100 100 100 
##$AQSEQ= 0
##$AQ_mod= 1
##$AUNM= <au_zg>
##$AUTOPOS= <>
##$BF1= 200.13
##$BF2= 200.13
##$BF3= 200.13
##$BF4= 200.13
##$BF5= 200.13
##$BF6= 200.13
##$BF7= 200.13
##$BF8= 200.13
##$BYTORDA= 1
##$CFDGTYP= 0
##$CFRGTYP= 5
##$CHEMSTR= <none>
##$CNST= (0..31)
1 1 145 1 1 1 1 1 1 1 1 1 1 1 1 1 1 1 1 1 1 1 1 1 1 1 1 1 1 1 1 1 
##$CPDPRG= <>
##$CPDPRG1= <>
##$CPDPRG2= <>
##$CPDPRG3= <>
##$CPDPRG4= <mlev>
##$CPDPRG5= <mlev>
##$CPDPRG6= <mlev>
##$CPDPRG7= <mlev>
##$CPDPRG8= <mlev>
##$CPDPRGB= <>
##$CPDPRGT= <>
##$D= (0..31)
0 0.7 0 0 0 0 0 0 0 0 0 0.03 0 0 0 0 0 0 0 0 0 0 0 0 0 0 0 0 0 0 0 0 
##$DATE= 1751528054
##$DBL= (0..7)
120 120 120 120 120 120 120 120 
##$DBP= (0..7)
150 150 150 150 150 150 150 150 
##$DBP07= 0
##$DBPNAM0= <>
##$DBPNAM1= <>
##$DBPNAM2= <>
##$DBPNAM3= <>
##$DBPNAM4= <>
##$DBPNAM5= <>
##$DBPNAM6= <>
##$DBPNAM7= <>
##$DBPOAL= (0..7)
0.5 0.5 0.5 0.5 0.5 0.5 0.5 0.5 
##$DBPOFFS= (0..7)
0 0 0 0 0 0 0 0 
##$DE= 6
##$DECBNUC= <off>
##$DECIM= 32
##$DECNUC= <off>
##$DECSTAT= 4
##$DIGMOD= 1
##$DIGTYP= 9
##$DL= (0..7)
0 120 120 120 120 120 120 120 
##$DP= (0..7)
$$ [...]
##$SUBNAM2= <"">
##$SUBNAM3= <"">
##$SUBNAM4= <"">
##$SUBNAM5= <"">
##$SUBNAM6= <"">
##$SUBNAM7= <"">
##$SUBNAM8= <"">
##$SUBNAM9= <"">
##$SW= 18.0517328524113
##$SWIBOX= (0..15)
0 0 2 0 0 0 0 0 0 0 0 0 0 0 0 0 
##$SW_h= 3612.71676300578
##$TD= 16384
##$TD0= 1
##$TE= 0
##$TE2= 300
##$TE3= 300
##$TEG= 300
##$TL= (0..7)
0 120 120 120 120 120 120 120 
##$TP= (0..7)
150 150 150 150 150 150 150 150 
##$TP07= 0
##$TPNAME0= <>
##$TPNAME1= <>
##$TPNAME2= <>
##$TPNAME3= <>
##$TPNAME4= <>
##$TPNAME5= <>
##$TPNAME6= <>
##$TPNAME7= <>
##$TPOAL= (0..7)
0.5 0.5 0.5 0.5 0.5 0.5 0.5 0.5 
##$TPOFFS= (0..7)
0 0 0 0 0 0 0 0 
##$TUNHIN= 0
##$TUNHOUT= 0
##$TUNXOUT= 0
##$USERA1= <user>
##$USERA2= <user>
##$USERA3= <user>
##$USERA4= <user>
##$USERA5= <user>
##$V9= 5
##$VALIST= <valist>
##$VCLIST= <CCCCCCCCCCCCCCC>
##$VD= 0
##$VDLIST= <DDDDDDDDDDDDDDD>
##$VPLIST= <PPPPPPPPPPPPPPP>
##$VTLIST= <TTTTTTTTTTTTTTT>
##$WBST= 1024
##$WBSW= 4
##$XGAIN= (0..3)
0 0 0 0 
##$XL= 0
##$YL= 0
##$YMAX_a= 103698
##$YMIN_a= -107580
##$ZGOPTNS= <>
##$ZL1= 120
##$ZL2= 120
##$ZL3= 120
##$ZL4= 120
##$ABSF1= 0
##$ABSF2= 0
##$ABSG= 0
##$ABSL= 0
##$ALPHA= 0
##$AQORDER= 0
##$ASSFAC= 0
##$ASSFACI= 0
##$ASSFACX= 0
##$ASSWID= 0
##$AUNMP= <proc_1d>
##$AZFE= 0.1
##$AZFW= 0.1
##$BCFW= 0
##$BC_mod= 2
##$BYTORDP= 0
##$COROFFS= 0
##$CY= -3
##$DATMOD= 1
##$DC= 0
##$DFILT= <>
##$DTYPP= 0
##$F1P= 0
##$F2P= 0
##$FCOR= 1
##$FTSIZE= 16384
##$FT_mod= 6
##$GAMMA= 0
##$GB= 0
##$INTBC= 1
##$INTSCL= 3.241238e-09
##$ISEN= 128
##$LB= 0.25
##$LEV0= 0
##$LPBIN= 0
##$MAXI= 10000
##$MC2= 0
##$MEAN= 0
##$ME_mod= 0
##$MI= 1.114404
##$NCOEF= 0
##$NC_proc= -8
##$NLEV= 6
##$NOISF1= 3.799351
##$NOISF2= 2.8
##$NSP= 0
##$NTH_PI= 0
##$NZP= 0
##$OFFSET= 15.50009
##$PC= 1
##$PHC0= -1360.891
##$PHC1= 10.04947
##$PH_mod= 1
##$PKNL= yes
##$PPARMOD= 0
##$PSCAL= 0
##$PSIGN= 0
##$REVERSE= no
##$SF= 200.130004324941
##$SI= 16384
##$SIGF1= 3
##$SIGF2= 2
##$SINO= 0.751879
##$SIOLD= 32768
##$SREGLST= <19F.Aceton>
##$SSB= 0
##$STSI= 16384
##$STSR= 0
##$SW_p= 3612.71676300578
##$SYMM= 0
##$S_DEV= 0
##$TDeff= 16384
##$TDoff= 0
##$TI= <>
##$TILT= no
##$TM1= 0
##$TM2= 0
##$TOPLEV= 0
##$USERP1= <user>
##$USERP2= <user>
##$USERP3= <user>
##$USERP4= <user>
##$USERP5= <user>
##$WDW= 1
##$XDIM= 16384
##$YMAX_p= 285819511
##$YMIN_p= -938077
$$ End of Bruker specific parameters
$$ ---------------------------------
##NTUPLES= NMR SPECTRUM
##VAR_NAME=  FREQUENCY,     SPECTRUM/REAL,   SPECTRUM/IMAG
##SYMBOL=    X,             R,               I
##VAR_TYPE=  INDEPENDENT,   DEPENDENT,       DEPENDENT
##VAR_FORM=  AFFN,          ASDF,            ASDF
##VAR_DIM=   16384,         16384,           16384
##UNITS=     HZ,            ARBITRARY UNITS, ARBITRARY UNITS
##FACTOR=    0.220516191357247, 1,           1
##FIRST=     3102.03300776802, 0,            0
##LAST=      -510.683755237758, 0,           0
##MIN=       -510.683755237758, -938077,     0
##MAX=       3102.03300776802, 285819511,    0
$$ Real data points
##PAGE= N=1
##DATA TABLE= (X++(R..R)), XYDATA
$$ [...]
8367 389967 631005 486618 252871 181228 94727 339786 452897 333068 247086 191943
8357 191943 254479 264845 204942 456163 509290 474848 599768 416861 628290 562842 438701
8346 438701 430587 429135 342351 265067 328330 364673 241832 -112146 338255 413580 410909 425426
8334 425426 606400 549205 433502 571091 413998 153015 291573 402872 369874 578585
8324 578585 573406 486846 681635 747124 457297 279587 36722 107753 156017 448998 385482
8313 385482 384394 453855 756775 784144 576758 393797 294219 520829 507739 629084 414133
8302 414133 404051 232767 107773 253488 314356 520411 550025 543879 656594 541797 433549
8291 433549 439463 749683 381721 88541 185763 361910 480588 142397 48329 257272
8281 257272 157597 217844 375430 416709 446379 429865 307044 525177 350017 449018 434698
8270 434698 359990 170081 324110 317997 243431 684196 488536 306784 369993 296108 255605
8259 255605 472892 266717 322021 415385 309421 75440 68753 565216 661012 536626 673744
8248 673744 518511 739855 491326 382024 264649 177408 303732 158580 248479 210476
8238 210476 181558 123669 262562 435425 429507 385624 710387 615746 652336 293465 -253542
8227 -253542 69988 435687 572528 506653 110493 26140 334906 434150 528345 463405 624059
8216 624059 609030 773621 498429 419378 342940 562124 549515 490191 361815 461112 343045
8205 343045 459964 443998 562457 606001 619887 587039 457921 576568 434578 251839
8195 251839 537896 793097 2110603 3717686 1460750 661601 370085 148199 142407 380888
8185 380888 457575 356983 276749 283838 244908 242807 320390 538376 521788 540938 550606 378930
8173 378930 390980 148639 92852 256945 541477 481646 402279 365378 492516 327789 397729
8162 397729 441184 505423 211603 154872 300395 598543 648980 472902 327090 236765 355130
8151 355130 300859 285223 319315 282484 513584 572347 594748 425035 347909 300054 187034
8140 187034 165773 343933 198827 188198 403349 201366 263665 226178 523294 575279 391102
8129 391102 607087 621086 411999 416585 531075 384159 392825 261859 317946 435943 428498
8118 428498 97712 -147282 222736 511878 189773 318567 411207 436702 466996 719165
8108 719165 173871 69413 150073 97835 164341 277541 385276 259215 472275 364964
8098 364964 350013 310814 465319 501379 532704 419647 321229 309380 362556 342378 415087
8087 415087 288218 321857 555520 654433 526979 695971 537093 631239 593898 611761 687579
8076 687579 455253 411859 332142 266360 289214 164935 333429 283789 441216 24770 340996
8065 340996 553164 731512 711927 372362 379347 398669 523355 471231 384208 269843 54075
8054 54075 152499 352336 377197 311970 277837 257776 134893 99452 150625 494974 649718
8043 649718 383987 129250 357716 285578 348449 187547 371036 490699 642300 551439
8033 551439 385847 446133 645451 432989 306296 508184 434998 301533 436668 478356
8023 478356 442349 460273 235415 101447 125338 175926 364573 256364 288265 453411 572742
8012 572742 366548 351202 459085 639165 751132 642993 241511 181943 501063 527090
8002 527090 347009 416299 593303 692714 523841 332390 376035 85618 8089 173519
7992 173519 590578 528641 334695 333888 377785 348371 320904 481746 379826 337222 238129
7981 238129 480506 531458 583929 520408 490413 624109 429932 343478 474416 628370 623322
7970 623322 672868 353200 196915 462337 627644 525840 696480 687950 567008 480942
7960 480942 390196 299825 380083 271024 233622 357454 428728 428064 383883 489430 354010
7949 354010 235112 479964 639040 285459 42313 153107 461763 411416 420771 482469
7939 482469 246332 217738 603641 750249 710351 563958 513071 423286 168079 67036
7929 67036 78669 368947 386691 271753 437642 425194 260976 145077 227045 396207 241422
7918 241422 432191 222293 107293 8904 78078 284889 207330 121109 297923 452524
7908 452524 281882 339784 422204 506478 385013 358425 504554 429990 316527 213378 276629
7897 276629 571556 641728 343870 286348 360499 348912 220000 378644 260948 390757
7887 390757 477131 458715 487290 645095 640273 351171 282217 500130 643961 397670 127392
7876 127392 293293 522522 561946 625944 555189 244540 140947 403725 625045 270188
7866 270188 -11629 -113368 71430 515895 258267 263318 272070 597357 731005 560984
7856 560984 384811 145345 -6243 -74805 14454 186915 456835 238253 290421 293836 281845
7845 281845 634751 457809 562975 620298 431591 353403 394059 331379 275985 473992 642822
7834 642822 376744 278738 402678 494754 260961 314370 431559 746943 1138847 681967
7824 681967 498316 330920 343261 485421 193754 328399 188977 206186 280788 333126
7814 333126 162505 409824 418764 316108 275061 381281 534681 734213 689153 719090 764483
7803 764483 896583 994120 236831 63705 362665 327294 272546 271633 464636 553326 343720
7792 343720 165649 280827 459101 519063 649806 733083 708792 702168 357935 430728 523877
7781 523877 403965 852655 469375 605054 740849 738749 570666 312634 541332 553770
7771 553770 413969 533654 516445 474930 294795 241030 160708 116280 123991 340115 316687
7760 316687 323250 443401 480239 575314 608222 521767 585923 575240 516119 405963 317524
7749 317524 383070 521419 660717 651503 745982 405926 326810 286483 420500 630817 664976
7738 664976 605636 464061 366177 478018 517412 372414 563531 526922 604358 706924 726372
7727 726372 600702 517315 580042 435991 413849 376037 305353 326181 380481 516965 462049
7716 462049 526689 740300 516608 185015 351384 478934 387892 391346 215121 144007 481267
7705 481267 637755 564680 280319 235335 151978 393949 535358 322824 315440 540322 365380
7694 365380 211115 -37797 -36744 350788 486280 416330 437281 389966 257327 343523 402897
7683 402897 372251 447687 400554 186701 23328 352189 654418 482250 475960 297596 459824
7672 459824 437584 368001 471194 347328 515688 744973 772655 420711 355218 162083
7662 162083 26214 412908 466339 471240 257224 316635 396402 324339 369848 467659 369968
7651 369968 7073 11261 346072 294355 214059 256488 618345 544774 402502 372926 490657
7640 490657 555979 667525 658526 306546 317233 656933 379366 479047 456112 236077 373268
7629 373268 544677 548945 573985 543685 424357 326293 375820 268202 197821 459235 631604
7618 631604 634635 399514 423701 458279 347184 434131 419327 722547 662247 353026 319087
7607 319087 453695 476858 479773 292237 288175 611320 514150 310899 589221 596296 566714
7596 566714 357091 294274 594716 727338 540858 536595 843557 807702 627427 414497
7586 414497 695237 515468 637829 633321 522453 695868 619886 400491 257120 196114
7576 196114 145458 429899 281473 75347 357716 298251 337651 599687 552091 244959
7566 244959 409458 501922 416744 416903 594365 460259 300002 105180 236300 171877 333737
7555 333737 372048 219882 330700 320334 289926 413597 391605 264141 399433 523980
7545 523980 577947 404834 343330 644307 522532 297933 633573 782955 515492 416258
7535 416258 663102 702747 570381 685790 666756 715475 706804 779501 779120 700154 594415
7524 594415 375704 500222 496421 564476 553917 303020 227666 288228 299911 289094 582524
7513 582524 490216 147355 301310 349548 363780 443417 128768 373480 336119 248049 292721
7502 292721 334448 234015 432554 567371 508884 634779 576967 409489 516288 484460
7492 484460 399335 382440 581423 584317 743884 405424 233090 435239 378415 590517 510459
7481 510459 552828 579907 636079 555948 596319 734787 641787 484702 789332 799290 784161
7470 784161 799958 785396 618112 901458 882299 683128 654650 244060 124580 374211
7460 374211 179973 -156040 -23567 557517 600442 628251 590284 538702 441811 631086 745156
7449 745156 439517 126160 380941 224856 17125 261873 458710 587656 404276 299474
7439 299474 444111 549365 575886 670356 625270 525398 500177 371533 591017 501408 661837
7428 661837 430841 405103 134592 -141022 54663 369261 657500 686432 607510 375805
7418 375805 165715 300994 265668 355713 381482 333369 282951 489430 439826 290302 499013
7407 499013 558422 673752 486411 521830 642053 671338 394889 445697 315232 204681
7397 204681 438574 448305 286351 348750 396381 208488 84302 279869 403438 392970 221788
7386 221788 451899 383866 436505 337559 283304 255525 436421 550295 481100 637357 450277
7375 450277 321272 599851 443909 439326 440636 468541 365809 473498 554467 570941 521306
7364 521306 432800 497212 632638 696056 626366 484511 453160 409507 424117 574905 510407
7353 510407 494842 903632 688003 167678 301448 211795 513062 469816 344781 361492
7343 361492 482914 480943 370744 445608 173121 422834 378093 317038 261547 309285 356356
7332 356356 640110 628118 350637 405316 357955 332176 267388 466543 610302 414213 490215
7321 490215 488981 415792 285048 312420 163652 269147 427480 589119 444145 297019
7311 297019 497899 526311 270353 163698 359160 510160 685378 266199 507102 710919
7301 710919 438254 168798 231187 346945 219624 358464 163218 -127528 213573 427726
7291 427726 587879 534536 452058 354215 539392 427679 561690 517580 520674 448232 467439
7280 467439 406197 438455 470606 587354 818471 491675 571857 576470 436021 79263 308302
7269 308302 714971 802334 979576 952530 691719 600085 529307 218663 170136 225514 108192
7258 108192 73473 231064 278935 327999 261751 339285 476225 554138 600463 600961 436580
7247 436580 362803 119624 217308 140466 8463 97218 334699 567873 582406 761147 869372
7236 869372 501274 396926 691287 480038 580859 723900 457290 324157 564432 238030
7226 238030 201005 663692 706793 876791 817515 597984 380579 489416 493864 408486 595554
7215 595554 677961 602662 748754 567172 618172 743287 524141 345544 312082 393578 235867
7204 235867 384874 437651 528194 522493 530974 588147 513204 431111 401815 415014 250256 204974
7192 204974 200771 216579 342714 502363 337938 437167 571245 758892 615687 348464
7182 348464 349542 390537 364594 249476 105436 224427 203486 290991 270024 107619 557373
7171 557373 433134 572669 349499 512580 376604 335843 589407 542140 440246 507570
7161 507570 450567 446161 462149 314385 148617 250174 233457 204128 -25943 280337 307608
7150 307608 322365 315088 431632 455667 387727 378123 323711 487102 431887 593763 509043
7139 509043 473403 309362 337173 461628 666573 474028 453334 373613 397435 578084 319942
7128 319942 437855 401621 584143 520137 436509 791684 389733 408930 483293 272113 24230
7117 24230 75567 175025 341218 332881 230616 444037 539904 271403 471907 629204 532991
7106 532991 480513 434460 261723 246152 583934 623841 276968 170519 501790 702752
7096 702752 793927 674302 408792 288482 350755 479770 597071 677066 381739 159164
7086 159164 498012 613824 432150 506420 681408 524164 423938 96937 133237 254036
7076 254036 347590 161564 254233 624130 604532 466092 351270 225233 206632 226283 340128
7065 340128 562233 711528 771347 624710 566314 506569 599145 656093 554737 522816 733602
7054 733602 352885 408791 532421 967642 877050 515518 483588 601889 612672 650074 812795
7043 812795 659812 469783 106206 30982 299315 444992 674106 513121 375122 399544
7033 399544 486363 691378 519655 365071 424724 506802 327533 552336 447746 457909
7023 457909 590461 771548 559656 480098 471918 637064 679784 533043 631152 796470 570827
7012 570827 700100 889542 765850 625065 586075 670437 677082 894127 890957 699409 619281
7001 619281 663475 842490 842579 653796 741894 637029 699456 601612 644182 740030 636651
6990 636651 441090 558586 771855 845940 666143 623837 709068 783794 746803 357333 393987
6979 393987 694063 696946 630209 480329 490483 421123 615851 482945 385993 560233 603129
6968 603129 668295 516829 508913 766353 643247 472170 481521 732510 539035 301104 602245
6957 602245 662391 503186 618623 550583 647553 729618 469047 385156 404941 631394 928288
6946 928288 575153 263745 511593 544226 695654 411633 571288 398717 401731 618739
6936 618739 781666 668720 342250 377047 304399 65465 166087 430728 601234 843124
6926 843124 735471 559180 461709 507526 503916 299668 448235 306396 435907 525977 368464
6915 368464 492646 687642 914417 811895 596884 686349 714964 405281 482713 785661
6905 785661 688108 464511 563153 739999 713500 551092 615726 607957 414648 781750 614954
6894 614954 429810 532780 269882 186390 392480 295616 395111 347560 345517 391874 526899
6883 526899 372226 414494 736478 441981 279870 425990 692585 513669 822780 758065
6873 758065 921229 961779 578831 447212 752457 750096 731923 960317 911784 645695 399104
6862 399104 519153 711991 787444 545756 250160 174730 -36973 57025 586723 622645
6852 622645 506052 445300 450794 623267 695711 531953 548471 793688 741295 494250 237153
6841 237153 216210 433007 502298 466718 618491 601141 423506 366601 201731 391113 539570
6830 539570 619288 522078 469061 462001 430897 546280 902011 733789 507333 404838 481470
6819 481470 420165 346791 565486 646589 483384 376838 375664 398630 606530 802735 799041
6808 799041 456579 429857 702756 441241 306245 495604 526469 553775 615619 941262
6798 941262 695107 451525 526457 603456 846475 836109 515377 408608 420957 564299
6788 564299 669372 912197 637318 535891 559359 348281 177654 43193 152577 685635
6778 685635 794617 643807 415400 472288 619325 541648 665748 774027 861933 620257
6768 620257 361366 497161 772331 877471 649045 636064 440988 457000 476696 465261
6758 465261 518850 745641 651135 330907 616711 833246 1062618 1020406 755899 650258
6748 650258 799067 675775 616403 499973 506177 639255 682593 779250 550717 675587 877127
6737 877127 1060149 1083826 1004783 802215 780253 1082923 978358 888268 952811 816516 800751
6726 800751 793323 710513 719736 662645 819271 799549 904518 907959 901173 945226 991410 890010
6714 890010 441433 491779 645512 624189 677469 421080 391163 453682 610046 773706 635154
6703 635154 670676 588426 967553 1047496 1044860 775665 589518 490459 479200 725703 799079
6692 799079 616099 384538 572024 481853 707254 731821 481891 639050 776548 725981
6682 725981 695759 504613 808372 870694 815596 655089 710967 631955 367083 366607 439968
6671 439968 297902 680694 710452 825987 654555 697456 629250 591412 789679 634520
6661 634520 569332 542520 655410 480671 292969 403889 525148 609153 711539 857407
6651 857407 380637 682156 619247 261534 388035 488159 694200 611482 611864 642434 706369
6640 706369 498046 636544 805013 536553 500984 579043 559914 332045 126617 294527
6630 294527 536272 582613 432302 544284 664196 477752 360722 448793 402178 416016
6620 416016 467230 590329 633883 591955 484770 369039 323137 435559 557685 712711
6610 712711 688335 635951 691082 502710 527963 695218 443511 495467 469688 494808 330542
6599 330542 570557 430473 485321 433036 555963 614434 445075 227578 514191 463867
6589 463867 510964 648767 773703 889065 696910 686507 647902 305396 290354 429946
6579 429946 472856 442705 589707 526378 611607 585730 794014 783955 795479 784199 413083
6568 413083 508561 681956 1110352 903236 955483 813518 853594 464056 353210 325853
6558 325853 -8341 21977 342625 816847 652337 498090 600959 581547 195711 248255
6548 248255 489864 447446 162348 158924 461643 363850 442305 480127 333065 422655 671668
6537 671668 671090 543198 490111 438595 348956 445770 716526 526622 574460 490575 426192
6526 426192 532862 797651 618981 627088 647773 427880 666105 529828 555928 499297 439272
6515 439272 235571 394579 348090 275713 303818 756809 523934 334387 362717 194535
6505 194535 210963 178133 158137 297822 165518 236367 369804 401579 298038 318376 503325
6494 503325 406137 297795 572815 560925 830884 793141 547843 481367 471115 635719 694650
6483 694650 605577 448724 577630 702409 348355 487140 565471 734514 806640 699112
6473 699112 627584 382921 423068 497414 544186 571608 869439 1135429 1048443 839828 441903
6462 441903 342868 547863 450533 489904 569830 557118 631107 771425 683986 943882 840802
6451 840802 541161 348324 407636 473359 512103 596625 567364 463400 388060 501963 612059
6440 612059 401553 314423 513203 564142 783637 717382 669869 342302 433760 376776 475352
6429 475352 792515 771382 838336 540059 431932 285261 350529 340653 441680 304120 403352
6418 403352 637488 666994 912089 1011041 479205 671479 574000 332373 479948 493869
6408 493869 387632 422695 540867 776564 499785 601523 733390 728171 641212 681768 727233
6397 727233 580719 649615 658148 844058 788743 511175 749338 724452 897757 937927 859504
6386 859504 659628 610125 611317 728200 705373 502505 623211 840056 797533 707169 800584
6375 800584 880671 994325 648719 612048 601722 632987 753257 821712 600846 601678 545976
6364 545976 587910 712431 710263 629987 708739 654818 552005 313537 498109 562237 296766
6353 296766 161080 409888 606450 514163 596383 618044 550085 537957 239969 476796 693173
6342 693173 558665 365251 479155 392751 402318 459029 650264 604822 498555 361776 305455
6331 305455 578904 644350 738669 766291 970508 681409 554734 526878 709832 585141
6321 585141 616056 534041 404636 427770 429805 520034 600635 680492 687809 458213 465862 758576
6309 758576 477401 446449 500510 578913 449503 658905 824625 695361 766362 610481
6299 610481 438746 334254 662674 1157999 973970 533941 658804 655277 522479 576937
6289 576937 609616 367478 438363 693904 588118 537058 437767 412124 354449 468481 460951
6278 460951 550256 580075 700519 538216 466412 507158 371452 437293 469704 314212 534814
6267 534814 618150 531583 552120 509257 600205 512402 536704 682095 498564 665725 695560
6256 695560 682327 733207 588732 639411 673247 647673 505931 543511 558391 568362 632213
6245 632213 715035 603961 570380 429440 544705 474844 574159 608563 503659 657940 636086
6234 636086 652870 635414 123267 392228 652829 528747 694121 657120 594450 744498
6224 744498 701353 593775 307205 461082 727970 835396 813356 448706 476592 470653 418470
6213 418470 545245 370416 287326 642044 731061 884658 803754 756719 525898 591342 803331
6202 803331 739925 604384 793751 787945 454015 780382 678929 854314 953957 963643 961041
6191 961041 588995 683161 597019 590773 861839 947280 907746 835680 745648 535362 664276
6180 664276 814417 545473 591347 749640 627542 427326 667760 856989 750589 620739
6170 620739 757662 857662 756367 906962 697659 585842 701519 748583 599668 537162
6160 537162 653453 711567 1056975 1140253 811950 860299 1251423 1164096 918231 1207921
6150 1207921 1222035 1307041 1397282 987134 1168654 1011928 683916 896936 946405 865163
6140 865163 781069 1100176 1119725 818937 761585 1069695 1283159 1021553 963684 1455689
6130 1455689 1354710 1246010 1353509 1331833 1387297 1266859 1248554 945042 1099734 1570752
6120 1570752 1447856 1445473 1582778 1383746 1370838 1270676 1507431 1299093 1258240 1367506
6110 1367506 1540564 1611635 1677661 1377429 1512610 1656868 1468918 1536524 1382749 1609280
6100 1609280 1778411 2008435 1875774 1597911 1461809 1632318 1583940 1671826 1459417 1533165
6090 1533165 1679759 1512205 1445294 1428397 1507139 1314335 1336040 1532204 1620200 1466177
6080 1466177 1711643 1885505 1467508 1326230 1494694 1504870 1548519 1592615 1714762 1675364
6070 1675364 1503665 1311866 1374622 1228389 1082126 1283022 1348966 1472326 1152848 1070772
6060 1070772 967345 738979 1089163 1261473 1087154 958275 1089611 1207031 1185203 1119114
6050 1119114 984023 910856 955023 847054 636531 542992 605075 604411 755067 965127 1118049
6039 1118049 1256446 972726 840588 891750 1016764 1039369 992623 885508 609000 824031
6029 824031 941370 881170 984455 879354 768347 797577 959447 831286 563117 563388 480155
6018 480155 540328 774635 570597 818770 940166 789280 591652 703629 810879 804648
6008 804648 1021609 912949 830603 1030726 798213 977835 828745 696631 668172 549074
5998 549074 486180 618698 580053 689788 759870 984097 916709 643137 656683 555128 833683
5987 833683 909470 844775 731384 776080 763978 704492 735937 545782 817031 1146826 810353
5976 810353 796630 656360 868115 855906 922398 958613 864916 600326 742641 1130036 1229655
5965 1229655 1219390 1085859 740795 914860 1099920 1108002 971173 794485 840860 942987
5955 942987 715374 922617 995917 1065971 1188795 1166872 976753 745629 807587 1095846
5945 1095846 1042669 922769 983297 1195702 933066 771720 609972 546495 857844 930853
5935 930853 891989 781607 889009 945369 933719 717104 831459 844109 1065573 865454
5925 865454 855886 1068218 977338 921133 987136 933835 515328 563991 716754 807923 770402
5914 770402 1203303 1080725 1011686 972664 1040863 1169252 875704 1053440 579350 830951
5904 830951 1109661 968460 1064942 843330 732113 1206620 1388284 1155541 1044741 1109346
5894 1109346 774790 875607 1000675 854015 810613 973969 942794 679261 732406 931655
5884 931655 1085952 1148744 994720 906213 760182 623029 741026 857123 823697 897822
5874 897822 1006675 1027898 779173 862900 844413 1144883 1359798 1126246 910660 891268
5864 891268 1043674 1116257 961780 920875 939867 1083016 1112358 948665 959647 1078778 1248286
5853 1248286 1163049 1182893 1074143 1110744 1067981 941109 1059891 1185534 1209047 1146752 972554
5842 972554 1153830 1206977 726577 781845 926329 995165 1158504 1257343 1101085 981514
5832 981514 1118676 1393868 1034193 915097 1266034 989409 966054 1067547 812359 813187
5822 813187 1057271 1154429 1364743 1075065 964281 827743 735677 879443 988311 859704
5812 859704 1038288 1011350 967514 1257786 1211457 982084 729137 849334 822793 1065722
5802 1065722 1060826 1006666 923276 868205 1059950 1102477 1134550 1011964 982255 1183267 1203640
5791 1203640 1032944 768070 646981 572202 616158 939970 1236089 1399231 1181785 1095497
5781 1095497 1225209 1530171 1490282 1399480 1350415 1540514 1421613 1382940 1247829 1286094
5771 1286094 1135008 1198165 1211404 907712 1055335 1248785 1343749 1359566 1377268 1299361 1022465
5760 1022465 1083919 1195666 1150389 914499 1135188 1144413 929286 964192 1123905 1355601
5750 1355601 1263107 1088078 985920 781905 981495 1009438 1114047 1169707 960145 802458
5740 802458 1020764 1296753 1112810 1112596 1181890 1174708 1124658 1229743 1485113 1286197 1111283
5729 1111283 1193911 1126311 1141397 1202201 1135385 1163109 1356032 1337317 1257209 1423502 1536781
5718 1536781 1369700 1172710 1193033 1290770 1180576 1173883 1290558 1371088 1072433 1014893 1075450
5707 1075450 1277454 1162843 1263078 859368 866328 1249818 1472479 1221742 1023620 1185295
5697 1185295 1317212 1368711 1337564 1238300 1295756 1293614 1285092 1058446 1227263 1067298 1133526
5686 1133526 1323265 1335246 1048658 1179113 1452670 1412475 1327356 1294540 1020941 886213
5676 886213 1050790 1356971 1349852 1250448 1498008 1677440 1538994 1358790 1271242 1044584
5666 1044584 1249237 1292799 1483935 1257537 1346811 1543534 1560695 1391456 1392967 1546957
5656 1546957 1312079 1358919 1331047 1305875 1347779 1611706 1775764 1794043 1758434 1471435 1973740
5645 1973740 1821931 1715105 1629818 1718269 1883396 1857769 1784638 1973950 1991468 2085616 1996557
5634 1996557 1598202 1679440 1638022 1466083 1618590 1733830 1632014 1893019 2257904 2022216
5624 2022216 1925485 2094488 2035542 1844068 1665788 1880176 2091693 2246791 2371887 2661893
5614 2661893 2512959 2610480 2833526 2827959 2900675 2745194 2723745 2781470 2683685 2582880 2973343
5603 2973343 3096368 3304285 3287865 3374483 3382790 3558239 3935810 4146218 4141479 4399047 4573860
5592 4573860 4853216 5155517 5356948 5974568 6082205 6238922 6479300 7064700 7365037 7683428
5582 7683428 7614994 7570592 7686919 7665775 7541577 7803624 7900106 8073651 8233169 8437718
5572 8437718 8676996 8790247 9104721 9321026 9493200 9779763 10191396 10679397 11414684 11337133
5562 11337133 11548015 12290663 12804523 13071133 13520582 13940247 14403144 14637131 14863916
5553 14863916 14810816 14898654 14766498 14658755 14817487 15072464 15050608 14888529 15057538 14976304
5543 14976304 15296452 15617637 16253474 16823130 17217633 17880036 18271334 18765035 19354879
5534 19354879 19856205 20152980 20281323 20486637 20671781 20849036 20829589 20483120 20289371 19928092
5524 19928092 19836732 19780658 19367005 19307237 19227857 19180768 19141620 19288717 19614964 19783355
5514 19783355 20121524 20428794 20620669 20672491 21020472 21585111 21771174 21948249 21925547 21821711
5504 21821711 22024824 22208274 21906420 21823462 21737925 21452798 21146525 20767810 20650249 20521635
5494 20521635 20150392 19880983 19292489 19068404 18718042 18487847 18559811 18564305 18457751 18271833
5484 18271833 18336598 18170900 18342099 18212709 18182777 17929604 17366573 17036542 16521371 15967012
5474 15967012 15496345 15159125 14830953 14451833 13961135 13644857 13420073 13396895 12920352 12756835
5464 12756835 12834860 12949580 13104998 12720080 12168686 11416090 10887179 10940124 10467914 10368488
5454 10368488 10200396 9853047 9729914 9760698 9495898 8878603 8512415 8353243 7826496 7329694
5444 7329694 7014817 6597998 6069422 5839026 5389443 5143673 5325189 5136322 4861608 4372719
5434 4372719 4693930 4710518 4699294 4659862 4450851 4523084 4424575 4093551 3878174 3575001
5424 3575001 3398138 3418928 3113693 3094092 3185435 2761033 2492444 2652035 2841225 2777982
5414 2777982 2455255 2427459 2661965 2571614 2381043 2243970 2343579 2107579 2058179 2109508
5404 2109508 2322939 2263214 2117305 2067797 2314716 2191423 1970703 1935456 2158572 2153679
5394 2153679 1870040 2061985 1992939 1772705 1714239 1645096 1925253 1801671 1536483 1609174
5384 1609174 1637841 1930964 1748609 1512197 1562742 1725310 1717711 1966401 1945520 1877050 1722494
5373 1722494 1367683 1106237 1334616 1436198 1321024 1241761 1378602 1386571 1489089 1417242
5363 1417242 1456952 1229385 1311489 1250675 1317622 1292082 1214717 1435053 1495057 1678063 1675006
5352 1675006 1808757 1591084 1491163 1296107 1309689 1395477 1222035 1255509 1307799 1451353
5342 1451353 1587200 1338261 1694240 1302281 1027558 1193804 1436061 1621868 1607584 1426216
5332 1426216 1251490 1366391 1566506 1337334 1214708 1332319 1635638 1643351 1614475 1681473
5322 1681473 1642998 1312870 1507295 1588491 1481673 1411015 1387021 1380510 1391932 1305893 948268
5311 948268 1051434 1355335 1535454 1275739 1299342 1138999 1095703 1222965 1168449 1176075 1066699
5300 1066699 1109215 1282795 1192478 1146619 1090387 1037348 968836 1340023 1438514 1279210 1141273
5289 1141273 1203038 1338843 1429400 1152862 1115135 1017561 957641 867377 831384 1080099 1297619
5278 1297619 1193944 957117 1070819 1202453 1385164 1244108 1224263 1508757 1461812 1418995
5268 1418995 1360248 1273250 1266953 1329829 1546289 1211866 1194645 1323064 990797 1091673 965346
5257 965346 1028104 920213 1136875 1010263 824732 932713 804692 707133 971594 954606
5247 954606 984463 1093282 1065322 1139149 1020663 1372291 1212498 1159120 1410793 1464365 1489022
5236 1489022 1288219 1256401 1497640 1542532 1501523 1551743 1569491 1314133 1125435 1027768 1301689
5225 1301689 1493578 1629173 1695239 1755075 1598750 1292600 1464980 1665574 1677472 1687373
5215 1687373 1528520 1466293 1308914 1722678 1711535 1309558 1082769 1400703 1508826 1378582
5205 1378582 1560832 1540003 1358105 1270439 1623588 1465727 1511962 1435889 1530058 1441787 1217714
5194 1217714 1451985 1506313 1519032 1478270 1516646 1980126 2012373 1754530 1527078 1687486
5184 1687486 1823002 1778271 1887076 1859396 2064605 2104146 1859872 1760269 2000280 2001170 2006244
5173 2006244 2122101 2175203 2092943 1999311 2360140 2533782 2440529 2240558 2274371 2370160 2473062
5162 2473062 2284052 2385621 2603644 2724244 2481000 2339731 2842847 3010348 3202096 3188907
5152 3188907 3172662 3308168 3430641 3322986 3770882 3721533 3958498 4281180 4497597 4788700
5142 4788700 4908974 4950977 5121759 5310846 5621769 5879770 6010645 6630647 7057575 6999980
5132 6999980 7381348 7452282 7224573 6974332 7039466 7223345 7308188 7433174 7377521 7467773
5122 7467773 7452881 7729558 7988192 8257897 8323919 8307696 8580445 9041647 9369416 9490619
5112 9490619 9899055 10300472 10660448 11363960 11853273 12232848 12975301 13580531 13709760 14404257
5102 14404257 15104102 15235185 15541089 15834470 15652836 15669457 15606828 15680910 15479622 15419516
5092 15419516 15168335 15044800 14889105 15099660 15236379 15382996 15580569 15669620 15610061 15665464
5082 15665464 15683517 15842770 16150547 16268132 16567835 16928980 17075786 17346778 17857296 18199900
5072 18199900 18587024 18797792 19370073 19625986 19759158 19880887 19861205 19886458 19780481 19697393
5062 19697393 19427200 18954385 19123123 19012369 18755534 18536845 18509797 18552126 18854325 18898718
5052 18898718 18798592 18788836 18132098 18258560 18076554 17460793 17438903 17460074 17184581 16875343
5042 16875343 16616859 16353647 16288447 16326409 16217299 15957443 15909152 15785156 15534428 15270794
5032 15270794 15191690 15155320 14963030 14677473 14615271 14633973 14688495 14692298 14708153 14706295 14454771
5021 14454771 14673790 15022839 14881303 14625833 14200289 14063883 13630121 13425896 12937225
5012 12937225 12353828 11854958 11513453 10878546 10152864 9947544 9986954 9460689 9083466 8987647
5002 8987647 8628301 8173915 8063031 8136073 7944037 8010941 7956130 7825283 7773849 7611460
4992 7611460 7542462 7575928 7531454 7620596 7396459 7258873 7369876 7166902 6970107 7059700
4982 7059700 7009526 6797894 6507350 6101317 5826745 5610774 5216238 5146652 4658411 4542787
4972 4542787 4544209 4347421 3984303 3735136 3947754 4008379 3801917 3653847 3369581 3461869
4962 3461869 3474673 3526783 3819450 3855250 3858826 3464092 3173469 2945784 3448787 3424979 2994459
4951 2994459 2955643 2767523 2830919 2698941 2704210 2611527 2793329 2460333 2396620 2221119 2191391
4940 2191391 2095206 2185928 2173828 2265415 2178069 2168229 2098764 2009299 1799226 1828352 2127843
4929 2127843 2083392 2066371 2063057 2096239 2111646 2025928 1883483 2183128 2079294 2224776 2128539
4918 2128539 2012303 2043511 1891626 1920720 1603558 1750685 2048550 1830823 1789759 1683591
4908 1683591 1678719 1759970 1904625 1723576 1716054 1669568 1915532 1784934 2025244 2188651 2217913
4897 2217913 2045861 2041474 2235860 2230506 2010144 2199406 2263755 2563943 2770102 2682321 2767665
4886 2767665 2947157 3274515 3508863 3535369 3743327 3898511 4280776 4920304 5087130 5453799
4876 5453799 6269992 7193255 7340722 6871071 5783354 5257045 4488124 3620475 3278691
4867 3278691 3055597 3054032 2786837 2726340 2239258 1924389 1838285 2005795 2340855 2194527
4857 2194527 2203771 1860019 1568495 1630970 1486113 1625625 1767939 1802470 1496538 1412139
4847 1412139 1479579 1301583 1120232 1307395 1598649 1379546 1477168 1263140 1342603 1447853
4837 1447853 1336097 1433142 1404671 1211448 1320658 1154018 891660 1253047 1456541 1366468
4827 1366468 1451980 1251223 1171789 1180497 1160227 918186 1100905 1144420 1094592 1140299 1032209
4816 1032209 1050321 1256525 1345303 1255340 1151467 1149927 1201940 1058943 1195381 1056080 1032479
4805 1032479 854937 970708 1147876 962337 842780 1133516 1150795 1145926 1055636 1095543
4795 1095543 967551 1015495 1232049 1404441 1159289 1036995 1117123 1274336 1291747 915269
4785 915269 1048005 1082449 1170518 1009380 1151685 991807 1032087 965839 1145190 1262909
4775 1262909 1401670 1382612 1194947 1072836 715598 937007 1201411 1213180 1537092 1339851
4765 1339851 1110717 1207938 887826 953283 1200911 1228214 1283846 1152243 1227630 1318628 1392617
4754 1392617 1244862 1503680 1514318 1362115 1526972 1291560 1357509 1247581 1091864 1271161
4744 1271161 1485113 1569100 1536412 1632969 1494459 1065635 975798 959857 1090689 1220111
4734 1220111 1175146 1122817 1124114 1058150 1067832 1284175 1344242 1374761 1354428 1288510 1350950 1268245
4722 1268245 1194319 1395110 1328098 1612921 1505500 1577309 1689521 1545026 1750701 1403245
4712 1403245 1536606 2025166 1775812 1442435 1533485 1414575 1593270 2011350 1830121 1605293
4702 1605293 1741747 1540173 1474709 1468724 1347194 1339239 1474286 1410035 1794410 1866874 1767612
4691 1767612 1643899 1346344 1510700 1638498 1550054 1719823 1603597 1748096 1494546 1641840
4681 1641840 1780907 1576842 1929627 1719941 1778008 1941758 2044208 1819629 1470102 1532459
4671 1532459 1880558 1858949 1491242 1571419 1543642 1743205 1656639 1615382 1577655 1730562 1896654
4660 1896654 1909011 1773099 1683650 1686868 1466126 1452078 1779925 1630027 1376648 1439751 1448784
4649 1448784 1613449 1619123 1787750 1680171 1656124 1654840 1378403 1429185 1481489 1729148 1667357
4638 1667357 1771359 1770152 1630834 1575609 1560725 1566249 1700831 1656083 1470009 1299130 1342761
4627 1342761 1558047 1613210 1715431 1827540 1835495 1544704 1664793 1525775 1703719 1343521
4617 1343521 1482537 1609296 1623510 1522550 1708963 1580876 1882644 1678218 1647230 2000418
4607 2000418 1731654 1783338 1795115 1584978 1691636 1698717 1774128 1641257 1829329 1906183 1756709
4596 1756709 1653749 1439574 1489730 1570471 1675890 1860068 1889693 1994107 1948972 1691101
4586 1691101 1536267 1517225 1705113 1603094 1580070 1347618 1474264 1545585 1770779 1626361
4576 1626361 1549972 1488510 1723099 1517215 1604606 1823216 2077633 2009260 1789010 1729335
4566 1729335 1839329 1885420 1811078 1875004 1818808 1659875 1716822 1598325 1816915 1837234 1862091
4555 1862091 1828824 1861181 1992663 1581554 1618375 1620976 1584264 1483428 1781012 1718235 1604800
4544 1604800 1667818 1743546 1619148 1724908 1811816 1756704 1654924 1728287 1876734 1878604 1750671
4533 1750671 2017204 1884517 1724289 2011016 1930139 1965567 1963172 1876789 2091196 2085110 1890049
4522 1890049 2110235 2118792 2224116 2481885 2469607 2380705 2314626 2232324 2328462 2287499 2390440
4511 2390440 2232244 1999112 2157958 2173783 2243785 2233301 2446307 2489589 2429275 2584248
4501 2584248 2623358 2357571 2082435 2288737 2586281 2621518 2502127 2315807 2324979 2526891
4491 2526891 2491983 2403967 2643137 2670517 2224713 2193413 2383216 2538372 2659958 2501805
4481 2501805 2652680 2902970 2832216 3022011 2806103 3044877 3017195 3002770 2769362 2737827
4471 2737827 3021423 3113615 2875137 2815816 3026144 3430505 3585876 3476844 3504763 3563847
4461 3563847 3718609 3564047 3748850 3641588 3754973 3792323 3834430 3844659 3931171 3953423
4451 3953423 4191864 4398807 4548449 4649692 4923692 5024516 5219387 5355779 5478925 5637390
4441 5637390 6130257 6498939 6869847 7202729 7528335 7839441 8150569 8285095 8898727 9493140
4431 9493140 9520235 9975613 10604325 11372157 12159950 12572180 12736012 13309093 13313929 13638654
4421 13638654 14085719 14504929 14903042 15395289 16246468 17221438 18042379 18719808 19394699
4412 19394699 20224651 20679906 21228724 21326329 21334844 21407484 21415498 21574186 22082784 22305437
4402 22305437 22479100 23229606 24117090 25036916 25601575 25985961 26364006 26216736 25571865
4393 25571865 24946430 24500845 24416763 24281109 24553274 25064644 25426378 25935310 26514329 26948802
4383 26948802 27101620 27125899 26839709 26486474 25810831 25161308 25141073 24838369 24563262 24649916
4373 24649916 24674994 24933091 24986374 24960955 25090833 25130309 24906848 24536405 24697302 24655452
4363 24655452 24818219 24653714 25027494 25461933 25816181 26374414 27171443 27958895 28662104
4354 28662104 29289221 29555961 29777594 30052816 30305596 30504646 30708009 30818169 30943963
4345 30943963 31058011 30907637 31078781 31385704 31923353 32747255 33558095 34397280 34840123
4336 34840123 35139041 35910316 36576748 37317552 38122680 38909111 39422590 39774547 40109136
4327 40109136 40152914 39860327 39741726 39899267 39651043 39421856 39497228 39725404 39639378 39496646
4317 39496646 39186336 38705725 37980888 37617738 36986878 36627221 36077211 35416037 34907496
4308 34907496 34651395 34202255 33933848 33717661 33358569 32664034 32192166 31935663 31598907
4299 31598907 31257043 30844526 30431483 29838742 28856247 27776575 26478182 25173299 23794417
4290 23794417 23018072 22201257 21338085 20589980 19810452 19312721 18532831 17809343 17099838
4281 17099838 16694388 15987533 15944847 15435323 15004960 14526674 13983392 13244589 12903055 12742440
4271 12742440 12428805 12083214 11833071 11653322 11504870 11347666 11056734 10944121 10879422 10747836
4261 10747836 10617936 10697542 10645336 10482005 10054141 9803736 9947640 9775546 9573057 9461824
4251 9461824 9427677 9526800 9433011 9348523 9140001 9125604 9084500 8709620 8491562 8152847 7834215
4240 7834215 7744334 7340042 7398476 7151123 7133978 7062431 6772402 6821342 6784249 6631781 6771203
4229 6771203 6596372 6333082 6474366 6279836 5899591 5950062 5935826 5944291 6090957 6069944
4219 6069944 6226493 6425098 6577935 6540166 6386097 6326407 6072461 5999974 6327714 6056922
4209 6056922 6046901 6166005 6379026 6661720 6465888 6444233 6434151 6432375 6646739 6448366
4199 6448366 6644070 6973872 6862317 7000521 6949516 6912062 6871877 7159315 7013896 6887145
4189 6887145 6919289 7124162 7241392 6893844 7127859 7291101 7313934 7334451 7474431 7255765
4179 7255765 7500227 7702738 7511461 7670304 7720631 7811336 7781391 7719063 7782966 7652919
4169 7652919 7829899 7714440 7840606 7762473 7900699 8047340 8357194 8250747 8054169 8221987
4159 8221987 8434465 8821556 8767043 9112264 9154849 9422278 9325174 9163218 9613611 10234399
4149 10234399 10467975 10624818 10845911 11156046 11473475 11743994 12130381 12311600 12689801
4140 12689801 12988430 13254035 13601039 14176683 14917993 15113596 15766577 16597020 16958327
4131 16958327 17572973 18146930 18688354 19379997 19629978 19744034 20946049 22175410 22939160
4122 22939160 23682861 24551227 25703923 26936890 28212666 29560982 31199488 32688345
4114 32688345 34459612 36416231 38505552 40670724 43263599 45962889 48765888 51943556
4106 51943556 55369252 59021616 62730949 66333463 70239957 74713484 79160771 83292644
4098 83292644 86959839 89793980 91042789 90792120 88688439 85324950 81289801 77138548
4090 77138548 72709007 68778593 65414651 62420512 59678784 57266304 55319824 53474610
4082 53474610 51900653 50266740 49177928 47825478 46719824 45519455 44451888 43808192
4074 43808192 43126189 42591970 41958970 41600077 41372624 41125465 41219562 41534399 41599737 41656827
4064 41656827 42282969 43171403 43878268 44485593 45385481 46428444 47495035 48377925 49146002
4055 49146002 50636183 52187958 53672933 55183057 56768284 58797117 60670936 62874022
4047 62874022 65023202 67043819 69722299 72624903 75492655 78400386 81462910 84800871
4039 84800871 88230655 91762003 95431181 98728090 101468278 104218701 106740891 108817810
4031 108817810 110346071 111677666 112305234 112473318 112296972 111066357 109836758 108247595
4023 108247595 106739355 104934282 103045624 100879590 98926263 96753249 94849865 92907180
4015 92907180 90605991 87951980 84471366 81217714 77609173 73719160 69577802 65553155
4007 65553155 61512413 57562492 53969597 50663905 47855639 44977284 42251283 40146349
3999 40146349 37846568 35775553 34182744 32551063 30995726 29657240 28452753 27212917
3991 27212917 26170596 25187643 24088931 23382154 22876906 22376549 21590431 21129279 20475713
3982 20475713 20203280 19854541 19361019 19049364 18638688 18255758 17679184 17268562 16887633
3973 16887633 16855026 16545156 16068853 15831733 15552489 15420727 15380931 15083742 14728744 14583355
3963 14583355 14515672 14254641 14422757 14266648 14298484 14204657 14274990 14301726 14164453 14293499
3953 14293499 14008734 13796821 13555284 13419080 13611101 13791534 13555408 13587298 13398382 13173784
3943 13173784 13257681 13376576 13585276 13472567 13547044 13905932 13949925 14167694 14414537 14855616
3933 14855616 15171310 15333985 15810278 16501586 17010212 17332416 17838127 18158758 18919950
3924 18919950 19345050 19723057 20041625 20354662 20443763 20484866 20556369 20515777 20369722 20371736
3914 20371736 20057309 19730387 19741298 19580461 19555458 19501621 19543923 19564639 19781988 19717807
3904 19717807 20031798 20296147 20530271 21197221 21566384 22001853 22763206 23380516 24233512
3895 24233512 24826875 25678632 26711704 28045629 29265977 30532496 31953827 33379025
3887 33379025 35309388 37290799 39304761 41581018 43862182 46412797 49104609 51479974
3879 51479974 54389166 57736931 60877712 64032434 67359489 70621550 73592974 76267970
3871 76267970 78840307 81384800 83594164 85268507 86557467 87423751 88277715 88506275 88291481
3862 88291481 88113751 87915138 87319880 86703597 86626636 86389517 86105142 85912550 85445756 85420680
3852 85420680 85125294 84622808 84199112 83037078 82262394 81244067 80129825 78958692 77625739
3843 77625739 76083158 74824886 73637929 72558149 71726879 70936336 70709239 70849312 71221895
3834 71221895 71960967 73334493 75245940 77402612 79763772 83024363 86290181 89622933
3826 89622933 92545803 95138175 97585956 99687113 101271682 102477431 103083906 103160696 103027092
3817 103027092 102101925 101015993 99833586 98190547 96737385 95151247 93067211 91604696
3809 91604696 90134172 87924228 86006261 83592345 80981111 78299060 75159342 72110132
3801 72110132 68902588 65530143 62096467 58781822 55692014 52624901 49610321 46670384
3793 46670384 44021180 41546737 39028922 36732797 34334651 32597984 30835198 29546350
3785 29546350 28327460 26723360 25461231 24310683 23267802 21991211 21329871 20645392
3777 20645392 19678107 19365343 19202298 18364273 17583491 17134251 16857649 16452025 16149387
3768 16149387 16393708 16142012 15834286 15964225 16299659 16516165 16562748 16501282 16568957 17027788
3758 17027788 16969807 16915894 17080131 16991761 16938668 16866101 16462107 16025458 15513612 15306260
3748 15306260 15090325 14780279 14062114 13409366 13171746 12761852 12383631 11998623 11421385
3739 11421385 11007114 10632217 10163839 9889028 9678766 9546124 9212753 8856397 8672548
3730 8672548 8375473 8424980 8419138 8490109 8564475 8262000 7893150 7674475 7755432 7647606 7475104
3719 7475104 7423125 7582416 7521047 7480327 7539974 7385419 7163403 7384280 7245685 7091908
3709 7091908 7069653 6896754 6832436 6837158 6963525 6911653 6635376 7055969 6968882 6687418 6432046
3698 6432046 6645385 6663127 6481687 6444289 6544970 6578522 6309824 6330615 6388796 6445649 6310697
3687 6310697 6380047 6255007 6361041 6363853 6679469 6602370 6468218 6579690 6851859 6959758
3677 6959758 6921473 7135229 6982446 6839354 6904996 7174984 7257242 7350279 7290815 7374359 7515184
3666 7515184 7445549 7729233 7763763 7768988 7768303 7805844 8057996 8501821 8831903 8985231 9108622
3655 9108622 9400941 9554766 9863405 10214660 10580157 11025066 11386299 11838603 12235787 12589797
3645 12589797 13149387 13970492 14471726 15186831 15739890 16162160 16835378 17475356 17815936
3636 17815936 18393909 18966190 19653980 20257538 20724525 21359502 21904357 22235378 22669284
3627 22669284 23009212 23500135 23555540 23723346 24159820 24018489 24295952 24420117 24419369 24632149
3617 24632149 24478882 24545959 24784529 24951094 25145341 25362382 25719322 25874286 26100318 26698450
3607 26698450 26895479 27183815 27801361 28701302 29563358 30494738 31919330 33594443 35193540
3598 35193540 37225364 39517241 41892449 44403493 46960841 50413064 54251758 58691830
3590 58691830 62676995 67269105 72448281 77615299 82875655 88148261 93171653 98111152
3582 98111152 102696649 107035291 111245933 115445499 119132032 122498534 125501924 128245238
3574 128245238 130606236 132565263 133854404 134727977 135005462 135033628 134217644 132707002 130979778
3565 130979778 128792003 126321761 123151398 119534488 116010888 112354901 108525108 104414526
3557 104414526 99780127 95389702 90837994 86206485 81788238 77680406 74059718 70768371
3549 70768371 67516586 64818941 62190302 60071539 58470599 57155901 56064450 55253105
3541 55253105 54581269 54129139 53679260 53566585 53781126 54365901 54585394 55080077 55664414
3532 55664414 56262282 56732629 56703205 56779809 57001350 57121926 57167121 56927327 56667152 56540478
3522 56540478 56346214 55648066 54965568 54722135 54291802 53436356 52415596 51414940 50479553
3513 50479553 49407134 47994369 46425381 44758497 42686978 40614591 38579474 36811814
3505 36811814 35306240 33936089 32566672 31298836 29845813 28838169 28019841 26992397
3497 26992397 26232031 25604489 25291444 24585549 24011653 23580606 23802276 23317187 23111810
3488 23111810 23227323 23427746 23600071 23986431 24423042 24882365 25041264 24763542 24687915 24707024
3478 24707024 24909474 24784217 24723667 24994086 25209561 25133184 25382486 25562195 25778131 25956932
3468 25956932 25873670 25944913 26255934 26298536 26659152 26816200 27195443 26975030 26760161 26680855
3458 26680855 26552817 26715093 26574730 26643372 26473967 26124347 26593082 27016725 27237166 27236021
3448 27236021 26789899 26403752 25897735 25706582 25626387 26018531 26441534 27208339 27862687 29064872
3438 29064872 29994840 31133350 32831461 34531461 36220706 37857903 39935046 42426086
3430 42426086 45617168 48852501 52043430 55696883 59640192 63444170 67754437 71985872
3422 71985872 75888049 79262101 82134417 84349142 85957696 86661750 85802888 83185427
3414 83185427 79854213 76761392 73372383 70299985 67293369 64599643 62298688 60459012
3406 60459012 58813003 57675789 56821471 56365041 56057656 56063421 56078657 56016164 56225403 56269604
3396 56269604 55997684 55667797 55591282 55321896 55049356 54760280 54213552 53845462 53912561 53905341
3386 53905341 53930539 53645171 53025637 52019933 50767411 49958899 48656949 47354465 45853718
3377 45853718 44337905 42690204 40830520 39272304 37341387 35612331 34017086 32359456
3369 32359456 30431886 28576473 27089562 25467635 23868332 22596919 21511778 20294236
3361 20294236 19489579 18872235 17989811 17321941 16615224 16038167 15332533 14878183 14068812
3352 14068812 13855711 13544871 13345572 12884750 12154034 11762469 11508844 11274636 11254551 10947388
3342 10947388 10807252 10658413 10319529 10288072 10115133 9825031 9974467 9871114 9717800 9890947
3332 9890947 9961391 10213575 10138212 10087266 9987944 10131482 10179086 10113544 10184822 10105285 10041311
3321 10041311 10008648 9545724 9407549 9217683 8901868 8600961 8556021 8521370 8196502 7991853
3311 7991853 7668146 7432447 7267384 7130001 7011885 6651038 6418591 6449014 6475259 6399813
3301 6399813 6328745 6275446 6176922 6171348 6094003 5920551 5789068 5935808 5968504 5673296 5955844
3290 5955844 5923275 5771408 5737193 5756057 5778590 5970154 5863193 5823306 5686742 5843960
3280 5843960 5959811 6067073 5936824 5852721 6083997 5765965 5902195 5956683 5826838 5526977
3270 5526977 5617847 5901252 5816856 5457591 5249158 5496682 5476663 5633795 5531737 5292780
3260 5292780 5658832 5319496 5155012 5652245 5966293 5897479 5936609 5762024 5511076 5597459
3250 5597459 5708250 5868270 5839468 5799898 5766443 5784880 5897746 5886797 5923147 6148647 6317304
3239 6317304 6536151 6720534 6534771 6648437 6814345 6883966 7043782 6917151 7052293 7324599
3229 7324599 7099017 7185035 7432377 7373183 7546618 7842924 8237910 8585286 8650077 8786069
3219 8786069 8861740 8793601 8970233 9481303 9884404 9690264 9886196 10332988 10773872 11284272
3209 11284272 11301074 11580431 12095970 12407862 12986808 13388250 14227403 14730228 15327764 16146625
3199 16146625 16828856 17812584 18790458 19813165 20385455 21104125 21486616 21306875 21443176
3190 21443176 21933882 22375346 22850441 23746893 24537544 25217937 26414102 27540585 28760550
3181 28760550 30152110 31480947 33122719 35270280 37319070 39740762 42347641 45258123
3173 45258123 48362146 52185745 56353701 61030505 66541891 72468067 79528011 87281645
3165 87281645 95967816 105539886 116022621 127380110 139268469 152290635 166554158
3158 166554158 183167667 202969870 226446367 252495860 275437369 285819511 276673653
3151 276673653 250892018 218504678 188298171 163256696 143504016 128354662 116349629
3144 116349629 106891616 99689136 93606532 88187847 83407979 79173514 75906024 72927037
3136 72927037 70579863 68977995 67430823 66552496 65900023 65132068 64865002 65048364 65283587
3127 65283587 65467698 66069999 67030563 68157736 68963851 69908811 71393698 73243886 75628888
3118 75628888 78565273 81904520 86248487 91259235 96498271 102630419 109459889 116826422
3110 116826422 125241513 134103529 143775053 154279870 165037712 176763641 188672610
3103 188672610 200758486 212586808 222334328 228349406 229335395 224637447 214321855 199880774
3095 199880774 184039422 168254803 153271014 139628975 127873428 117445885 108192829
3088 108192829 99701689 92329032 85720705 79493699 73950884 69001915 64520208 60479135
3080 60479135 56855731 53201948 49766901 46931544 44349128 42028386 39616444 37448608
3072 37448608 35563922 33816385 32025690 30624543 29144467 27847395 26464850 25149752
3064 25149752 24217147 23093376 21936931 21159897 20302597 19509977 18844668 17908438 17279626
3055 17279626 16824542 16449015 15876514 15207856 14554316 14298836 13976923 13568071 12922944
3046 12922944 12341030 12094518 11927155 11606128 11496880 11083549 10773809 10741451 10269044 9926313
3036 9926313 9707845 9497221 9160734 8976861 8674487 8601274 8466566 8261723 8098688 7733134
3026 7733134 7415336 7338401 7189062 6889807 6648652 6537660 6349749 6182592 6183653 6142144
3016 6142144 5895404 5769656 5636914 5769134 5691722 5146935 5123139 5311150 5337648 5212448
3006 5212448 4986352 4856958 4644557 4691765 4653632 4274585 4406138 4220478 4138170 3859245
2996 3859245 3884240 3905589 3825271 3840560 3607308 3409635 3304654 3267456 3398116 3296311
2986 3296311 3362891 3242877 3322297 3155038 2914453 2799595 2823715 2653212 2552128 2656644
2976 2656644 2499740 2470813 2487755 2727850 2561296 2303190 2029008 1950554 2190028 2378462
2966 2378462 2375152 2267903 2334154 2241943 2193886 2238905 2419890 2249706 1994112 1759510 1975508
2955 1975508 1981927 2029037 2115022 1979762 1966503 1712200 1723888 1937634 1830643 1804363 1717131
2944 1717131 1668011 1629810 1552740 1582066 1769543 1718703 1371265 1355343 1444316 1539946 1497065
2933 1497065 1341793 1338504 1241174 1434944 1488041 1108476 1059148 981323 1101644 1011064 1122428
2922 1122428 1214871 1166454 869177 953367 983556 951659 1121640 1109497 1211699 1201687 1008805
2911 1008805 1224895 977423 886120 1098382 1160829 1058006 1001931 987946 1067136 933710
2901 933710 819109 909024 922390 682440 883088 1243876 916567 959841 1102897 1062500
2891 1062500 1050799 1112491 1213683 972442 932694 989588 1077565 1148851 1071845 973637 969466
2880 969466 1217531 1393248 1307347 1517183 1394014 1318621 1353750 1475563 1479758 1739170 1878482
2869 1878482 1869861 1700581 1739067 1720004 1328602 1430296 1539714 1340446 1387249 1432894 1161788
2858 1161788 1268432 1209427 931426 940003 1229227 1125078 658471 340734 486738 542304
2848 542304 796388 745761 918624 1014161 851350 758126 960051 835529 885305 837009 765705
2837 765705 868311 1024752 1123415 835230 769936 753595 953253 784199 760079 978148
2827 978148 1202824 1415085 1309069 1229709 1498007 1528885 1542110 1330387 1231390 1100759
2817 1100759 1137096 1266185 1161696 1401599 1556445 1507903 1405137 1306613 1165783 1064435
2807 1064435 1121384 852938 900475 854608 714439 954771 758518 698616 609480 906492
2797 906492 1006559 634135 686061 580014 322090 346463 268196 292086 437678 619463
2787 619463 541029 702908 768944 540635 192259 571191 517973 278628 385210 415043
2777 415043 201936 219107 181619 61360 -82555 -10384 -136488 163608 353064 443181
2767 443181 349253 255152 327854 390374 277257 193041 345365 395736 329455 -14467 116534
2756 116534 188879 116698 -21778 122436 110977 243522 310969 276623 207092 295767 36276
2745 36276 43984 202710 375853 323602 246654 19871 173335 114970 98827 308476 169262
2734 169262 68529 45925 286839 286226 132920 128591 274189 330884 130244 -195509 -291510
2723 -291510 -71649 15818 -63015 12348 -62497 -41313 96380 -152971 -145460 -32741 76687
2712 76687 88317 182817 257323 55365 -207256 -73036 -65295 -299949 54417 325197 172321
2701 172321 257765 -119446 -280719 -67318 6043 226381 108627 65528 -127878 -80276
2691 -80276 -22625 165991 -33177 -94226 211985 173528 147805 163546 59855 208687 172489
2680 172489 231927 153781 15132 245925 189699 70378 5342 170639 49954 11025 202242
2669 202242 -22243 -165295 -66751 -201361 114479 47346 -178930 351798 453253 356836
2659 356836 204037 12670 100405 -1473 -19518 132384 455049 419337 336212 43665
2649 43665 23972 -232647 -231513 -48278 131609 370417 412930 139060 62857 135904 -15482
2638 -15482 -38619 -8597 159560 19002 16947 48468 -70528 192743 283371 134262 -67365
2627 -67365 -16343 -130514 -100549 46870 -15401 -36953 2115 48418 -403776 -217917 -144193
2616 -144193 -4278 247894 182391 -161591 -270047 -240181 -107732 -79056 -50094 24588 270991
2605 270991 407083 130283 227221 307790 233560 77697 -80907 126568 398272 437988
2595 437988 132064 -113168 -70293 109628 194823 142722 152669 135486 73679 148263 465895
2584 465895 499571 618889 685536 585794 570729 222227 230019 268351 342942 -33861 -163782
2573 -163782 -62425 351035 362853 115146 146684 -130877 -93950 -86292 121983 248913 204565
2562 204565 -58444 -1658 63397 -5447 29551 -112175 -130314 40218 104020 -93992 -246252
2551 -246252 -436852 -300072 -66832 -108935 -125873 140036 -27271 29734 117942 85452 221376
2540 221376 95169 119609 235941 211691 116095 -44378 16612 -72806 -58505 21674 150942
2529 150942 44814 150429 199155 188180 359396 384539 187765 -89275 -57181 -227744
2519 -227744 38932 257060 335986 459444 220943 312413 495074 324671 141415 362550
2509 362550 21416 -147965 -44870 -245260 106917 394746 246296 88787 481584 95613
2499 95613 72354 128082 -24420 -62984 42950 119359 199775 89720 -15800 6521 16511
2488 16511 285759 351886 -3298 8789 -125443 33821 -72270 17091 204377 229515 277518
2477 277518 388605 341095 246506 268755 126784 184457 -188924 -262936 -55921 -56093 36089
2466 36089 323646 299390 420709 285043 221636 292509 143467 282787 292864 -2009 107869
2455 107869 263539 257854 295643 529831 528099 214051 495562 376722 350115 456242 294785
2444 294785 402152 341426 424950 395751 270708 109745 80200 120732 308862 222283 469819
2433 469819 538965 232113 438870 513540 309749 -17128 -54840 385956 628888 532917
2423 532917 357974 346108 264067 8755 358506 494781 486175 421510 382919 336882 469496
2412 469496 279617 477428 613394 346998 432894 607802 257134 4776 290372 182403
2402 182403 401395 377796 578523 351698 236073 648478 884709 852491 1069127 904667
2392 904667 808730 891087 716667 985385 1141626 1135151 1135984 1050313 757537 791181 697236
2381 697236 947527 1260547 1344499 1289976 1317568 1420928 1188051 1185897 1320833 1400896 1330822
2370 1330822 1391419 1472529 1516450 1752577 1888258 2077709 2057085 2050742 2035404 2468818 2623228
2359 2623228 2580200 2766909 2620807 2867579 3169775 3162522 3601764 3756765 3884528 4024068
2349 4024068 4242213 4934808 5262106 5521579 5848767 6166877 6782720 7184638 7643643 8390168
2339 8390168 9252813 9881166 10703453 11791789 12936306 14426216 15944446 17635096 19341417
2330 19341417 20876947 22288411 24785890 27563756 30818074 34065621 37617609 41705598
2322 41705598 46290659 51448308 58761539 68958505 83590718 96513545 98212537 82478267
2314 82478267 63038664 50598298 42066648 35605039 30288612 26543613 23572048 21457361
2306 21457361 19664605 18387881 17065312 16228461 15352673 14362374 12946882 11847621 10895626
2297 10895626 10278450 9308003 8457923 8072970 7551960 6948973 6434014 5815461 5468733
2288 5468733 5167969 5009958 4759009 4844031 4309880 3835782 3658795 3551882 3449646 3339346
2278 3339346 3048337 2814068 2537030 2436536 2390712 2661368 2724553 2273737 1985068 2051738
2268 2051738 2079244 2074774 2262954 2231354 1898002 1648741 1503849 1574558 1650534 1665466 1484089
2257 1484089 1349785 1470794 1379653 1219578 1278287 1427807 1133824 1040595 980378 1193657
2247 1193657 1260940 1107444 1101121 1280087 1337733 1110642 823864 998477 1110571 866239
2237 866239 618483 519376 768880 685539 286530 557624 799349 809989 837201 701431
2227 701431 766122 767578 695937 759715 794552 722002 664901 547779 738927 745652 542937
2216 542937 527376 595072 693268 372341 411199 366871 396193 512120 589074 500662 444874
2205 444874 536797 350947 210293 285743 263536 248609 551194 616634 567363 368618 277146
2194 277146 305305 326936 383036 425618 144007 -69906 -109660 296841 361074 440644 501558
2183 501558 312155 74271 90949 423112 381803 239987 139924 194232 229162 31367
2173 31367 82901 72628 326497 354537 215541 475242 646871 738384 667598 441441 94775
2162 94775 126422 236838 314375 288784 193263 131730 -49312 116702 160933 78413 107494
2151 107494 70593 165771 76613 71776 -98634 -241617 -372083 -321240 -265821 -154611 -346915
2140 -346915 -139433 -138339 30575 -123731 -48288 113038 -51994 8365 -168270 -262447 -7147
2129 -7147 259486 65932 264537 190393 70389 179825 232267 299635 177107 17778 -195346
2118 -195346 -165971 68105 -70511 -145166 -225761 -250903 -155607 -175153 -167673 -136907 -87049
2107 -87049 72148 258704 390038 235467 -115959 68028 218247 70899 -150462 -212311
2097 -212311 -124077 5863 -278552 -266411 -100278 -54953 -27983 -20363 18069 -40267 -43660
2086 -43660 -119097 37373 88797 -153253 -55575 -139793 17829 80531 -303600 -323582 -124436
2075 -124436 -66805 -161054 -315611 -174631 29176 -117989 158499 117764 -12452 148658
2065 148658 212548 263257 108052 41359 9462 -134273 -116647 120314 307608 323570 213976
2054 213976 -218 144178 156533 244307 248170 258151 275309 386487 412660 364405 509220
2043 509220 335436 87122 68494 226563 203028 8821 -71622 201377 149712 -256838
2033 -256838 -36300 194457 216480 20429 64830 -184059 -386552 -335176 3302 141713
2023 141713 213190 -68576 -69882 129 -56600 -52745 -204067 -28949 38858 99480 -40816
2012 -40816 -192469 -78207 19409 -8846 99496 254550 92137 -99589 -68074 88386
2002 88386 -138155 -294292 -160088 -150222 -252190 -64160 -169227 -368680 37125 138260
1992 138260 -43039 -174258 -327461 -432882 -214826 38848 -150826 -173835 -161534 -436238
1982 -436238 -173861 77098 -138483 -301480 -264200 -117211 38407 -18326 -486 227645
1972 227645 137764 65595 -88151 -169383 -54928 68093 -119510 -166440 164746 89277 -104609
1961 -104609 -366635 -194471 73354 54902 102409 13496 -93660 -69949 -262907 14916
1951 14916 -274934 -566457 -535441 -588106 -600248 -515350 -174068 -22903 234578 44244 127339
1940 127339 218779 -298168 -406684 -405645 -229261 -364551 -402315 -575427 -308528 -156626
1930 -156626 -224188 77425 -162782 -204874 -102192 -140667 -208793 -355654 -349245 -284681 -17794
1919 -17794 -144297 -331164 -160803 -185951 -346678 17721 -195795 -166379 -75705 -146201 -162395
1908 -162395 -191459 -74352 -45703 -42291 -144785 -70461 -60511 -159520 -423734 -221710 -281117
1897 -281117 -256019 -19976 130406 90501 -318174 -422570 -257731 -123804 -57874 -322808
1887 -322808 -309541 -54596 21456 55064 111381 -29207 141168 124493 91214 212417 -99894
1876 -99894 -86263 125346 80993 -66350 -39000 -3827 -350362 -377208 -48410 -29158 25528
1865 25528 -174502 -286217 -35058 94499 -157255 61612 53687 119498 133541 103324 39654
1854 39654 132725 156360 -178317 -211622 -185907 91425 214017 235331 103258 228986 152945
1843 152945 186547 -9809 -12140 226808 230405 -128985 -136796 -14594 -87497 -123310 -164373
1832 -164373 -274001 -313182 -155996 57296 -211408 -195603 188821 201371 227308 260125 153755
1821 153755 290 -128489 -28447 213605 170231 281041 195652 36422 -67252 61472
1811 61472 -147651 -127917 -47922 -177703 -216525 -207413 10123 -184546 -166502 -183035 -225050
1800 -225050 -365082 -101241 13740 -136848 -352851 -72526 -86865 -205559 -104453 -61874
1790 -61874 10778 -22425 225298 123378 113723 85380 -76962 -3906 118686 -15103 -24177
1779 -24177 265457 177906 104561 45385 152909 59718 134429 73668 22149 101413 16105
1768 16105 -1346 -14579 95426 98786 39948 -209061 -362427 -593738 -367156 -216780 -55127
1757 -55127 30887 -74077 -209056 -452452 -414908 -64730 -36682 -47771 99805 30526 -196455
1746 -196455 -195339 -271618 -281129 -222498 -124152 -246880 -281267 -213996 -177498 -191383 -73998 -76938
1734 -76938 -90188 30320 -186991 -160689 -192985 -196631 -2933 104130 141231 -50567 -266790
1723 -266790 -276055 -535683 -264304 -8733 -11798 260597 141950 67741 -28025 -142947 -152817
1712 -152817 -71877 61091 -32649 -162413 -86938 -117075 -95311 -36936 -4651 -24891 -169780
1701 -169780 -110406 184724 233402 237448 246884 261541 220157 223762 180082 -61712 -263130 -172437
1689 -172437 -314621 -371853 -253647 -127117 -68242 61720 -133104 -109670 -162096 -246153 -101447
1678 -101447 -472474 -368092 -258992 -310397 -335542 -521767 -327264 -101970 -11512 -6986 -55764
1667 -55764 -94171 -11769 147931 -240942 -349791 -115597 -31664 -75248 22144 93244 -105152
1656 -105152 -132623 230581 227232 58375 -213749 -143388 -70837 122240 402373 78228 39811
1645 39811 195128 -152472 -235855 129194 174528 -149265 8365 -34558 -150191 61532
1635 61532 -97151 39319 125183 67780 22457 -30905 -111356 -159053 -60646 -139172 -239963
1624 -239963 -21567 -16829 -253653 -257044 -311942 -201130 -67386 -151760 23025 262834 64440
1613 64440 -202324 -246967 -161214 -4663 -90450 278088 547200 298418 236583 245024 364865
1602 364865 6160 130957 -184847 -126904 4870 -145430 -293212 -358087 -334058 -517616
1592 -517616 -60025 -138993 -195076 -180142 80812 -25473 -314916 -190054 125166 72308
1582 72308 -301040 -281160 -220594 -97332 149368 -8826 -188615 -192015 133969 155366 1776
1571 1776 366991 604846 396737 -161800 -23849 83935 -274084 -197903 24395 209559
1561 209559 156592 241770 160756 167837 186880 120605 -225944 -318962 81080 75228 -176621
1550 -176621 -539807 -512193 -325434 -32233 44049 -27249 -251969 -147978 -92013 13816
1540 13816 56416 426599 407779 264088 267863 36535 -232803 7728 163550 -100243 -44956
1529 -44956 -62082 -11904 -36518 -38111 -61786 -16998 -26842 94983 249856 104849 -25700
1518 -25700 -35644 -29967 10757 84815 98489 119889 198793 66392 33660 190097 -10184 -86434
1506 -86434 -12588 -94502 -178222 119752 38500 51624 58980 63637 16643 48096 272295 154028
1494 154028 190329 -24440 252964 392898 273136 14454 138914 59524 -186994 -93135
1484 -93135 -73569 -250157 -145473 10629 -124422 -356700 -247835 -489691 -376825 -10616
1474 -10616 22529 -215505 -26542 101714 59752 318184 495863 322917 189452 93355
1464 93355 -128590 16056 288904 349171 -13576 -77713 129701 245931 269296 186147 64637
1453 64637 -47958 264347 153071 -22098 129752 -95476 -205185 -238894 -157424 -279911
1443 -279911 -128497 -233969 -85183 -100258 -174874 -239648 -273499 37512 184985 83869
1433 83869 11346 238647 -125991 -145915 -24673 88123 -48872 -94020 154565 38879
1423 38879 137023 173683 48057 -71218 -304695 -379083 -109066 36665 -52905 31734 55090
1412 55090 61290 -14810 42779 26567 115595 147975 -84260 -278272 -371149 -217588 47378
1401 47378 180863 -11079 138689 164213 -172114 -179911 -273250 -80606 247318 -153470 -141575
1390 -141575 -193488 -225393 -156691 -121441 -125178 -225392 -265749 -193448 -179423 -169494 -41335 -206693
1378 -206693 -179685 37668 18794 -129203 -270271 -293050 -435541 -486247 -365000 -101338
1368 -101338 62300 -118930 -381478 -559529 -417130 -46886 75083 34627 87822 126376
1358 126376 -189544 -61686 132326 -18627 -118456 -104790 -21514 40233 139237 33893 -108400
1347 -108400 -60136 112070 322308 314769 178845 -64553 166288 315878 190862 5156
1337 5156 -67093 1158 23130 -142236 -29753 -49703 108560 79467 54001 104461 99611 180414
1325 180414 84417 -101793 -161118 26108 -138387 42441 238716 96744 -70685 31194
1315 31194 -224828 -185504 23948 98307 156747 111977 -114455 -149723 19479 -145496 -218907
1304 -218907 850 31259 -44590 97210 47467 -160015 -239170 -100365 -3178 -217933 -374359
1293 -374359 -136247 46773 -234424 -273777 -309567 -174792 67874 214887 157031 68169
1283 68169 -1289 -87397 -221336 -230208 -233828 -313150 -134107 95036 209920 -56648 -92925
1272 -92925 -280958 -148101 196878 227071 123650 168206 433606 131699 280695 320834
1262 320834 212570 242925 173637 -71945 -162495 -56985 95885 200899 183894 191451 -67987
1251 -67987 -404669 -302070 -246905 -169849 -380498 -262079 -371700 -487311 -278369 -194937
1241 -194937 -252211 -336297 107163 183927 -151280 -216058 208939 101701 20063 -70651 -114
1230 -114 275664 70984 -21327 -187577 13752 111026 360496 224816 127675 -39318 -8800
1219 -8800 274530 299634 4342 -175375 -87354 -169975 -242866 -58001 95632 63367 81032
1208 81032 -102202 -6846 80129 -81610 27309 -16771 -51550 210984 56035 159621 65841
1197 65841 172229 52635 105948 72499 -61355 -56850 32441 25408 139328 45726 102855
1186 102855 106684 103705 -117719 55139 241811 -36930 -104173 6321 -87398 -124031 127611
1175 127611 137355 -35877 -247403 -228569 -176468 -177459 -383981 -279690 -254083 -120770 -86911
1164 -86911 -115157 4114 -131386 125195 -2951 -208455 -197259 -71518 299997 308998 363835
1153 363835 234363 -66833 206625 159203 -8928 89858 67914 194000 98616 -106279
1143 -106279 -29457 -104028 -317771 -367219 -241721 -70073 -29859 -252843 -184159 -68594 -2360
1132 -2360 -266108 -79102 24578 -111693 95747 187304 99635 -79962 132521 -76051
1122 -76051 160241 36995 41375 84283 -236880 -118821 -132604 58588 56497 -68409 -144112
1111 -144112 -51679 16250 -82978 54058 64669 -28427 154171 350817 506262 179645 -22723
1100 -22723 5295 -212586 -14911 253245 54299 -269401 -14059 -2859 -31431 -160875
1090 -160875 -171024 -31283 100088 198713 122531 18577 146210 385082 274770 87908
1080 87908 387949 422360 300826 -11326 -44204 156096 197760 -26631 -246633 -32542
1070 -32542 36152 13624 -132798 -38653 -42227 121161 199358 26524 23027 -39813 -194168
1059 -194168 2224 163442 33232 -138679 -243213 -124215 -204798 -218489 -442399 -299182
1049 -299182 -134867 -460652 -413645 -153687 -49040 -22834 -145458 86078 -28507 -131144
1039 -131144 -60841 -51961 84053 -192311 -137940 137536 2674 -181742 -109378 -206974 -200742
1028 -200742 -4234 -3123 -34423 103994 68816 -159808 127083 319683 246083 116393 -4885
1017 -4885 -58252 30068 -67158 84543 286285 192171 176837 119916 -19011 -127524 -220985
1006 -220985 -213890 32632 -116692 -13211 -53735 50697 293103 316895 44906 -183130
996 -183130 -145591 -197300 -201563 107744 71869 131426 -13176 -52889 83917 15004 33745
985 33745 464636 345964 188813 263695 44194 -117958 -72796 -54388 -242668 -144716 -99788
974 -99788 99310 8785 222463 177605 -61270 -84439 18133 36926 -198507 -326815 -116752
963 -116752 182438 66348 76218 -140714 -165731 22354 -248097 -246396 -165434 -120986 158168
952 158168 -8011 27117 -13133 44308 -35344 -58804 7568 -95641 -195581 -293099 -345855
941 -345855 -338351 -268989 -372887 -15062 54455 222478 56861 -66474 64023 120079 348495
930 348495 275398 77271 -10072 166316 -45514 -194566 -175908 -237760 -19817 -248062 -101832
919 -101832 -133341 -129402 46970 -36030 -85029 -130627 -298825 -309937 -177624 -321084 -335432
908 -335432 -236883 -187472 -274365 -36934 78783 276782 241965 -101665 -31899 235128 -156705
897 -156705 -316211 -501262 -359321 35962 162636 56774 30570 -35177 18878 432005
887 432005 202576 334836 26580 -1042 25962 139133 170315 221885 -77615 -249231 39825
876 39825 103128 -18921 -259454 -80701 -86389 -262598 5152 331499 92934 29526 155202
865 155202 151941 191624 160768 180339 87877 -177609 -20749 -29637 -149991 -73440 174195
854 174195 87679 -125976 22105 -36297 -259617 -243902 -173190 -29344 143458 72716 -39988
843 -39988 110815 23688 26352 -115900 -138485 -45201 -40346 -89980 -170172 -303566 -114871 -133783
831 -133783 187417 293410 103281 -21790 -228067 90117 91679 13025 34719 101193 94301
820 94301 162850 111619 -186540 -126275 7322 10758 -30904 -299163 -138358 -159703 -354800
809 -354800 -84257 35438 -49645 10109 -72440 -89554 155172 172921 -219214 -297367 -492145
798 -492145 -399738 -204663 -34608 151192 7979 96893 22338 -298532 -54190 40057 67033
787 67033 116819 53718 197418 288502 183234 152777 219362 247447 -48624 -57213 -270220
776 -270220 -325962 -115773 -97981 46092 18545 -44353 181315 175472 65858 498791 358953
765 358953 22429 122472 169013 314852 447614 233503 15298 -75329 7548 -137360
755 -137360 -268224 -165817 -169360 -89694 -69355 335744 384514 303448 81122 -280025 -103469
744 -103469 -124592 -13958 -17962 -19014 -180574 29398 188456 12967 -228373 33081 137853
733 137853 -134606 -221736 -114480 204216 53627 -256983 -112314 -198080 -177245 -80940 -81423
722 -81423 -260022 -239851 41713 187376 112804 64177 -15433 -102088 -121097 107848 409873
711 409873 296943 326591 274943 78888 246907 -160013 -324406 206227 365855 129106
701 129106 122809 -79983 -108990 202881 95142 199142 150666 395409 473603 290562 20603
690 20603 123942 91299 115530 -110858 -139520 -215127 -193576 226387 206100 248215 326722
679 326722 87614 -76389 -144552 -194335 -117979 160140 69277 14957 -121305 -80911 -129063
668 -129063 -310555 -297126 -95980 26723 -128794 -94585 -37055 -18607 -172717 -220719 -132419
657 -132419 -164191 -184047 -38600 -114629 37177 -136670 79674 173171 209382 75203 278335
646 278335 264080 56714 107782 10372 -147627 -185168 -6223 28609 45436 -22389 19289
635 19289 37038 -328529 -177340 392141 252014 -71850 64036 19614 46272 9925 -164949
624 -164949 -201488 56983 177770 -43384 -133927 -258909 -192982 -220804 39778 266567 217145
613 217145 -32557 -3668 145820 81929 211391 222426 75919 -64640 -165236 -293953
603 -293953 -298102 -234798 -264542 -286954 -127509 7161 -55307 -32953 -96987 -49394 -155171
592 -155171 -347780 -157476 95844 118482 244543 -27876 -180468 -104641 85332 -109792
582 -109792 -109388 -31332 42995 216862 206975 389584 295423 354158 262704 194305 253252 -18653
570 -18653 -166568 177121 96006 152911 291447 259106 218081 255978 202589 89905 -58986
559 -58986 -5079 245671 178233 87892 111498 -61416 -101574 -9726 -105165 81653 40783
548 40783 59223 76751 159811 -91483 -128043 -77285 74267 74996 149510 214644 -6242 -154840
536 -154840 -433501 -556614 -265180 -151912 10298 67169 21183 -109201 24117 303848
526 303848 -55893 -39205 -18087 -29497 -32973 -246040 -110437 -69778 -193588 30940 62451
515 62451 32077 -44631 -127826 -52301 285088 190781 98218 -241524 -358908 -225033 -262439
504 -262439 -223648 -160187 134398 205401 63920 -104987 138549 293640 119602 -162089
494 -162089 92290 213319 247511 315393 17281 -89835 -214876 -406831 -473870 -152267
484 -152267 269294 146290 173180 -94978 -505867 -388585 -7630 97974 -75140 53246
474 53246 -97078 -179354 2322 -111385 -286578 43754 -158333 -19758 -23902 58711 209251
463 209251 91806 108558 191594 153231 66006 -134855 -10435 48435 193476 310378 104368
452 104368 236281 343819 310751 260844 232837 214469 153957 90119 39487 39857 -22251 -626338
440 -626338 -530513 -197853 259143 153467 75630 200161 344182 -13799 -307153 -23930
430 -23930 62969 29562 -282657 -61046 2636 -72062 -99547 100635 3293 -127651 -264023
419 -264023 -254269 155648 188954 91725 -52980 92435 169893 166869 263223 216458 194236 94886
407 94886 299702 -89994 -215568 -183564 -103386 41232 23630 -33422 -25375 -44634 -144592
396 -144592 -44962 -104069 -285043 -372732 -282254 -135196 -139213 -66546 -181648 -214480 181660
385 181660 -41969 11139 -42722 -138669 -61701 -79280 7484 122522 82830 -43478 31075
374 31075 135667 50226 -150900 -39302 -22948 -28047 -198948 -297624 -190655 -100382 133017
363 133017 72953 -275633 114463 620449 296149 106330 -15331 58180 -160467 -80867
353 -80867 -126057 102668 126457 -55742 -308165 -101907 69449 130642 68190 -97104 -271238
342 -271238 84184 199030 -7618 74529 62038 -124597 -79346 616909 382316 123962
332 123962 132656 57628 -20367 -58849 111168 9802 -263285 -169292 -27352 -237871 -98687
321 -98687 -141641 -95319 53822 -5366 116699 91680 22192 -292391 -63656 -260392 1168
310 1168 239530 67961 198937 -122705 -234324 -163955 209032 175822 58201 76548 -115974
299 -115974 120027 558957 302104 366220 555129 307609 203694 46757 184301 122665
289 122665 118541 151750 119625 96006 13503 378746 583680 408192 454027 424128 5184
278 5184 61603 393513 404445 282308 -218589 -18580 283869 141871 120749 62539 -108563
267 -108563 -67923 166423 319268 205213 -79471 -187172 123352 -93281 -160621 77383
257 77383 280906 63571 73477 61411 106945 208842 62329 52065 -16585 -286517 -294958
246 -294958 -89303 -42429 22214 101086 122019 256659 75245 -40973 -196012 -134801 -170036
235 -170036 -227290 -256617 -74887 165085 222961 -117640 -147707 185790 144618 -23208 30369
224 30369 -106539 24566 189953 -28576 -6729 -72597 -231646 -266764 -261426 -425515 -37742
213 -37742 305432 345952 98097 87963 -42356 -11614 -314819 -111664 46586 -63227 -172657
202 -172657 27657 105451 -121261 -256239 -254379 897 -29008 53484 -128915 -289289 -264182
191 -264182 -68212 34906 -155538 -52144 -39831 -191896 -37391 77346 315078 384879
181 384879 274807 274612 226237 29219 -89042 45418 -133452 139029 79832 98162 66555
170 66555 238601 -105656 -61720 63276 63962 76457 208737 182854 82915 -73633 -241284
159 -241284 -186538 -70186 -128193 -174326 -221082 -336170 -214345 -41031 262134 149813 -42440
148 -42440 -140315 -130865 -7896 -76495 -85073 -96898 -154250 -54673 -23580 -22262 -146193 217006
136 217006 266752 231437 151744 -159348 -104123 -116559 -163885 -4976 -72816 31085 -134158
125 -134158 -119391 -135440 -111413 -113600 -66532 -157984 83882 14469 -192426 -111426 78762
114 78762 114844 230857 164275 49823 137263 37810 -67419 -262082 -82554 159814 -20996
103 -20996 -187826 -157249 -59725 -57630 -97384 -183799 -200898 -224732 -195986 -149474 -34289 66468
91 66468 87794 133720 -50758 53669 -137380 -140589 -171050 -7040 13809 88229 228068
80 228068 196845 88102 -179581 -384033 -320264 -22451 -212909 -150204 -127930 -135067 -176751
69 -176751 -130664 -77387 -151037 -129799 -91433 -11322 -20893 33831 131217 92273 -87568 -36715
57 -36715 33859 -69585 -105972 -56123 234833 181838 87398 168412 170683 332363 169548 87585
45 87585 -93053 -295819 -140146 -185565 -168153 -320577 -306282 -340991 -189562 -20692 151433
34 151433 84646 -32652 47036 44653 136358 -70183 -79511 50068 -177047 -182199 -24351 -47399
22 -47399 86627 137324 164372 193904 61716 -60580 -212070 -251762 -112407 -85312 -36762
11 -36762 -188908 -78740 -52450 -153796 -137100 -167034 -207218 -290965 -440450 -278640 -345933
0 -345933
$$ Imaginary data points
##PAGE= N=2
##DATA TABLE= (X++(I..I)), XYDATA
16383 -1594335 -1648690 -1596332 -1515892 -1397446 -1625067 -1483885 -1509414 -1707091 -1691217 -1643622
16373 -1643622 -1600401 -1640507 -1550807 -1559471 -1522732 -1421602 -1326985 -1220260 -1242931 -1177755 -1315467
16362 -1315467 -1318350 -1088527 -697103 -595259 -818361 -982405 -1159633 -1146782 -1158318 -1035106
16352 -1035106 -1041678 -966537 -842704 -846546 -725814 -529465 -507861 -718497 -665576 -442297 -496121
16341 -496121 -673090 -800433 -726012 -656412 -881990 -783528 -559663 -473858 -568131 -670003
16331 -670003 -490727 -694460 -514811 -393914 -611231 -723217 -605780 -472851 -102050 -89435
16321 -89435 -121252 -141738 -222444 -268300 -152107 65717 -9007 -21889 -159983 -240397 -284162
16310 -284162 -275725 -254983 -154065 -322604 -207258 -95974 -51956 -15500 344660 272258 130059
16299 130059 133826 128059 158264 20853 -43474 74119 60457 118558 284721 418753 528100
16288 528100 399906 303618 277855 341609 572610 662937 654047 726359 786049 579451 768410
16277 768410 551360 398946 418192 559713 802104 732773 469113 600512 769751 823116
16267 823116 917591 788500 792794 682594 766532 790447 886702 1092335 1065199 991902 846457
16256 846457 690403 822371 806811 855963 982784 1017759 940252 957116 792189 972166
16246 972166 1280607 1332663 1133418 1314620 1352965 1378561 1261397 1060311 1027783 996215
16236 996215 1098971 1221076 993359 1011698 934726 966463 1094444 1039668 968688 977041 1056358
16225 1056358 1188445 1300084 1126267 1288223 1429300 1465498 1402714 1163244 1188121 1274965
16215 1274965 1160074 1240632 1093903 1234109 1421538 1523951 1505638 1717602 1591916 1501180
16205 1501180 1366106 1269716 1288567 1323243 1401270 1214275 1455626 1611371 1436613 1263482
16195 1263482 1404721 1571279 1747620 1602981 1578400 1726925 1835665 1509376 1424524 1647249
16185 1647249 1779669 1633963 1503157 1546244 1517445 1833836 1985402 1896379 1918719 1780290
16175 1780290 1552591 1695164 1829382 1612620 1643996 1619425 1635293 1842464 2047468 2049592
16165 2049592 1894397 1873586 1859576 1633676 1668427 1830520 1978592 1869122 2167048 2193239
16155 2193239 1919443 1826875 1951082 1914523 1723113 1778283 1793990 1805670 1710523 1739326 1708581
16144 1708581 1809872 1797337 1977235 1955885 2414288 2148679 2040513 2198502 2072014 2038162
16134 2038162 1979089 1714783 1688222 1759034 1919932 1964150 2045286 1878778 2010423 2363057
16124 2363057 2332614 2080347 1953504 2194984 2494467 2203407 1839610 1867457 1915632 1980042
16114 1980042 2205132 2256569 2292063 2042112 2147328 2289567 2276562 2243316 2206951 2322790
16104 2322790 2206762 2045316 2083592 2267759 2315794 2382300 2012267 2185516 2292873 2128359
16094 2128359 2089397 1971617 2346458 2312683 2045952 2027639 1996858 2065950 1858138 1980665
16084 1980665 2002949 2092349 2074098 2131336 1952110 2017355 2010486 1873046 1847746 2111851 2136555
16073 2136555 2282627 2331254 2207341 2170833 2033126 1811863 1752896 1637611 1981615 1850699
16063 1850699 1930125 1999453 2005424 1938212 1808035 1911601 1842528 2017861 2092205 1799976 1883361
16052 1883361 2070616 1765818 1911947 2071400 2120441 1902517 1785574 1904358 2103543 1990214
16042 1990214 1824140 1918549 2285008 2248541 2029632 2157046 1906108 1967910 1814004 1962960
16032 1962960 1935695 1910420 2090892 2111543 2029341 1911836 1759079 1732788 2026952 2132085
16022 2132085 2104609 2365323 2274933 2025439 2017507 1985789 1958161 1905441 2070165 2055862 2359905
16011 2359905 2047154 2167758 2331316 2477646 2378638 2123896 2081848 2276956 2266577 2088118
16001 2088118 2029459 2002888 2086162 2032146 1733129 1554336 1822415 1884707 1913223 2298481
15991 2298481 2164585 2115934 2039218 1869542 1679393 1736018 2000811 2086401 1947999 2104089
15981 2104089 2217518 2155510 2200846 2271143 2120529 2252707 2085466 2050963 2072070 1859375
15971 1859375 1954992 2071843 1992185 2350095 2369020 2478550 2113201 2199575 2016081 2091320
15961 2091320 2365692 2415266 2173559 1923031 2055503 2030825 2178942 2196687 2335927 2215467
15951 2215467 2150758 1936540 2134854 1983962 2090471 1897092 1713110 2095659 2490677 2384648
15941 2384648 2210653 2080366 2189492 2392788 2576893 2393282 2545089 2349469 2373644 2285227
15931 2285227 2290726 1795734 1916797 2281094 2144347 1877212 1877826 2242105 2374717 2067359
15921 2067359 2188386 2224377 2174218 2210473 2005211 2269569 2038280 1977390 1973627 2230034
15911 2230034 2203182 2122897 2259270 2195390 2167148 1758149 1635698 1500403 1567120 2006339
15901 2006339 2110105 2022737 2013296 1809038 1920581 2151126 2228443 1930799 1789014 1990599
15891 1990599 2001972 2132334 2342883 2344917 2271666 2351113 2192531 2168209 2165303 2115084 1978730
15880 1978730 1957287 2222132 2502565 2287553 2182264 2284233 2414674 2382091 2264634 2326675
15870 2326675 2247383 2054064 1938757 2240038 2310951 2064971 2052201 1949246 1995525 1915677
15860 1915677 2050409 2192139 2090187 1879697 1722502 1896508 1795455 2009585 2393557
15851 2393557 2269331 2214063 2147054 2169610 2260109 2206412 2002640 1776308 2012294 2319845
15841 2319845 2110988 2102431 2116168 2098472 2269943 2486927 2433942 2423384 2320007 2352392 2027583
15830 2027583 1690280 1675373 1611733 1920498 1828485 1963725 1843658 1943744 2143956 2434435
15820 2434435 2481036 1996807 1774580 1976055 2192459 2233303 2183884 2251586 2130618 1918288
15810 1918288 1965595 2257420 2047737 1890647 2165732 2002741 2116244 2108299 2300655 2210770
15800 2210770 2038461 1835020 1857519 1839131 1983605 1941351 2024290 2063101 2284125 2197482
15790 2197482 2244337 2243830 2328561 2139154 1992892 2204524 2328583 2209097 2048170 2153625
15780 2153625 2271292 2099303 2006677 2054941 2024901 1989377 2071946 2089949 2043404 2162400 1949401
15769 1949401 1949269 2074629 2128173 2084416 2009515 2057144 2231459 2064834 2086131 2075574 2184107
15758 2184107 2206718 2369916 2147393 2155234 2326539 2445911 2346460 1998145 1754227 1892604
15748 1892604 2088234 2012004 2171972 2138589 2083457 2214985 2219479 2104540 2032419 2001811 2086668
15737 2086668 2155782 1819233 1875796 1863520 2107173 2169044 2307275 2235600 2084249 2131414
15727 2131414 2193165 2258472 2261675 2062956 2099817 2263680 2209926 1986782 2292117 2488365
15717 2488365 2408934 2367849 2431990 2380563 2235975 2146812 2195181 2259842 2142712 2056171 2047662
15706 2047662 2231118 2434831 2416501 2436681 2487941 2365322 2424897 2385885 2051377 1973441
15696 1973441 2162441 2198409 2338103 2158455 2270661 2147480 2282099 2279167 2232476 2222763
15686 2222763 2243257 2247772 2349565 2280782 2410152 2213980 2371049 2429383 2133237 2098951
15676 2098951 2077818 2227796 2314636 2141364 2156918 2257678 2172879 2209079 2244018 2012384
15666 2012384 2035150 2047381 2015676 2065626 2177185 2223158 2202034 2314707 2179441 1973181
15656 1973181 1799046 1803973 1815211 1714201 1715797 2302971 2552547 2286485 2172170 2048814
15646 2048814 2047571 2125027 2133082 2121606 2033367 2053410 1930089 2047136 2019315 2065057 1953655
15635 1953655 1877265 1901674 1973217 2305302 2207643 2115478 2322349 2335319 2519108 2837929
15625 2837929 2653125 2399793 2229790 2100174 2076285 2118647 2127511 2060141 2225075 2080967
15615 2080967 2131647 2316139 2346116 1997143 1771947 2088911 2223651 2327933 2387199 2379778
15605 2379778 2294713 2490914 2500830 2323472 2302755 2249665 2404411 2045683 1950433 2052559
15595 2052559 2142211 2035828 1839587 2041670 2029156 2117069 2134262 2035583 2283469 2360919
15585 2360919 2042212 2049402 2145027 2021360 2077015 2351528 2476894 2304638 2338766 2489290
15575 2489290 2287115 2159773 1712788 1762455 1853394 2071159 2197179 2129882 2042631 1996867
15565 1996867 2116532 2112904 2091139 1952674 1936202 2051134 1733628 1737308 2071684 2065333 2006894
15554 2006894 2189111 2246421 2216193 2196128 2280527 2494991 2289967 2238437 2375557 2444705
15544 2444705 2279538 2159524 1703215 1617924 1785459 1965554 2100759 2106523 2391558 2213369
15534 2213369 1796984 1982258 2267425 2310964 2199058 2332632 2285027 1998490 2109938 2096774
15524 2096774 2327969 2627695 2398642 2109178 2287395 2348661 2223524 2394348 2326729 2138264
15514 2138264 2202175 2331602 2316158 2377236 2526211 2423525 2360083 2155450 2198484 2181219
15504 2181219 2156978 2130548 1969985 2247945 2040569 1982080 2075632 2027269 1998333 2183433
15494 2183433 2238295 2326849 2105792 1920726 2072701 2183540 2052199 2137156 2020818 2050926
15484 2050926 2212549 1905084 1945174 1980534 1950292 1884918 1961632 2023683 2092158 2153140 2224347
15473 2224347 2385680 2425950 2430589 2464247 2240243 2192790 2172527 2154225 2449955 2461989 2331669
15462 2331669 2418913 2300010 2469664 2327010 2353659 2499614 2497165 2377691 2440133 2439936 2626334
15451 2626334 2519741 2414675 2480499 2459687 2491338 2489257 2161035 1811145 2037298 2043526 2241091
15440 2241091 2487611 2428069 2406553 2363125 2278296 2206824 2171203 2461805 2419791 2324030 2150794
15429 2150794 2216596 2276068 2314654 2236632 2094702 2342513 2318253 2353553 2639041 2556747 2463117
15418 2463117 2561895 2494646 2443768 2150661 2097426 2274292 2365731 2310916 1935015 2023704 2089123
15407 2089123 2196302 2293130 2335928 2088984 2237352 2199265 1939842 2041691 2074725 2366511
15397 2366511 2270294 2285019 2274777 2181625 2251510 2306787 2355181 2321701 2264881 2234337 2109974
15386 2109974 2193553 2440715 2264735 2419538 2545322 2540867 2423394 2138244 2363629 2376510
15376 2376510 2151708 2094356 2044729 2114974 1973676 2031332 2244153 2258192 2270086 2097326
15366 2097326 1817654 1787852 1951178 1952154 2117172 2096897 2099813 2197050 2153753 2181310 2192346
15355 2192346 2459728 2416432 2058315 2244320 2495288 2211474 2023577 2211697 2282362 2628199
15345 2628199 2509396 2278875 2284351 2183382 2463808 2374690 2476774 2228285 1986734 1887401
15335 1887401 1842069 1990397 1922805 2164746 2351739 2603559 2375903 2156282 2313990 2292561
15325 2292561 2112899 1920824 1885585 2030846 2342498 2348212 2288050 2379568 2603764 2522802
15315 2522802 2479540 2364897 2110365 2174677 2080732 2087868 1970978 2292881 2174910 2111630
15305 2111630 2279308 2196269 2491340 2538502 2270712 2042456 2005619 2178781 2251489 2417601
15295 2417601 2330260 2405198 2450013 2242915 2361723 2121157 1911113 2036691 2172443 2269954
15285 2269954 2366031 2125586 2074707 2273903 2415952 2518438 2321476 2219351 2323145 2065648
15275 2065648 2122879 2163173 2135163 2119044 2265046 2112651 2049657 2442054 2409557 2379824 2523626
15264 2523626 2438666 2068193 2211145 2098193 2187656 2280390 2185420 2127069 2251783 1935514
15254 1935514 2173914 2311467 2137004 2144449 2486984 2424304 2559329 2718481 2282609 2055517
15244 2055517 2223868 2314747 2227538 2420664 2546432 2310445 2329479 2389521 2082398 2138636
15234 2138636 1997405 1957531 2187461 2493279 2112180 2173109 2131219 2103411 1947070 2127959
15224 2127959 2345488 2384735 2287851 2459844 2096388 1965457 2131659 2076409 2355386 2367425
15214 2367425 2433681 2379178 2339097 2533353 2610967 2364101 2562020 2574501 2358225 2294397
15204 2294397 2243253 2283315 2345048 2145539 1978258 2082040 2058438 2294589 2342660 2346838 2393622
15193 2393622 2474856 2374074 2340814 2426360 2599462 2606604 2706517 2466625 2350003 2323884 2396221
15182 2396221 2402175 2455748 2349463 1984840 2094178 2203443 2188156 2285245 2382858 2343233 2552963
15171 2552963 2329535 2161910 2156126 1794516 2151649 2713033 2477872 2539466 2320851 2393901
15161 2393901 2481021 2403428 2375867 2309947 2128016 2187693 2379927 2113077 2266896 2534344
15151 2534344 2393141 2507939 2577813 2690893 2606041 2294809 2448887 2446124 2407019 2209978
15141 2209978 2100609 2338590 2299665 2308405 2156436 2119918 2181744 2221845 2170398 2075587 2028394
15130 2028394 1958500 2107156 2136707 2007209 2054449 2077767 2126581 2215534 2446820 2237623
15120 2237623 1982516 2102933 2492629 2177716 2451565 2519571 2230973 2049440 2242817 2374504
15110 2374504 2377033 2548309 2441550 2424400 2580985 2373829 2263194 2442994 2309097 2205692
15100 2205692 2191348 2170171 2275748 2321718 2360349 2630742 2628332 2217026 1951695 2194165
15090 2194165 2252373 2407314 2422087 2398520 2329917 2225533 2115590 2178854 2376947 2457949
15080 2457949 2346339 2287439 2377675 2452294 2297661 2492157 2370546 2442970 2327970 2427327
15070 2427327 2471442 2459498 2233556 2427468 2268978 2060797 2083028 2312158 2337645 2311626
15060 2311626 2248719 2362627 2560834 2446924 2269453 2263161 2305538 2275905 2381790 2432287
15050 2432287 2615427 2395182 2373349 2572596 2686558 2373367 2120441 2029554 2263940 2341004
15040 2341004 2198287 2197419 2187242 2290974 2435360 2428510 2771997 2657041 2383621 2292409 2400083
15029 2400083 2373820 2391493 2490857 2400095 2261283 2366056 2557385 2542378 2604073 2643064 2353660
15018 2353660 2460418 2437314 2427597 2396691 2439993 2065532 1847662 2110033 2252143 2281047
15008 2281047 2351860 2209250 2316687 2332875 2201630 2253985 2402521 2323353 2097990 2092584
14998 2092584 2380572 2584380 2233178 2319396 2317471 1988821 2161191 2463933 2368097 2208040
14988 2208040 2301590 2168693 2263538 2287147 2189148 2340349 2309293 2484607 2530228 2470468 2529058
14977 2529058 2582016 2387725 2373699 2257826 2176788 2178661 2391564 2450909 2232193 2228032 2398373
14966 2398373 2205952 2109985 1956210 2069054 2118689 2057146 2030904 2210309 2107264 2333550
14956 2333550 2368928 2326164 2246288 2244113 2482408 2311404 2287805 2379119 2170033 2108637 2036744
14945 2036744 1943850 2203236 2664001 2483383 2402001 2350829 2426330 2562155 2319751 2426329
14935 2426329 2530614 2501341 2551670 2475031 2266116 2418660 2375826 2328615 2255344 2348088 2169565
14924 2169565 2118538 2441709 2549661 2759640 2576869 2353592 2542796 2600131 2318642 2246207
14914 2246207 2493431 2627373 2743058 2588537 2463823 2333984 2410087 2330417 2242326 2114538
14904 2114538 2395368 2496144 2408618 2227618 2195309 2306460 2248200 2254107 2405919 2244796
14894 2244796 2019960 2068417 2129190 2196980 2057591 2267669 2465905 2198552 1954010 1926217
14884 1926217 2446503 2545996 2488355 2608516 2739307 2628402 2527472 2667591 2593955 2270588
14874 2270588 2197867 2601189 2571520 2541861 2795284 2768025 2607092 2443529 2481369 2311420
14864 2311420 2339800 2516426 2184531 2402152 2420535 2508198 2590240 2394801 2641195 2471298
14854 2471298 2379564 2506669 2384893 2357211 2097962 2108786 2421744 2268643 2271611 2184392
14844 2184392 2279977 2501012 2548004 2526778 2534327 2493170 2586883 2710446 2566525 2236974 2289744
14833 2289744 2502338 2384737 2639703 2817645 2866743 2677471 2432121 2288201 2473360 2652429
14823 2652429 2809051 2884274 2806430 2572615 2187558 2233972 2599110 2583069 2402286 2292720
14813 2292720 2323749 2375877 2523542 2516124 2304590 2248433 2336484 2514079 2733303 2611757
14803 2611757 2578807 2377964 2464852 2610796 2392905 2337962 2244613 2186668 2275932 2380670
14793 2380670 2533137 2534101 2272129 2247913 2278916 2131056 2189390 2378623 2271079 2098375
14783 2098375 2286432 2401571 2279183 2398761 2452119 2465602 2506751 2337823 2166072 2269266
14773 2269266 2503671 2390270 2324120 2213604 2262089 2637176 2377935 2117162 2074002 2511479
14763 2511479 2454162 2386090 2288736 2354482 2594318 2538834 2558345 2606052 2520250 2485359 2384793
14752 2384793 2311585 2420816 2341210 2408230 2331208 2539645 2440088 2513591 2418772 2534438 2517339
14741 2517339 2219849 2286333 2448666 2599953 2475563 2554984 2295622 2071872 2161106 2423180
14731 2423180 2503414 2427875 2196099 2228379 2347788 2256021 2262575 2327196 2479561 2563865 2653763
14720 2653763 2201558 2153465 2256666 2371062 2512595 2328786 2410793 2489366 2180976 2237337
14710 2237337 2394949 2632784 2713490 2787654 2819532 2597302 2412357 2435374 2529370 2516208
14700 2516208 2309060 2382453 2520417 2655216 2507829 2274026 2216238 2534180 2484285 2458565
14690 2458565 2404449 2146899 2566242 2772698 2746888 2805740 2869853 2746102 2571392 2483207
14680 2483207 2558900 2412296 2471562 2452663 2451822 2080510 2344123 2548948 2459456 2370214 2387991
14669 2387991 2176727 2244623 2214224 2160225 2328066 2368081 2534341 2623142 2416942 2509659
14659 2509659 2678690 2831630 2593806 2522754 2221619 2188861 2456987 2112422 2016019 2238293
14649 2238293 2282238 2559561 2698999 2449213 2512315 2491823 2742823 2647207 2416474 2377074
14639 2377074 2383940 2452711 2353248 2287414 2502613 2681694 2784798 2620694 2601836 2383169
14629 2383169 2687613 2653608 2393333 2669697 2468214 2314381 2415687 2652363 2609050 2486812
14619 2486812 2633003 2328371 2178066 2226901 2193569 2223012 2265248 2407383 2707621 2430087
14609 2430087 2111102 2426307 2446055 2458880 2377011 2562072 2607008 2497708 2637819 2461707
14599 2461707 2274448 2291041 2425506 2467875 2303478 2529619 2658599 2340510 2306891 2344640
14589 2344640 2377730 2471283 2570853 2407713 2456436 2620397 2440654 2544366 2509005 2530159
14579 2530159 2735242 2654918 2529665 2209619 2281654 2408716 2569276 2662420 2421033 2546465
14569 2546465 2612003 2566018 2221720 2336180 2437596 2436111 2469630 2492330 2663818 2615108 2665539
14558 2665539 2401233 2456386 2577009 2727504 2515246 2421571 2322204 2483638 2303257 2268719
14548 2268719 2483669 2461345 2586570 2543062 2469786 2441614 2343828 2338479 2262769 2718909 2741220
14537 2741220 2312177 2341293 2390053 2266826 2182888 2372991 2487842 2536194 2470683 2476991 2780608
14526 2780608 2823317 2748307 2787698 2529750 2581498 2735226 2648732 2667588 2618805 2395727 2400214
14515 2400214 2587033 2788220 2775346 2480985 2783387 2902705 2675867 2608415 2566233 2614966
14505 2614966 2277466 2383300 2196876 2322823 2578115 2903770 2689214 2444941 2467779 2505553
14495 2505553 2478403 2552223 2445176 2336666 2182717 2302772 2189999 2079484 2134165 2275879
14485 2275879 2226995 2309756 2412622 2164941 2337906 2514214 2707447 2517918 2557368 2721435
14475 2721435 2811065 2746482 2768946 2635430 2437051 2229511 2318552 2285859 2327130 2256775 2589683
14464 2589683 2817215 2600070 2516380 2496316 2441695 2584079 2761232 2517434 2576469 2644896
14454 2644896 2635411 2506405 2652627 2603931 2561001 2367285 2356842 2593982 2543615 2370557
14444 2370557 2528929 2741390 2683117 2778028 2575091 2428659 2439214 2362229 2325636 2436159
14434 2436159 2413793 2285725 2165937 2430063 2692483 2717800 2427648 2520244 2567514 2469572
14424 2469572 2495904 2898082 2693468 2620137 2767402 2661016 2852570 2894538 2990961 2890830
14414 2890830 2672083 2518753 2585729 2697489 2687093 2772245 2777850 2590925 2552471 2554814 2192487
14403 2192487 2190741 2489550 2393446 2719391 2531418 2576229 2574368 2627459 2671894 2574312 2677010
14392 2677010 2757530 2873975 2690243 2388902 2386523 2273412 2269830 2468275 2366007 2447869
14382 2447869 2482271 2487671 2630946 2441696 2380843 2632247 2798159 2951666 2870789 2504866
14372 2504866 2639174 2985696 2814162 2684465 2563283 2618598 2582490 2455263 2456392 2207663
14362 2207663 2182797 2639913 2863903 2577633 2346873 2404082 2573093 2694521 2633264 2479052
14352 2479052 2468404 2600184 2752018 2656715 2707448 2606430 2516834 2453146 2459452 2528658 2539952
14341 2539952 2522767 2496087 2700159 2484680 2431942 2454851 2364659 2314977 2251334 2404815 2698513
14330 2698513 2844372 2448407 2345587 2429375 2548899 2465503 2269738 2528832 2378446 2470486
14320 2470486 2795196 2880704 2791650 2443782 2432162 2399069 2217628 2237411 2353222 2456740
14310 2456740 2690541 3118737 2793328 2723076 2785281 2761928 2722254 2564261 2548291 2560360
14300 2560360 2564531 2591419 2305808 2358422 2434633 2379548 2500450 2567188 2838947 2824127 2853517
14289 2853517 2958611 2698090 2613770 2606878 2526366 2664475 2677617 2595554 2941353 2867634 2675067
14278 2675067 2623399 2644409 2803645 2590084 2424950 2485174 2517795 2593101 2546655 2668478
14268 2668478 2764093 2704641 2671502 2627932 2548985 2593121 2559109 2604764 2765178 2724197 2781650
14257 2781650 2904086 2993301 2867424 2675027 2511477 2530224 2442469 2399220 2505024 2579767
14247 2579767 2736990 2925405 2654900 2436680 2339363 2428517 2609783 2728681 2815317 2912931
14237 2912931 2843041 2557018 2681705 2916738 2678172 2446110 2630399 2769538 2604548 2506833
14227 2506833 2583247 2870954 2764009 2763035 2476913 2514010 2762660 2673782 2661515 2533605 2508826
14216 2508826 2435816 2519903 2692719 2599934 2630695 2568571 2831889 2891982 2517357 2723086
14206 2723086 2741464 2667707 2725683 2619476 2687969 2631081 2278673 2458787 2622441 2683957
$$ [...]
##END NTUPLES=NMR SPECTRUM
##END=
