##TITLE=1H_DE-80H_X3
 200.13MHz, d2o
 8 sc
 
 19ns.26.2.2025
##JCAMPDX= 6.0         $$ Bruker NMR JCAMP-DX V2.0
##DATA TYPE= NMR SPECTRUM
##DATA CLASS= NTUPLES
##ORIGIN= UXNMR, Bruker Analytische Messtechnik GmbH
##OWNER= pz
$$ XWIN-NMR		Version 3.5
$$ Tue Jun 17 14:21:47 2025 Russian Standard Time (UT+4h)  Yarkov@DPX200
##.OBSERVE FREQUENCY= 200.1313
##.OBSERVE NUCLEUS= ^1H
##.ACQUISITION MODE= SIMULTANEOUS
##.ACQUISITION SCHEME= undefined
##.AVERAGES= 8
##.DIGITISER RES= 18
##SPECTROMETER/DATA SYSTEM= spect
##.PULSE SEQUENCE= zg30
##.SOLVENT NAME= CDCl3
##.SHIFT REFERENCE= (INTERNAL, CDCl3, 0, 15.5012)
##AUDIT TRAIL= $$ (NUMBER, WHEN, WHO, WHERE, WHAT)
$$ ##TITLE= Audit trail, XWIN-NMR		Version 3.5
$$ ##JCAMPDX= 5.01
$$ ##ORIGIN= Bruker BioSpin GmbH
$$ ##OWNER= Yarkov
$$ C:/Bruker/XWIN-NMR/data/yarkov2/nmr/H-C/1/pdata/1/auditp.txt
$$ ##AUDIT TRAIL=  $$ (NUMBER, WHEN, WHO, WHERE, WHAT)
(   1,<2025-06-17 14:20:38.23 +0400>,<Yarkov>,<DPX200>,
      <created by zg, POWCHK disabled, PULCHK disabled
       configuration hash MD5:
       00 E9 B6 7A A2 85 ED C7 34 08 36 98 17 FE 4E 26
       data hash MD5: 16K
       63 6E 1D 79 E2 95 26 AA 86 CB B7 94 CB 3F 07 E8>)
(   2,<2025-06-17 14:20:46.03 +0400>,<Yarkov>,<DPX200>,
      <Start of raw data processing
       efp BC_mod = 2 LB = 0.25 FT_mod = 6 PKNL = 1 PHC0 = -1710.962 PHC1 = 6.96656 SI = 16K 
       data hash MD5: 16K
       F9 B8 E7 B5 18 20 8A 04 DD 95 25 7F 31 E8 4B 72>)
(   3,<2025-06-17 14:21:03.65 +0400>,<Yarkov>,<DPX200>,
      <pk PHC0 = -10.55536 PHC1 = 13 
       data hash MD5: 16K
       C6 C4 3D BE B8 30 33 E9 B7 32 43 68 46 78 A7 4B>)
(   4,<2025-06-17 14:21:06.31 +0400>,<Yarkov>,<DPX200>,
      <abs ABSG = 5 
       data hash MD5: 16K
       A4 66 94 DF 1E 6C 37 41 2F 8E DD 04 5A B9 8C EF>)
$$ ##END=
$$ 
$$ hash MD5
$$ 17 4A 0C FA 07 A9 52 12 CF C6 6B BA 57 94 05 B8
##$RELAX= 
##$RELAX= 
##$RELAX= 
##$RELAX= 
##$RELAX= 
##$RELAX= 
$$ Bruker specific parameters
$$ --------------------------
##$DU= <C:/Bruker/XWIN-NMR>
##$EXPNO= 1
##$NAME= <H-C>
##$PROCNO= 1
##$TYPE= <nmr>
##$USER= <yarkov2>
##$AMP= (0..31)
100 100 100 100 100 100 100 100 100 100 100 100 100 100 100 100 100 100 
100 100 100 100 100 100 100 100 100 100 100 100 100 100 
##$AQSEQ= 0
##$AQ_mod= 1
##$AUNM= <au_zg>
##$AUTOPOS= <>
##$BF1= 200.13
##$BF2= 200.13
##$BF3= 200.13
##$BF4= 200.13
##$BF5= 200.13
##$BF6= 200.13
##$BF7= 200.13
##$BF8= 200.13
##$BYTORDA= 1
##$CFDGTYP= 0
##$CFRGTYP= 5
##$CHEMSTR= <none>
##$CNST= (0..31)
1 1 145 1 1 1 1 1 1 1 1 1 1 1 1 1 1 1 1 1 1 1 1 1 1 1 1 1 1 1 1 1 
##$CPDPRG= <>
##$CPDPRG1= <>
##$CPDPRG2= <>
##$CPDPRG3= <>
##$CPDPRG4= <mlev>
##$CPDPRG5= <mlev>
##$CPDPRG6= <mlev>
##$CPDPRG7= <mlev>
##$CPDPRG8= <mlev>
##$CPDPRGB= <>
##$CPDPRGT= <>
##$D= (0..31)
0 0.7 0 0 0 0 0 0 0 0 0 0.03 0 0 0 0 0 0 0 0 0 0 0 0 0 0 0 0 0 0 0 0 
##$DATE= 1750155637
##$DBL= (0..7)
120 120 120 120 120 120 120 120 
##$DBP= (0..7)
150 150 150 150 150 150 150 150 
##$DBP07= 0
##$DBPNAM0= <>
##$DBPNAM1= <>
##$DBPNAM2= <>
$$ [...]
##$SUBNAM3= <"">
##$SUBNAM4= <"">
##$SUBNAM5= <"">
##$SUBNAM6= <"">
##$SUBNAM7= <"">
##$SUBNAM8= <"">
##$SUBNAM9= <"">
##$SW= 18.0517328524113
##$SWIBOX= (0..15)
0 0 2 0 0 0 0 0 0 0 0 0 0 0 0 0 
##$SW_h= 3612.71676300578
##$TD= 16384
##$TD0= 1
##$TE= 0
##$TE2= 300
##$TE3= 300
##$TEG= 300
##$TL= (0..7)
0 120 120 120 120 120 120 120 
##$TP= (0..7)
150 150 150 150 150 150 150 150 
##$TP07= 0
##$TPNAME0= <>
##$TPNAME1= <>
##$TPNAME2= <>
##$TPNAME3= <>
##$TPNAME4= <>
##$TPNAME5= <>
##$TPNAME6= <>
##$TPNAME7= <>
##$TPOAL= (0..7)
0.5 0.5 0.5 0.5 0.5 0.5 0.5 0.5 
##$TPOFFS= (0..7)
0 0 0 0 0 0 0 0 
##$TUNHIN= 0
##$TUNHOUT= 0
##$TUNXOUT= 0
##$USERA1= <user>
##$USERA2= <user>
##$USERA3= <user>
##$USERA4= <user>
##$USERA5= <user>
##$V9= 5
##$VALIST= <valist>
##$VCLIST= <CCCCCCCCCCCCCCC>
##$VD= 0
##$VDLIST= <DDDDDDDDDDDDDDD>
##$VPLIST= <PPPPPPPPPPPPPPP>
##$VTLIST= <TTTTTTTTTTTTTTT>
##$WBST= 1024
##$WBSW= 4
##$XGAIN= (0..3)
0 0 0 0 
##$XL= 0
##$YL= 0
##$YMAX_a= 137061
##$YMIN_a= -132930
##$ZGOPTNS= <>
##$ZL1= 120
##$ZL2= 120
##$ZL3= 120
##$ZL4= 120
##$ABSF1= 15.50449
##$ABSF2= -2.547359
##$ABSG= 5
##$ABSL= 3
##$ALPHA= 0
##$AQORDER= 0
##$ASSFAC= 0
##$ASSFACI= 0
##$ASSFACX= 0
##$ASSWID= 0
##$AUNMP= <proc_1d>
##$AZFE= 0.1
##$AZFW= 0.1
##$BCFW= 0
##$BC_mod= 2
##$BYTORDP= 0
##$COROFFS= 0
##$CY= -3
##$DATMOD= 1
##$DC= 0
##$DFILT= <>
##$DTYPP= 0
##$F1P= 0
##$F2P= 0
##$FCOR= 1
##$FTSIZE= 16384
##$FT_mod= 6
##$GAMMA= 0
##$GB= 0
##$INTBC= 1
##$INTSCL= 3.241238e-09
##$ISEN= 128
##$LB= 0.25
##$LEV0= 0
##$LPBIN= 0
##$MAXI= 10000
##$MC2= 0
##$MEAN= 0
##$ME_mod= 0
##$MI= 1.114404
##$NCOEF= 0
##$NC_proc= -8
##$NLEV= 6
##$NOISF1= 3.799351
##$NOISF2= 2.8
##$NSP= 0
##$NTH_PI= 0
##$NZP= 0
##$OFFSET= 15.50119
##$PC= 1
##$PHC0= -1721.517
##$PHC1= 19.96656
##$PH_mod= 1
##$PKNL= yes
##$PPARMOD= 0
##$PSCAL= 0
##$PSIGN= 0
##$REVERSE= no
##$SF= 200.130004105024
##$SI= 16384
##$SIGF1= 3
##$SIGF2= 2
##$SINO= 0.751879
##$SIOLD= 32768
##$SREGLST= <19F.Aceton>
##$SSB= 0
##$STSI= 16384
##$STSR= 0
##$SW_p= 3612.71676300578
##$SYMM= 0
##$S_DEV= 0
##$TDeff= 16384
##$TDoff= 0
##$TI= <>
##$TILT= no
##$TM1= 0
##$TM2= 0
##$TOPLEV= 0
##$USERP1= <user>
##$USERP2= <user>
##$USERP3= <user>
##$USERP4= <user>
##$USERP5= <user>
##$WDW= 1
##$XDIM= 16384
##$YMAX_p= 465962817
##$YMIN_p= -418536
$$ End of Bruker specific parameters
$$ ---------------------------------
##NTUPLES= NMR SPECTRUM
##VAR_NAME=  FREQUENCY,     SPECTRUM/REAL,   SPECTRUM/IMAG
##SYMBOL=    X,             R,               I
##VAR_TYPE=  INDEPENDENT,   DEPENDENT,       DEPENDENT
##VAR_FORM=  AFFN,          ASDF,            ASDF
##VAR_DIM=   16384,         16384,           16384
##UNITS=     HZ,            ARBITRARY UNITS, ARBITRARY UNITS
##FACTOR=    0.220516191357247, 1,           1
##FIRST=     3102.25325546625, 0,            0
##LAST=      -510.463507539526, 0,           0
##MIN=       -510.463507539526, -418536,     0
##MAX=       3102.25325546625, 465962817,    0
$$ Real data points
##PAGE= N=1
##DATA TABLE= (X++(R..R)), XYDATA
$$ [...]
$$ plain form
5936 2817021 2831931 2713807 2703887 2445085 2285080 2326692 2290851 2358817 2348714 2279979 2092022
5925 2092022 2036756 2145376 2152849 2058418 1848106 1841674 1813466 1908965 1827346 1641854 1815953
5914 1815953 1738694 1589302 1394033 1356824 1423273 1535201 1565837 1506550 1426171 1330644 1299354
5903 1299354 1223430 1159744 1303228 1196881 1241610 1127129 950742 1120775 1128627 1125132 1146464
5892 1146464 1166461 936746 994700 971898 954751 887813 991449 854012 776829 841156 878559
5881 878559 949797 1085474 895482 967537 985870 844319 717202 760887 711945 737164 665809
5870 665809 737149 796312 807365 759038 714092 678182 642005 737563 784104 786059 693389 776391
5858 776391 676534 718986 677322 713128 646318 699603 800757 656798 678868 654558 744357
$$ packed form
5936B817021J4910j18124r920k58802j60005M1612l5841O7966j0103o8735j87957
5925B092022n5266J08620P473r4431k10312o432k8208R5499q1619j85492J74099
5914A815953p7259j49392j95269l7209O6449J11928L0636n9287q0379r5527l1290
5903A299354p5924o3686J43484j06347M4729j14481j76387J70033P852l495K1332
5892A146464J9997k29715N7954k2802j7147o6938J03636j37437p7183O4327L7403
5881H78559P1238J35677j89992P2055J8333j41551j27117M3685m8942K5219p1355
5870F65809P1340N9163J1053m8327m4946l5910l6177R5558M6541J955r2670Q3002
5858G76391r9857M2452m1664L5806o6810N3285J01154j43959K2070k4310Q9799
$$ plain form
5847 744357 773350 639927 750450 762036 622990 711367 704171 474386 522073 603376 581970
5836 581970 540773 530627 583349 525298 570643 660824 713040 660200 527587 681229 654398
5825 654398 623505 545886 513879 718269 741858 701698 580526 665633 654004 614649 603719
5814 603719 415247 404170 496817 670596 757106 622470 602312 688370 797561 738560 652666
5803 652666 658198 570263 559628 411773 560752 534268 495022 540935 685187 660341 670942
5792 670942 841907 820820 668497 679287 665720 712772 602889 491179 623156 812563
5782 812563 899322 812299 722556 877311 973356 1014133 929404 880885 817428 782608 818897
5771 818897 770994 734522 675879 776409 852990 749707 715973 776255 892598 881083 887725
$$ packed form
5847G44357K8993j33423J10523J1586j39046Q8377p196k29785M7687Q1303k1406
5836E81970m1197j0146N2722n8051M5345R0181N2216n2840j32613J53642k6831
5825F54398l0893p7619l2007K04390K3589m0160j21172Q5107j1629l9355j0930
5814F03719j88472j1077R2647J73779Q6510j34636k0158Q6058J09191n9001q5894
5803F52666N532q7935j0635j47855J48979k6484l9246M5913J44252k4846J0601
5792F70942J70965k1087j52323J0790j3567M7052j09883j11710J31977J89407
5782H12563Q6759q7023q9743J54755R6045M0777q4729m8519o3457l4820L6289
5771H18897m7903l6472n8643J00530P6581j03283l3734O0282J16343j1515O642
$$ plain form
5760 887725 709822 664136 851275 891088 905002 924509 837997 776864 895478 874873 826373
5749 826373 968248 952090 855699 747075 729689 733213 913884 924862 897383 1040157 1040358
5738 1040358 1159076 1183289 1196779 1186394 1069174 1051511 1101738 1098896 1099724 1042846 1240069
5727 1240069 1359212 1474641 1286578 1333162 1480504 1555867 1651098 1768126 1895972 2209074
5717 2209074 2506100 2778314 2617839 2125336 1919961 1763536 1597804 1381977 1404312 1399380
5707 1399380 1438792 1440371 1186713 1135376 1074460 1162955 1211553 1268891 1302440 1300037 1117618
5696 1117618 1088024 1162291 1167136 1078193 1082518 1118066 987706 1071922 1047621 1046867 997561 1068650
5684 1068650 1118481 1085855 1199618 1124975 1017432 1048426 1083243 1115005 1100325 1030032 980944
$$ packed form
5760H87725j77903m5686J87139L9813J3914J9507q6512o1133J18614k0605m8500
5749H26373J41875j6158r6391j08624j7386L524J80671J0978k7479J42774K01
5738A040358J18718K4213J3490j0385j17220j7663N0227k842Q28n6878J97223
5727A240069J19143J15429j88063M6584J47342P5363R5231J17028J27846L13102
5717B209074K97026K72214j60475m92503k05375j56425j65732k15827K2335m932
5707A399380L9412J579k53658n1337o0916Q8495M8598N7338L3549k403j82419
5696A117618k9594P4267M845q8943M325L5548j30360Q4216k4301p54m9306P1089
5684A068650M9831l2626J13763p4643j07543L0994L4817L1762j4680p0293m9088
$$ plain form
5673 980944 1039204 1060599 1130865 1139437 1115443 1185462 1211010 1209143 1215655 1369722 1290675 1348430
5661 1348430 1317937 1264976 1152457 1110214 1174505 1387597 1417833 1395139 1446530 1362029 1565729
5650 1565729 1637082 1572964 1661108 1748738 1785750 1897337 1906771 1879709 1963361 2051449 2020442
5639 2020442 2131095 2014917 1916454 1984666 1990770 1939448 2001571 2017280 1975753 1858988 1952821
5628 1952821 2138593 2044875 2149702 2321776 2372826 2432724 2547538 2675777 2734643 2902092
5618 2902092 3069813 3193310 3331207 3483284 3771361 3914397 4107560 4312708 4500992 4558805
5608 4558805 4467132 4585904 4659018 4714551 4987240 5045281 5172364 5259253 5341831 5724991 5943331
5597 5943331 6363708 6847057 7333037 7678545 8170723 8720662 9296198 9966239 10509066 10808982
$$ packed form
5673I80944N8260K1395P0266Q572k3994P0019K5548j867O512J54067p9047N7755
5661A348430l0493n2961j12519m2243O4291K13092L0236k2694N1391q4501K03700
5650A565729P1353o4118Q8144Q7630L7012J11587R434k7062Q3652Q8088l1007
5639B020442J10653j16178r8463O8212O104n1322O2123J5709m1527j16765R3833
5628A952821J85772r3718J04827J72074N1050N9898J14814J28239N8866J67449
5618B902092J67721J23497J37897J52077K88077J43036J93163K05148J88284N7813
5608D558805r1673J18772P3114N5533K72689N8041J27083Q6889Q2578L83160K18340
5597E943331M20377M83349M85980L45508M92178N49939N75536O70041N42827K99916
$$ plain form
5587 10808982 10802645 10768980 10702729 10736856 10676368 10463698 10196386 9796498 9631800 9516675
5577 9516675 9266240 9296114 9380844 9623413 9844425 9979537 10290616 10524554 10838815 11351385
5567 11351385 12053082 12544646 13465692 14475171 15565223 16475054 17239972 17281227 16749615
5558 16749615 15673045 14160830 12906646 11792814 10927554 10197706 9486821 8956286 8618065
5549 8618065 8300291 8229288 8208305 8224680 8286027 8284289 8423107 8652723 8920859 9401314 9912462
5538 9912462 10471477 11103013 11959379 12827046 13512445 14125152 14403714 14095382 13110227 11732561
5528 11732561 10496982 9326253 8395565 7783701 7227796 6977050 6683028 6303712 6106443
5519 6106443 5785553 5634166 5679976 5786214 5901605 5898802 6006320 6243620 6439992 6816383
$$ packed form
5587A0808982o337l3665o6251L4127o0488k12670k67312l99888j64698j15125
5577I516675k50435K9874Q4730K42569K21012J35112L11079K33938L14261N12570
5567A1351385P01697M91564R21046J009479J090052R09831P64918M1255n31612
5558A6749615j076570j512215j254184j113832q65260p29848p10885n30535l38221
5549H618065l17774p1003k0983J6375O1347j738J38818K29616K68136M80455N11148
5538I912462N59015O31536Q56366Q67667O85399O12707K78562l08332r85155j377666
5528A1732561j235579j170729r30688o11864n55905k50746k94022l79316j97269
5519F106443l20890j51387M5810J06238J15391k803J07518K37300J96372L76391
$$ plain form
5509 6816383 7468373 7998823 8382989 8713258 9134003 9472930 9029629 8125976 7160758 6365369
5499 6365369 5725295 5328343 5031187 4837433 4759942 4653805 4533112 4477023 4292105 4235985
5489 4235985 4194479 4309049 4338019 4373632 4561390 4518616 4753774 4921449 5260467 5584650
5479 5584650 5748849 6013871 6294671 6418983 6273451 6050602 5905163 5951577 5791762 5865824
5469 5865824 5910975 6196899 6412052 6712820 6955723 7474621 8023443 8216747 8500872 8929980
5459 8929980 9558330 10353538 11289821 12381641 13522215 14440990 14598591 13958958 13041325
5450 13041325 12116627 11568771 11106348 10598253 10343927 10147015 10118703 10315097 10355054 10582369
5440 10582369 10906048 11402738 12005273 12815132 13632736 14404302 15199823 15720030 16396277
$$ packed form
5509F816383O51990N30450L84166L30269M20745L38927m43301r03653r65218p95389
5499F365369o40074l96952k97156j93754p7491j06137j20693n6089j84918n6120
5489D235985m1506J14570K8970L5613J87758m2774K35158J67675L39018L24183
5479E584650J64199K65022K80800J24312j45532k22849j45439M6414j59815P4062
5469E865824M5151K85924K15153L00768K42903N18898N48822J93304K84125M29108
5459H929980O28350P95208R36283J091820J140574R18775J57601o39633r17633
5450A3041325r24698n47856m62423n08095k54326j96912k8312J96394L9957K27315
5440A0582369L23679M96690O02535Q09859Q17604P71566P95521N20207O76247
$$ plain form
5431 16396277 17295695 18340350 19804276 21480637 23348814 24843904 25322946 24320212
5423 24320212 22312093 20095709 18374007 17162999 16231017 15401713 14609201 13893112 13324911
5414 13324911 13029312 12926340 12842806 12739488 13006701 13229399 13462802 13781651 13994661 14145964
5404 14145964 14088958 14026532 13951458 14267592 14575743 14533814 14399943 13727263 12690641 11490446
5394 11490446 10336231 9343456 8729031 8176798 7567964 7235987 6739970 6463101 6097588
5385 6097588 5707155 5653304 5607545 5558490 5455417 5142986 5050746 5018850 4840789 4750533 4570547
5374 4570547 4301106 4012189 3873029 3597281 3363845 3115510 3019032 2916332 2675776 2510579
5364 2510579 2515224 2385830 2376299 2461934 2327094 2295167 2118864 2095242 2034894 2014091 1977501
$$ packed form
5431A6396277Q99418J044655J463926J676361J868177J495090M79042j002734
5423B4320212k008119k216384j721702j211008r31982q29304p92512p16089n68201
5414A3324911k95599j02972q3534j03318K67213K22698K33403L18849K13010J51303
5404A4145964n7006o2426p5074L16134L08151m1929j33871o72680j036622j200195
5394A1490446j154215r92775o14425n52233o08834l31977m96017k76869l65513
5385F097588l90433n3851m5759m9055j03073l12431r2240l1896j78061r0256j79986
5374D570547k69441k88917j39160k75748k33436k48335r6478j02700k40556j65197
5364B510579M645j29394r531Q5635j34840l1927j76303k3622o0348k0803l6590
$$ plain form
5353 1977501 1909954 1894392 1801980 1903982 1817168 1686097 1822336 1827210 1796843 1869074 1745797
5342 1745797 1619811 1571271 1451554 1449262 1515253 1358412 1427654 1432857 1460533 1553497 1411084
5331 1411084 1427893 1332616 1327302 1288955 1235890 1174420 1323745 1453016 1523337 1308352 1281369
5320 1281369 1130355 1101819 1102282 1194193 1297762 1406164 1449920 1462466 1424195 1297159 1197208
5309 1197208 1243686 1296018 1075941 1105878 1194799 1040833 1007848 1025498 1031321 1039472 954381
5298 954381 941563 996462 1105557 1000742 1015431 1043788 1135493 1067953 938680 941058 1098913
5287 1098913 1149334 1034747 878119 875216 986339 1033581 1184680 1352130 1352996 1296330 1179076
5276 1179076 1093223 925278 978605 872871 851691 843335 890730 1005033 959275 891411 846199
$$ packed form
5353A977501o7547j5562r2412J02002q6814j31071J36239M874l0367P2231j23277
5342A745797j25986m8540j19717k292O5991j56841O9242N203K7676R2964j42413
5331A411084J6809r5277n314l8347n3065o1470J49325J29271P0321k14985k6983
5320A281369j51014k8536M63R1911J03569J08402M3756J2546l8271j27036r9951
5309A197208M6478N2332k20077K9937Q8921j53966l2985J7650N823Q151q5091
5298I54381j2818N4899J09095j04815J4689K8357R1705o7540j29273K378J57855
5287A098913N0421j14587j56628k903J11123M7242J51099J67450Q66n6666j17254
5276A179076q5853j67945N3327j05734k1180q356M7395J14303m5758o7864m5212
$$ plain form
5265 846199 820578 938591 933907 914476 884905 845137 735448 898658 1050361 1017785 932496
5254 932496 840752 830918 873396 995394 948192 963300 904072 916178 1135762 1102301 922839
5243 922839 922242 893112 1002733 1022108 908666 986901 1019320 1002247 912795 886428 947103 1010002
5231 1010002 1027518 1097716 1019666 1009321 992933 1086811 1195482 1139582 989655 952048 958067
5220 958067 907006 965116 967695 1163312 1213849 1192319 1134932 938881 913764 818814 933708
5209 933708 1136346 1087164 938441 851698 946835 1007677 966247 997245 1082582 1020010 859368
5198 859368 772122 944430 947862 851194 793821 781736 820383 763337 872983 1037202 878620
5187 878620 830895 865318 879006 920578 1050650 973432 998676 1076379 1000840 892016 971998
$$ packed form
5265H46199k5621J18013m684j9431k9571l9768j09689J63210J51703l2576q5289
5254I32496r1744r834M2478J21998m7202J5108n9228J2106K19584l3461j79462
5243I22839n97k9130J09621J9375j13442P8235L2419j7073q9452k6367O0675O2899
5231A010002J7516P0198p8050j0345j6388R3878J08671n5900j49927l7607O019
5220I58067n1061N8110K579J95617N0537k1530n7387j96051k5117r4950J14894
5209I33708K02638m9182j48723q6743R5137O0842m1430L0998Q5337o2572j60642
5198H59368q7246J72308L432r6668n7373j2085L8647n7046J09646J64219j58582
5187H78620m7725L4423J3688M1572J30072p7218K5244P7703p5539j08824P9982
$$ plain form
5176 971998 1028262 1038018 1072045 1135723 1192252 1188096 1054709 1034939 1060810 1127029 1074698 1015314
5164 1015314 1024664 1025024 1029866 1104184 1029839 1003890 1156959 1152214 1143294 1180015 1180016 1192729 1207224
5151 1207224 1105754 1140368 1038986 869189 965983 1261390 1274172 1282814 1213348 1232515 1386689
5140 1386689 1423850 1446902 1368374 1391171 1408569 1442421 1492416 1369888 1334958 1476302 1474588
5129 1474588 1495216 1547189 1493569 1510444 1550340 1643268 1769068 1740053 1773793 1709576 1684926
5118 1684926 1732736 1796201 1803190 1813921 1918931 1880969 1984855 2106918 2217775 2204104 2286688
5107 2286688 2268107 2333398 2669441 2817560 2788449 2890861 3016968 3044822 3162356 3399201
5097 3399201 3495250 3723749 3873690 4194350 4546430 4770477 4951040 5007778 5304939 5675536
$$ packed form
5176I71998N6264R756L4027O3678N6529m156j33387j9770K5871O6219n2331n9384
5164A015314R350L60M842P4318p4345k5949J53069m745q920L6721JJ2713J4495
5151A207224j01470L4614j01382j69797R6794K95407J2782Q642o9466J9167J54174
5140A386689L7161K3052p8528K2797J7398L3852M9995j22528l4930J41344j714
5129A474588K0628N1973n3620J6875L9896R2928J25800k9015L3740o4217k4650
5118A684926M7810O3465O989J0731J05010l7962J03886J22063J10857j3671Q2584
5107B286688j8581O5291L36043J48119k9111J02412J26107K7854J17534K36845
5097C399201R6049K28499J49941L20660L52080K24047J80563N6738K97161L70597
$$ plain form
5087 5675536 6221613 6556151 7023261 7661158 8308948 9021445 9748017 10739352 11999859
5078 11999859 13260244 14871436 16861392 19224812 21722898 25013083 28996611 32574387
5070 32574387 34462650 34482954 35537253 38208896 40989990 42250309 41119276 40537961 42116548
5061 42116548 45625682 48881305 48367010 41764603 33686613 28248049 24334115 21498839
5053 21498839 19235271 17691626 16191648 14790355 13599012 12497793 11691811 10870276
5045 10870276 10155091 9681593 9002867 8393703 8006218 7554587 6957993 6727239 6359512
5036 6359512 5990834 5809796 5494434 5134369 4957177 4811795 4550719 4420376 4300082 4051643
5026 4051643 3980065 3735540 3585615 3546965 3583244 3582459 3420006 3239657 3152561 3042243 2914019
$$ packed form
5087E675536N46077L34538M67110O37897O47790P12497P26572R91335J260507
5078A1999859J260385J611192J989956K363420K498086L290185L983528L577776
5070C2574387J888263K0304J054299K671643K781094J260319j131033n81315J578587
5061D2116548L509134L255623n14295o602407q077990n438564l913934k835276
5053B1498839k263568j543645j499978j401293j191343j101219q05982q21535
5045A0870276p15185m73498o78726o09164l87485m51631n96594k30754l67727
5036F359512l68678j81038l15362l60065j77192j45382k61076j30343j20294k48439
5026D051643p1578k44525j49925l8650L6279p85j62453j80349q7096j10318j28224
$$ plain form
5015 2914019 2877889 2864838 2763901 2707385 2660985 2605669 2593677 2517108 2438789 2506459 2380015
5004 2380015 2342211 2352352 2408611 2260548 2095323 2030599 2114201 2109558 2169649 2207245 2171715
4993 2171715 2162593 2065514 1988998 2042086 2096043 2003899 2039763 1959265 1931099 1922317 1919489 2032681
4981 2032681 1943260 1880837 1921248 2031264 2024190 2142003 2144073 2064006 2192650 2091109 2179037
4970 2179037 2268154 2314058 2371266 2415434 2461169 2526765 2576597 2652114 2713929 2910680 3031066
4959 3031066 3028040 3020185 3196887 3343568 3602635 3701729 3812349 3809169 3795294 3731894 3864772
4948 3864772 3742436 3569560 3555692 3428273 3338761 3237696 2996052 3033759 2998133 2929214
4938 2929214 2883017 2890495 2974609 2755300 2666574 2522886 2497264 2487026 2367535 2371927 2207202
$$ packed form
5015B914019l6130j3051j00937n6516m6400n5316j1992p6569p8319O7670j26444
5004B380015l7804J0141N6259j48063j65225o4724Q3602m643O0091L7596l5530
4993B171715r122r7079p6516N3088N3957r2144L5864q0498k8166q782k828J13192
4981B032681q9421o2423M0411J10016p074J17813K070q0067J28644j01541Q7928
4970B179037Q9117M5904N7208M4168M5735O5596M9832P5517O1815J96751J20386
4959C031066l026p855J76702J46681K59067R9094J10620l180j3875o3400J32878
4948C864772j22336j72876j3868j27419q9512j01065k41644L7707l5626o8919
4938B929214m6197P478Q4114k19309q8726j43688k5622j0238j19491M392j64725
$$ plain form
4927 2207202 2194469 2253583 2235676 2377433 2375111 2229318 2389737 2465537 2653734 2770568 2883132
4916 2883132 3048745 3092426 2954999 2823201 2632782 2408826 2319620 2167851 2205455 2213074
4906 2213074 2279490 2254087 2254675 2330985 2346134 2195533 2206130 2185028 2310007 2247711 2171643
4895 2171643 2317852 2330644 2320936 2489075 2651992 2707181 2893588 2848641 2716034 2694814 2648209
4884 2648209 2608419 2591334 2581244 2624519 2495534 2433946 2447881 2359312 2525833 2502227 2465505
4873 2465505 2543939 2549272 2507481 2628971 2671776 2735087 2626869 2566233 2692647 2861513 2972375
4862 2972375 3104908 3076751 3010395 2981332 2941872 3009384 2896840 3035831 3081360 3066757 3088226
4851 3088226 3163453 3238179 3357887 3421002 3441117 3656458 3924257 3961530 3976739 4162884 4196182
$$ packed form
4927B207202j2733N9114j7907J41757k322j45793J60419P5800J88197J16834J12564
4916B883132J65613M3681j37427j31798j90419k23956q9206j51769L7604P619
4906B213074O6416k5403N88P6310J5149j50601J0597k1102J24979o2296p6068
4895B171643J46209J2792r708J68139J62917N5189J86407m4947j32607k1220m6605
4884B648209l9790j7085j0090M3275j28985o1588J3935q8569J66521k3606l6722
4873B465505P8434N333m1791J21490M2805O3311j08218o0636J26414J68866J10862
4862B972375J32533k8157o6356k9063l9460O7512j12544J38991M5529j4603K1469
4851C088226P5227P4726J19708O3115K0115K15341K67799L7273J5209J86145L3298
$$ plain form
4840 4196182 4061804 3976194 3974884 3938914 3867394 3948469 4003926 4130302 4371343 4565586 4678215
4829 4678215 4664681 4681845 4741399 4845970 4918660 5112769 5246756 5364550 5638044 5753001
4819 5753001 5846052 6091548 6280567 6613940 6839657 7126724 7487652 7789615 8109276 8520635
4809 8520635 8657406 9239658 9745751 10229621 10768856 11368816 11969113 12565619 13297144 13873579
4799 13873579 14624105 15472988 16369647 17392268 18529091 19630102 20698143 21939570 23510880
4790 23510880 25067803 27063353 29583467 32362754 35143258 37685156 39337423 40269044
4782 40269044 40651371 41282953 42068117 42773563 43166020 43470696 43924372 44667705 45738834
4773 45738834 47063940 48268359 49516071 50814058 52630513 54768463 56725341 58696140
$$ packed form
4840D196182j34378q5610j310l5970p1520Q1075N5457J26376K41041J94243J12629
4829D678215j3534J7164N9554J04571P2690J94109J33987J17794K73494J14957
4819E753001R3051K45496J89019L33373K25717K87067L60928L01963L19661M11359
4809H520635J36771N82252N06093M83870N39235N99960O00297N96506P31525N76435
4799A3873579P50526Q48883Q96659J022621J136823J101011J068041J241427J571310
4790B3510880J556923J995550K520114K779287K780504K541898J652267R31621
4782D0269044L82327O31582P85164P05446L92457L04676M53676P43333J071129
4773D5738834J325106J204419J247712J297987J816455K137950J956878J970799
$$ plain form
4765 58696140 60431855 62075643 63520302 65344221 67545708 70056428 72862639 76134568
4757 76134568 79452123 82826452 85872802 87585013 86951994 84462755 81219173 78251525
4749 78251525 75560340 73192759 71233623 69336345 67798638 66499348 65037457 63053477
4741 63053477 60736754 58402473 56515547 54894483 53410461 52319690 51444031 50531839
4733 50531839 49559231 48810007 48538983 48511520 48577090 48234664 47616193 47031662 46379863 45548455
4723 45548455 44063330 41356155 37903285 34523204 31643307 29458298 27726718 26378187
4715 26378187 25262102 24054314 22987039 21912691 20956890 20011859 19120415 18511528 17848441
4706 17848441 17235170 16500693 15967018 15410978 14680659 14160646 13694989 13100604 12620595
$$ packed form
4765E8696140J735715J643788J444659J823919K201487K510720K806211L271929
4757G6134568L317555L374329L046350J712211o33019k489239l243582k967648
4749G8251525k691185k367581j959136j897278j537707j299290j461891j983980
4741F3053477k316723k334281j886926j621064j484022j090771q75659r12192
4733E0531839r72608p49224k71024k7463O5570l42426o18471n84531o51799q31408
4723D5548455j485125k707175l452870l380081k879897k185009j731580j348531
4715B6378187j116085j207788j067275j074348r55801r45031q91444o08887o63087
4706A7848441o13271p34477n33675n56040p30319n20013m65657n94385m80009
$$ plain form
4697 12620595 12343788 12192839 11912404 11501306 11151235 10907757 10756959 10323789 10123464
4688 10123464 9873110 9636384 9422623 9080403 8921585 8677838 8576548 8338490 8239018 8243676
4678 8243676 8182093 8027374 8064217 8002331 7792351 7767892 7910973 7886378 7765783 7756553 7852164
4667 7852164 7899395 7834334 7894903 7896291 7868020 7714754 7684007 7636531 7680982 7801318 7754062
4656 7754062 7523944 7520526 7309872 7106059 6927853 6711912 6546571 6340427 6061007 5887239
4646 5887239 5633491 5547126 5401602 5343692 5295872 5180975 5202143 5089587 4962340 5010674
4636 5010674 5032303 5035869 5055735 5145775 5251957 5117579 5075116 4952192 4934161 4898385 4920461
4625 4920461 4871926 4599526 4394561 4292542 4108784 3944144 3797958 3689281 3634284 3578895
$$ packed form
4697A2620595k76807j50949k80435m11098l50071k43478j50798m33170k00325
4688A0123464k50354k36726k13761l42220j58818k43747j01290k38058r9472M658
4678H243676o1583j54719L6843o1886k09980k4459J43081k4595j20595r230R5611
4667G852164M7231o5061O0569J388k8271j53266l0747m7476M4451J20336m7256
4656G754062k30118l418k10654k03813j78206k15941j65341k06144k79420j73768
4646E887239k53748q6365j45524n7910m7820j14897K1168j12556j27247M8334
4636E010674K1629L566J9866R0040J06182j34378m2463j22924j8031l5776K2076
4625D920461m8535k72400k04965j02019j83758j64640j46186j08677n4997n5389
$$ plain form
4615 3578895 3333825 3114529 3045654 3085904 3074301 3020403 2926220 2846627 2886421 2853405 2836682
4604 2836682 2650285 2501837 2529201 2409158 2396266 2331578 2395795 2484376 2690930 2642116 2607601
4593 2607601 2523950 2384719 2389414 2372896 2409342 2281616 2243223 2215095 2194109 2268804 2205299
4582 2205299 2197860 2312148 2209526 2289719 2345197 2253087 2191306 2199449 2156146 2139369 2046887
4571 2046887 1961973 2089498 2011339 2005288 2067318 2099642 2040019 2030821 1996520 2058460 1978713 1945013
4559 1945013 2127144 2099754 2116032 2116560 1962270 1995295 2019133 2187532 2262144 2199161 2048468
4548 2048468 2053874 2008721 1986556 2103899 2076457 2032439 2082935 2053638 2067948 1995594 1922014
4537 1922014 1989306 2133828 2204905 1985980 1930420 1970530 2013244 1866804 1990622 2013028 1964754
$$ packed form
4615C578895k45070k19296o8875M0250j1603n3898r4183p9593L9794l3016j6723
4604B836682j86397j48448K7364j20043j2892o4688O4217Q8581K06554m8814l4515
4593B607601q3651j39231M695j6518L6446j27726l8393k8128k0986P4695o3505
4582B205299p439J14288j02622Q0193N5478r2110o1781Q143m3303j6777r2482
4571B046887q4914J27525p8159o051O2030L2324n9623r198l4301O1940p9747l3700
4559A945013J82131k7390J6278N28j54290L3025K3838J68399P4612o2983j50693
4548B048468N406m5153k2165J17343k7442m4018N0496k9297J4310p2354p3580
4537A922014O7292J44522P1077k18925n5560M0110M2714j46440J23818K2406m8274
$$ plain form
4526 1964754 1843502 1971753 1968372 2033696 2061479 2060842 1954685 2015571 2093006 2007074 1835559
4515 1835559 1738258 1818670 1876050 1927845 2063862 2028082 1853410 1832619 1919169 1925024 1881265
4504 1881265 1894908 1875130 1876297 1867956 2030559 1860155 1845523 1956137 1902325 1872133 1803325
4493 1803325 1816446 1807493 1877670 1924920 1971342 2084837 1939570 1960959 2020066 2025206 1978950
4482 1978950 2176093 2186495 2065828 2077468 2212654 2042948 2070656 2102833 2105639 2129431 2087556
4471 2087556 2016408 2057537 1998348 2004703 2293574 2206001 2142075 2043727 2060001 2147763 2170310
4460 2170310 2142134 2272781 2295160 2287665 2325637 2228549 2187710 2402750 2394870 2304136 2325951
4449 2325951 2440945 2481447 2529346 2560543 2553328 2485171 2387105 2528800 2565375 2709604 2659112
$$ packed form
4526A964754j21252J28251l381O5324K7783o37j06157O0886P7435q5932j71515
4515A835559r7301Q0412N7380N1795J36017l5780j74672k0791Q6550N855m3759
4504A881265J3643j9778J167q341J62603j70404j4632J10614n3812l0192o8808
4493A803325J3121q953P0177M7250M6422J13495j45267K1389N9107N140m6256
4482A978950J97143J0402j20667J1640J35186j69706K7708L2177K806K3792m1875
4471B087556p1148M1129n9189O355K88871q7573o3926r8348J6274Q7762K2547
4460B170310k8176J30647K2379p495L7972r7088m0839K15040p880r0734K1815
4449B325951J14994M0502M7899L1197p215o8157r8066J41695L6575J44229n0492
$$ plain form
4438 2659112 2536230 2647867 2547866 2540462 2597154 2642565 2547386 2471528 2439853 2455876 2517388
4427 2517388 2443697 2385221 2546740 2565161 2602525 2508867 2465849 2496090 2525151 2506369 2564633
4416 2564633 2544313 2551959 2662864 2724824 2738728 2748723 2656405 2670330 2661902 2740322 2726069 2650768
4404 2650768 2581115 2573392 2567405 2636367 2652273 2634840 2698955 2638586 2678300 2647883 2716378 2834711
4392 2834711 2682114 2454718 2730610 2715861 2570911 2650714 2693140 2559912 2654361 2727019
4382 2727019 2720915 2755882 2727590 2716425 2892294 2928133 2956156 2944835 2900455 2961166 3083168
4371 3083168 3031793 3077712 2966749 2837818 2878829 2950720 2912785 2854790 2848714 2937908 2849957
4360 2849957 2932111 3024686 2980219 2870363 2974125 3005580 2973120 3035836 3005723 3118289 3014453
$$ packed form
4438B659112j22882J11637j00001p404N6692M5411r5179p5858l1675J6023O1512
4427B517388p3691n8476J61519J8421L7364r3658m3018L0241K9061j8782N8264
4416B564633k0320P646J10905O1960J3904R995r2318J3925q428P8420j4253p5301
4404B650768o9653p723n987O8962J5906j7433O4115o0369L9714l0417O8495J18333
4392B834711j52597k27396K75892j4749j44950P9803M2426j33228R4449P2658
4382B727019o104L4967k8292j1165J75869L5839K8023j1321m4380O0711J22002
4371C083168n1375M5919j10963j28931M1011P1891l7935n7995o076Q9194q7951
4360B849957Q2154R2575m4467j09856J03762L1455l2460O2716l0113J12566j03836
$$ plain form
4349 3014453 2896770 2964572 2964344 2987405 3061475 3042044 3038303 3031968 3033209 3011542 3176749 3180173
4337 3180173 3124819 3071042 3127334 3128398 3040370 3014286 3052088 3146159 3279571 3371307 3452707
4326 3452707 3444948 3511708 3496967 3417492 3489137 3594702 3613055 3648789 3700043 3827785 3847027
4315 3847027 3916134 4105000 4081665 4175343 4336190 4441626 4394484 4713512 4819668 4983543
4305 4983543 5173895 5325717 5637682 5832727 5889033 6150152 6433925 6771004 7117597 7284470
4295 7284470 7609854 7853924 8230191 8651737 9216426 9738732 10273961 10943694 11758765 12414566
4285 12414566 12940912 13342370 13663173 14049053 14208558 14575032 15183290 15903814 16867075
4276 16867075 17817361 18870156 20072461 21078509 22035310 22937843 23602559 23920609 23980202
$$ packed form
4349C014453j17683O7802k28K3061P4070j9431l741o335J241k1667J65207L424
4337C180173n5354n3777N6292J064q8028k6084L7802R4071J33412R1736Q1400
4326C452707p759O6760j4741p9475P1645J05565J8353L5734N1254J27742J9242
4315C847027O9107J88866k3335R3678J60847J05436m7142L19028J06156J63875
4305D983543J90352J51822L11965J95045N6306K61119K83773L37079L46593J66873
4295G284470L25384K44070L76267M21546N64689N22306N35229O69733Q15071O55801
4285A2414566N26346M01458L20803L85880J59505L66474O08258P20524R63261
4276A6867075R50286J052795J202305J006048R56801R02533O64716L18050N9593
$$ plain form
4267 23980202 24128700 24303371 24632062 24943881 25440895 26255492 27044141 28219851 29397901
4258 29397901 30413587 31214470 31794731 31846343 31467202 31082023 30512750 30006875 29605034
4249 29605034 29248510 29004915 29064405 29207417 29542196 29858523 30022791 30112694 29888605 29476048
4239 29476048 28962816 28080179 27207025 26376667 25581404 24764791 24087426 23414226 22737957
4230 22737957 22148574 21820151 21462001 21062811 20589577 20076481 19596097 19103260 18470264
4221 18470264 17789851 16919811 16024544 15280936 14411742 13631110 13184259 12560310 12148717
4212 12148717 11913410 11763238 11395343 11080937 10797097 10449679 10019900 9617938 9196986
4203 9196986 8768176 8300045 7965681 7748540 7566662 7430168 7315053 7276435 7056485 6910535
$$ packed form
4267B3980202J48498J74671L28691L11819M97014Q14597P88649J175710J178050
4258B9397901J015686Q00883N80261N1612l79141l85179n69273n05875m01841
4249B9605034l56524k43595N9490J43012L34779L16327J64268Q9903k24089m12557
4239B9476048n13232q82637q73154q30358p95263q16613o77365o73200o76269
4230B2737957n89383l28423l58150l99190m73234n13096m80384m92837o32996
4221A8470264o80413q70040q95267p43608q69194p80632m46851o23949m11593
4212A2148717k35307j50172l67895l14406k83840l47418m29779m01962m20952
4203I196986m28810m68131l34364k17141j81878j36494j15115l8618k19950j45950
$$ plain form
4193 6910535 6852975 6782129 6521762 6239409 6032395 5778031 5771090 5868138 5559100 5444415
4183 5444415 5446543 5314557 5074412 5107909 5136203 5082890 5053218 5114921 5063886 4955988 4967526
4172 4967526 5008200 4953928 4916622 4832964 4799816 4812815 4708112 4727334 4890122 4704369 4719588
4161 4719588 4687471 4807382 4674847 4589732 4615277 4657429 4658350 4674933 4535604 4394212 4584281
4150 4584281 4705639 4757746 4767774 4585966 4577912 4665862 4592429 4529919 4688952 4816227 4726025
4139 4726025 4570255 4627632 4643995 4579335 4717295 4666421 4636967 4705124 4699423 4891244 4850700
4128 4850700 4858670 4932510 5089499 5165822 5136855 5149450 5156438 5205647 5282886 5371899 5643237
4117 5643237 5511316 5510773 5659307 5551156 5651822 5714792 5939739 6085041 6227068 6370865
$$ packed form
4193F910535n7560p0846k60367k82353k07014k54364o941R7048l09038j14685
4183E444415K128j31986k40145L3497K8294n3313k9672O1703n1035j07898J1538
4172D967526M0674n4272l7306q3658l3148J2999j04703J9222J62788j85753J5219
4161D719588l2117J19911j32535q5115K5545M2152R21J6583j39329j41392J90069
4150D584281J21358N2107J0028j81808q054Q7950p3433o2510J59033J27275r0202
4139D726025j55770N7377J6363o4660J37960n0874k9454O8157n701J91821m0544
4128D850700P970P3840J56989P6323k8967J2595O988M9209P7239Q9013K71338
4117E643237j31921n43J48534j08151J00666O2970K24947J45302J42027J43797
$$ plain form
4107 6370865 6553150 6655547 6842932 7115541 7337844 7572501 7883610 8234192 8662974 8858799
4097 8858799 8940519 9125548 9255345 9284415 9619269 9957755 10378114 10891759 11214276 11630598
4087 11630598 12103480 12492753 12614410 12618090 12744274 12766627 12960346 13082999 13149471 13433888
4077 13433888 13844933 14314120 14922443 15402118 15910656 16252890 16566640 16485810 16127697 15718712
4067 15718712 15320900 15115240 15044105 15109137 15204867 15482937 15771494 16061985 16468556 16729900
4057 16729900 16691417 16530909 16178792 15798505 15584343 15201973 15041032 14984848 15104792 14997822
4047 14997822 15004464 15176294 15252942 15307406 15311016 15016807 14870543 14808627 14647039 14563426 14477849
4036 14477849 14536995 14655356 14791809 15003205 15118141 15280228 15357327 15334846 15564497 15773394
$$ packed form
4107F370865J82285J02397J87385K72609K22303K34657L11109L50582M28782J95825
4097H858799Q1720J85029J29797K9070L34854L38486M20359N13645L22517M16322
4087A1630598M72882L89273J21657L680J26184K2353J93719J22653O6472K84417
4077A3433888M11045M69187O08323M79675N08538L42234L13750q0830l58113m08985
4067A5718712l97812k05660p1135O5032R5730K78070K88557K90491M06571K61344
4057A6729900l8483j60508l52117l80287k14162l82370j60941n6184J19944j06970
4047A4997822O642J71830P6648N4464L610k94209j46264o1916j61588q3613q5577
4036A4477849N9146J18361J36453K11396J14936J62087P7099k2481K29651K08897
$$ plain form
4026 15773394 16175088 16518242 16850825 17486644 18088425 18372510 18572153 18576700 18405148 18343325
4016 18343325 18474460 18764686 19104350 19422015 19826148 20334595 20792751 21242622 21601890
4007 21601890 21811183 21915570 21924537 21849292 21829100 21915774 22034443 22084635 22212868 22404403
3997 22404403 22600418 22732616 23006757 23446152 23570318 23469587 23326760 23337423 23297405 23224755
3987 23224755 23078508 22904166 22738906 22835715 23043907 23134471 23038623 23201335 23127857 23067536
3977 23067536 22950747 22744127 22468658 22186655 21925022 21730286 21643929 21603068 21421818 21115670
3967 21115670 20961652 20841023 20867561 20876128 20937446 21159725 21518174 21925154 22281292 22727242
3957 22727242 23210002 23673010 23843263 24133325 24355708 24376270 24641725 24889080 25017024 25207124
$$ packed form
4026A5773394M01694L43154L32583O35819O01781K84085J99643M547j71552o1823
4016A8343325J31135K90226L39664L17665M04133N08447M58156M49871L59268
4007B1601890K09293J04387Q967p5245k0192Q6674J18669N0192J28233J91535
3997B2404403J96015J32198K74141M39395J24166j00731j42827J0663m0018p2650
3987B3224755j46247j74342j65260R6809K08192R0564r5848J62712p3478o0321
3977B3067536j16789k06620k75469k82003k61633j94736q6357m0861j81250l06148
3967B1115670j54018j20629K6538Q567O1318K22279L58449M06980L56138M45950
3957B2727242M82760M63008J70253K90062K22383K0562K65455K47355J27944J90100
$$ plain form
3947 25207124 25454325 26064325 26671000 27338038 28089705 28861858 29638767 30373163 31271950
3938 31271950 32259396 33244712 34192051 35426149 36681398 38071048 39601884 41452100 43758509
3929 43758509 46455356 49652857 53175744 56631982 59664157 61545557 62194754 61967439
3921 61967439 61772768 62008613 62604978 63668766 65005936 66489070 68502904 71113558 73996523
3912 73996523 76802283 79319124 81273425 82395326 82905585 82862686 82757311 82782773 82992877
3903 82992877 83742577 85127717 86985793 89507046 92759998 96780060 101156337 105399688
3895 105399688 109096568 111475053 110992794 106798078 100586391 94215277 88980864 85121011
3887 85121011 82572909 80970644 79981342 79496489 79188537 79069160 79047349 79073932 78652511
$$ packed form
3947B5207124K47201O10000O06675O67038P51667P72153P76909P34396Q98787
3938C1271950R87446R85316R47339J234098J255249J389650J530836J850216K306409
3929D3758509K696847L197501L522887L456238L032175J881400O49197k27315
3921F1967439j94671K35845N96365J063788J337170J483134K013834K610654K882965
3912G3996523K805760K516841J954301J121901N10259m2899j05375K5462K10104
3903H2992877P49700J385140J858076K521253L252952M020062M376277M243351
3895A05399688L696880K378485m82259m194716o211687o371114n234413l859853
3887H5121011k548102j602265r89302m84853l07952j19377k1811K6583m21421
$$ plain form
3878 78652511 77942413 76705186 74602248 71773407 68654918 65407631 62697176 60936695
3870 60936695 59505359 58739495 58438503 58326906 58066867 57722116 57226166 56112584 54251305
3861 54251305 51602317 48779560 46440747 44290999 42690548 41386589 40386768 39428630
3853 39428630 38532271 37396530 36184695 34971654 33675118 32467986 31517888 30670097 29907621
3844 29907621 29175622 28718543 28427242 28231712 28193569 27999198 27993229 28209678 28409897 28626780
3834 28626780 28827597 28905733 28835227 28525708 28415432 28119069 27676419 27101389 26363960 25577148
3824 25577148 24997750 24365424 23848990 23294915 22827994 22557238 22498909 22546858 22544601 22742886
3814 22742886 22999732 23179071 23468001 23600674 23559546 23341389 23186619 23002164 23012233 23082395
$$ packed form
3878G8652511p10098j237227k102938k828841l118489l247287k710455j760481
3870F0936695j431336p65864l00992j11597k60039l44751m95950j113582j861279
3861E4251305k648988k822757k338813k149748j600451j303959r99821r58138
3853C9428630q96359j135741j211835j213041j296536j207132r50098q47791p62476
3844B9907621p31999m57079k91301j95530l8143j94371n969K16449K00219K16883
3834B8626780K00817P8136p0506l09519j10276k96363m42650n75030p37429p86812
3824B5577148n79398o32326n16434n54075m66921k70756n8329M7949k257J98285
3814B2742886K56846J79339K88930J32673m1128k18157j54770j84455J0069P0162
$$ plain form
3804 23082395 23152975 23276701 23423585 23585870 23467536 23361551 23091019 22681035 22460047 22349756
3794 22349756 22203901 21980291 21671208 21454527 21306221 21302773 21361303 21644028 21424625 21486861
3784 21486861 21691782 21755765 21737126 21693971 21671251 21459025 21379738 21476582 21742329 22226674
3774 22226674 22725564 23212957 23876105 24534353 25406899 26072891 26595804 27416263 28229111
3765 28229111 29284740 30616636 31860174 33178506 34905849 36951569 39238076 41861986
3757 41861986 44794132 47909615 51530265 55417743 59309412 63252586 66820526 69936838
3749 69936838 72356600 73961858 74860608 75336503 75322969 75029884 74641177 74291329 74398607
3740 74398607 74757824 75410283 75960203 76472642 76798029 76651886 75977471 74356731 72261464
$$ packed form
3804B3082395P0580J23726J46884J62285j18334j05985k70532m09984k20988j10291
3794B2349756j45855k23610l09083k16681j48306l448N8530K82725k19403O2236
3784B1486861K04921O3983j8639m3155k2720k12226p9287R6844K65747M84345
3774B2226674M98890M87393O63148O58248Q72546O65992N22913Q20459Q12848
3765B8229111J055629J331896J243538J318332J727343K045720K286507K623910
3757D1861986K932146L115483L620650L887478L891669L943174L567940L116312
3749F9936838K419762J605258Q98750M75895j3534k93085l88707l49848J07278
3740G4398607L59217O52459N49920N12439L25387j46143o74415j620740k095267
$$ plain form
3731 72261464 69244060 65766113 61697935 57533133 53481313 49578785 45912445 42531247
3723 42531247 39644414 37058627 34797562 32731365 31033817 29547578 27964146 26620715
3715 26620715 25530796 24419314 23551285 22703833 22063250 21388777 20646620 20034847 19356752
3706 19356752 18865397 18506099 18035489 17579073 17277553 17139008 16867199 16488187 16242336
3697 16242336 15976068 15739711 15634613 15465290 15182559 14905706 14898116 14780692 14506097 14379945
3687 14379945 14181009 14003708 13842940 13830043 13791764 13748425 13605099 13486173 13269778 13210891
3677 13210891 13206020 13267663 13293819 13216558 12985712 12925245 12966742 12899447 12984013 13117708 13241951
3666 13241951 13125974 13199986 13305129 13385995 13588553 13742663 13951381 14019682 14159463 14323134
$$ packed form
3731G2261464l017404l477947m068178m164802m051820l902528l666340l381198
3723D2531247k886833k585787k261065k066197j697548j486239j583432j343431
3715B6620715j089919j111482q68029q47452o40583o74473p42157o11773o78095
3706A9356752m91355l59298m70610m56416l01520j38545k71809l79012k45851
3697A6242336k66268k36357j05098j69323k82731k76853p590j17424k74595j26152
3687A4379945j98936j77301j60768j2897l8279m3339j43326j18926k16395n8887
3677A3210891m871O1643K6156p7261k30846o0467M1497o7295Q4566J33695J24243
3666A3241951j15977P4012J05143Q0866K02558J54110K08718O8301J39781J63671
$$ plain form
3656 14323134 14481997 14788403 15014040 15197939 15619777 15967765 16299895 16614064 16866336
3647 16866336 17040576 17142739 17189702 17360294 17380243 17306642 17379547 17348916 17484654 17502549
3637 17502549 17691126 17906308 18066864 18295387 18336084 18638454 18850037 18894345 19131176 19396751
3627 19396751 19720433 19957740 20126778 20148877 20427282 20724302 21145513 21753275 22473994 23322333
3617 23322333 24432733 25600875 27098810 28666393 30554058 32298266 34112563 35732897
3609 35732897 37188130 38625443 39657292 40361395 40923929 41203548 41213637 41025999 40947377
3600 40947377 40889377 40923461 41067049 41178032 41124826 40926635 40481071 39784705 39086439 38206198
3590 38206198 37046969 35717929 34408900 33119406 31930186 30849222 29868601 29126574
$$ packed form
3656A4323134J58863L06406K25637J83899M21838L47988L32130L14169K52272
3647A6866336J74240J02163M6963J70592J9949p3601P2905l0631J35738J7895
3637A7502549J88577K15182J60556K28523M0697L02370K11583M4308K36831K65575
3627A9396751L23682K37307J69038K2099K78405K97020M21211O07762P20719Q48339
3617B3322333J110400J168142J497935J567583J887665J744208J814297J620334
3609C5732897J455233J437313J031849P04103N62534K79619J0089j87638p8622
3600D0947377n8000L4084J43588J10983n3206j98191m45564o96366o98266q80241
3590C8206198j159229j329040j309029j289494j189220j080964r80621p42027
$$ plain form
3582 29126574 28554103 28189241 27924030 27739291 27828824 28135452 28182265 28463719 28920708 29585665
3572 29585665 30298992 31137778 32331016 33613707 34995173 36677260 38693407 40750069
3564 40750069 43203924 46001962 49192964 52726886 56700505 61246566 66335851 72099487
3556 72099487 78228302 84463458 90724070 96668690 102419358 107779901 113048474 118130981
3548 118130981 122681355 126798589 130383810 133190338 135166792 136380573 137301153 137481389
3540 137481389 137274736 136386339 135182231 133496877 131588530 129419941 126899007 124157856
3532 124157856 121158604 117746158 114359360 111239595 108258872 105489582 103070813 101023913
3524 101023913 99800452 99182762 99349982 100303671 102112347 105154248 110084943 116515802
$$ packed form
3582B9126574n72471l64862k65211j84739Q9533L06628M6813K81454M56989O64957
3572B9585665P13327Q38786J193238J282691J381466J682087K016147K056662
3564D0750069K453855K798038L191002L533922L973619M546061N089285N763636
3556G2099487O128815O235156O260612N944620N750668N360543N268573N082507
3548A18130981M550374M117234L585221K806528J976454J213781R20580J80236
3540A37481389k06653q88397j204108j685354j908347k168589k520934k741151
3532A24157856k999252l412446l386798l119765k980723k769290k418769k046900
3524A01023913j223461o17690J67220R53689J808676L041901M930695O430859
$$ plain form
3516 116515802 124591346 134370286 146663111 159106007 168367924 172455364 176169853 182952538
3508 182952538 191919102 198914208 200474477 194802535 184588817 177687977 175265269 175926862
3500 175926862 178115271 181657514 185683179 189947371 194126255 198077353 201759793 205142144
3492 205142144 208684584 212904217 218452714 225662474 234815064 245346487 258137385 271992556
3484 271992556 283557902 289484503 291279012 293949859 297022962 298178304 292753561 278911449
3476 278911449 256635976 234178485 215692446 200353897 187440480 176631922 167437444
3469 167437444 159538028 153007412 147426375 142435117 138144250 134287170 130772140 127400336
3461 127400336 124251118 120821987 117359419 113850191 110193572 106523812 102874327 99129000
$$ packed form
3516A16515802Q075544R778940J2292825J2442896R261917M087440L714489O782685
3508A82952538Q966564O995106J560269n671942j0213718o900840k422708O61593
3500A75926862K188409L542243M025665M264192M178884L951098L682440L382351
3492B05142144L542440M219633N548497P209760R152590J0531423J2790898J3855171
3484B71992556J1565346N926601J794509K670847L073103J155342n424743j3842112
3476B78911449k2275473k2457491j8486039j5338549j2913417j0808558r194478
3469A67437444p899416o530616n581037m991258m290867l857080l515030l371804
3461A27400336l149218l429131l462568l509228l656619l669760l649485l745327
$$ plain form
3453 99129000 95471153 91794179 88037974 84576735 81352896 78400095 75517518 72984312
3445 72984312 70862096 68917844 67272814 65829015 64483672 63498200 62619921 61821923 61202154
3436 61202154 60971340 60687716 61051146 61583701 62599738 63852407 65336986 67036499 68818871
3427 68818871 70606028 72407005 73250867 72618726 71540337 70601646 69821274 69080204 68050773
3418 68050773 67011711 65970504 64785954 63745711 62835998 61923003 61138213 60406126 59937953
3409 59937953 59254472 58780350 58446066 57791687 57004080 56247334 55549490 54893162 54224022
3400 54224022 53728296 53208444 52786745 51350203 48906851 46571563 44965576 43777545 42908877
3391 42908877 42215488 41608538 41310056 41401464 41574984 41825675 42322208 43081382 44023222 45235689
$$ packed form
3453I9129000l657847l676974l756205l461239l223839k952801k882577k533206
3445G2984312k122216j944252j645030j443799j345343r85472q78279p97998o19769
3436F1202154k30814k83624L63430N32555J016037J252669J484579J699513J782372
3427F8818871J787157J800977Q43862o32141j078389r38691p80372p41070j029431
3418F8050773j039062j041207j184550j040243r09713r12995p84790p32087m68173
3409E9937953o83481m74122l34284o54379p87607p56746o97844o56328o69140
3400E4224022m95726n19852m21699j436542k443352k335288j605987j188031q68668
3391D2908877o93389o06950k98482R1408J73520K50691M96533P59174R41840J212467
$$ plain form
3381 45235689 46697507 48537437 50790773 53508430 57121975 61272986 66469927 72814221
3373 72814221 80310023 88544645 96460120 103768023 110744576 115264925 114778676 105679849
3365 105679849 92420441 81996089 74738502 69741098 66333466 64135402 62462493 61519437
3357 61519437 61221544 61080304 61409774 62120198 62950744 64209192 65799195 68069485 71071035
3348 71071035 74887106 79686513 85901276 93030616 100865658 108176484 114901347 121408538
3340 121408538 124860040 122750859 112705116 101138848 93490772 89040724 86852068 86232336
3332 86232336 86761097 87704625 89317078 91045756 92998051 95091196 97079248 98877953
3324 98877953 100343397 101167013 101456881 101432810 101168350 100436186 99600440 98402976 96636659
$$ packed form
3381D5235689J461818J839930K253336K717657L613545M151011N196941O344294
3373G2814221P495802Q234622P915475P307903O976553M520349m86249r098827
3365A05679849j3259408j0424352p257587m997404l407632k198064j672909r43056
3357F1519437k97893j41240L29470P10424Q30546J258448J590003K270290L001550
3348G1071035L816071M799407O214763P129340P835042P310826O724863O507191
3340A21408538L451502k109181j0045743j1566268p648076m450048k188656o19732
3332H6232336N28761R43528J612453J728678J952295K093145J988052J798705
3324I8877953J465444Q23616K89868k4071k64460p32164q35746j197464j766317
$$ plain form
3315 96636659 94669303 92265632 89430662 86362334 83449469 80560039 77753733 75030258
3307 75030258 72378743 69605013 66808640 63996902 61303657 58627077 56019416 53444175
3299 53444175 50608474 47818951 45176631 42565666 40045544 37552967 35279861 33268779
3291 33268779 31491685 29739250 28012424 26647577 25428450 24321064 23169004 22376708
3283 22376708 21613578 20930126 20308226 19813365 19263372 18694842 18433159 18078529 17628925
3274 17628925 17319501 17025283 16748507 16714087 16483621 16386721 16392074 16289642 16190482 16134904
3264 16134904 16117049 16208839 16129933 15966453 15928199 15547784 15361386 15192961 15037652 14726434
3254 14726434 14473004 14150441 13834926 13528236 13242075 12983304 12834648 12759655 12587251 12368211
$$ packed form
3315I6636659j967356k403671k834970l068328k912865k889430k806306k723475
3307G5030258k651515k773730k796373k811738k693245k676580k607661k575241
3299E3444175k835701k789523k642320k610965k520122k492577k273106k011082
3291C3268779j777094j752435j726826j364847j219127j107386j152060p92296
3283B2376708p63130o83452o21900m94861n49993n68530k61683l54630m49604
3274A7628925l09424k94218k76776l4420k30466r6900N353j02432r9160n5578
3264A6134904j7855R1790p8906j63480l8254l80415j86398j68425j55309l11218
3254A4726434k53430l22563l15515l06690k86161k58771j48656p4993j72404k19040
$$ plain form
3244 12368211 12126418 11842637 11592980 11397493 11148496 10955549 10601450 10356524 10177187
3235 10177187 10072071 9818116 9695125 9627722 9545943 9453982 9371301 9314503 9186209 9213629
3225 9213629 9293565 9323919 9165005 9208164 9116786 9097331 9194733 9281550 9302411 9182729 9113351
3214 9113351 9053373 8976715 8945441 8973819 8885374 8893700 8878698 8910268 8846206 8740514 8741656 8922319
3202 8922319 8937090 8927205 8962443 8944372 8966972 9026044 9043431 9104702 8971170 8947815 9033095
3191 9033095 9029193 9043244 9081946 9072767 9152057 9157974 9084192 9026115 8932359 8973965 9025132 8969737
3179 8969737 8973578 9027215 9102944 8997676 9037491 9045687 8988765 9112349 9308571 9332756 9210130
3168 9210130 9312538 9377422 9444109 9588718 9547023 9487169 9530530 9696869 9872231 9878216 9971370
$$ packed form
3244A2368211k41793k83781k49657j95487k48997j92947l54099k44926j79337
3235A0177187j05116k53955j22991o7403q1779r1961q2681n6798j28294K7420
3225I213629P9936L0354j58914M3159r1378j9455R7402Q6817K0861j19682o9378
3214I113351n9978p6658l1274K8378q8445Q326j5002L1570o4062j05692J142J80663
3202H922319J4771r885L5238j8071K2600N9072J7387O1271j33532k3355Q5280
3191I033095l902J4051L8702r179P9290N917p3782n8077r3756M1606N1167n5395
3179H969737L841N3637P5729j05268L9815Q196n6922J23584J96222K4185j22626
3168I210130J02408O4884O6687J44609m1695n9854M3361J66339J75362N985R3154
$$ plain form
3157 9971370 10190702 10369857 10545356 10570824 10755777 10929940 11123059 11380378 11764872 12107568
3147 12107568 12406444 12735323 12977460 13333404 13488561 13726734 14052791 14345051 14567806
3138 14567806 14833479 15060480 15241829 15561611 15863256 15991291 16374183 16790210 17353196
3129 17353196 17805332 18186900 18752836 19449589 20165738 20902232 21605666 22330040 23389613
3120 23389613 24406664 25444140 26548859 27835302 29169891 30318419 31530862 32738396
3112 32738396 33991925 35259990 36694239 38404941 40165890 42007021 44234734 46624810
3104 46624810 49240344 52302216 56046862 60109318 64554245 69749152 75657276 82228232
3096 82228232 89808428 98409288 108132427 119374333 132198029 146889225 163711157 182953345
$$ packed form
3157I971370K19332J79155J75499K5468J84953J74163J93119K57319L84494L42696
3147A2107568K98876L28879K42137L55944J55157K38173L26057K92260K22755
3138A4567806K65673K27001J81349L19782L01645J28035L82892M16027N62986
3129A7353196M52136L81568N65936O96753P16149P36494P03434P24374J059573
3120B3389613J017051J037476J104719J286443J334589J148528J212443J207534
3112C2738396J253529J268065J434249J710702J760949J841131K227713K390076
3104D6624810K615534L061872L744646M062456M444927N194907N908124O570956
3096H2228232P580196Q600860R723139J1241906J2823696J4691196J6821932J9242188
$$ plain form
3088 182953345 205630497 232963576 266015636 304606705 347954381 394496311 438327921
3081 438327921 465962817 464077571 434469686 396334200 366477213 349475613 341185035
3074 341185035 332240195 313551663 283457721 249432992 218642947 192990251 172130345
3067 172130345 155029253 141099770 129803654 120002960 111165207 103224997 95820872 89056821
3059 89056821 83112971 77652722 72885981 68301558 64095090 60440615 57081604 53910613
3051 53910613 50994735 48449800 46348734 44154830 42040593 40298419 38662879 37200070
3043 37200070 35863070 34367251 33113873 31964409 30766251 29554951 28503869 27615420
3035 27615420 26659018 25725523 24939143 24092040 23304317 22531118 21764696 20957456 20138363
$$ packed form
3088A82953345K2677152K7333079L3052060L8591069M3347676M6541930M3831610
3081D38327921K7634896j885246k9607885l8135486k9856987j7001600q290578
3074C41185035q944840j8688532l0093942l4024729l0790045k5652696k0859906
3067A72130345j7101092j3929483j1296116r800694q837753p940210p404125o764051
3059H9056821n943850n460249m766741m584423m206468l654475l359011l170991
3051E3910613k915878k544935k101066k193904k114237j742174j635540j462809
3043C7200070j337000j495819j253378j149464j198158j211300j051082q88449
3035B7615420r56402r33495p86380q47103p87723p73199p66422q07240q19093
$$ plain form
3026 20138363 19512992 18888856 18408574 18050497 17489939 16939526 16541716 16026945 15521004
3017 15521004 15092221 14710139 14307304 13900794 13670365 13313543 13133772 13021506 12777670
3008 12777670 12464631 12099827 11934311 11763972 11581454 11240590 10909596 10768697 10559345
2999 10559345 10368840 10226652 10047200 9766876 9635142 9436634 9254104 9177223 9153000 8938654
2989 8938654 8784869 8523833 8344635 8097988 8063173 7938430 7650075 7423803 7277660 7111223
2979 7111223 7020330 6888540 6841638 6944370 6782510 6694809 6547242 6461821 6468358 6387598 6117719
2968 6117719 6005805 5872659 5852608 5846302 5876861 5761961 5422410 5402624 5489315 5294344 5392724
2957 5392724 5329855 5170547 5137567 4966484 4983354 4946349 4713974 4695706 4671535 4504682 4440296
$$ packed form
3026B0138363o25371o24136m80282l58077n60558n50413l97810n14771n05941
3017A5521004m28783l82082m02835m06510k30429l56822j79771j12266k43836
3008A2777670l13039l64804j65516j70339j82518l40864l30994j40899k09352
2999A0559345j90505j42188j79452k80324j31734j98508j82530p6881k4223k14346
2989H938654j53785k61036j79198k46647l4815j24743k88355k26272j46143j66437
2979G111223r0893j31790m6902J02732j61860q7701j47567q5421O537q0760k69879
2968F117719j11914j33146k0051o306L0559j14900l39551j9786Q6691j94971R8380
2957E392724o2869j59308l2980j71083J6870l7005k32375j8268k4171j66853o4386
$$ plain form
2946 4440296 4530431 4374568 4299487 4125490 3952038 3948641 3812027 3724355 3763708 3636668 3604804
2935 3604804 3670866 3681390 3702305 3696780 3576010 3393545 3368180 3346509 3314465 3134158 3169332
2924 3169332 3094013 2924373 3000046 3025647 2965164 2925185 2794654 2720723 2693913 2586687 2535991
2913 2535991 2457356 2527309 2535264 2557572 2509186 2368667 2369332 2372630 2291569 2350788 2369731 2348515
2901 2348515 2349576 2308657 2236128 2350857 2333754 2241570 2166463 2111291 2083662 2115463 2019764
2890 2019764 2063090 2061171 1971901 1997707 1898298 1829399 1901750 2017044 1831909 1812596 1959271
2879 1959271 1980891 1971928 1933800 1928203 1958733 1887156 1938755 1936031 1845924 1929137 2087333 2031906
2867 2031906 1869450 1725099 1714340 1888985 1990328 2011294 1918247 1837746 1767931 1834277 1833670
$$ packed form
2946D440296R0135j55863p5081j73997j73452l397j36614q7672L9353j27040l1864
2935C604804O6062J0524K0915n525j20770j82465k5365k1671l2044j80307L5174
2924C169332p5319j69640P5673K5601o0483l9979j30531p3931k6810j07226n0696
2913B535991p8635O9953P955K2308m8386j40519O65L298q1061N9219J8943k1216
2901B348515J061m0919p2529J14729j7103r2184p5107n5172k7629L1801r5699
2890B019764M3326j919q9270K5806r9409o8899P2351J15294j85135j9313J46675
2879A959271K1620q963l8128n597L0530p1577N1599k724r0107Q3213J58196n5427
2867B031906j62456j44351j0759J74645J01343K0966r3047q0501o9815O6346o07
$$ plain form
2856 1833670 1840349 1953298 1880640 1852889 1807819 1775295 1843708 1688392 1676038 1692737 1711711
2845 1711711 1616423 1624840 1614583 1539004 1631562 1661837 1655662 1645915 1660489 1574046 1621469 1533325
2833 1533325 1607055 1715188 1644153 1490086 1489462 1486582 1598563 1649094 1622391 1625515 1616519 1494482
2821 1494482 1545187 1523072 1576045 1601033 1654507 1550686 1608655 1789673 1827894 1752872 1790566
2810 1790566 1768947 1832023 2071249 2000847 2146814 2315612 2503353 2662922 2763116 2850033
2800 2850033 2932010 3239150 3416981 3483653 3433584 3228375 3054297 2983439 2938025 2758032
2790 2758032 2656747 2444498 2404913 2254661 2015842 1861819 1839225 1768042 1709693 1647828
2780 1647828 1580376 1581521 1474963 1437700 1434049 1390880 1297177 1247960 1243780 1279294 1341012 1276617
$$ packed form
2856A833670O679J12949p2658k7751m5070l2524O8413j55316j2354J6699J8974
2845A711711r5288Q417j0257p5579R2558L0275o175r747J4574q6443M7423q8144
2833A533325P3730J08133p1035j54067o24k880J11981N0531k6703L124q996j22037
2821A494482N0705k2115N2973K4988N3474j03821N7969J81018L8221p5022L7694
2810A790566k1619O3076K39226p0402J45967J68798J87741J59569J00194Q6917
2800B850033Q1977L07140J77831O6672n0069k05209j74078p0858m5414j79993
2790B758032j01285k12249l9585j50252k38819j54023k2594p1183n8349o1865
2780A647828o7452J145j06558l7263l651m3169r3703m9217m180L5514O1718o4395
$$ plain form
2768 1276617 1130088 1071780 1008832 1011337 1158847 1111856 1152145 1157930 954947 1083960 990095
2757 990095 900989 876163 935544 953859 933601 1056138 1000057 968177 818069 829944 774804
2746 774804 711125 702866 746595 781080 781390 819176 655835 552519 678588 683561 593724 631259
2734 631259 674352 797885 782068 753394 846140 761585 675803 637192 593494 611905 631714
2723 631714 518099 601260 822214 817141 586890 576215 593052 713249 713279 445600 604962
2712 604962 540625 442436 493452 624978 697538 587417 570628 529430 447672 545744 532136
2701 532136 498375 588050 623877 622238 648164 703674 573717 463108 520317 625446 609865
2690 609865 536395 542965 504418 442682 375573 430312 463662 461963 470643 459973 549770 400429
$$ packed form
2768A276617j46529n8308o2948K505J47510m6991M0289N785k02983J29013r3865
2757I90095q9106k4826N9381J8315k0258J22537n6081l1880j50108J1875n5140
2746G74804o3679q259M3729L4485L10L7786j63341j03316J26069M973q9837L7535
2734F31259M3093J23533j5817k8674R2746q4555q5782l8611m3698J8411J9809
2723F31714j13615Q3161K20954n073k30251j0675J6837J20197L0k67679J59362
2712F04962o4337r8189N1016J31526P2560j10121j6789m1198q1758R8072j3608
2701E32136l3761Q9675L5827j639K5926N5510j29957j10609N7209J05129j5581
2690F09865p3470O570l8547o1736o7109N4739L3350j699Q680j0670Q9797j49341
$$ plain form
2678 400429 434184 527603 514455 449476 463138 446284 587789 504401 513813 385194 498425
2667 498425 579398 471969 451486 438347 422248 406907 501863 430357 295817 268732 246505
2656 246505 265691 437905 399340 352870 311599 314067 353941 416761 296606 308483 338048
2645 338048 363036 290045 260111 456163 411303 253376 237933 375865 389965 400269 373055
2634 373055 326478 243569 243182 153445 197003 284329 239954 266224 235335 237916 261753 234071
2622 234071 223430 212111 252284 282612 270991 460413 282371 207459 147043 166842 354443
2611 354443 360372 386858 322885 125233 228639 260200 237279 250585 265441 175730 337749
2600 337749 328600 192794 314958 408479 270722 215175 324117 347361 444773 377128 246406
$$ packed form
2678D00429L3755R3419j3148o4979J3662j6854J41505q3388R412j28619J13231
2667D98425Q0973j07429k0483j3139j6099j5341R4956p1506j34540k7085k2227
2656B46505J9186J72214l8565m6470m1271K468L9874O2820j20155J1877K9565
2645C38048K4988p2991k9934J96052m4860j57927j5443J37932J4100J0304k7214
2634C73055m6577q2909l87q9737M3558Q7326m4375K6270l0889K581K3837k7682
2622B34071j0641j1319M0173L0328j1621J89422j78042p4912o0416J9799J87601
2611C54443N929K6486o3973j97652J03406L1561k2921J3306J4856q9711J62019
2600C37749r149j35806J22164R3521j37757n5547J08942K3244R7412o7645j30722
$$ plain form
2589 246406 205344 276870 323547 232509 236294 458298 550098 558300 531901 530623 583401 512673
2577 512673 388553 333548 397506 208778 301168 300983 389550 338624 242201 316580 397564 419584
2565 419584 203290 297620 307377 208392 185591 212352 242375 253169 123770 59755 253331
2554 253331 282048 196918 149403 236139 197219 276476 362298 179908 260872 303248 344259
2543 344259 164432 177347 168431 95928 188326 151572 75636 90286 215093 239577 300252
2532 300252 296324 252943 212904 166448 188639 173516 212597 177932 165015 153697 225860 269456
2520 269456 189775 139631 75103 111973 134214 128088 183257 280618 246355 268003 215530 150850
2508 150850 84672 169414 136201 -2269 -42465 -52490 118219 144483 172676 170124 115049
$$ packed form
2589B46406m1062P1526M6677r1038L785K22004R1800Q202k6399j278N2778p0728
2577E12673j24120n5005O3958j88728R2390j85Q8567n0926r6423P4379Q0984K2020
2565D19584k16294R4330R757r8985k2801K6761L0023J0794j29399o4015J93576
2554B53331K8717q5130m7515Q6736l8920P9257Q5822j82390Q0964M2376M1011
2543C44259j79827J2915q916p2503R2398l6754p5936J4650J24807K4484O0675
2532C00252l928m3381m0039m6456K2191j5123L9081l4665j2917j1318P2163M3596
2520B69456p9681n0144o4528L6870K2241o126N5169R7361l4263K1648n2473o4680
2508A50850o6178Q4742l3213j38470m0196j0025J70709K6264K8193k552n5075
$$ plain form
2497 115049 183534 209298 261745 181835 181409 159139 9100 99290 151514 145683 153890 253220
2485 253220 329118 335360 192327 287640 352065 191548 214983 101598 264 241172 146279
2474 146279 116828 119453 209193 204007 265469 218316 251412 357268 300901 149504 145918 136296
2462 136296 150373 63893 -15029 16174 106612 126531 216662 128858 129414 263064 195443 213303
2450 213303 131673 70074 28306 32018 102215 193263 143227 229232 322013 161122 194454 90061
2438 90061 142332 215242 326478 311535 239372 94300 69976 235254 195815 182268 132837
2427 132837 194494 229859 221022 151624 273933 314549 448797 385939 422679 411819 446765
2416 446765 322621 279683 346855 380269 242271 227822 333363 336506 270414 193647 76882
$$ packed form
2497A15049O8485K5764N2447p9910m26k2270j50039R0190N2224n831Q207R9330
2485B53220P5898O242j43033R5313O4425j60517K3435j13385j01334K40908r4893
2474A46279k9451K625Q9740n186O1462m7153L3096J05856n6367j51397l586r622
2462A36296J4077q6480p8922L1203R0438J9919R0131q7804N56J33650o7621J7860
2450B13303q1630o1599m1768L712P0197R1048n0036Q6005R2781j60891L3332j04393
2438I0061N2271P2910J11236j4943p2163j45072k4324J65278l9439j3547m9431
2427A32837O1657L5365q837o9398J22309M0616J34248o2858L6740j0860L4946
2416D46765j24144m2938O7172L3414j37998j4449J05541L143o6092p6767j16765
$$ plain form
2405 76882 205232 210861 298850 227055 277138 427491 334086 237802 358627 454126 493848
2394 493848 512081 460302 453444 342290 360104 339781 422214 508990 559008 502700 514428 598606
2382 598606 635137 628079 712001 685244 662294 634118 588195 593856 612337 630475 617646 598835
2370 598835 439163 672369 777800 820535 782082 819726 849977 1049521 1112134 950039 971108
2359 971108 1090977 1251968 1237978 1329091 1395078 1537780 1714393 1925765 1954896 2064730
2349 2064730 2148874 2343761 2344802 2451796 2599938 2822116 3205175 3310876 3607704 3791116
2339 3791116 4092601 4492906 4965401 5342528 5930891 6581006 7371002 8025380 9139894
2330 9139894 10173262 11112650 11770148 12559146 13690515 15365422 17177087 19520716 22207081
$$ packed form
2405G6882J28350N629Q7989p1795N0083J50353r3405r6284J20825R5499L9722
2394D93848J8233n1779o858j11154J7814k0323Q2433Q6776N0018n6308J1728Q4178
2382E98606L6531p058Q3922k6757k2950k8176m5923N661J8481J8138j2829j8811
2370E98835j59672K33206J05431M2735l8453L7644L0251J99544O2613j62095K1069
2359I71108J19869J60991j3990R1113O5987J42702J76613K11372K9131J09834
2349B064730Q4144J94887J041J06994J48142K22178L83059J05701K96828J83412
2339C791116L01485M00305M72495L77127N88363O50115P89996O54378J114514
2330I139894J033368R39388O57498P88998J131369J674907J811665K343629K686365
$$ plain form
2321 22207081 25821051 30711131 36886947 43381431 51783969 62860801 71420046 70763244
2313 70763244 56809319 43623373 35336220 29757650 25614987 22387531 19930338 17835160
2305 17835160 16501402 15365637 14282213 13391657 12629184 11917796 11280743 10160342 9166913
2296 9166913 8410425 7902716 7301812 6712682 6316787 5873546 5546892 5270852 4949521 4742792
2286 4742792 4483946 4228645 3979876 3906209 3678865 3443785 3361815 3332606 3208465 3088878
2276 3088878 2990955 2883216 2732148 2489000 2301538 2329066 2164862 2070168 2032418 2103521
2266 2103521 2036844 2006864 2005745 1914593 1663410 1732548 1633662 1536832 1559149 1528363 1401670
2255 1401670 1431747 1424050 1488837 1413638 1262701 1215232 1218055 1167661 1071590 1110764 1171863 1076177
$$ packed form
2321B2207081L613970M890080O175816O494484Q402538J1076832Q559245o56802
2313G0763244j3953925j3185946q287153n578570m142663l227456k457193k095178
2305A7835160j333758j135765j083424q90556p62473p11388o37053j120401r93429
2296I166913p56488n07709o00904n89130l95895m43241l26654k76040l21331k06729
2286D742792k58846k55301k48769p3667k27344k35080q1970k9209j24141j19587
2276C088878r7923j07739j51068k43148j87462K7528j64204r4694l7750P1103
2266B103521o6677k9980j119r1152k51183O9138r8886r6830K2317l0786j26693
2255A401670L0077p697O4787p5199j50937m7469K823n0394r6071L9174O1099r5686
$$ plain form
2243 1076177 878926 1004347 965828 1014482 936951 1059647 954080 796367 862577 779607
2233 779607 773138 897118 886868 694635 690249 799413 816179 804465 841335 860164 879968
2222 879968 659481 665726 724941 638266 671343 685518 685256 725457 854496 682088 530558
2211 530558 551922 504684 485731 382455 550199 597645 477364 591081 507585 512232 503959
2200 503959 459461 474105 466113 479490 488821 563240 582119 545147 448355 515706 467264 535717
2188 535717 498434 449448 437394 530129 332645 385038 481724 369839 421685 349351 366509
2177 366509 400460 444391 368677 242741 328012 258763 194497 478418 519812 557683 436947
2166 436947 309473 258998 308464 378286 269887 158488 183275 221570 251594 120213 124446
$$ packed form
2243A076177j97251J25421l8519M8654p7531J22696j05567j57713O6210q2970
2233G79607o469J23980j0250j92233m386J09164J6766j1714L6870J8829J9804
2222H79968k20487O245N9215q6675L3077J4175k62M0201J29039j72408j51530
2211E30558K1364m7238j8953j03276J67744M7446j20281J13717q3496M647q273
2200E03959m4498J4644p992J3377R331P4419J8879l6972r6792O7351m8442O8453
2188E35717l7283m8986j2054R2735j97484N2393R6686j11885N1846p2334J7158
2177C66509L3951M3931p5714j25936Q5271o9249o4266K83921M1394L7871j20736
2166D36947j27474n0475M9466O9822j08399j11399K4787L8295L0024j31381M233
$$ plain form
2155 124446 244438 268730 302425 215721 55856 150244 82514 193758 286700 311758 208133
2144 208133 95764 228590 324515 302873 254189 234155 114205 68041 125990 179789 159616
2133 159616 208119 186873 170243 159648 220991 243286 59939 45124 159381 133035 208571
2122 208571 294023 147870 133368 218142 236198 219232 143087 218888 411548 309852 271694
2111 271694 304418 206771 387099 364364 217586 162079 160046 12152 61400 64786 127035
2100 127035 298601 287786 248093 259750 43574 -2907 88985 74075 148996 219229 277562
2089 277562 141062 132521 216456 115184 196722 240039 162846 126727 191506 273640 269079 218222
2077 218222 60813 40389 -55564 -64910 73004 279923 274446 13221 104346 113641 185512
$$ packed form
2155A24446J19992K4292L3695q6704j59865R4388o7730J11244R2942K5058j03625
2144B08133j12369J32826R5925k1642m8684k0034j19950m6164N7949N3799k0173
2133A59616M8503k1246j6630j0595O1343K2295j83347j4815J14257k6346P5536
2122B08571Q5452j46153j4502Q4774J8056j6966p6145P5801J92660j01696l8158
2111B71694L2724r7647J80328k2735j46778n5507k033j47894M9248L386O2249
2100A27035J71566j0815l9693J1657k16176m6481R1892j4910P4921P0233N8333
2089B77562j36500q541Q3935j01272Q1538M3317p7193l6119O4779Q2134m561n0857
2077B18222j57409k0424r5953r346J37914K06919n477k61225R1125R295P1871
$$ plain form
2066 185512 200040 233937 299404 213910 195065 184581 161504 92382 204217 203243 208736 211327
2054 211327 321043 205144 290348 273148 277555 391130 407952 416527 349536 452521 335749
2043 335749 244696 308297 309436 182939 189316 266070 335165 289968 168889 145229 18071
2032 18071 234538 398017 313865 254904 111965 59671 18559 -10679 -45081 75817 140778
2021 140778 140979 147387 110284 108865 87809 109943 30565 120161 107092 15485 35188 -66568
2009 -66568 -85722 41598 197139 232937 28820 121642 178370 139806 176084 155533 101999
1998 101999 62405 58344 -66569 -14916 -43617 -3177 141519 107997 59867 429 -77171
1987 -77171 3327 3264 -14227 38105 29095 -9310 42127 68076 204676 72296 -101662 -29971
$$ packed form
2066A85512J4528L3897O5467q5494j8845j0484k3077o9122J11835r74N493K591
2054B11327J09716j15899Q5204j7200M407J13575J6822Q575o6991J02985j16772
2043C35749r1053O3601J139j26497O377P6754O9095m5197j21079k3660j27158
2032A8071K16467J63479q4152n8961j42939n2294m1112k9238l4402J20898O4961
2021A40778K01O408l7103j419k1056K2134p9378Q9596j3069r1607J9703j01756
2009f6568j9154J27320J55541L5798k04117R2822N6728l8564L6278k0551n3534
1998A01999l9594m061j24913N1653k8701M0440J44696l3522m8130n9438p7600
1987g7171Q0498o3j7491N2332r010l8405N1437K5949J36600j32380j73958P1691
$$ plain form
1975 -29971 30361 -36853 -163783 -55872 -58780 -14029 130799 176298 185750 97044 28111 -43611
1963 -43611 -66306 28068 41988 178831 197156 139139 118247 112780 36040 -80865 -25664 3921
1951 3921 -28593 -90381 -38030 79774 111169 122293 2712 47891 -24479 -2204 71270 -77826
1939 -77826 -23970 131420 192719 169725 83605 78280 55949 61118 44700 47653 64372 120454
1927 120454 78561 -15147 101217 125778 56985 53782 102939 102383 227927 124216 62937 -28013
1915 -28013 -56041 -127697 4812 -39721 7474 130004 -15886 -7202 12073 -26655 -26650 30965
1903 30965 81865 130570 11193 -101724 -116359 41290 247669 141588 52471 -80296 -85844
1892 -85844 -64294 -117711 -128366 -43264 72500 101870 220447 198626 117105 106648 82367
$$ packed form
1975b9971O0332o7214j26930J07911k908M4751J44828M5499R452q8706o8933p1722
1963d3611k2695R4374J3920J36843J8325n8017k0892n467p6740j16905N5201K9585
1951C921l2514o1788N2351J17804L1395J1124j19581M5179p2370K2275P3474j49096
1939g7826N3856J55390O1299k2994q6120n325k2331N169j6418K953J6719N6082
1927A20454m1893r3708J16364K4561o8793l203M9157n56J25544j03711o1279r0950
1915b8013k8028p1656J32509m4533M7195J22530j45890Q684J9275l8728NN7615
1903C0965N0900M8705j19377j12917j4635J57649K06379j06081q9117j32767n548
1892h5844K1550n3417j0655Q5102J15764K9370J18577k1821q1521j0457k4281
$$ plain form
1881 82367 148032 89194 -5994 58265 26878 -53548 -139091 -172387 -112978 106471 188810 171130
1869 171130 -25823 -36325 101665 57631 -40982 -101081 -147450 21142 -17812 -13860 42066
1858 42066 -101163 -56783 -46170 56531 42420 -75205 -138976 -175053 -47940 96384 122267
1847 122267 90403 -14853 -63232 -33090 4059 32628 53838 26793 -61203 -68601 -176045
1836 -176045 -142137 -51616 -63441 104899 24730 20135 -8118 29522 103018 143823 145264 -38910
1824 -38910 -116117 -94696 -65514 -6480 -47907 -116822 -64739 11587 155172 26508 -125414
1813 -125414 -135255 -124793 -21432 9658 67571 150694 109604 52315 76596 127099 198909 145678
1801 145678 49508 48459 185490 187058 217018 35590 -97131 45059 12863 37250 -14352
$$ packed form
1881H2367O5665n8838r5188O4259l1387q0426q5543l3296N9409K19449Q2339j7680
1869A71130j96953j0502J37990m4034r8613o0099m6369J68592l8954L952N5926
1858D2066j43229M4380J0613J02701j4111j17625o3771l6077J27113J44324K5883
1847A22267l1864j05256m8379L0142L7149K8569K1210k7045q7996p398j07444
1836a76045L3908R0521j1825J68340q0169m595k8253L7640P3496M0805J441j84174
1824c8910p7207K1421K9182N9034m1427o8915N2083P6326J43585j28664j51922
1813a25414r841J0462J03361L1090N7913Q3123m1090n7289K4281N0503P1810n3231
1801A45678r6170j049J37031J568K9960j81428j32721J42190l2196K4387n1602
$$ plain form
1790 -14352 66440 -4008 -37190 -56962 8911 137196 97481 -8197 109334 5037 -6144
1779 -6144 73785 -3675 82290 64903 -13045 -65677 -87311 -71333 -38305 -3189 116674 130939
1767 130939 -29751 135364 55715 -3246 28100 107852 40826 -61376 -134067 -27706 -11816
1756 -11816 -174593 -123040 -9118 -708 -70758 -9270 -101353 -88719 -103797 -153062 95731
1745 95731 224672 86503 69389 26585 -91875 -57215 31908 27144 -19201 23346 -6939
1734 -6939 -6604 -31313 26595 144743 81472 60150 8172 -65078 5555 46860 -27901 45760
1722 45760 149648 137535 -3140 -67896 -82715 -32841 30880 33266 -36848 57924 20212 -27358
1710 -27358 -1327 -78586 -58997 15727 3008 11022 -5010 123600 120580 5510 49028 -44247
$$ packed form
1790a4352Q0792p0448l3182j9772O5873J28285l9715j05678J17531j04297j1181
1779f144P9929p7460Q5965j7387p7948n2632k1634J5978L3028L5116J19863J4265
1767A30939j60690J65115p9649n8961L1346P9752o7026j02202p2691J06361J5890
1756a1816j62777N1553J13922Q410p0050O1488r2083J2634j5078m9265K48793
1745I5731J28941j38169j7114m2804j18460L4660Q9123m764m6345M2547l0285
1734f939L35k4709N7908J18148o3271k1322n1978p3250P0633M1305p4761P3661
1722D5760J03888j2113j40675o4756j4819M9874O3721K386p0114R4772l7712m7570
1710b7358K6031p7259J9589P4724j2719Q014j6032J28610l020j15070M3518r3275
$$ plain form
1698 -44247 42677 177396 117273 168878 42418 35856 -3923 61149 -47172 -58114 18257
1687 18257 36668 39705 124308 224102 118900 -44018 65413 149622 169329 48244 46760
1676 46760 -61703 -79133 -65403 84237 67856 -22762 -117163 -118130 -42763 45596 57198 -17738
1664 -17738 82482 8300 28413 15504 66664 -49328 42327 46962 -5252 -17871 52952 82198
1652 82198 112396 58358 3950 -67893 -28588 -148055 -201154 -179856 -173368 -86496 -125160 -89723
1640 -89723 -31627 113490 124616 152940 198213 160278 -85474 -68238 52562 -18876 -16181
1629 -16181 -46250 -67686 -80040 65066 59405 56716 84245 42934 -3785 61489 83569 31202
1617 31202 84846 137939 115947 114562 38486 11780 -12105 -57006 -8458 -76571 -93356 56580
$$ packed form
1698d4247Q6924J34719o0123N1605j26460o562l9779O5072j08321j0942P6371
1687A8257J8411L037Q4603R9794j05202j62918J09431Q4209J9707j21085j484
1676D6760j08463j7430J3730J49640j6381r0618r4401r67P5367Q8359J1602p4936
1664a7738J00220p4182K0113j2909N1160j15992R1655M635n2214j2619P0823K9246
1652H2198L0198n4038n4408p1843L9305j19467n3099K1298O488Q6872l8664L5437
1640h9723N8096J45117J1126K8324M5273l7935k45752J7236J20800p1438K695
1629a6181l0069k1436j2354J45106n661k689K7529m1311m6719O5274K2080n2367
1617C1202N3644N3093k1992j385p6076k6706k3885m4901M8548o8113j6785J49936
$$ plain form
1605 56580 27114 -114434 -273051 -127330 -61615 12872 54980 40501 52776 99406 -43128
1594 -43128 -54927 7180 56716 39477 14660 -23874 -59830 -67515 -131231 -169052 -23374 -21364
1582 -21364 -72121 -97951 102522 151125 34372 -29601 -59194 -124781 -70951 -13606 -116250
1571 -116250 -16881 -123197 -182985 -194784 -21110 2836 -47346 -28980 -52068 -51399 -34220 -53066
1559 -53066 145205 142336 132689 51966 32809 31201 46582 24559 -28021 22103 -80552 -92891
1547 -92891 63437 5062 -38342 -84668 -110355 -42407 -149168 -49365 119261 -4752 -87055
1536 -87055 -47259 -39416 -27604 -105989 -193504 -173533 -69806 -120238 -96859 -96243 821 45081
1524 45081 42589 -59900 -137577 -162711 -181673 -67699 -123512 -52345 -54203 -26100 26593 -26678
$$ packed form
1605E6580k9466j41548j58617J45721O5715P4487M2108j4479J2275M6630j42534
1594d3128j1799O2107M9536j7239k4817l8534l5956p685o3716l7821J45678K010
1582b1364n0757k5830K00473M8603j16753o3973k9593o5587N3830N7345j02644
1571a16250R9369j06316n9788j1799J73674K3946n0182J8366k3088O69J7179j8846
1559e3066J98271k869r647q0723j9157j608J5381k2023n2580N0124j02655j2339
1547i2891J56328n8375m3404m6326k5687O7948j06761R9803J68626j24013q2303
1536h7055L9796P843J1812p8385q7515J9971J03727n0432K3379O16R7064M4260
1524D5081k492j02489p7677k5134j8962J13974n5813P1167j858K8103N2693n3271
$$ plain form
1512 -26678 40599 31449 20156 31219 -957 84872 54240 15454 -10886 55377 58156 92280
1500 92280 144221 122458 24021 10169 48669 12300 103590 32036 -63072 61723 -42181
1489 -42181 -7392 72720 85940 155540 81510 41326 56981 144730 47704 -71168 -53226 30491
1477 30491 94983 43223 92122 82231 -30409 -23274 1109 35743 118810 94761 105468 76058
1465 76058 120274 105582 90066 -50788 -162211 -142835 -36002 -4790 13827 119981 56867
1454 56867 86544 59563 40886 -51827 -140249 -134496 28878 -153796 -157568 -21873 107951
1443 107951 55124 41736 155722 27816 -38587 -181238 -351285 -296343 -224731 -179183 -64630
1432 -64630 -34753 45107 2297 59837 -64685 -145817 -93152 84504 2318 -59246 -50841 -40964
$$ packed form
1512b6678O7277r150j1293J1063l2176Q5829l0632l8786k6340O6263K779L4124
1500I2280N1941k1763r8437j3852L8500l6369R1290p1554r5108J24795j03904
1489d2181L4789Q0112J3220O9600p4030m0184J5655Q7749r7026j18872J7942Q3717
1477C0491O4492n1760M8899r891j12640P135K4383L4634Q3067k4049J0707k9410
1465G6058M4216j4692j5516j40854j11423J9376J06833L1212J8617J06154o3114
1454E6867K9677k6981j8677r2713q8422N753J63374j82674l772J35695J29824
1443A07951n2827j3388J13986j27906o6403j42651j70047N4942P1612M5548J14553
1432f4630K9877P9860m2810N7540j24522q1132N2665J77656q2186o1564Q405R877
$$ plain form
1420 -40964 -131575 -133623 -31047 115793 32454 89147 123664 66927 121289 -21502 -67704
1409 -67704 -76246 -65240 -42081 -40773 24865 119410 -469 15996 46935 63788 52540 2765
1397 2765 119210 95798 -17428 4933 -96062 35651 -29440 -143199 -130602 -78521 -32716
1386 -32716 -17721 27410 -85432 -116568 -66467 38799 113969 -136846 -119714 -518 -33176
1375 -33176 -20657 31139 71434 154472 177088 197899 97825 -50976 13940 -13681 -3925 13781
1363 13781 76 189590 137778 117248 21592 -38997 -141740 -74767 -2854 13335 52908
1352 52908 48872 11204 66368 -11696 101227 114007 30994 19159 -40930 -3832 12943 -59000
1340 -59000 -55130 64122 21100 120082 77964 -121489 -126081 -68651 -94320 17028 22681 108495
$$ packed form
1420d0964r0611k048J02576J46840q3339N6693L4517n6737N4362j42791m6202
1409f7704q542J1006K3159J308O5638R4545j19879J6465L0939J6853j1248m9775
1397B765J16445k3412j13226K2361j00995J31713o5091j13759J2597N2081M5805
1386c2716J4995M5131j12842l1136N0101J05266P5170k50815J7132J19196l2658
1375c3176J2519N1796M0295Q3038K2616K0811j00074j48801O4916k7621R756J7706
1363A3781j3705J89514n1812k0530r5656o0589j02743O6973P1913J6189L9573
1352E2908m036l7668N5164p8064J12923J2780q3013j1835o0089L7098J6775p1943
1340e9000L870J19252m3022R8982m2118j99453m592N7430k5669J11348N653Q5814
$$ plain form
1328 108495 176272 193104 101862 -31837 -52512 -49901 -9933 26668 79374 -7017 151515
1317 151515 136651 -47458 -94684 -141210 -20326 -71447 -50258 -7032 40698 -4563 -138497
1306 -138497 -39376 -7370 10637 107946 29652 -44 25186 106 65556 93989 98967 77025
1294 77025 88693 29328 28139 47858 -154573 -50559 5758 50359 47307 20363 -42457 -23489
1282 -23489 -68317 -141513 -210931 -193994 -171595 -159940 82942 86608 61002 194083 199186 180583
1270 180583 137971 228616 166698 47905 64744 58128 24614 54674 -61735 -115917 39718
1259 39718 148152 66488 173874 215461 212668 20824 -86111 13526 187028 231644 147625
1248 147625 30403 17809 106293 6289 -137855 -159903 -100580 223921 217043 123034 60079
$$ packed form
1328A08495O7777J6832r1242j33699k0675K611L9968L6601N2706q6391J58532
1317A51515j4864j84109m7226m6526J20884n1121K1189M3226M7730m5261j33934
1306a38497R9121L2006J8007R7309p8294k9696K5230k5080O5450K8433M978k1942
1294G7025J1668n9365j189J9719k02431J04014N6317M4601l052k6944o2820J8968
1282b3489m4828p3196o9418J6937K2399J1655K42882L666k5606J33081N103j8603
1270A80583m2612R0645o1918j18793J6839o616l3514L0060j16409n4182J55635
1259C9718J08434q1664J07386M1587k793j91844j06935R9637J73502M4616q4019
1248A47625j17222j2594Q8484j00004j44144k2048N9323L24501o878r4009o2955
$$ plain form
1237 60079 42044 148502 72502 91347 40726 -22203 -90446 115269 76656 -94898 -142764
1226 -142764 -150176 -155901 -13365 39040 26341 55202 104723 -95066 -22939 -52658 -64727 88982
1214 88982 25373 -108256 -104510 61503 153125 112855 126206 104246 19323 -10239 -91275 -87213
1202 -87213 -149861 -54020 53501 5590 613 -49164 -45570 -17154 -12339 62010 119056 123311
1190 123311 -102749 -67365 -125844 -123631 -1669 21993 67156 2379 70860 44565 -38260
1179 -38260 -138713 -107102 -54987 -41544 -40312 -59666 -18449 103490 46434 -37817 -52386 -188742
1167 -188742 -119698 -31442 5769 40585 -75473 104250 -30628 -26296 65814 -31902 -72855
1156 -72855 -77061 -18921 102386 35882 157368 68713 -14896 -24992 -138270 -123630 -122169 -31206
$$ packed form
1237F0079j8035J06458p6000J8845n0621o2929o8243K05715l8613j71554m7866
1226a42764p412n725J42536N2405j2699K8861M9521j99789P2127k9719j2069J53709
1214H8982o3609j33629L746J66013R1622m0270J3351k1960q4923k9562q1036M062
1202h7213o2648R5841J07521m7911m977m9777L594K8416M815P4349N7046M255
1190A23311k26060L5384n8479K213J21962K3662M5163o4777O8481k6295q2825
1179c8260j00453L1611N2115J3443J232j9354M1217J21939n7056q4251j4569j36356
1167a88742O9044Q8256L7211L4816j16058J79723j34878M332R2110r7716m0953
1156g2855m206N8140J21307o6504J21486q8655q3609j0096j13278J4640J461R0963
$$ plain form
1144 -31206 -26201 -58250 -60939 48835 -79367 -123002 -132913 -184800 -86932 -37741 34255 -8515
1132 -8515 56069 69916 20494 -48992 34323 71711 -25998 57667 62694 8866 90552 -6177
1120 -6177 -53551 -29772 -39285 -2475 -65953 -64862 -55988 70076 154729 36591 10813 35966
1108 35966 -66831 -15238 -56649 -101343 -202388 -112297 -41852 -21728 -8657 35636 -40343
1097 -40343 -92197 58720 146404 23010 116620 94595 83576 5265 -79157 -17789 36025
1086 36025 86158 634 -46000 -11389 33481 50377 69524 73231 178187 9215 53718 48514
1074 48514 -24976 34309 36151 -15631 -21342 129229 69357 80292 98426 64903 -59457 -24128
1062 -24128 1743 -48077 -32365 -821 108206 270634 304620 188620 39229 63426 88652
$$ packed form
1144c1206N005l2049k689J09774j28202m3635r911n1887R7868M9191P1996m2770
1132h515O4584J3847m9422o9486Q3315L7388r7709Q3665N027n3828Q1686r6729
1120f177m7374K3779r513L6810o3478J091Q874J26064Q4653j18138k5778K5153
1108C5966j02797N1593m1411m4694j01045R0091P0445K0124J3071M4293p5979
1097d0343n1854J50917Q7684j23394R3610k2025j1019p8311q4422O1368N3814
1086C6025N0133q5524m6634L4611M4870J6896J9147L707J04956j68972M4503n204
1074D8514p3490N9285J842n1782n711J50571n9872J0935J8134l3523j24360L5329
1062b4128K5871m9820J5712L1544J09027J62428L3986j16000j49391K4197K5226
$$ plain form
1051 88652 50791 25015 -44630 -104990 -124644 74332 26018 25996 173998 85612 39438 26256
1039 26256 -29412 23411 -101891 -3102 -110968 4547 125818 21470 -39531 -172287 -134262
1028 -134262 -123985 -80591 -148446 -169165 -149105 -53541 -90600 -39933 -74813 -33016 -144120
1017 -144120 -161784 -27422 21885 114369 105264 1143 -28593 10188 35659 88024 19428
1006 19428 30791 51548 20225 128454 -81127 -82526 -80390 -62292 44328 -31911 -140432
995 -140432 -182535 -116704 -83970 -124013 -129829 32429 -13806 -28136 -78053 -33512 25500 -71769
983 -71769 -99380 -52218 -2823 -10740 -78958 15223 -2157 138833 161914 207363 145906 3194
971 3194 -62591 -164785 -151723 -15051 14833 68975 -28789 -60379 31943 -17660 14152 99078
$$ packed form
1051H8652l7861k5776o9645o0360j9654J98976m8314k2J48002q8386m6174j3182
1039B6256n5668N2823j25302R8789j07866J15515J21271j04348o1001j32756L8025
1028a34262J0277M3394o7855k0719K0060R5564l7059N0667l4880M1797j11104
1017a44120j7664J34362M9307R2484r105j04121k9736L8781K5471N2365o8596
1006A9428J1363K0757l1323J08229k09581j399K136J8098J06620p6239j08521
995a40432m2103O5831L2734m0043n816J62258m6235j4330m9917M4541N9012r7269
983g1769k7611M7162M9395p917o8218R4181j7380J40990K3081M5449o1457j42712
971C194o5785j02194J3062J36672K9884N4142r7764l1590R2322m9603L1812Q4926
$$ plain form
959 99078 89472 46750 27441 -30010 42373 53202 25877 -100741 -29983 -76772 -21030 -3100
947 -3100 -86987 -131784 -222750 -188938 -177510 -111984 -123634 -52259 -28357 6046 9907 -35032
935 -35032 72833 68455 26737 20665 -1132 41652 101660 191334 204734 59299 56012 111538
923 111538 -25989 -36367 29896 70207 55472 -88851 -68493 -34400 -28690 -20313 2642 -2659
911 -2659 -62463 53105 134703 -4468 124440 151305 8101 76243 37335 -46353 -160836
900 -160836 -40488 -2993 -57657 -33482 77266 24339 3652 7122 38392 68613 -63266
889 -63266 -17577 42058 -89491 49343 167082 146731 13023 69204 42403 52695 103067
878 103067 84473 105409 55924 244100 234274 174351 245118 258411 180835 212440 68939 -2618
$$ packed form
959I9078r606m2722j9309n7451P2383J0829k7325j26618P0758m6789N5742J7930
947c100q3887m4797r0966L3812J1428O5526j1650P1375K3902L4403L861m4939
935c5032J07865m378m1718o072k1797M2784O0008Q9674J3400j45435l287N5526
923A11538j37527j0378O6263M0311j4735j44323K0358L4093N710Q377K2955n301
911b659n9804J15568Q1598j39171J28908K6865j43204O8142l8908q3688j14483
900a60836J20348L7495n4664K4175J10748n2927k0687L470L1270L0221j31879
889f3266M5689N9635j31549J38834J17739k0351j33708N6181k6801J0292N0372
878A03067j8594K0936m9485J88176r826n9923P0767J3293p7576L1605j43501p1557
$$ plain form
866 -2618 16342 35575 74797 106467 142296 272781 143182 69889 -73287 -185799 -189644 -153472
854 -153472 -23481 28800 92518 -58583 -12713 39041 -46777 -131952 -68224 9440 37504
843 37504 65221 52223 -72691 -27474 5058 108035 158391 106344 117792 10723 157992
832 157992 115868 67553 78716 177883 64205 -29906 19012 12332 -57864 -145417 -117022 -78324
820 -78324 -40266 113850 173044 224522 142173 72704 45858 41114 -74325 14013 66417 35464
808 35464 102695 -10785 39287 129831 -7314 -49226 58421 -67044 -167578 -49265 15589
797 15589 -53225 -146398 -182009 -153191 -153418 -66099 -64104 -76667 -100743 -40531 65095 -37248
785 -37248 -83556 -65579 -9521 -21819 -24222 -88328 21901 -8511 -98007 -42207 21619 -5300
$$ packed form
866b618J8960J9233L9222L1670L5829J30485j29599p3293j43176j12512l845L6172
854a53472J29991N2281O3718j51101M5870N1754q5818q5175O3728P7664K8064
843C7504K7717j2998j24914M5217L2532J02977N0356n2047J1448j07069J47269
832A57992m2124m8315J1163R9167j13678r4111M8918o680p0196q7553K8395L8698
820g8324L8058J54116N9194N1478q2349o9469k6846m744j15439Q8338N2404l0953
808C5464O7231j13480N0072R0544j37145m1912J07647j25465j00534J18313O4854
797A5589o8814r3173l5611K8818k27Q7319J995j2563k4076O0212J05626j02343
785c7248m6308J7977N6058j2298k403o4106J10229l0412q9496N5800O3826k6919
$$ plain form
773 -5300 93862 167198 -57442 -138246 -99517 57480 113792 76516 -74130 72128 -15353
762 -15353 -7206 -60555 -1240 51969 51211 -92103 -57060 -6963 -25749 -55164 -48570 45169 -145291
749 -145291 -121869 -72865 -100267 -101879 -52459 -82944 -106840 -130731 -158240 -70023 -11744 147377
737 147377 199126 52314 41951 93608 52322 46100 118185 134391 189748 120157 186409 150798
725 150798 91378 22001 215276 224656 82813 63818 98380 63446 -4698 -17367 14002 62110
713 62110 76325 -11535 -49607 138614 4824 -5764 -6649 -39726 -64678 -123595 -131199 -46354
701 -46354 95539 51536 -62081 -72666 -137545 -110326 71199 162252 88279 85795 -29551
690 -29551 14826 -93371 -226106 -52768 -37371 -157421 -219369 -180298 -249016 -177072 -215587
$$ packed form
773e300R9162P3336k24640q0804L8729J56997N6312l7276j50646J46258q7481
762a5353Q147n3349N9315N3209p58j43314L5043N0097j8786k9415O594R3739j90460
749a45291K3422M9004k7402j612M9420l0485k3896k3891k7509Q8217N8279J59121
737A47377N1749j46812j0363N1657m1286o222P2085J6206N5357o9591O6252l5611
725A50798n9420o9377J93275R380j41843j8995L4562l4934o8144j2669L1369M8108
713F2110J4215q7860l8072J88221j33790j0588q85l3077k4952n8917p604Q4845
701d6354J41893m4003j13617j0585o4879K7219J81525R1053p3973k484j15346
690b9551M4377j08197j32735J73338J5397j20050o1948L9071o8718P1944l8515
$$ plain form
679 -215587 -382501 -244313 -167165 -7910 -125466 -229436 -35745 -34718 -176974 -144137 3595
668 3595 58023 67520 -36931 37638 44120 -45288 70335 66344 85231 66605 89581 87641 3500
655 3500 13399 -16084 13654 -29315 -29914 -34467 -76061 -84022 -22902 -20319 -85966 -145154 -57403
642 -57403 4834 -71957 -62207 -640 -12541 -72350 -206230 -167816 -61444 -32379 -27303 -2034
630 -2034 1517 -16805 -28751 -32341 -3139 39318 8613 30810 -12976 60076 68791 -53375 -63655
617 -63655 -24958 -69962 -61372 -129953 67801 135417 60321 191122 101368 25059 -74129 -132652
605 -132652 180609 5907 -31800 62654 20739 124236 134398 -6418 -55050 252873 132009
594 132009 14510 90831 295630 267598 283722 51820 -90715 -77157 -81315 -120645 -7707
$$ packed form
679b15587j66914J38188P7148J59255j17556j03970J93691J027j42256L2837J47732
668C595N4428R497j04451P4569O482q9408J15623l991J8887j8626K2976j940q4141
655C500R899k9483K9738m2969n99m553m1594p961O1120K583o5647n9188Q7751
642e7403O2237p6791R750O1567j1901n9809j33880L8414J06372K9065N076K5269
630b034L551j8322j1946l590K9202M2457l0705K2197m3786P3052Q715j22166j0280
617f3655L8697m5004Q590o8581J97754O7616p5096J30801q9754p6309r9188n8523
605a32652L13261j74702l7707R4454m1915J03497J0162j40816m8632L07923j20864
594A32009j17499P6321K04799k8032J6124k31902j42535J3558m158l9330J12938
$$ plain form
583 -7707 23347 -140304 -86858 -197494 -197451 -13062 -12873 -75061 17338 51652 20334 -54180 -66184
570 -66184 -36596 18990 -33496 -39094 -20295 -31385 21941 76983 71768 -67488 -213025 -69627
558 -69627 -5569 -53970 -98522 -18088 71760 15947 -52067 -55028 -81168 -91669 -114377 -119260
546 -119260 -6357 -83859 -107128 -102161 -52667 -117642 -137651 -33468 -44641 -109921 -84608 31587
534 31587 52244 102806 51411 18265 68954 24338 83945 -117148 -161563 -121480 -96888 5261
522 5261 101064 24759 111770 75664 -23551 -127480 20403 21431 -30078 177277 73594 -94902
510 -94902 -154431 47760 3959 -86565 -134544 -237834 -266741 -184174 -117734 54571 -93028
499 -93028 -92309 43100 -36424 -61498 32006 -32884 31410 -61114 -28174 61782 -81897 -3822
$$ packed form
583g707L1054j63651N3446j10636M3J84389J89o2188R2399L4314l1318p4514j2004
570f6184K9588N5586n2486n598J8799j1090N3326N5042n215j39256j45537J43398
558f9627O4058m8401m4552Q0434Q9848n5813o8014k961k6140j0501k2708m883
546a19260J12903p7502k3269M967M9494o4975k0009J04183j1173o5280K5313J16195
534C1587K0657N0562n1395l3146N0689m4616N9607k01093m4415M0083K4592J02149
522E261R5803p6305Q7011l6106r9215j03929J47883J028n1509K07355j03683j68496
510i4902n9529K02191m3801r0524m7979j03290k8907Q2567O6440J72305j47599
499i3028P19J35409p9524k5074R3504o4890O4294r2524L2940Q9956j43679P8075
$$ plain form
487 -3822 5034 72078 102047 -87980 -104693 -89503 -122851 37138 129429 12159 -159706 -201213
475 -201213 -182742 -116811 -118844 -211316 -47471 103830 82939 -114539 -128340 1708 10518
464 10518 3084 -11645 41206 66229 54235 104459 86149 41869 71601 76594 63749 -38637
452 -38637 36645 -27644 62295 158543 154152 -26905 -29806 -44443 -171844 -105859 -37414 -59313
440 -59313 -161255 -10728 38514 -30920 67912 60376 23441 -53845 -114092 -70093 -137190 -148612
428 -148612 -141375 -105828 -58050 -54892 -67551 -22511 -83404 5130 18426 -48605 -61698 -151847
416 -151847 -179894 -45259 -17685 23430 18468 -122312 -170136 -156990 -63522 25519 14433 48165
404 48165 -22275 -132679 -122328 -85260 -140554 -138386 -33223 14121 -57673 -43181 72200 52771
$$ packed form
487c822Q856O7044K9969j90027j6713J5190l3348J59989R2291j17270j71865m1507
475b01213J8471O5931k033r2472J63845J51301k0891j97478j3801J30048Q810
464A0518p434j4729N2851K5023j1994N0224j8310m4280K9732M993j2845j02386
452c8637P5282o4289Q9939R6248m391j81057k901j4637j27401O5985O8445k1899
440e9313j01942J50527M9242o9434R8832p536l6935p7286o0247M3999o7097j1422
428a48612P237L5547M7778L158j2659M5040o0893Q8534J3296o7031j3093r0149
416a51847k8047J34635K7574M1115m962j40780m7824J3146R3468Q9041j1086L3732
404D8165p0440j10404J0351L7068n5294K168J05163M7344p1794J4492J15381j9429
$$ plain form
392 52771 39381 24725 93100 -50637 -141641 -120636 -125149 -160487 -42514 -154142 -133857 -116315
380 -116315 22730 -7907 -32989 40433 43149 49856 -83209 -213031 -230513 -91927 -47776
369 -47776 -55764 -107361 -170391 -131205 -51338 -22648 -83524 -53385 153421 49134 -94630 -86157
357 -86157 -89103 -94003 -73103 -78641 -83142 -108823 21090 42983 -25337 -158794 -215574 -189725
345 -189725 -181064 -159063 -44186 -54680 -112526 -180871 -153198 -76036 -85462 -133635 8716 47287
333 47287 77705 89216 12670 8913 -43308 -68568 -96990 23475 29909 -37661 -84427 -157856
321 -157856 -168373 -90125 -158651 -99879 -82794 -3711 51696 13963 29075 -2904 -100795 -97736
309 -97736 -13198 -71257 -10461 87335 -3906 -65236 46223 14187 93220 36173 -103427 -109558
$$ packed form
392E2771j3390j4656O8375j43737r1004K1005m513l5338J17973j11628K0285J7542
380a16315J39045l0637k5082P3422K716O707j33065j29822j7482J38586M4151
369d7776p988n1597o3030L9186P9867K8690o0876L0139K06806j04287j43764Q473
357h6157k946m900K0900n538m501k5681J29913K1893o8320j33457n6780K5849
345a89725Q661K2001J14877j0494n7846o8345K7673P7162r426m8173J42351L8571
333D7287L0418J1511p6546l757n2221k5260k8422J20465O434o7570m6766p3429
321a57856j0517P8248o8526N8772J7085P9083N5407l7733J5112l1979r7891L059
309i7736Q4538n8059O0796R7796r1241o1330J11459l2036P9033n7047j39600o131
$$ plain form
297 -109558 -38615 14522 89463 108544 -39243 -177041 -90553 37515 197255 -71331 -82603
286 -82603 -28968 -109580 2209 -111195 -189163 -155003 -36958 18048 -83955 -71060 7191
275 7191 -67785 -267299 -119376 -47665 -135070 -40254 -7904 -31216 10319 56003 8559 -58948
263 -58948 -101718 -156834 -70216 -175980 -141379 -139539 -136269 -60256 -152377 34636 -45817 -60327
251 -60327 -47027 -70004 -80969 -21797 -94668 -131081 -77190 -126844 -117090 -103643 -125245 -143405
239 -143405 -164195 -183781 -155302 -167122 -204928 -104296 -85691 -62418 38951 42580 23469 124566
227 124566 103204 34130 -57639 -104869 -158236 -177840 -43309 -43609 8422 55216 -78407 -54381
215 -54381 -127853 -44557 -59423 -102482 -71717 -102278 -225855 -211150 -284048 -131322 -181374 -44629
$$ packed form
297a09558P0943N3137P4941J9081j47787j37798Q6488J28068J59740k68586j1272
286h2603N3635q0612J11789j13404p7968L4160J18045N5006j02003J2895P8251
275G191p4976j99514J47923P1711q7405R4816L2350k3312M1535M5684m7444o7507
263e8948m2770n5116Q6618j05764L4601J840L270P6013r2121J87013q0453j4510
251f0327J3300k2977j0965N9172p2871l6413N3891m9654R754J3447k1602j8160
239a43405k0790j9586K8479j1820l7806J00632J8605K3273J01369L629j9111J01097
227A24566k1362o9074r1769m7230n3367j9604J34531l00N2031M6794j33623K4026
215e4381p3472Q3296j4866m3059L0765l0561j23577J4705p2898J52726n0052J36745
$$ plain form
203 -44629 -8548 107626 65550 -149272 -274347 -249299 -77826 -121871 -68402 -27881 34586
192 34586 88717 56697 -58512 -113260 -175232 -52303 -54960 -101748 -137470 -45823 31369 -137661
180 -137661 -161805 -136879 -92119 -130845 -136729 -80901 -79700 -102232 -29471 24254 69187 -32088
168 -32088 -105537 6085 -36464 64572 -21437 22203 38431 53145 -80765 -62054 -38960
157 -38960 25902 -20876 -67032 -97858 -183888 -177217 -89151 -79838 35398 132961 6321 -56824
145 -56824 -44799 -105487 44369 14250 -65120 -116016 -141424 -178141 -105270 -5709 40304 -66257
133 -66257 -139511 34354 -117415 -175384 -76010 -83535 -46475 -52248 -61929 -77430 158763 67188
121 67188 -90753 -117984 -96139 -76838 -16833 -31897 -47165 -36237 114375 111940 -91763 -25590
$$ packed form
203d4629L6081J16174m2076k14822j25075K5048J71473m4045N3469M0521O2467
192C4586N4131l2020j15209n4748o1972J22929k657m6788l5722R1647P7192j69030
180a37661k4144K4926M4760l8726n884N5828J201k2532P2761N3725M4933j01275
168c2088p3449J11622m2549J01036q6009M3640J6228J4714j33910J8711K3094
157c8960O4862m6778m6156l0826q6030O671Q8066R313J15236R7563j26640o3145
145e6824J2025o0688J49856l0119p9370n0896k5408l6717P2871R9561M6013j06561
133f6257p3254J73865j51769n7969R9374p525L7060n773r681j5501K36193r1575
121F7188j57941k7231K1845J9301O0005j5064j5268J0928J50612k435k03703O6173
$$ plain form
109 -25590 -96832 -168875 -150660 -158488 -211870 -72214 -123998 -120047 -116616 -80896 -97499 -56971
97 -56971 -86893 -73412 -91904 -95030 -84260 -58678 -58827 -99025 -19474 -12879 -29991 -207008 -190361
84 -190361 -182136 -201979 -69509 -136670 -97451 -146410 -97670 -108377 -93780 -20715 -43709 -52649
72 -52649 -75435 -36191 -22672 131081 41976 -56481 -76102 -73160 -29936 -22733 -19333 -109916 -116681
59 -116681 -54656 -15050 -21263 -46532 -70627 -53387 -139793 -167225 -167829 -204295 -147359 -132353 -108940
46 -108940 -2946 4449 -30762 -85356 -145823 -101050 -132377 -61743 -70787 -105569 -154394 -157480
34 -157480 -83825 -77062 -76823 -162392 -122979 -74882 -28024 -37422 99177 59365 37728 44055 7657
21 7657 -18292 -83703 -162652 -149016 -70725 -77571 -135432 -92099 -114849 -76572 -9087 -82592 -109922
$$ packed form
109b5590p1242p2043J8215p828n3382J39656n1784L951L431L5720j6603M0528
97e6971k9922J3481j8492l126J0770K5582j49m0198P9551O595j7112j77017J6647
84a90361Q225j9843J32470o7161L9219m8959M8740j0707J4597P3065k2994q940
72e2649k2786L9244J3519J53753q9105r8457j9621K942M3224P203L400r0583o765
59a16681O2025L9606o213k5269k4095J7240q6406k7432o04l6466N6936J5006K3413
46a08940J05994P395l5211n4594o0467M4773l1327P0634r044l4782m8825l086
34a57480P3655O763K39q5569L9413M8097M6858r398J36599l9812k1637O327l6398
21G657k5949o5411p8949J3636P8291o846n7861M3333k2750L8277O7485p3505k7330
$$ plain form
8 -109922 -70199 -45935 -25455 24387 20239 -127851 -174125 -182512
0 -182512
$$ packed form
8a09922L9723K4264K0480M9842m148j48090m6274q387
0a82512
$$ Imaginary data points
##PAGE= N=2
##DATA TABLE= (X++(I..I)), XYDATA
$$ plain form
16383 -2187758 -2202406 -2026749 -1971394 -1971973 -1976212 -1940981 -2027829 -1946018 -1852498 -1845393 -1866983 -1845294
16371 -1845294 -1894208 -1838035 -1812069 -1758825 -1729588 -1727468 -1594275 -1544746 -1607148 -1487849 -1374054
16360 -1374054 -1381402 -1487473 -1326620 -1325287 -1367911 -1352058 -1406874 -1335437 -1307288 -1315025 -1313486 -1249224
16348 -1249224 -1151012 -1071982 -993974 -1029767 -1215046 -1142145 -1144718 -1040569 -941705 -992359 -959726
16337 -959726 -845253 -838113 -835459 -888766 -910172 -873811 -956094 -882715 -786242 -732023 -627880
16326 -627880 -570030 -581368 -562557 -539097 -527536 -426412 -419416 -544075 -468538 -466630 -398087
16315 -398087 -406621 -379303 -305632 -282776 -306824 -330471 -230178 -172005 -160512 -184937 -110286
16304 -110286 -96954 -88129 -24300 -74948 -30204 119329 53627 -3968 -12397 45799 99037 159039
$$ packed form
16383b187758j4648J75657N5355n79m239L5231q6848Q1811R3520P105k1590K1689
16371a845294m8914N6173K5966N3244K9237K120J33193M9529o2402J19299J13795
16360a374054p348j06071J60853J333m2624J5853n4816P1437K8149p737J539O4262
16348a249224R8212P9030P8008l5793j85279P2901k573J04149R8864n0654L2633
16337i59726J14473P140K654n3307k1406L6361q2283P3379R6473N4219J04143
16326f27880N7850j1338J8811K3460J1561J01124O996j24659P5537J908O8543
16315c98087q534K7318P3671K2856k4048k3647J00293N8173J1493k4425P4651
16304a10286J3332Q825O3829n0648M4744J49533o5702n7595q429N8196N3238O0002
$$ plain form
16292 159039 184623 148508 129899 265149 343194 238023 179117 204439 309405 353463 381577
16281 381577 367367 297375 375799 285131 371454 545026 518165 523374 610617 592087 585032 686560
16269 686560 714822 674762 524173 641558 748025 688570 686604 838380 839113 708054 743863
16258 743863 798742 846220 870476 903128 901849 838311 825425 907347 854974 933363 993152 953206
16246 953206 1086015 1006295 953791 940247 957306 1028980 1035979 1152475 1123104 1116788 1035071
16235 1035071 1158656 1166062 1003016 1086330 1163372 1178284 1344430 1296944 1229963 1234582 1297097
$$ packed form
16292A59039K5584l6115j8609J35250P8045j05171n8906K5322J04966M4058K8114
16281C81577j4210o9992P8424r0668Q6323J73572k6861N209Q7243j8530p055J01528
16269F86560K8262m0060j50589J17385J06467n9455j966J51776P33j31059L5809
16258G43863N4879M7478K4256L2652j279o3538j2886Q1922n2373P8389N9789l9946
16246I53206J32809p9720n2504j3544J7059P1674O999J16496k9371o316q1717
16235A035071J23585P406j63046Q3314P7042J4912J66146m7486o6981M619O2515
$$ [...]
##END NTUPLES=NMR SPECTRUM
##END=
