##TITLE=1H_DE-80H_X3
 200.13MHz, d2o
 8 sc
 
 19ns.26.2.2025
##JCAMPDX= 6.0         $$ Bruker NMR JCAMP-DX V2.0
##DATA TYPE= NMR SPECTRUM
##DATA CLASS= NTUPLES
##ORIGIN= UXNMR, Bruker Analytische Messtechnik GmbH
##OWNER= pz
$$ XWIN-NMR		Version 3.5
$$ Thu Jun 19 14:02:55 2025 Russian Standard Time (UT+4h)  Yarkov@DPX200
##.OBSERVE FREQUENCY= 200.1313
##.OBSERVE NUCLEUS= ^1H
##.ACQUISITION MODE= SIMULTANEOUS
##.ACQUISITION SCHEME= undefined
##.AVERAGES= 8
##.DIGITISER RES= 18
##SPECTROMETER/DATA SYSTEM= spect
##.PULSE SEQUENCE= zg30
##.SOLVENT NAME= CDCl3
##.SHIFT REFERENCE= (INTERNAL, CDCl3, 0, 15.5287)
##AUDIT TRAIL= $$ (NUMBER, WHEN, WHO, WHERE, WHAT)
$$ ##TITLE= Audit trail, XWIN-NMR		Version 3.5
$$ ##JCAMPDX= 5.01
$$ ##ORIGIN= Bruker BioSpin GmbH
$$ ##OWNER= Yarkov
$$ C:/Bruker/XWIN-NMR/data/yarkov2/nmr/H-C/1/pdata/1/auditp.txt
$$ ##AUDIT TRAIL=  $$ (NUMBER, WHEN, WHO, WHERE, WHAT)
(   1,<2025-06-19 14:01:46.15 +0400>,<Yarkov>,<DPX200>,
      <created by zg, POWCHK disabled, PULCHK disabled
       configuration hash MD5:
       00 E9 B6 7A A2 85 ED C7 34 08 36 98 17 FE 4E 26
       data hash MD5: 16K
       54 F0 5D 39 4E 28 E7 83 11 B2 D9 EC 28 1D D0 0A>)
(   2,<2025-06-19 14:01:54.79 +0400>,<Yarkov>,<DPX200>,
      <Start of raw data processing
       efp BC_mod = 2 LB = 0.25 FT_mod = 6 PKNL = 1 PHC0 = -1713.14 PHC1 = 3.166575 SI = 16K 
       data hash MD5: 16K
       4C 0C E2 EF 59 B1 A7 43 26 F9 A1 93 92 1C 88 09>)
(   3,<2025-06-19 14:02:10.81 +0400>,<Yarkov>,<DPX200>,
      <pk PHC0 = -7.179296 PHC1 = 17 
       data hash MD5: 16K
       69 D4 BD 06 AD 3C 04 1E 1F B0 1B 3D 2E C7 7D 0A>)
(   4,<2025-06-19 14:02:16.42 +0400>,<Yarkov>,<DPX200>,
      <abs ABSG = 5 
       data hash MD5: 16K
       2A 0A 9E 9E 5B A1 D6 E7 4F C8 0B 16 5B B2 C9 21>)
$$ ##END=
$$ 
$$ hash MD5
$$ BA 6C 56 3C 56 F8 9C 53 85 B5 D1 83 AC 72 01 05
##$RELAX= 
##$RELAX= 
##$RELAX= 
##$RELAX= 
##$RELAX= 
##$RELAX= 
$$ Bruker specific parameters
$$ --------------------------
##$DU= <C:/Bruker/XWIN-NMR>
##$EXPNO= 1
##$NAME= <H-C>
##$PROCNO= 1
##$TYPE= <nmr>
##$USER= <yarkov2>
##$AMP= (0..31)
100 100 100 100 100 100 100 100 100 100 100 100 100 100 100 100 100 100 
100 100 100 100 100 100 100 100 100 100 100 100 100 100 
##$AQSEQ= 0
##$AQ_mod= 1
##$AUNM= <au_zg>
##$AUTOPOS= <>
##$BF1= 200.13
##$BF2= 200.13
##$BF3= 200.13
##$BF4= 200.13
##$BF5= 200.13
##$BF6= 200.13
##$BF7= 200.13
##$BF8= 200.13
##$BYTORDA= 1
##$CFDGTYP= 0
##$CFRGTYP= 5
##$CHEMSTR= <none>
##$CNST= (0..31)
1 1 145 1 1 1 1 1 1 1 1 1 1 1 1 1 1 1 1 1 1 1 1 1 1 1 1 1 1 1 1 1 
##$CPDPRG= <>
##$CPDPRG1= <>
##$CPDPRG2= <>
##$CPDPRG3= <>
##$CPDPRG4= <mlev>
##$CPDPRG5= <mlev>
##$CPDPRG6= <mlev>
##$CPDPRG7= <mlev>
##$CPDPRG8= <mlev>
##$CPDPRGB= <>
##$CPDPRGT= <>
##$D= (0..31)
0 0.7 0 0 0 0 0 0 0 0 0 0.03 0 0 0 0 0 0 0 0 0 0 0 0 0 0 0 0 0 0 0 0 
##$DATE= 1750327305
##$DBL= (0..7)
120 120 120 120 120 120 120 120 
##$DBP= (0..7)
150 150 150 150 150 150 150 150 
##$DBP07= 0
##$DBPNAM0= <>
##$DBPNAM1= <>
##$DBPNAM2= <>
$$ [...]
##$SUBNAM3= <"">
##$SUBNAM4= <"">
##$SUBNAM5= <"">
##$SUBNAM6= <"">
##$SUBNAM7= <"">
##$SUBNAM8= <"">
##$SUBNAM9= <"">
##$SW= 18.0517328524113
##$SWIBOX= (0..15)
0 0 2 0 0 0 0 0 0 0 0 0 0 0 0 0 
##$SW_h= 3612.71676300578
##$TD= 16384
##$TD0= 1
##$TE= 0
##$TE2= 300
##$TE3= 300
##$TEG= 300
##$TL= (0..7)
0 120 120 120 120 120 120 120 
##$TP= (0..7)
150 150 150 150 150 150 150 150 
##$TP07= 0
##$TPNAME0= <>
##$TPNAME1= <>
##$TPNAME2= <>
##$TPNAME3= <>
##$TPNAME4= <>
##$TPNAME5= <>
##$TPNAME6= <>
##$TPNAME7= <>
##$TPOAL= (0..7)
0.5 0.5 0.5 0.5 0.5 0.5 0.5 0.5 
##$TPOFFS= (0..7)
0 0 0 0 0 0 0 0 
##$TUNHIN= 0
##$TUNHOUT= 0
##$TUNXOUT= 0
##$USERA1= <user>
##$USERA2= <user>
##$USERA3= <user>
##$USERA4= <user>
##$USERA5= <user>
##$V9= 5
##$VALIST= <valist>
##$VCLIST= <CCCCCCCCCCCCCCC>
##$VD= 0
##$VDLIST= <DDDDDDDDDDDDDDD>
##$VPLIST= <PPPPPPPPPPPPPPP>
##$VTLIST= <TTTTTTTTTTTTTTT>
##$WBST= 1024
##$WBSW= 4
##$XGAIN= (0..3)
0 0 0 0 
##$XL= 0
##$YL= 0
##$YMAX_a= 172316
##$YMIN_a= -163462
##$ZGOPTNS= <>
##$ZL1= 120
##$ZL2= 120
##$ZL3= 120
##$ZL4= 120
##$ABSF1= 15.5089
##$ABSF2= -2.54295
##$ABSG= 5
##$ABSL= 3
##$ALPHA= 0
##$AQORDER= 0
##$ASSFAC= 0
##$ASSFACI= 0
##$ASSFACX= 0
##$ASSWID= 0
##$AUNMP= <proc_1d>
##$AZFE= 0.1
##$AZFW= 0.1
##$BCFW= 0
##$BC_mod= 2
##$BYTORDP= 0
##$COROFFS= 0
##$CY= -3
##$DATMOD= 1
##$DC= 0
##$DFILT= <>
##$DTYPP= 0
##$F1P= 0
##$F2P= 0
##$FCOR= 1
##$FTSIZE= 16384
##$FT_mod= 6
##$GAMMA= 0
##$GB= 0
##$INTBC= 1
##$INTSCL= 3.241238e-09
##$ISEN= 128
##$LB= 0.25
##$LEV0= 0
##$LPBIN= 0
##$MAXI= 10000
##$MC2= 0
##$MEAN= 0
##$ME_mod= 0
##$MI= 1.114404
##$NCOEF= 0
##$NC_proc= -8
##$NLEV= 6
##$NOISF1= 3.799351
##$NOISF2= 2.8
##$NSP= 0
##$NTH_PI= 0
##$NZP= 0
##$OFFSET= 15.52873
##$PC= 1
##$PHC0= -1720.319
##$PHC1= 20.16657
##$PH_mod= 1
##$PKNL= yes
##$PPARMOD= 0
##$PSCAL= 0
##$PSIGN= 0
##$REVERSE= no
##$SF= 200.129998592103
##$SI= 16384
##$SIGF1= 3
##$SIGF2= 2
##$SINO= 0.751879
##$SIOLD= 32768
##$SREGLST= <19F.Aceton>
##$SSB= 0
##$STSI= 16384
##$STSR= 0
##$SW_p= 3612.71676300578
##$SYMM= 0
##$S_DEV= 0
##$TDeff= 16384
##$TDoff= 0
##$TI= <>
##$TILT= no
##$TM1= 0
##$TM2= 0
##$TOPLEV= 0
##$USERP1= <user>
##$USERP2= <user>
##$USERP3= <user>
##$USERP4= <user>
##$USERP5= <user>
##$WDW= 1
##$XDIM= 16384
##$YMAX_p= 457517522
##$YMIN_p= -943314
$$ End of Bruker specific parameters
$$ ---------------------------------
##NTUPLES= NMR SPECTRUM
##VAR_NAME=  FREQUENCY,     SPECTRUM/REAL,   SPECTRUM/IMAG
##SYMBOL=    X,             R,               I
##VAR_TYPE=  INDEPENDENT,   DEPENDENT,       DEPENDENT
##VAR_FORM=  AFFN,          ASDF,            ASDF
##VAR_DIM=   16384,         16384,           16384
##UNITS=     HZ,            ARBITRARY UNITS, ARBITRARY UNITS
##FACTOR=    0.220516191357247, 1,           1
##FIRST=     3107.76479157938, 0,            0
##LAST=      -504.951971426403, 0,           0
##MIN=       -504.951971426403, -943314,     0
##MAX=       3107.76479157938, 457517522,    0
$$ Real data points
##PAGE= N=1
##DATA TABLE= (X++(R..R)), XYDATA
$$ [...]
5919B8254472J791789K537118K936289J734350j083007l731370l935111k826564
$$ 28254472 30046261 32583379 35519668 37254018 36171011 32439641 28504530 25677966
5911B5677966j952718j414515r63121o51464o29605n99869m70939k90992k66213
$$ 25677966 23725248 22310733 21347612 20696148 20066543 19466674 18995735 18704743 18438530
5902A8438530k92845k77352j24950J9871j12292J11133J56938K19730K22619J39454
$$ 18438530 18145685 17868333 17743383 17763254 17650962 17762095 17919033 18138763 18361382 18500836
5892A8500836M00393Q37104R61989R16673K61272q21571j741631j409893r72717
$$ 18500836 18901229 19738333 20700322 21616995 21878267 21056696 19315065 17905172 16932455
5883A6932455q39919o91389m85201l16480m41187k33868j73170j03081k42600
$$ 16932455 16092536 15401147 14915946 14599466 14158279 13924411 13751241 13648160 13405560
5874A3405560k48514j44211j85754j69654o5960k02877j62672n7308p1065J3926
$$ 13405560 13157046 13012835 12827081 12657427 12591467 12388590 12225918 12168610 12097545 12111471
5864A2111471K8263P0059N6283k4164q432k87378k82348k88702k61985r9435j78561
$$ 12111471 12139734 12209793 12266076 12241912 12233480 11946102 11663754 11375052 11113067 11013632 10835071
5853A0835071j77712j38854j54377p1412k66123j45137O5728j6176j88348j60499
$$ 10835071 10657359 10518505 10364128 10292716 10026593 9881456 9947184 9931008 9742660 9582161
5843I582161o9611o7487q0716n4225m047j0271K067J366k16334j048k509j79969
$$ 9582161 9512550 9445063 9364347 9310122 9306075 9295804 9297871 9299237 9082903 9081855 9079346 8899377
5831H899377n0930j29020l0925l0552j06224m6778o5632q4349r1157l9586K8747
$$ 8899377 8848447 8719427 8688502 8657950 8551726 8504948 8439316 8354967 8263810 8224224 8252971
5820H252971j06132j05210j50182q9366R3451j9601j5630j4002p9358J6514n1384
$$ 8252971 8146839 8041629 7891447 7802081 7895532 7875931 7860301 7846299 7766941 7783455 7732071
5809G732071q6300K8663j5697j85712n7710M2648n8025j9770j00712m6575j16254
$$ 7732071 7645771 7674434 7658737 7473025 7415315 7457963 7399938 7380168 7279456 7232881 7116627
5798G116627l5740R1633j4750R10J3047j61766j72213r7481j8607M0264P0150
$$ 7116627 7080887 7172520 7157770 7158680 7171727 7009961 6837748 6740267 6721660 6761924 6832074
5787F832074j48679m8512o6883j20441j7859L5164J6304o7859J11330q0587l951
$$ 6832074 6683395 6634883 6568000 6447559 6429700 6464864 6481168 6413309 6524639 6444052 6440101
5776F440101j75865j54742l631J65917r3500j26328L1589K5708j84618o1228k9946
$$ 6440101 6264236 6109494 6105863 6271780 6178280 6051952 6083541 6109249 5924631 5863403 5833457
5765E833457k1782J03863m8815L415r8339m3898J13503n3208j4270O9873j53585
$$ 5833457 5811675 5915538 5866723 5870138 5771799 5727901 5841404 5788196 5773926 5843799 5690214
5754E690214m9927P5888j39189M8981M036j49683q7398n2136j03176J53876K2506
$$ 5690214 5640287 5716175 5576986 5625967 5630003 5480320 5392922 5340786 5237610 5391486 5413992
5743E413992j18699j7767j0459J26140r8646j75883J14162j07122j20163L0498
$$ 5413992 5295293 5277526 5267067 5393207 5294561 5118678 5232840 5125718 5005555 5036053
5733E036053L209J88603N9925j27984l2851j91109n2504J68474j76048L63k53
$$ 5036053 5039262 5227865 5287790 5159806 5126955 4935846 4883342 5051816 4875768 4876131 4875878
5722D875878Q6628l3262l5774j12918j44624J11586k8068M4414J50976j38613
$$ 4875878 4962506 4929244 4893470 4780552 4635928 4747514 4719446 4763860 4914836 4776223
5712D776223j15996q2930j7843P8755P9577L636k6715M6680J00913O2814M5656
$$ 4776223 4660227 4577297 4559454 4638209 4717786 4721422 4694707 4741387 4842300 4905114 4950770
5701D950770k8933J13369m9126j52731r8899k2549j333j24423p6020j45423k7127
$$ 4950770 4921837 5035206 4986080 4833349 4734450 4711901 4710568 4586145 4510125 4364702 4337575
5690D337575J13963J10545j57897K4257J03414j23515p4119P5017J65550Q5974
$$ 4337575 4451538 4562083 4404186 4428443 4531857 4408342 4334223 4409240 4574790 4660764
5680D660764j3772j41322P9898K5510R2265J70003p4198R9049L9350J57014M68420
$$ 4660764 4646992 4505670 4585568 4611078 4703343 4873346 4799148 4898197 4937547 5094561 5562981
5669E562981K36699q1934k34327l90346k36869j89880j74026o8725n5842k05853
$$ 5562981 5799680 5717746 5483419 5093073 4856204 4666324 4492298 4423573 4367731 4161878
5659D161878J0463J09688j01369J6849J15182r3220l717J08259q7118p6174j01478
$$ 4161878 4172341 4282029 4180660 4197509 4312691 4219471 4215754 4324013 4236895 4160721 4059243
5648D059243J43161O8286P9608j7363P6759j0148J13243J57358J21931J70126
$$ 4059243 4202404 4270690 4350298 4332935 4409694 4399546 4512789 4670147 4792078 4962204
5638D962204K36797K17397o9986l38947l85358k13909m3043k1232j92436m5432
$$ 4962204 5199001 5416398 5346412 5007465 4622107 4408198 4365155 4343923 4151487 4106055
5628D106055o306j42890n843N0947K7298J5727j11679o2151K9010N5490q0650
$$ 4106055 4099749 3956859 3951016 4001963 4029261 4044988 3933309 3871158 3900168 3955658 3875008
5617C875008L3958k5363n49Q9179m7679P6597l0047k423j00189j702P6088R5427
$$ 3875008 3908966 3883603 3883054 3972233 3924554 4001151 3971104 3968681 3868492 3866790 3942878 4038305
5605D038305J17175j36954q1603r4548o6212j4840p7139k8264J54782m2505p641
$$ 4038305 4155480 4018526 3936923 3842375 3776163 3761323 3684184 3655920 3810702 3768197 3760556
5594C760556Q2503M9963J6772K1571l0396K5931j03566j10749P5266P8145p9462
$$ 3760556 3843059 3893022 3909794 3931365 3900969 3926900 3823334 3712585 3787851 3865996 3786534
5583C786534J05611K5011j43352q7722K8093K522m2490N6669P7717n2784l5503
$$ 3786534 3892145 3917156 3773804 3686082 3714175 3716697 3674207 3730876 3808593 3755809 3720306
5572C720306k4170O1543l8128j288J22877P8919K2349L7913J62855o9103k52172
$$ 3720306 3696136 3757679 3719551 3718263 3841140 3920059 3942408 3980321 4143176 4074073 3821901
5561C821901J9723M4940M692N0684K3497m3603l5219k3685J39975K7925P4143
$$ 3821901 3841624 3886564 3891256 3941940 3965437 3921834 3886615 3862930 4002905 4030830 4104973
5550D104973p1728j51811o9374J33058P9288l7646k186J33835Q2127J50608R7122
$$ 4104973 4033245 3881434 3812060 3945118 4024406 3986760 3984574 4118409 4200536 4351144 4448266
5539D448266M2019K36047q9458j84666n8995j80740k31885k8286j70301m9878
$$ 4448266 4490285 4726332 4636874 4452208 4393213 4212473 3980588 3952302 3782001 3732123
5529C732123J10973o9108L4522J06092r4253J00676M2087R2099j74043r4795n5589
$$ 3732123 3843096 3773988 3808510 3914602 3820349 3921025 3963112 4055211 3881168 3786373 3730784
5518C730784M983j2885K23387J84624N4073P2223J64814J4036J94984J4357k58752
$$ 3730784 3735767 3722882 3946269 4130893 4184966 4257189 4422003 4436039 4631023 4645380 4386628
5507D386628l70990j48188l1075p0410j3015j78862j93951j05172J31425J9642
$$ 4386628 4015638 3867450 3836375 3765965 3752950 3574088 3380137 3274965 3406390 3426032
5497C426032m8447J76176M978m2644p6081p6179n3769M8015J8712j9723J16309
$$ 3426032 3377585 3553761 3558739 3516095 3440014 3363835 3310066 3358081 3376793 3357070 3473379
5486C473379J64389J03002j06341K21904m1922K7184k24698l28547j18546l0640
$$ 3473379 3637768 3740770 3634429 3856333 3814411 3841595 3616897 3288350 3169804 3139164
5476C139164M3630p8789j40552l8342j0711M8366L6225j30603O2388k0342r6744
$$ 3139164 3182794 3104005 2963453 2925111 2914400 2962766 2998991 2868388 2930776 2910434 2813690
5465B813690J1j0960n1089P2918J00508N9529J12368J09178p5553j4632K49020
$$ 2813690 2813701 2802741 2751652 2824570 2925078 2984607 3096975 3206153 3130600 3115968 3364988
5454C364988l1013r073j3625N0184o1157r2042J693J25312K8439O3126K42173
$$ 3364988 3333975 3324902 3311277 3361461 3300304 3208262 3209955 3335267 3363706 3426832 3669005
5443C669005p034l13K41034J54527M7450J70199L48991J39574J63575L33533K74025
$$ 3669005 3661971 3661658 3902692 4057219 4104669 4274868 4623859 4763433 4927008 5260541 5534566
5432E534566M62483M36888K11229l44536k72852k21628k17353k77925j98477l4818
$$ 5534566 5997049 6433937 6645166 6300630 6027778 5806150 5588797 5310872 5112395 5077577
5422E077577j91352j01540o041N5081O6937M2131J00311K63197K22607J16001
$$ 5077577 4886225 4784685 4778644 4833725 4900662 4942793 5043104 5306301 5528908 5644909
5412E644909K75787K03591K57363L57273M64487K78778L77792N85735N49092N20353
$$ 5644909 5920696 6124287 6381650 6738923 7203410 7482188 7859980 8445715 8994807 9515160
5402I515160J50933k06509p03618q80602n62511n83375l02887l10509k60265k09906
$$ 9515160 9666093 9459584 8755966 7875364 7312853 6729478 6426591 6116082 5855817 5645911
5392E645911j97223o2191k31404j01303o3041M97J80401N2600l0992r9655P9524
$$ 5645911 5448688 5386497 5155093 5053790 4990749 4991246 5171647 5224247 5193255 5093600 5173124
5381E173124O4789j18565K99745J71618J32411J02622p707p3374l75834l64499
$$ 5173124 5237913 5119348 5419093 5590711 5723122 5825744 5818037 5744663 5368829 5004330
5371E004330l20081k76971j46651k01087k11492j04038j34562k61317m2567L5699
$$ 5004330 4684249 4407278 4260627 4059540 3848048 3744010 3609448 3348131 3305564 3341263
5361C341263r2860j93404q5158j09505M898q1844o1950O8250M9236j35790n4237
$$ 3341263 3248403 3054999 2969841 2860336 2865234 2783390 2721440 2789690 2838926 2703136 2648899
5350B648899k123j09726q8095R5282K4563J569o8803j08678o9213K0994j31974
$$ 2648899 2646776 2537050 2448955 2544237 2568800 2570369 2501566 2392888 2323675 2344669 2212695
5339B212695j957l3793N8024Q0106N1261l7930J2431j12577N9728J3082R0709
$$ 2212695 2210738 2176945 2234969 2315075 2366336 2328406 2340837 2228260 2287988 2301070 2391779
5328B391779Q7791k39624n3578J66494P6621l508J36599L2888j08604o7523j22074
$$ 2391779 2479570 2239946 2186368 2352862 2429483 2425975 2562574 2595462 2486858 2419335 2297261
5317B297261L8588O6643j37764N3648p9842J41260o1128J65255r2786j38758r5344
$$ 2297261 2335849 2402492 2264728 2318376 2238534 2379794 2318666 2483921 2391135 2252377 2157033
5306B157033R4885J4688l4768o998m6694p8072p1367N6103J87290k4990j15277
$$ 2157033 2251918 2266606 2231838 2224840 2178146 2100074 2028707 2084810 2272100 2247110 2131833
5295B131833j08584K2523K2064P5101J45510l3132j2317Q0598k988k0399j279
$$ 2131833 2023249 2045772 2067836 2142937 2288447 2255315 2242998 2323596 2320608 2300209 2298930
5284B298930N1826L520o9525O7804J30453j4026j7539k7740J6918Q0397K9148
$$ 2298930 2350756 2354276 2284751 2352555 2483008 2468982 2451443 2423703 2440621 2521018 2550166
5273B550166j15331P866L6150m2611M9269p4354L5007K6059r9124P5932n0259
$$ 2550166 2434835 2442701 2478851 2436240 2485509 2411155 2446162 2472221 2373097 2449029 2398770
5262B398770p9146J44238M1587L977o7999R2010q0294j03764R3419K6127r632
$$ 2398770 2319624 2463862 2505449 2509426 2441427 2533437 2453143 2349379 2442798 2468925 2459293
5251B459293J92536Q6929k03645j00288n1450M7914P8271N8313J29024L8653M378
$$ 2459293 2651829 2738758 2535113 2434825 2383375 2431289 2509560 2567873 2696897 2735550 2739928
5240B739928O8353L0294o1893r925O81l0339K9081L2530r5459l5267K1510j79854
$$ 2739928 2808281 2838575 2776682 2766757 2767438 2737099 2766180 2798710 2703251 2667984 2689494 2509640
5228B509640J6266J69867O5815p7939r1151J62611J52465m0513q9788l2212k6804
$$ 2509640 2525906 2695773 2761588 2683649 2592498 2755109 2907574 2867061 2777273 2745061 2718257
5217B718257L1757j24600J0387L2034J14486k1597n8168K5651Q0968k7706j3122
$$ 2718257 2750014 2625414 2635801 2667835 2782321 2760724 2702556 2728207 2809175 2781469 2768347
5206B768347K02394L1070l3306l0826j0453O3343K47227K8012k8685N7672j35140
$$ 2768347 2970741 3001811 2968505 2937679 2927226 2990569 3237796 3265808 3237123 3294795 3159655
5195C159655J14989J95657r616j0403J07598M8207K7372R6179L357Q9573Q7790
$$ 3159655 3274644 3470301 3460685 3450282 3557880 3606087 3633459 3729638 3732995 3822568 3910358
5184C910358p2344K68746J56183J54241J29926o1499J34686J10110J9453j522
$$ 3910358 3838014 4106760 4262943 4417184 4547110 4485611 4620297 4730407 4749860 4748338
5174D748338K7297J75945K10096j8449q2919J27336J89145N4537J43394L56771
$$ 4748338 4775635 4951580 5161676 5143227 5060308 5187644 5376789 5431326 5574720 5931491
5164E931491J93064J94472J74219l901K34759L04995L25514K70104K09980K89257
$$ 5931491 6124555 6319027 6493246 6489345 6724104 7029099 7354613 7624717 7834697 8123954
5154H123954L57082K35059M04286L71354M00783M10935M42207N38357O53324O74441
$$ 8123954 8481036 8716095 9120381 9491735 9892518 10303453 10745660 11284017 11937341 12611782
5144A2611782O85950O31627P12797R70883Q50235R61006R87885J127719J178225
$$ 12611782 13297732 13929359 14642156 15613039 16463274 17424280 18412165 19539884 20718109
5135B0718109J308120J339293J577260J651947J768631J954530K116022K334587
$$ 20718109 22026229 23365522 24942782 26594729 28363360 30317890 32433912 34768499
5127C4768499K540059K475377K599475K621103K330950J909237J100709P94768
$$ 34768499 37308558 39783935 42383410 45004513 47335463 49244700 50345409 51140177
5119E1140177L85647J62189K65844K29129K30742O66394J021501J158998J253350
$$ 51140177 51525824 51688013 51953857 52182986 52413728 53080122 54101623 55260621 56513971
5110E6513971J272688J390722J421796J600276J809802K074465K325372K142824
$$ 56513971 57786659 59177381 60599177 62199453 64009255 66083720 68409092 70551916
5102G0551916K256457K383691K417190K685912K814601K983037L299907L643869
$$ 70551916 72808373 75192064 77609254 80295166 83109767 86092804 89392711 93036580
5094I3036580M055952M236175L938956K939903J189176q33569k581485l793395
$$ 93036580 97092532 101328707 105267663 108207566 109396742 108563173 105981688 102188293
5086A02188293m168122m299960l853963l388876l061638k585997k128828k248488
$$ 102188293 98020171 93720211 89866248 86477372 83415734 80829737 78700909 76452421
5078G6452421k144743k028663k142667j841492j695463j553837j344363j136629
$$ 76452421 74307678 72279015 70136348 68294856 66599393 65045556 63701193 62564564
5070F2564564r52804q90203r44901o11786o01378n36005j03793k9735j8908j15536
$$ 62564564 61611760 60721557 59776656 59164870 58563492 58027487 57923694 57893959 57875051 57759515
5060E7759515k60293o92643j399922k171321k636001k868819l026122k855580
$$ 57759515 57499222 56806579 55406657 53235336 50599335 47730516 44704394 41848814
5052D1848814k687557k564501k151939j956395j733952j532240j353090j210309
$$ 41848814 39161257 36596756 34444817 32488422 30754470 29222230 27869140 26658831
5044B6658831j207977q89230r12182j028264j206612j170673j041773r36581q54618
$$ 26658831 25450854 24561624 23649442 22621178 21414566 20243893 19202120 18265539 17410921
5035A7410921p18707o64018p05798p03924o25287m57921o46578m76022l39921
$$ 17410921 16692214 16028196 15322398 14618474 13993187 13535266 12888688 12412666 12072745
5026A2072745m72601l31445l25359l20596l44521l18323k14412k38110j87112
$$ 12072745 11600144 11268699 10943340 10622744 10278223 9959900 9745488 9507378 9320266
5017I320266l08508k12047j71912j92182l2551k75506k34449k41049o5611j57050
$$ 9320266 9011758 8799711 8627799 8435617 8403066 8127560 7893111 7652062 7586451 7429401
5007G429401k31585j13873k7854j52487j81571j82863k16101j12558j43574r0000
$$ 7429401 7197816 7083943 7056089 6903602 6722031 6539168 6323067 6210509 6066935 5976935
4997E976935j93238j65128m5050m1165k11952j39605j56364j33561K5351n8284
$$ 5976935 5783697 5618569 5573519 5532354 5320402 5180797 5024433 4890872 4916223 4857939
4987D857939k16013j16903P2246o7739r6918k52684j45048m227j5038r6616j51916
$$ 4857939 4641926 4525023 4597269 4529530 4432612 4179928 4034880 4030653 4015615 3918999 3767083
4976C767083o0600p160M37j74182j75531n1081J2746q5001m2054r334n8220k2024
$$ 3767083 3706483 3699323 3699760 3525578 3350047 3298966 3311712 3226711 3184657 3175323 3117103 3095079
4964C095079r4716o4927m8223l496O8941q3073j12644p6714m9648k8850L3987
$$ 3095079 3000363 2935436 2887213 2883717 2952658 2869585 2756941 2680227 2630579 2601729 2635716
4953B635716p4426n4356q3684N7582K1824q7955n827j79890m1683J59571m119
$$ 2635716 2561290 2506934 2423250 2480832 2502656 2414701 2408874 2228984 2187301 2346872 2342753
4942B342753r9280J08524k2781j48919l3835K721j29818j6309r6859R8535L7048
$$ 2342753 2243473 2351997 2329216 2180297 2146462 2149183 2019365 2003056 1906197 2004732 2041780
4931B041780J2300N3224q4564P7481m7448M9234J0744k9820j75856l1894M1431
$$ 2041780 2054080 2107304 2022740 2100221 2052773 2102007 2112751 2082931 1907075 1875181 1916612
4920A916612L8877k1156o2713J58075N8058L8216K3308R5452j12077j85235M1600
$$ 1916612 1955489 1934333 1871620 2029695 2087753 2125969 2149277 2244729 2132652 1947417 1989017
4909A989017J67530o7613j26228k291j50425k5609K9452J56470N0989q0079j54680
$$ 1989017 2156547 2088934 1962706 1960415 1809990 1784381 1813833 1970303 2021292 1941213 1786533
4898A786533r9985N4865Q881R8188j0771q5805j54154j15707O7485R0792q0094
$$ 1786533 1686548 1741413 1750294 1848482 1837711 1751906 1597752 1482045 1549530 1640322 1560228
4887A560228J41334J90916j13169J5744k7298n1026k1629K1314r6052l119Q9433
$$ 1560228 1701562 1892478 1779309 1795053 1767755 1716729 1695100 1716414 1620362 1617243 1706676
4876A706676M1340r5296K13322q3389K0469J35510O7203K1896j27231q0600J70132
$$ 1706676 1748016 1652720 1866042 1782653 1803122 1938632 2005835 2027731 1900500 1819900 1990032
4865A990032j6550l6605J84808j8010R8903K68337K24608j44293J46024O9184
$$ 1990032 1973482 1936877 2121685 2103675 2202578 2470915 2695523 2551230 2697254 2766438
4855B766438N4899K70000J25998P415L89093K98144R2704L39680M09557M48741
$$ 2766438 2821337 3091337 3217335 3224750 3613843 3911987 4004691 4344371 4753928 5202669
4845E202669L86299N20418N24588M54587O33895P52580J043064J204959J344523
$$ 5202669 5588968 6109386 6633974 7088561 7722456 8475036 9518100 10723059 12067582
4836A2067582J364182J907980K824513K957613K253698p09149l706511l845650
$$ 12067582 13431764 15339744 18164257 21121870 23375568 22666419 18959908 15114258
4828A5114258k667667j801951j382327q57874o59283o63653n95251l97856k49117
$$ 15114258 12446591 10644640 9262313 8404439 7745156 7081503 6486252 6088396 5839279
4819E839279k93382l57190l63421j13306k22863r4998j06463k87458j82840j61346
$$ 5839279 5545897 5188707 4825286 4711980 4489117 4394119 4287656 4000198 3817358 3656012
4809C656012K0258q6713L0271j65389l9512n0049j34587j31208o591j51894l4015
$$ 3656012 3676270 3589557 3619828 3454439 3414927 3364878 3230291 3099083 3092492 2940598 2906583
4798B906583o6481j77095j3787p1870j6289m3159l1173J52892J6768m9051n6906
$$ 2906583 2840102 2663007 2649220 2577350 2561061 2517902 2486729 2639621 2656389 2607338 2550432
4787B550432N5203J61860j46982N9666Q4854j134J11032O4835N1177M6419k5235
$$ 2550432 2605635 2767495 2620513 2680179 2765033 2763899 2874931 2939766 2990943 3037362 3012127
4776C012127K33854J01468j09362R2876L8623j52402k06673j6508r1610n6652
$$ 3012127 3245981 3347449 3238087 3330963 3369586 3217184 3010511 2994003 2902393 2845741
4766B845741n4283O3722o1320r7911p134N2113p421n4460N9479p6489M719J17198
$$ 2845741 2791458 2855180 2793860 2695949 2688815 2740928 2733507 2679047 2738526 2662037 2666756 2783954
4754B783954O0975p0623N8699K20831J77770q27k5585K0523Q5047n7269R7214
$$ 2783954 2844929 2774306 2833005 3053836 3231606 3230779 3205194 3225717 3310764 3253495 3350709
4743C350709k0480q9672k4841N0926j45604j59145m2813P323n6880l4371j00314
$$ 3350709 3330229 3240557 3215716 3266642 3121038 2961893 2919080 2926403 2869523 2835152 2734838
4732B734838o1479J001J2787j10118j0177j0366n6013J22738K6553N7457J90790
$$ 2734838 2673359 2674360 2687147 2577029 2566852 2556486 2500473 2623211 2649764 2707221 2898011
4721B898011J33606q2042r138M1521N1512l5221l8440J09529j1413k93755r856
$$ 2898011 3031617 2949575 2940437 2981958 3033470 2998249 2959809 3069338 3057925 2764170 2754314
4710B754314M6177p4883l3772j72500K2122q5853r8977r4642k1951j25999n2714
$$ 2754314 2800491 2725608 2691836 2519336 2541458 2455605 2356628 2261986 2240035 2114036 2061322
4699B061322K0263L6000k1908j50655q0999M5003l5698R5146l0821k1137q355
$$ 2061322 2081585 2117585 2095677 1945022 1864023 1909026 1873328 1968474 1937653 1916516 1908161
4688A908161o9018O9427j8372K7384O551j32439J3497q3357p0452m5642k07917
$$ 1908161 1839143 1908570 1890198 1917582 1924133 1791694 1805191 1721834 1651382 1605740 1397823
4677A397823j27335o8522n3288o9580q952m4251l23n4393L278L396Q6871r9229
$$ 1397823 1270488 1201966 1148678 1079098 1070146 1025895 1025572 971179 974457 977853 1064724 965495
4665I65495l1801r4221n7727P7236q6694o8185J2528l2390R42J34639l9568J7431
$$ 965495 933694 839473 781746 858982 772288 704103 716631 684241 685183 819822 780254 797685
4653G97685n9598j12387n2855o9919J22143M1506j1615j24846J57220k8728q0117
$$ 797685 738087 625700 572845 502926 625069 666575 654960 530114 687334 658606 578489
4642E78489N4471j30044m9844J5648L6867Q3540N5345J1785J5469P942k9721l0381
$$ 578489 632960 502916 453072 468720 505587 589127 644472 656257 671726 679668 649947 619566
4630F19566j2549q978J11558L4081r0079k5339j23567r0079k32775J04093J33888
$$ 619566 607017 598039 709597 743678 653599 628260 504693 414614 181839 285932 419820
4619D19820J50523J35197l5130k19614n2570J49397R2967j77622j42480K8976
$$ 419820 570343 705540 670410 450796 398226 547623 640590 462968 320488 349464
4609C49464n983N0696L9309q9412J05667J9810m1704P9780j17924Q685J28447
$$ 349464 343481 394177 433486 344074 449741 469551 427847 507627 389703 398388 526835
4598E26835L9881j66730o4856q543P0056J28243j85862o9624J15323J0419l9613
$$ 526835 566716 399986 335130 326587 396643 524886 339024 269400 384723 395142 355529
4587C55529O6080n1343J6307L4471r6080J21587R5914k5320j25615J01220R8159
$$ 355529 421609 370266 386573 421044 324964 446551 542465 517145 391530 492750 590909
4576E90909n0487L4083O1554O3675p602p2004M94j06965r0218J6905L4524J84340
$$ 590909 540422 574505 636059 699734 692132 620128 620622 513657 423439 440344 474868 659208
4564F59208O5336o0951K8603o0236q315j8154R0904p3793l1041l236L7346M4551
$$ 659208 724544 663593 692196 631960 623645 605491 696395 622602 591561 588325 625671 670222
4552F70222J07252q5356n8654N609P7802R7015J00823o0886k1560J75587o4624
$$ 670222 777474 692118 633464 639073 716875 813890 914713 853827 832267 1007854 943230
4541I43230M0384j44799p9141M9608M6340P9953m8169q7621j7107m7528P5748
$$ 943230 983614 838815 759674 809282 855622 935575 887406 799785 782678 735150 810898
4530H10898J53206j38363P5193N2152m3962p0435Q0795M5179q322o0625N8838
$$ 810898 964104 825741 900934 953086 909124 838689 919484 964663 956341 895716 954554
4519I54554o0888R8932K0076l4847q7363K162J20049n9865n2391l87N0749p0411
$$ 954554 893666 992598 1012674 977827 890464 892626 1012675 952810 900419 900032 950781 880370
4507H80370k7946J09584J8053r4785L3937k6921k378j71535L0858R1082q2009
$$ 880370 852424 962008 980061 885276 919213 892292 889914 718379 749237 840319 758310
4496G58310L1952k5230j14853P7199K17Q4045L6189j29631J06945j3446q5384
$$ 758310 790262 765032 650179 727378 727595 811640 847829 718198 825143 811697 726313
4485G26313k7581q059n1797q758Q8260j33925N2208P3070p410P9181k0781L8172
$$ 726313 698732 690673 638876 630118 718378 584453 636661 709731 702321 781502 760721 798893
4473G98893J6595j5201j6624j9163R366n2578m55j19925N4721N5318J7203k0761
$$ 798893 815488 800287 783663 764500 773866 721288 720833 600908 655629 710947 728150 707389
4461G07389K706Q5877j27643J4775L5600n4830j05813R4966j0058M9051J58217
$$ 707389 710095 795972 668329 683104 718704 663874 558061 653027 642969 692020 850237
4450H50237q2044j10283N2261J76326P7958j54494j01665P8711r686M549q2754
$$ 850237 768193 657910 710171 886497 964455 809961 708296 787007 777321 781870 699116
4439F99116p8747L5145o4641Q265R9732l408Q0397l70M5872M0005O6161l8933
$$ 699116 620369 655514 590873 599138 698870 695462 775859 775489 821361 861366 927527 888594
4427H88594J6716j65410N480K0213M5230J8271J45664p9616l5954J59499J55662
$$ 888594 905310 739900 745380 765593 810823 829094 974758 895142 859188 1018687 1174349
4416A174349o4536j13993L4645L9901J38382K17027J09923P092Q3273k4996L421
$$ 1174349 1109813 995820 1030465 1070366 1208748 1425775 1535698 1542790 1626063 1601067 1604488
4405A604488M9808M5508n9059j04691P7007n9731R4227J19370R6066J6795P7489
$$ 1604488 1654296 1699804 1640745 1536054 1613061 1553330 1647557 1766927 1862993 1879788 1957277
4394A957277L8223J85248L2444j7720K9883r6171J18897L1684K24719J5644K4299
$$ 1957277 1995500 2180748 2213192 2195472 2225355 2129184 2248081 2279765 2504484 2520128 2544427
4383B544427J36124K42838J00319J47338J46947L06535K49889J12356J40670L10099
$$ 2544427 2680551 2923389 3023708 3171046 3317993 3624528 3874417 3986773 4127443 4437542
4373D437542K13429L01703L58933K39009J41780K69216K52306L09073K27155L73620
$$ 4437542 4650971 4952674 5311607 5550616 5692396 5961612 6213918 6522991 6750146 7123766
4363G123766K36009L81291M20021N86766N80715N90451P72205P94345P12004M32104
$$ 7123766 7359775 7741066 8161087 8747853 9328568 9919019 10691224 11485569 12197573 12629677
4353A2629677L34956K88614K69185K36908M42944O35609Q33262Q91365R57162
$$ 12629677 12964633 13253247 13522432 13759340 14202284 14837893 15671155 16562520 17519682
4344A7519682J314484J390501J417648J268289Q66759M01139j87783m89535m26601
$$ 17519682 18834166 20224667 21642315 22910604 23777363 24178502 23990719 23501184 23074583
4335B3074583l06070q3546K45767N73257Q82761J089583J329809J180301J155208
$$ 23074583 22768513 22684967 22930734 23503991 24386752 25476335 26806144 27986445 29141653
4326B9141653P21367K21456o50278j157152j324156j373429j052027m75828k44226
$$ 29141653 29863020 30084476 29434198 28277046 26952890 25579461 24527434 24051606 23807380
4317B3807380j33360K98548L62098N64287O22282K36156n8348o40547j089472
$$ 23807380 23674020 23972568 24334666 24898953 25521235 25757391 25699043 25058496 23969024
4308B3969024j549843j367352j494192j111750p34757p33277n18447r7410k40786
$$ 23969024 22419181 21051829 19557637 18445887 17711130 16977853 16459406 16361996 16121210
4299A6121210k05283Q3342j63846m39597o75838p42210q20984q77208q22045n66681
$$ 16121210 15915927 15999269 15835423 15395826 14719988 13977778 13156794 12279586 11457541 10890860
4289A0890860l93809k18732l04364j79185j92058j19261k57861j81298l44441
$$ 10890860 10497051 10278319 9973955 9794770 9602712 9483451 9225590 9044292 8699851
4280H699851J48796j88698n3879k9352j93516p7182J15023K65909N0953R8104
$$ 8699851 8848647 8659949 8606070 8576718 8383202 8306020 8421043 8686952 8737905 8836009
4270H836009J46478N3892M8942K0174P7358J82941K55928K48784K67118M08692
$$ 8836009 8982487 9036379 9085321 9105495 9182853 9365794 9621722 9870506 10137624 10546316
4260A0546316L81536L55928L15871L49296K99193K76726J03966K20762Q3656J92307
$$ 10546316 10927852 11283780 11599651 11948947 12248140 12524866 12628832 12849594 12933250 13125557
4250A3125557L55797M31687O88548P09047O19482O85547O43042N65741K00712
$$ 13125557 13481354 13913041 14601589 15310636 15930118 16615665 17258707 17824448 18025160
4241A8025160j15681j91940k34559j97778P2630K95236K80086L97362M74763N28291
$$ 18025160 17909479 17717539 17482980 17285202 17357832 17653068 17933154 18330516 18805279 19333570
4231A9333570O42048O45660L76555k51737m95806o45378n71154o58248o83885
$$ 19333570 19975618 20621278 20997833 20746096 20250290 19604912 19033758 18375510 17691625
4222A7691625l08482j25593j40015k2474J99191J70724n434j64727k60437m53225
$$ 17691625 17383143 17257550 17117535 17095061 17294252 17464976 17459542 17294815 17034378 16581153
4212A6581153q07255p39076q00206q32625n07749m32321k98048k02739j35374
$$ 16581153 15773898 15034822 14234616 13401991 12894242 12461921 12163873 11961134 11825760
4203A1825760j50924k63757j27267l74780l16087m64542m24070l94517m33121
$$ 11825760 11674836 11411079 11283812 10909032 10592945 10128403 9704333 9309816 8876695
4194H876695l16169n13701l70822k60763k11464j83650j14839q2320k38984j94028
$$ 8876695 8560526 8046825 7676003 7415240 7203776 7020126 6905287 6822967 6583983 6389955
4184F389955j48141k07078k0217j98127j47134j90638j36316j08610j12067j9507
$$ 6389955 6241814 6034736 6014519 5816392 5669258 5478620 5342304 5233694 5121627 5102120
4174E102120j06536j7985j0161O8058r8176o9637k1461n1664O4405q0077J12526
$$ 5102120 4995584 4977599 4967438 5035496 4937320 4867683 4846222 4794558 4858963 4778886 4891412
4163D891412Q117j5487J38744K43J83525R5597J33555J71012L0054N6810R2214
$$ 4891412 4899529 4884042 5022786 5023029 5206554 5302151 5435706 5606718 5636772 5693582 5785796
4152E785796M6133J43010K34849J8752R0718R6157Q7449R8497L6182K69509J22125
$$ 5785796 5831929 5974939 6209788 6228540 6319258 6415415 6502864 6601361 6637543 6907052 7029177
4141G029177K56137K20991P3836J69686K81677L64301L65795M98208L83775L94420
$$ 7029177 7285314 7506305 7580141 7749827 8031504 8395805 8761600 9259808 9643583 10038003
4131A0038003N07394N21468K09799K41560R2762K29126K93261L31896K76724K38394
$$ 10038003 10545397 11066865 11276664 11518224 11610986 11840112 12133373 12465269 12741993 12980387
4121A2980387N10564M11357M48504P26052Q43081Q15382J006259J106118J294313
$$ 12980387 13490951 13902308 14350812 15076864 15919945 16735327 17741586 18847704 20142017
4112B0142017J600511J531403J671101J988234K263302K371542K750524K922620
$$ 20142017 21742528 23273931 24945032 26933266 29196568 31568110 34318634 37241254
4104C7241254K860991L172524L069341K977816K714771J974646R15070J83947
$$ 37241254 40102245 43274769 46344110 49321926 52036697 54011343 54926413 55110360
4096E5110360n07205o13015l54351J93416Q92359J565135J991706K524489K678452
$$ 55110360 54603155 53990140 53635789 53829205 54721564 56286699 58278405 60802894 63481346
4087F3481346K772470K672000K251565J969586J716519J695371J232007R94590
$$ 63481346 66253816 68925816 71177381 73146967 74863486 76558857 77790864 78785454
4079G8785454J020707R68400J216017J751440K578762L027113L777338M890744
$$ 78785454 79806161 80774561 81990578 83742018 86320780 89347893 93125231 98015975
4071I8015975N583482O156242N471094L329074m29378m159246o774178p217368
$$ 98015975 103599457 109755699 115226793 118555867 118126489 113967243 107193065 99975697
4063I9975697o474597n182965m000203k794273j697833j226057q72199o00770
$$ 99975697 93501100 88318135 84317932 81523659 79825826 78599769 77727570 77126800
4055G7126800m03879o77571q86117j336613j539694j948941k390535k584811k800624
$$ 77126800 76722921 76045350 75159233 73822620 72282926 70333985 67943450 65358639 62558015
4046F2558015k678901k321942j784295j200180o83829m3045L12758K69196J59739
$$ 62558015 59879114 57557172 55772877 54572697 53888868 53845823 54158581 54427777 54587516
4037E4587516j94454r67087j981891k769393l151597l230808l079775k755328
$$ 54587516 54393062 53425975 51444084 48674691 45523094 42292286 39212511 36457183
4029C6457183k558592k220505j951541j786466j570177j149854j063406r85111
$$ 36457183 33898591 31678086 29726545 27940079 26369902 25220048 24156642 23171531
4021B3171531r76613q13734p38126o45114n84030m85432m24345l78963l53328
$$ 23171531 22194918 21381184 20643058 19997944 19413914 18928482 18504137 18125174 17771846
4012A7771846l46458m69053l89307j53445j50584k70865l36845m93431m95118
$$ 17771846 17425388 16956335 16567028 16413583 16262999 15992134 15655289 15161858 14666740
4003A4666740m67574l73010m54952m33388j52695j28828k31479k74510m2228k13469
$$ 14666740 14199166 13826156 13371204 12937816 12785121 12656293 12424814 12150304 12108076 11894607
3993A1894607L638K4632o0222j76912j88046M0684r3520l37984k6751l6378k78315
$$ 11894607 11898245 11922877 11862655 11685743 11497697 11538381 11444861 11106877 11080126 11043748 10765433
3982A0765433j38284n0886k17152k21565r2320o9317l18347n2757j29478n4975
$$ 10765433 10627149 10576263 10359111 10137546 10045226 9975909 9657562 9604805 9475327 9420352
3972I420352l0358j45437P525k30184m2624j46293o0410R0565q0021j13654K3753
$$ 9420352 9389994 9244557 9252082 9021898 8979274 8832981 8772571 8863136 8783115 8669461 8693214
3961H693214J62570j04059n2404J24379j402Q8217k8798r6967O9745J57192J36996
$$ 8693214 8855784 8751725 8699321 8823700 8822298 8910515 8881717 8784750 8854495 9011687 9148683
3950I148683R3499J17922J33694O7929J03041M32858K75954K21813K88918K63395
$$ 9148683 9242182 9360104 9493798 9561727 9664768 10097626 10373580 10595393 10884311 11147706
3940A1147706K61018K75042K25072M87336M94883L88629L91691Q25650O95858
$$ 11147706 11408724 11683766 11908838 12396174 12891057 13279686 13671377 14497027 15192885
3931A5192885P43132Q45663R77302J144913J308940J342629J444299J597146J869396
$$ 15192885 15936017 16781680 17758982 18903895 20212835 21555464 22999763 24596909 26466305
3922B6466305K120307K297186K562723K886366L022347L303852L821242L959596
$$ 26466305 28586612 30883798 33446521 36332887 39355234 42659086 46480328 50439924
3914E0439924M331038M520468M181004L945144L321660K757473K140513J239133
$$ 50439924 54770962 59291430 63472434 67417578 70739238 73496711 75637224 76876357
3906G6876357P91076J73220k75429n03850m50632m59489Q30N0378K95301N11045
$$ 76876357 77667433 77840653 77565224 77061374 76610742 76151253 76152083 76202461 76497762 77008807
3896G7008807M69656K57408j86660p60828j444700k104545k608375l153011l351916
$$ 77008807 77478463 77735871 77549211 76788383 75343683 73239138 70630763 67477752 64125836
3887F4125836l866976l888801l749057l350502l316236k990313k715938k382770
$$ 64125836 60258860 56370059 52621002 49270500 45954264 42963951 40248013 37865243
3879C7865243j885735j925623j603821j509623j482505j355527j125519j062884
$$ 37865243 35979508 34053885 32450064 30940441 29457936 28102409 26976890 25914006
3871B5914006j029943j091114q43212r68760p79475n43188o45614m87298m65404
$$ 25914006 24884063 23792949 22949737 21980977 21201502 20658314 20012700 19525402 19059998
3862A9059998m18132k66547k99163j53598j99711l70692j58076r8852j62156j55391
$$ 19059998 18641866 18375319 18076156 17922558 17722847 17352155 17194079 17095227 16933071 16777680
3852A6777680k21412j25183k29961j29799j47055j70073j13524j97063l4283j54253
$$ 16777680 16556268 16431085 16201124 16071325 15924270 15754197 15640673 15443610 15409327 15255074
3842A5255074p9879L023J64034n4748J3433R691J26029N4766J26001r1972o4314
$$ 15255074 15175195 15178218 15342252 15287504 15300937 15310628 15436657 15491423 15617424 15525452 15461138
3831A5461138J51904j6434L2542j18174m2142J31449N5922l18268L1259L2372
$$ 15461138 15613042 15596608 15629150 15510976 15468834 15600283 15656205 15337937 15369196 15401568
3821A5401568J9960R5881J34011J08794K06162M18149K10668R415J65932J81951
$$ 15401568 15421528 15517409 15651420 15760214 15966376 16384525 16595193 16604608 16770540 16952491
3811A6952491K07453J59741P6033j021q3588j41906k74383j17505q0219k13694
$$ 16952491 17159944 17319685 17395718 17394697 17311109 17169203 16894820 16777315 16697096 16483402
3801A6483402k22022r1239j86683j40157n0746p8523j76925J816n2351j84620
$$ 16483402 16261380 16170141 15983458 15843301 15792555 15714032 15537107 15538923 15486572 15301952
3791A5301952l26002j54774N3190m5275j26619k623r8092j35554l2406j19782
$$ 15301952 14975950 14821176 14874366 14829091 14702472 14699849 14601757 14466203 14433797 14314015
3781A4314015J02919P2940M9885J73329J36066J12277J98237J31683J69079K78390
$$ 14314015 14416934 14489874 14539759 14713088 14849154 14961431 15159668 15291351 15460430 15738820
3771A5738820L55519N93556L72018M05479M67416O76600P67276O53372Q69955
$$ 15738820 16094339 16687895 17059913 17465392 17932808 18609408 19376684 20030056 20900011
3762B0900011Q61308Q98666P97152P43500O28962M84427K26923j29391k43715
$$ 20900011 21761319 22659985 23457137 24200637 24829599 25314026 25540949 25411558 25167843
3753B5167843l39819l59725n37493n99628n16515m58368l35684k13332k26657
$$ 25167843 24828024 24468299 23930806 23331178 22814663 22356295 22020611 21807279 21580622
3744B1580622j69128m165R0347K01913J58082K35463K66633M92783L84037N79835
$$ 21580622 21411494 21407329 21497676 21699589 21857671 22093134 22359767 22852550 23236587 23816422
3734B3816422P96075O24823O18055R21019Q19607R46215J093171J220982J353934
$$ 23816422 24612497 25237320 25855375 26776394 27596001 28542216 29635387 30856369 32210303
3725C2210303J351561J639989J923591K074268K481293K722876K988888L275321
$$ 32210303 33561864 35201853 37125444 39199712 41681005 44403881 47392769 50668090
3717E0668090L799731M247859M535311N184966N860723O487015O910223P282519
$$ 50668090 54467821 58715680 63250991 68435957 74296680 80783695 87693918 94976437
3709I4976437P349777P386173O958576O322058N300704M596869M057755L131398
$$ 94976437 102326214 109712387 116670963 122993021 128293725 132890594 136948349 140079747
3701A40079747K201718J594137Q01287J38162l45100p79657q36504r78991j102859
$$ 140079747 142281465 143875602 144676889 144815051 144469951 143690294 142853790 141874799 140771940
3692A40771940j313130j124368j197631j528884j755612j942814k425772k480745
$$ 140771940 139458810 138334442 137136811 135607927 133852315 131909501 129483729 127002984
3684A27002984k897939k926472l176467l375527l214102k977829k895198k770769
$$ 127002984 124105045 121178573 118002106 114626579 111412477 108434648 105539450 102768681
3676A02768681k620739k741323k828982k926812k830011k897568k775689k578827
$$ 102768681 100147942 97406619 94577637 91650825 88820814 85923246 83147557 80568730
3668H0568730k216784j785975j450019j187441j104126q04861r36159j087007
$$ 80568730 78351946 76565971 75115952 73928511 72824385 72019524 71083365 69996358
3660F9996358j398171j725280k013859k278071k480565k588867k776194k871048
$$ 69996358 68598187 66872907 64859048 62580977 60100412 57511545 54735351 51864303
3652E1864303k577494k568594k209773j964366j562269j475162j043748r36805
$$ 51864303 49286809 46718215 44508442 42544076 40981807 39506645 38462897 37526092
3644C7526092q52503o41762m96958k29107l05132k69084k65414k15537l61004
$$ 37526092 36673589 36031827 35534869 35305762 35000630 34731546 34466132 34250595 33889591
3635C3889591m12320n07890o99096o80230o71226r14187p73458p27025r27092
$$ 33889591 33477271 32969381 32270285 31590055 30918829 30004642 29231184 28504159 27577067
3626B7577067o69776o38729p13624n89646m22494n18851l65271l14915l67985
$$ 27577067 26907291 26268562 25554938 24965292 24542798 24023947 23658676 23343761 22975776
3617B2975776m22656j73342m80497k77839p4471l10836l27763k82225k27336j55536
$$ 22975776 22553120 22379778 21899281 21621442 21546971 21236135 20908372 20626147 20398811 20243275
3607B0243275p4360j3514q6919m6992m9104m1966J11172j18809N1757J31538J16421
$$ 20243275 20168915 20155401 20068482 20021490 19972386 19930420 20041592 19922783 19974540 20106078 20222499
3596B0222499Q84M5577k079J34840K96098K43070L12134J42276R7398O7857K6597
$$ 20222499 20223383 20268960 20266881 20401721 20697819 20940889 21253023 21395299 21492697 21560554 21587151
3585B1587151N0559K4097J874Q9079Q254Q6909K9910J09240J84112K15822J01310
$$ 21587151 21637710 21661807 21663681 21752760 21761014 21847923 21877833 21987073 22171185 22387007 22488317
3574B2488317K91951J07264l4085O0772L56038J85981K36394R2239J14127L02862
$$ 22488317 22780268 22887532 22853447 22914219 23270257 23456238 23692632 23784871 23898998 24201860
3564B4201860M10789M12770N52275N68408O63014Q23689R56309Q09210J185335
$$ 24201860 24612649 25025419 25577694 26146102 26809116 27632805 28589114 29398324 30583659
3555C0583659J267824J379382J460599J808536J879812J934293K314306K345918
$$ 30583659 31851483 33230865 34691464 36500000 38379812 40314105 42628411 44974329
3547D4974329K564183K622781K796445L012386L057241L342825L675077M085800
$$ 44974329 47538512 50161293 52957738 55970124 59027365 62370190 66045267 70131067
3539G0131067M605872M951682N449911O133744O569036O772834P031130P339986
$$ 70131067 74736939 79688621 85138532 91272276 97841312 104614146 111645276 118985262
3531A18985262P151924O733588O374069N717535N147173M378671L922453L279300
$$ 118985262 126137186 132870774 139244843 144962378 150109551 154488222 158410675 161689975
3523A61689975K719937K369870J836478J502991J416787J089309R02285K53419
$$ 161689975 164409912 166779782 168616260 170119251 171536038 172625347 173527632 173781051
3515A73781051l50030r51634j219570j743816k162757k844529l313810l733980
$$ 173781051 173431021 172479387 171259817 169516001 167353244 164508715 161194905 157460925
3507A57460925m184529m186980l889340l798740l522042l134556k378128j757076
$$ 157460925 153276396 149089416 145200076 141401336 137879294 134744738 132366610 130609534
3499A30609534q80550n6001P47026J262930J978570K230653K287934K168517K163998
$$ 130609534 129728984 129672983 130420009 131682939 133661509 135892162 138180096 140348613 142512611
3490A42512611K390384K260322K010482J859508J627338K454645L475588M230532
$$ 142512611 144902995 147163317 149173799 151033307 152660645 155115290 158590878 162821410
3482A62821410L467012N79356k766509k497474p72547O15705J512593K311239
$$ 162821410 166288422 166867778 164101269 161603795 160831248 161446953 162959546 165270785
3474A65270785K020077K024610J603495J192390N52701p848q45931j303007j743726
$$ 165270785 167290862 169315472 170918967 172111357 172664058 172656210 171810279 170507272 168763546
3465A68763546j989556k137647k013522j891060j689625j300690j246885j377641
$$ 168763546 166773990 164636343 162622821 160731761 159042136 157741446 156494561 155116920
3457A55116920j084706n25692K04358m16108l059344p336322r165159p960888
$$ 155116920 154032214 153506522 153710880 153294772 150235428 142899106 133733947 125773059
3449A25773059o907637o034891n466630n000820m494028m227320m146702l909546
$$ 125773059 118865422 112830531 107363901 102363081 97869053 93641733 89495031 85585485
3441H5585485l752631l475474k992359k640377k098501j737523j490500j064127
$$ 85585485 81832854 78357380 75365021 72724644 70626143 68888620 67398120 66333993
3433F6333993p62700m00458l41845l0407K28943M10010M28270P69994O86551J083546
$$ 66333993 65571293 65170835 64828990 64798583 65027526 65437536 65865806 66635800 67322351 68405897
3423F8405897J187227J339271J185880J904229K051828K579491K936480L842885
$$ 68405897 69593124 70932395 72118275 74022504 76074332 78653823 81590303 85433188
3415H5433188M397246N625823O526248P858438P152491P449590Q073931J0766286
$$ 85433188 89830434 95456257 101982505 109840943 116993434 124443024 132516955 143283241
3407A43283241J2641737J5694938J6057728K0766846K9565838M5581729M8559574
$$ 143283241 155924978 171619916 187677644 208444490 238010328 283592057 332151631
3400C32151631K5276291l3302495o6083588m4908472k8850359j7808681j2531319
$$ 332151631 357427922 324125427 258041839 213133367 184283008 166474327 153943008
3393A53943008p949687n618093l741033k931364j383081l63550J188408K251240
$$ 153943008 145993321 140375228 136634195 133702831 132319750 131956200 133144608 135395848
3385A35395848L651229M454046N066698O073532Q097679J0892204J3083941J5151859
$$ 135395848 139047077 143501123 148567821 154641353 162739032 173631236 186715177 201867036
3377B01867036J6424723K2581446L3252781M8763010M7544919J7606844m1421687
$$ 201867036 218291759 240873205 274125986 322888996 370433915 388040759 346619072
3370C46619072n9512542l5998506k1840239j2012416q005879m464409l945872
$$ 346619072 287106530 251108024 229267785 217255369 209249490 204785081 200839209
3363B00839209l180135l483276l341038m722320m954619o194661o499741p173605
$$ 200839209 197659074 194175798 190834760 186112440 181157821 174963160 168463419 161289814
3355A61289814o939353p173910p001399p828776p927329p542158o387880n242004
$$ 161289814 154350461 147176551 140175152 132346376 124419047 116876889 110489009 105247005
3347A05247005m103744l323490k282318k019768k572159m885810n501397m428083
$$ 105247005 101143261 97819771 95537453 93517685 90945526 86059716 80558319 76130236
3339G6130236l264200k736454k461662k273931j997665j701033j185065r68533
$$ 76130236 72866036 70129582 67667920 65393989 63396324 61695291 60510226 59541693
3331E9541693o51117l08738k5765L22515O12252N14964L22052m22775r63705l67015
$$ 59541693 58890576 58581838 58556073 58878588 59490840 60005804 60327856 59905081 58941376 58574361
3321E8574361K04661N28241J058425J610010K233580J998021O13607j693173k027321
$$ 58574361 58779022 59307263 60365688 61975698 64209278 66207299 66820906 65127733 63100412
3312F3100412r38864r6080O25410J124084J799967K189831K487367K557150K557602
$$ 63100412 62161548 62065468 62690878 63814962 65614929 67804760 70292127 72849277 75406879
3303G5406879K513976K473992K053995J415592O98005Q1773q25450j656782k644462
$$ 75406879 77920855 80394847 82448842 83864434 84562439 84644212 83818762 82161980 79517518
3294G9517518l478337l913609m163222m247366m037446m276088l733134l287164
$$ 79517518 76039181 72125572 67962350 63714984 59677538 55401450 51668316 48381152
3286D8381152l096028k673977k170436k114477j884633j764275j576901j442347
$$ 48381152 45285124 42611147 40440711 38326234 36441601 34677326 33100425 31658078
3278C1658078j238094j245874j074089j135863j071331r91302r84886p76157m56418
$$ 31658078 30419984 29174110 28100021 26964158 25892827 24901525 23916639 23140482 22684064
3269B2684064p10884n09494q42946n81251m36144l24018n25093l57063k32158
$$ 22684064 21973180 21463686 20620740 20039489 19603345 19279327 18754234 18397171 18165013
3260A8165013k65239k79290l13890m11582k70917j75827m18022k80096l01358
$$ 18165013 17899774 17620484 17306594 16895012 16624095 16448268 16030246 15750150 15448792
3251A5448792k63420j79907k50119j80354k83716j20148J66708r1322j47530j36447
$$ 15448792 15185372 15005465 14755346 14574992 14291276 14171128 14337836 14246514 14098984 13962537
3241A3962537j71909j04569j48312j12102k29660o641k5862l25848K8088l7882
$$ 13962537 13790628 13686059 13537747 13425645 13195985 13189344 13163482 12837634 12865722 12827840
3231A2827840j81426o4048k23000j82403k9572j37751J0698j15230j00862j6384
$$ 12827840 12646414 12582366 12359366 12176963 12147391 12009640 12020338 11905108 11804246 11787862
3221A1787862j26763M917j87239m6059O3333r0015j35611m6195j36018N9920j08931
$$ 11787862 11661099 11666016 11478777 11432718 11496051 11406036 11270425 11224230 11088212 11148132 11039201
3210A1039201p8500J848j20031k4718j29160j19525P3384n0628k3982j39558j72110
$$ 11039201 10960701 10962549 10842518 10817800 10688640 10569115 10642499 10591871 10567889 10428331 10256221
3199A0256221j86273n4469L7429J22144j48745k2829j5404J93859J96832J10601
$$ 10256221 10069948 10015479 10052908 10175052 10026307 10003478 9988074 10181933 10378765 10489366
3189A0489366j24878Q5582R5377M1600J70080Q0907m0634p7531J45686Q0453J90951
$$ 10489366 10364488 10450070 10545447 10587047 10757127 10838034 10797400 10719869 10865555 10946008 11136959
3178A1136959J14100J73049P9954K214J03579J32625K51227J87629J23279Q8429
$$ 11136959 11251059 11424108 11504062 11506276 11609855 11742480 11993707 12181336 12304615 12393044
3168A2393044J13959L12921Q3068J75840J45476K92379K52743K48414K94110L46726
$$ 12393044 12507003 12819924 12902992 13078832 13224308 13516687 13769430 14017844 14311954 14658680
3158A4658680J32923K02659K85613L72225K73298N04314M02127K90972P11082
$$ 14658680 14791603 14994262 15279875 15652100 15925398 16429712 16831839 17122811 17833893
3149A7833893O70884P87274R06625O38386Q90903J063972J190863J186291J285827
$$ 17833893 18504777 19292051 20198676 20837062 21727965 22791937 23982800 25169091 26454918
3140B6454918J185101J225098J381646J461037J637580J918019J966073J976717
$$ 26454918 27640019 28865117 30246763 31707800 33345380 35263399 37229472 39206189
3132C9206189K455436K590981K852742L530781L627304L921090L937374L882894
$$ 39206189 41661625 44252606 47105348 50636129 54263433 58184523 62121897 66004791
3124F6004791L877251M264258M974729N972395P138337Q517448R794420J1259778
$$ 66004791 69882042 74146300 79121029 85093424 92231761 100749209 110543629 121803407
3116A21803407J2688024J3676321J4502493J5874224J8200879K0894596K4150480
$$ 121803407 134491431 148167752 162670245 178544469 196745348 217639944 241790424
3109B41790424K7761320L2791328M0044952M6281761M4061566K4786171r944208
$$ 241790424 269551744 302343072 342388024 388669785 432731351 457517522 447573314
3102D47573314m2745165n5605005n0511925l9840182k9949530k2253461j7314194
$$ 447573314 404828149 349223144 298711219 258871037 228921507 206668046 189353852
3095A89353852j3771436j1420020j0055274r161478q105145p353973o699482n820698
$$ 189353852 175582416 164162396 154107122 144945644 136840499 129486526 122787044 116966346
3087A16966346n123621m445483l660645l306539k566985k095835j571562p35003
$$ 116966346 111842725 107397242 103736597 100430058 97863073 95767238 94195676 93460673
3079I3460673j38638M92270J096004J686234K367392L247063L660217M164859
$$ 93460673 93322035 93814305 94910309 96596543 98963935 102210998 105871215 110036074
3071A10036074M513475M854996N392753O150163O866194P911524R194029J0800680
$$ 110036074 114549549 119404545 124797298 130947461 137813655 145725179 154919208 165719888
3063A65719888J2814622J4738798J6468432J8822494K2488156K5400255K2361144
$$ 165719888 178534510 193273308 209741740 228564234 251052390 276452645 298813789
3056B98813789Q531930j3860200l1640818l5539796l0809435k3936595j8280869
$$ 298813789 307345719 293485519 261844701 226304905 195495470 171558875 153278006
3049A53278006j4294392j1129111r270236q131016p759473o816821o209217n968986
$$ 153278006 138983614 127854503 118584267 110453251 102693778 95876957 89667740 83698754
3041H3698754n299273m722653m263031l934035l774934l181604l012985k831511
$$ 83698754 78399481 73676828 69413797 65479762 61704828 58523224 55510239 52678728
3033E2678728k545893k242376k114613j976396j810291j504615j474070j388646
$$ 52678728 50132835 47890459 45775846 43799450 41989159 40484544 39010474 37621828
3025C7621828j306587j251747j332052j086999r94923r55445r58872q07413p39990
$$ 37621828 36315241 35063494 33731442 32644443 31649520 30694075 29735203 28927790 28187800
3016B8187800o95985q85155q03686o20152m34766p40129p30573o84922p35626
$$ 28187800 27491815 26606660 25802974 25182822 24748056 24007927 23277354 22592432 21856806
3007B1856806o83435n87612o35517n04955l92063n19427m28756n93062l69566
$$ 21856806 21173371 20585759 19950242 19445287 19053224 18533797 18105041 17511979 17142413
2998A7142413l02333l94433j82518l09422l87271m62258k84675j95385l04494
$$ 17142413 16840080 16445647 16263129 15953707 15566436 15104178 14819503 14624118 14319624
2989A4319624m04591l24114k15777j92826p6882j71369j85403j83131k47311k32510
$$ 14319624 13915033 13590919 13375142 13182316 13105434 12934065 12748662 12565531 12318220 12085710
2979A2085710k66735j69244k24623j70607r1525l38014k25460o7059j06101j14644
$$ 12085710 11818975 11649731 11425108 11254501 11162976 10824962 10599502 10532443 10426342 10311698
2969A0311698n3152j46519j81922k52739o6766j79238q9676j65035j90168j28158
$$ 10311698 10258546 10112027 9930105 9677366 9610600 9431362 9341686 9176651 8986483 8858325
2959H858325j34564k87451m9923k12806j04452j86163j04168j01373p0541j73024
$$ 8858325 8723761 8436310 8386387 8173581 8069129 7882966 7778798 7677425 7606884 7433860
2949G433860j68483j3719N3500j35802k24674o8784Q6926K1550j34863j77251
$$ 7433860 7265377 7251658 7305158 7169356 6944682 6875898 6962824 6984374 6849511 6672260
2939F672260j7062j79878r6508M2768o9233L1714k20904j45959n7470j17948r9329
$$ 6672260 6655198 6475320 6378812 6421580 6352347 6384061 6163157 6017198 5959728 5841780 5742451
2928E742451p7431N103l7017j94744J5122Q7925k8280l9998l9323p0490Q2504
$$ 5742451 5665020 5670123 5633106 5438362 5453484 5541409 5513129 5473131 5433808 5363318 5445822
2917E445822L1179j00452j28695k3081p0596m8887j20709j22661r7621L259J1412
$$ 5445822 5477001 5376549 5247854 5224773 5154177 5105290 4984581 4861920 4764299 4767558 4778970
2906D778970N8908j22230k35952n8233K9497l2614j8661l0919k7476j49018j28833
$$ 4778970 4837878 4715648 4479696 4421463 4450960 4418346 4399685 4368766 4341290 4192272 4063439
2895D063439J9860n5246k6110k27889P8596P0406O2461j21141k4907j8651J5643
$$ 4063439 4083299 4028053 4001943 3774054 3852650 3923056 3985517 3864376 3839469 3820818 3836461
2884C836461o5881j33008q2439R8317j3215n3997J992r77Q7349n8197p8975m984
$$ 3836461 3770580 3637572 3555133 3653450 3640235 3586238 3588230 3587253 3674602 3616405 3537430 3532446
2872C532446j730o7765l5161L8308r5088j3888j3005p315o1707p2840J11240J22640
$$ 3532446 3530716 3462951 3427790 3466098 3371010 3357122 3344117 3336802 3275095 3202255 3313495 3436135
2860C436135p6643k36913J09275l0348j23755m2431O9945n5438n7739j6380M6882
$$ 3436135 3359492 3122579 3231854 3201506 3077751 3035320 3105265 3049827 2992088 2975708 3022590
2849C022590l3930r5075k6834P9186R7924N3971o0571N8993k8089J9477o6960
$$ 3022590 2988660 2893585 2866751 2945937 3043861 3097832 3037261 3096254 3068165 3087642 3020682
2838C020682p3476N0857j2588K141J27593J1450P6465R9470J13388J4974J7366
$$ 3020682 2947206 2998063 2985475 2987616 3115209 3126659 3203124 3302594 3415982 3430956 3448322
2827C448322J18825M8935J01623K50213J92944K06464K10840J9974O8614j28259
$$ 3448322 3567147 3616082 3717705 3967918 4160862 4367326 4578166 4598140 4666754 4538495
2817D538495k63627j85734p8939k44847r7530k07279k49097M2593j18744k59034
$$ 4538495 4274868 4089134 4010195 3765348 3667818 3460539 3211442 3254035 3135291 2876257
2807B876257r0516O5839n3710k6079j8002q536m493J09539J9722p6772j4567K6158
$$ 2876257 2785741 2851580 2797870 2771791 2753789 2745253 2740760 2850299 2870021 2793249 2778682 2804840
2795B804840R2491J6696p1193j49703L5559j73004p7717J25339O9825p4521R3389
$$ 2804840 2897331 2914027 2842834 2693131 2728690 2555686 2477969 2603308 2673133 2598612 2692001
2784B692001J47567J0039J21767J3262o3007J32091K4382J05095Q5740J9094J53369
$$ 2692001 2839568 2849607 2971374 2984636 2921629 3053720 3078102 3183197 3268937 3288031 3441400
2773C441400J03375O3716p5692j17052j88972k76748n0415o9110j48921m9794
$$ 3441400 3544775 3608491 3532799 3415747 3226775 2950027 2899612 2830502 2681581 2631787
2763B631787j87439k4757k6301l3531k18171k1806J25392O9610J47789L8178j35555
$$ 2631787 2444348 2419591 2393290 2359759 2141588 2119782 2245174 2314784 2462573 2500751 2365196
2752B365196j42525K2565L955r4055j01933q8778J3161j83209m0724O6347k3935
$$ 2365196 2222671 2245236 2249191 2155136 2053203 1964425 1977586 1794377 1753653 1820000 1796065
2741A796065p2035O669J58924M976L2836O3410j48309l5246R8454l8094J4266
$$ 1796065 1724030 1730699 1889623 1894599 1927435 1990845 1842536 1807290 1905744 1867650 1881916
2730A881916o4167J0122j02461K3901j136j09467m7581Q6138O7139j08637k3925
$$ 1881916 1817749 1827871 1725410 1749311 1748175 1638708 1591127 1677265 1744404 1635767 1611842
2719A611842n62n111m1708m045J0885M4951j45536q716l885Q6931L0278j0731
$$ 1611842 1611280 1606169 1564461 1560416 1571301 1616252 1470716 1462000 1458115 1545046 1575324 1564593
2707A564593K5532p9566J8866j50528N4038J24752L1370k10057j05873R0295L7774
$$ 1564593 1590125 1510559 1529425 1378897 1432935 1557687 1589057 1379000 1273127 1363422 1401196
2696A401196R4626o10j26266M0881q1449j07747K18555K0552j7428n7544m3669
$$ 1401196 1495822 1495212 1368946 1409827 1328378 1220631 1439186 1459738 1442310 1384766 1341097
2685A341097m0956N4974k3712k2154J7123j40312k9399j5704J04907j61731P6199
$$ 1341097 1300141 1355115 1331403 1309249 1326372 1186060 1156661 1140957 1245864 1084133 1160332
2674A160332K31294q3663k5648o7846m5232k7694n4310L782R2728J30539L2242
$$ 1160332 1391626 1307963 1282315 1214469 1169237 1141543 1087233 1091015 1183743 1314282 1346524
2663A346524p6689R9495m0917o4191m4428j81751R9866j8353L8129K6065j27483
$$ 1346524 1269835 1369330 1328413 1264222 1219794 1038043 1137909 1119556 1157685 1183750 1056267
2652A056267j09738M8371J66247J1455j73924K1122k3612M437N1484q6232j59
$$ 1056267 946529 994900 1161147 1172602 998678 1019800 996188 1000625 1052109 965877 965718
2641I65718m0541N6244J38889m6157r0942n0693l1714q8950k682n1107R4513J04181
$$ 965718 925177 981421 1120310 1074153 983211 932518 900804 811854 809172 758065 852578 956759
2629I56759J8327l0561j28141p3378J26351J21732p9840M1878j7080n252j38493
$$ 956759 975086 944525 816384 743006 869357 991089 911249 953127 936047 930795 792302
2618G92302j23020N7983J65696j5139m5842r4342r8707J16093J06710R3093Q1256
$$ 792302 669282 727265 892961 877822 831980 737638 638931 755024 861734 954827 1036083
2607A036083n7006j83489n8820J26395J7788J30276L1368p139M660j32417l1003
$$ 1036083 979077 795588 736768 863163 880951 1011227 1042595 1035456 1040116 907699 876696
2596H76696K3815J06856l3661j05752R9301K2110o5722r7796J2350m4556m9591
$$ 876696 900511 1007367 973706 867954 967255 989365 923643 825847 838197 793641 744050
2585G44050J96521M3099m6747K1184J0080j19589m8043Q1101N5528l3734k6752
$$ 744050 940571 983670 936923 958107 968187 848598 800555 881656 937184 903450 876698
2574H76698j7812J2968L7273L7674j08358O3297j2202n5433J06348P5375J9070
$$ 876698 858886 871854 909127 946801 838443 901740 889538 834105 940453 1015828 1034898
2563A034898j41081q0100M8661J968j1308J51747L0844n3534n6605j67417o8041
$$ 1034898 893817 813717 862378 864346 853038 1004785 1035629 982095 925490 758073 690032
2552F90032J31131J12501j45716o7390k0954J55395j08294j34438M0664J07700
$$ 690032 821163 933664 787948 720558 699604 854999 746705 612267 652931 760631
2542G60631R5761j18622m3006R3974p084J8950r1741k0085m1369M8086J43138
$$ 760631 856392 737770 694764 788738 781654 800604 708863 688778 647409 695495 838633
2531H38633N195r7097n3173M2918k0338J87760j21280j23615m5946O1254k0684
$$ 838633 843828 746731 693558 736476 716138 903898 782618 659003 613057 674311 653627
2520F53627J30834R7646m4494n0919N7909M04R3158n1214l8407l7039r6826j13909
$$ 653627 784461 882107 837613 786694 844603 845007 938165 886951 848544 811505 714679 600770
2508F00770J9981J24011M4152j4169j22657m7690r6860L2736J33844J6126k9898
$$ 600770 620751 744762 788914 774745 652088 604398 507538 540274 674118 690244 660346
2497F60346l700l4276j1176K12744J43566k12913o4950J325j02805k142P7080
$$ 660346 656646 622370 611194 823938 967504 754591 689641 690966 588161 586019 663099
2486F63099J14553q1771l1701j02982k185J1831J69134O7662j58650M0421K7013
$$ 663099 777652 695881 664180 561198 559013 570844 739978 807640 648990 689411 716424
2475G16424J5399L6281j19797J37578k7344j36440R4803q3652j7575M2750J499
$$ 716424 731823 768104 648307 785885 758541 622101 716904 633252 615677 658427 659926
2464F59926m8994j9720m159N5729J42255q0207q3268J6351J55603o2029l3063
$$ 659926 610932 591212 587053 642782 785037 704830 621562 637913 793516 731487 698424
2453F98424N6940k4395N6947j49142q5472K9958L2587J9362n4280M3797J43418
$$ 698424 755364 730969 787916 638774 553302 583260 615847 635209 580929 624726 768144
2442G68144j6899J223l6210j36614L6324j3512o5204J56789N8221L947j54212
$$ 768144 751245 752468 716258 579644 615968 602456 537252 694041 752262 756209 601997
2431F01997J05793o7364r7737O5578L7451J1762o1233P6477P4891k9358N1433
$$ 601997 707790 640426 542689 608267 645718 657480 596247 672724 747615 718257 769690
2420G69690j14514j02103P0403K7822j5517k7877L5979O7838R1805k4896k18750
$$ 769690 655176 553073 623476 651298 635781 607904 643883 711721 803526 778630 559880
2409E59880O7503N635L2598l3385M0740p0198m745K6673n9420r9372L1473P5373
$$ 559880 627383 633018 665616 632231 672971 602773 598028 624701 565281 465909 497382 572755
2397E72755l2344l0385J48759J4993o2413m1218r24L8978j0967n1256J6987Q7276
$$ 572755 540411 510026 658785 673778 611365 570147 569223 608201 597234 545978 562965 650241
2385F50241N4524j79443K3629M3855n085M1629n8063L8918j3709r4099J5361K5542
$$ 650241 704765 525322 548951 592806 587721 629350 571287 610205 596496 502397 517758 543300
2373E43300O8961J53826Q096k7885m8911J8796M3114k8754Q0952p386o6178j6949
$$ 543300 612261 766087 774183 746298 697387 716183 759297 730543 811495 804109 737931 720982
2361G20982M7405J8495J05147l3215n799J45194o6198p5058l2070J05793R0389
$$ 720982 768387 786882 892029 858814 853015 998209 932011 856953 824883 930676 1021065
2350A021065N8059j41883L8038Q875j22001Q710K465L0808P6777M2720J25033
$$ 1021065 1079124 937241 975279 984154 862153 870863 873328 904136 980913 1023633 1148666
2339A148666J61198P970K4658J9664p2247J87635J5563j4195J47052K05925o1124
$$ 1148666 1309864 1317834 1342492 1362156 1289909 1477544 1493107 1478912 1625964 1831889 1770765
2328A770765J57900p76P5971Q6192K06005J16051J51617J61334K50453k3645J96456
$$ 1770765 1928665 1927889 2003860 2090052 2296057 2412108 2563725 2725059 2975512 2951867 3148323
2317C148323K00523K05979L15889L23407K50222O1227K46785M13371M09620N96305
$$ 3148323 3348846 3554825 3870714 4194121 4444343 4505570 4752355 5165726 5575346 6171651
2307F171651O96896R16547J077934Q32991N83065J060621R48982J297816J384260
$$ 6171651 6868547 7785094 8863028 9696019 10279084 11339705 12288687 13586503 14970763
2298A4970763K034977K122146K868567K990003L242714M296304O844198R349436
$$ 14970763 17005740 19127886 21996453 24986456 28229170 32525474 39369672 48719108
2290D8719108P355517k724637j2536810r305004n591622l783660k669585k000477
$$ 48719108 56074625 53349988 40813178 31508174 25916552 22132892 19463307 17462830
2282A7462830j582603j329001j140148r37816o83215o04427m38769m28300p87273
$$ 17462830 15880227 14551226 13411078 12473262 11790047 11185620 10746851 10318551 9531278
2273I531278q31065p85202m44373n06961n83081m13147m18807k96266j89383k76618
$$ 9531278 8700213 7915011 7470638 6963677 6380596 5967449 5548642 5252376 5062993 4786375
2263D786375j88391k79462k08939j10511q7268j13534j95262o4624j16259l10591
$$ 4786375 4597984 4318522 4109583 3999072 3911804 3798270 3603008 3538384 3422125 3111534
2253C111534q0549n8779j93157r5425q9079L0652J3363j01452r5746j55044p8047
$$ 3111534 3030985 2972206 2779049 2683624 2594545 2625197 2638560 2537108 2441362 2286318 2208271
2242B208271m7502Q5481J9860j28454j4822n5601q8327n3113j12377M603j0539
$$ 2208271 2160769 2246250 2266110 2137656 2122834 2067233 1978906 1925793 1813416 1818019 1807480
2231A807480m7432j44377p1781p4610j90629P9049O3242r4552r969q4735K8137
$$ 1807480 1760048 1615671 1543890 1469280 1278651 1357700 1420942 1326390 1316421 1231686 1259823
2220A259823l7175J21176J24096n1620l5421M5941P5307j21293p2337M9763j38600
$$ 1259823 1222648 1343824 1467920 1416300 1380879 1426820 1502127 1380834 1308497 1358260 1219660
2209A219660n9677k0673M7056K5123j72510O0043M115K5359o2703J9046n8632
$$ 1219660 1159983 1139310 1186366 1211489 1038979 1099022 1103137 1128496 1065793 1084839 1026207
2198A026207j83693q90L2602J607J78880K4020k4438q3970N8693r7401L4862J1112
$$ 1026207 842514 841624 874226 875833 1054713 1078733 1054295 970325 1029018 931617 966479 977591
2186I77591P1833r5471n4274r2000O7993N5885j9666j86119K2646R0474l0513
$$ 977591 1049424 953953 899679 807679 875672 931557 911891 725772 748418 838892 808379
2175H08379j4670p7388L9535L4956J32752k4093p3878p4149L3680N6798k424J8980
$$ 808379 793709 716321 755856 790812 923564 899471 825593 751444 785124 841922 839498 858478
2163H58478O8581j16681n6404J66748N041j7134m9057j99591n3091J96701Q2336
$$ 858478 927059 810378 753974 920722 925763 908629 859572 659981 606890 803591 885927
2152H85927j11103j38611r2634P3606K4273j65377Q388R872L3814P4934r861j39697
$$ 885927 774824 636213 543579 617185 641458 476081 484469 494341 528155 603089 593228 453531
2140D53531L5807J53347l6230J36443j89095R871j25495n835K8684o1795P8210
$$ 453531 489338 642685 606455 742898 553803 563674 438179 432344 461028 399233 477443
2129D77443n5671J0874J05797o5364j24531O3466Q3532l086J40956n7185J05064
$$ 477443 421772 432646 538443 473079 348548 412014 495546 492460 633416 576231 681295
2118F81295P6706r9527l2759O381N0842N2357k344j22572m3342M6778n8834M38
$$ 681295 758001 658474 625715 632096 682938 735295 732951 610379 567037 613815 554981 555419
2106E55419j34649j1799J16140m6846q3628J7379O7748M0875R4322n4021l0193
$$ 555419 420770 408971 525111 478265 394637 412016 479764 520639 614961 560940 530747
2095E30747n3534O6529j27006l2272J37495n859l1615P862J0622j09960j30226
$$ 530747 477213 543742 416736 384464 521959 516100 484485 492347 502969 393009 262783
2084B62783K9433K6059K7177J40535O5134l40k2097l9903q6592L6530J13824k7810
$$ 262783 292216 318275 345452 485987 551121 550781 528684 488781 402189 438719 552543 524733
2072E24733n6348m9599K4984J2779m7466O5620J12171J7438l3369j0548r1264
$$ 524733 468385 418786 443770 456549 409083 474703 586874 604312 570943 560395 469131
2061D69131j4330L2485j14865J16106n4735N6646J19775j36011j36695j2056j08092
$$ 469131 454801 487286 372421 488527 433792 490438 610213 474202 337507 325451 217359
2050B17359J18123p230L8004J38546J71358n4835O423m9512k17551Q2556m6514
$$ 217359 335482 328252 366256 504802 676160 621325 627748 578236 360685 443241 396727
2039C96727J9266J18501k562K6148p0001j22494J18724l0433m7993L5139k8786
$$ 396727 415993 534494 531932 558080 488079 365585 484309 453876 405883 441022 412236
2028D12236m4384J73469q0240K8443K2528l4338j2972M4169P3536q5209q7324
$$ 412236 367852 541321 461081 489524 512052 477714 464742 508911 582447 497238 409914
2017D09914J15113J90396j06163j38908J9886r5511n3102J70075k5755n1871n867
$$ 409914 525027 715423 609260 470352 490238 394727 341625 511700 485945 434074 428207
2006D28207j6460J36291O4734j63353M6036K8257k6505k16327O9341J4607k7783
$$ 428207 411747 548038 612772 449419 495455 523712 497207 280880 350221 364828 337045
1995C37045O5984k5348k0461P4555J13238m8740J771j96044Q8408m0215j17748
$$ 337045 403029 377681 357220 431775 545013 496273 498044 302000 390408 350193 232445
1984B32445K3460J02278K2890J9811j8541m5333Q0343J0110m6548J10650k6812
$$ 232445 255905 358183 381073 400884 382343 337010 417353 427463 380915 491565 464753
1973D64753k5722l0176j14172k5267J3572L4955k8464k6996p1363r677K06471
$$ 464753 439031 408855 294683 269416 282988 317943 289479 262483 191120 181443 387914
1962C87914M0395L8305l5530L9468j0570m5954K6214k78632K7614J03909k2646
$$ 387914 428309 466614 431084 470552 459982 414028 440242 161610 189224 293133 270487
1951B70487J61941K3855k7527m8577K7243j44218p2552J15589O2149l6918p5377
$$ 270487 432428 456283 428756 380179 407422 263204 190652 306241 368390 331472 256095
1940B56095l0708J12649J86213j21253l1829J3122j46769p3458O8606Q7403m0220
$$ 256095 225387 338036 524249 402996 371167 384289 237520 164062 232668 320071 279851
1929B79851k3577n9404O3871k8340o8431J47249J829M5028K386j1395p9325J82050
$$ 279851 256274 196870 260741 232401 163970 311219 313048 358076 360462 349067 269742 451792
1917D51792j0400j04006l7987k9462r5897Q1711J4759J2753L7590M320j5662r7974
$$ 451792 441392 337386 299399 269937 174040 255751 270510 283263 320853 325173 309511 211537
1905B11537J3086O3887L6490l9614K6573Q5563j32386j12897N9287r6418K5634
$$ 211537 224623 288510 325000 285386 311959 397522 265136 152239 211526 115108 140742
1894A40742K5606P863M8469j9012K9935J18006R8431l6899m5469r3925j19490
$$ 140742 166348 174211 222680 203668 233603 351609 450040 413141 367672 273747 154257
1883A54257k9375O8146J52709N5085j70792j85608J32522K6744n7489L9094k8785
$$ 154257 124882 193028 345737 400822 230030 44422 176944 203688 146199 185293 156508
1872A56508q4712Q3214o2033J9684m5727l4938R5721J25574N8400J5083L2485
$$ 156508 71796 155010 92977 112661 66934 31996 127717 253291 311691 326774 359259
1861C59259m1927p0821m650O4214K0315j34897Q671N2120M8715r1633j4838P3968
$$ 359259 317332 246511 241861 306075 326390 191493 200164 252284 300999 209366 194528 268496
1849B68496k522j4092j4400J0350o0737J15029K1082k3412j406j13185o2700K3274
$$ 268496 265974 251882 237482 247832 187095 302124 323206 299794 298388 185203 122503 145777
1837A45777M8876k668j31246Q5989j08713R6175R7197O2899o1996K1953R0104
$$ 145777 194653 191985 60739 146728 38015 134190 231387 294286 232290 254243 344347
1826C44347p8026o5448k3623j72763N5677J93135j553j16087L6432M9447j00250
$$ 344347 266321 200873 177250 4487 60164 253299 251746 135659 172091 221538 121288
1815A21288O9758j31618r733J09212n8023O9972J08116O3563K8033j81202M1535
$$ 121288 191046 59428 49695 158907 100884 170856 278972 342535 370568 189366 230901
1804B30901n7422P746J2877J26617K0092o0592M7500j42472M0982Q6858Q439O2700
$$ 230901 173479 181225 194102 320719 340811 280219 327719 185247 226229 313087 321526 384226
1792C84226n6016l6150j26436m1437j8399Q1540O1931O4789P3213j29812j29272
$$ 384226 328210 292060 165624 124187 105788 187328 249259 314048 387261 257449 128177
1781A28177L430J00897j46001j1872O8020J46554Q0805p8579o2742K0117N8154
$$ 128177 131607 232504 86503 74631 142651 289205 370010 291431 228689 248806 306960
1770C06960r5130L7747l7432k08761P9234j4117O6376K5163l7780o2535J10703
$$ 306960 211830 249577 212145 3384 82618 68501 134877 160040 122260 59725 170428
1759A70428J7193K6090r2168J259J0723N2601J23735r7639k5621M4411Q436O0956
$$ 170428 187621 213711 121543 122802 133525 186126 309861 212222 186601 231012 239448 300404
1747C00404m1401q6824J8658N8268L3501j76827n4779j7847J23956K2412M4974
$$ 300404 259003 172179 190837 249105 282606 105779 51000 33153 157109 179521 224495
1736B24495M490k5547p2946Q1949J26963k754r3925o0155q0595J035L5275q5292
$$ 224495 228985 203438 130492 212441 339404 336650 242725 182570 101975 103010 138285 52993
1724E2993m9743Q5388r5837J7182K3048J08757O4724l0508R9137M1462j03020
$$ 52993 3250 88638 -7199 9983 33031 141788 206512 176004 275141 316603 213583
1713B13583p4479Q1445j58196N4867N3658P8092O9220j51730J4678N6907j41210
$$ 213583 139104 220549 62353 117220 170878 248970 318190 166460 181138 238045 96835
1702I6835o9827J88259l2250j25637J2090N8024J37764j6313l4609r918K2620
$$ 96835 27008 215267 183017 57380 69470 127494 265258 248945 214336 204418 227038
1691B27038j593L7057l0325j16135P8569O7301n1309M8543R5240n2590o1629m4401
$$ 227038 225445 262502 232177 116042 194611 261912 210603 259146 354386 301796 240167 195766
1679A95766O2446k5918k3845j22083j01877J11635M1322l1390j22964o4486J97488
$$ 195766 258212 232294 208449 86366 -15511 96124 137446 106056 -16908 -81394 116094
1668A16094J31873L8270p3865j1015R8138p3055j7869N5766R9205j47500O765
$$ 116094 247967 286237 212372 201357 299495 226440 208571 264337 363542 216042 222807
1657B22807Q8978J1928l6780K9997m4773o0153O5261o9229r1634o8055P40J10228
$$ 222807 311785 323713 286933 316930 272157 212004 277265 208036 116402 48347 49087 159315
1645A59315J67363p9324j15493J00123L988m1577m322P1311N6556j55215N7654
$$ 159315 326678 247354 131861 231984 235972 194395 190073 261384 317940 162725 220379
1634B20379N3055Q9875J2974q3368j36220J7856L8253k508j12072p0281o1413
$$ 220379 273434 363309 376283 292915 156695 174551 212804 210296 98224 27943 -33470
1623c3470M7326M9083j7405J7746O0187J13173O848o3974j33272n7001q7389J14569
$$ -33470 13856 62939 45534 63280 123467 236640 243488 179514 46242 -10759 -98148 16421
1611A6421J10020M8993N250m9285q0283P9970n5935J49365n2774j77071N4103
$$ 16421 126441 175434 180684 131399 51116 131086 75151 224516 171742 -5329 48774
1600D8774J4307r5439O3811Q1865j8614R126j08178Q5905K1019n1585j1130p4188
$$ 48774 63081 -32358 31453 113318 94704 103830 -4348 81557 102576 50991 39861 -34327
1588c4327N9531M6778L0346J6461o5919N2071J04982K5832Q140j62836p2172L5032
$$ -34327 25204 71982 102328 118789 52870 104941 209923 235755 243895 81059 8887 43919
1576D3919L8314J20922j1613r9943Q7677J6680N1419q6813j14204J6587J23574
$$ 43919 82233 203155 191542 91599 179276 195956 247375 160562 46358 62945 186519
1565A86519j214k06504J77984J09402j9078q8274r1160L2016J37055J1037Q4453
$$ 186519 185305 -21199 156785 266187 247109 158835 67675 99691 236746 247783 332236
1554C32236r6835Q354Q1414j7807m0606j05894k5395K7968o2270j84838J49386
$$ 332236 235401 243755 325169 307362 266756 160862 135467 163435 101165 -83673 65713
1543F5713K2833L3793j60929O1560O8665j28553J03485P6781l9424J6381m7983
$$ 65713 88546 122339 -38590 22970 91635 -36918 66567 143348 103924 120305 72322
1532G2322j4050M8964p3932J9945l0276l8483N6689L7020L5321j41836j37924
$$ 72322 58272 107236 33304 53249 22973 -15510 41179 78199 113520 -28316 -166240
1521a66240J09607J60113p9530J3112J72484k2112j296m0126J7550o6669j35121
$$ -166240 -56633 103480 23950 37062 209546 187434 186138 146012 163562 96893 -38228
1510c8228J29414K2911N0640N6055l3410k5283M1250M3570p5313K9888K0280m5519
$$ -38228 91186 114097 164737 220792 187382 162099 203349 246919 171606 201494 221774 176255
1498A76255j05294K1346J25323j24678n1156J74781k02944j31K815K2548O735
$$ 176255 70961 92307 217630 92952 41796 216577 13633 13502 16317 38865 45600
1487D5600J99953K1350k4545j02052k116N6414L6514n6137r5373M6755k9634M786
$$ 45600 245553 266903 242358 140306 138190 194604 231118 174981 79608 126363 96729 101515
1475A01515K584p3190N7023O0715L6922r8536K23p0980l3174L7011n495M3962
$$ 101515 104099 30909 87932 148647 185569 87033 87256 16276 -16898 20113 14618 58580
1463E8580q0338J03446O8038M2500j3135p0219j7058J16490j50947k8860o0622
$$ 58580 -21758 81688 149726 192226 179091 108872 91814 208304 57357 28497 -32125
1452c2125k112K14307q557k2751J17514k4669p3726j01711J5980P3098m3249M886
$$ -32125 -34237 180070 171513 148762 266276 241607 167881 66170 82150 155248 111999 116885
1440A16885o5725n6111j3775J20486J2665o4422N9659O3740k6629r4880N0633
$$ 116885 51160 -4951 -18726 101760 114425 50003 109662 173402 146773 51893 102526
1429A02526O518L512k6339o1298p6783R4836R5571Q1264j8015o9669q0469L4317
$$ 102526 109044 112556 86217 24919 -51864 42972 138543 219807 201792 132123 51654 85971
1417H5971k3938N7522M6670n997o5176N8232n2258n1858K7209m6501J33496k4322
$$ 85971 62033 119555 166225 160228 95052 153284 101026 49168 76377 29876 163372 139050
1405A39050l6465K6484P9041k5491j30515J04720R5132O1124j06082n4241R4811
$$ 139050 102585 129069 208110 182619 52104 156824 251956 313080 206998 152757 247568
1394B47568p4673j5422J31117j69354j17695O4328l0709K9040q2861M9760M764
$$ 247568 172895 157473 288590 119236 1541 65869 35160 64200 -18661 31099 35863
1383C5863J48570l2862P6216q5910j37891j4745J30848N5238L1453J6057j04047
$$ 35863 184433 151571 227787 141877 3986 -10759 120089 175327 206780 222837 118790
1372A18790r0085o0800K42208q7193j60252J05431J02238m5599o0652P3579K852
$$ 118790 28705 -32095 210113 122920 -37332 68099 170337 124738 64086 137665 140517
1361A40517J0212J42088j56669l8892j3457k5722l1612j5684R4037J63587j59738
$$ 140517 150729 292817 136148 97256 83799 58077 26465 10781 104818 268405 108667
1350A08667j09795J0780L1240J1602j06695J45112O1701P4429k75523j4067J36060
$$ 108667 -1128 9652 40892 52494 -54201 90911 152612 227041 -48482 -62549 73511
1339G3511L0541o1878j04303Q1738Q9278P7608P285p3844o2346l5555q5712m62
$$ 73511 104052 42174 -62129 19609 108887 186495 193780 119936 57590 22035 -63677 -64139
1327f4139O1741J13670k8334j43224N8952J00218o7177O2986p5919R3604P457
$$ -64139 -2398 111272 82938 -60286 -1334 98884 31707 94693 18774 112378 119835
1316A19835r319r0902N8126l0417j3972P1216M6960o5545j12158L7212L65o3492
$$ 119835 110516 19614 77740 47323 33351 104567 151527 85982 -26176 11036 11401 -52091
1304e2091J5334N2963k2209L0304n7050J10774J879K8770o9999n5285K0939k7339
$$ -52091 -36757 16206 -6003 24301 -32749 78025 79904 108674 38675 -16610 4329 -23010
1292b3010j20278N5985J47212J47868o8386M1622o6759J29945p9797j31394Q0226
$$ -23010 -143288 -87303 59909 207777 139391 181013 114254 244199 164402 33008 113234
1281A13234j24183J20312N9296L8157m491j34702j14619J63720R6888q5519j1253
$$ 113234 -10949 109363 168659 206816 202325 67623 -46996 116724 213612 128093 116840
1270A16840l3457k0249k8147P870K1168n5406P4353j2048O2663M9941j95033J9697
$$ 116840 83383 63134 34987 42857 64025 8619 82972 70924 133587 183528 -11505 8192
1258H192P1696O0741N6444l220j30007o3620o8978j8778l6180Q0153J36226O1333
$$ 8192 79888 140629 197073 193853 63846 226 -68752 -87530 -123710 -43557 92669 154002
1246A54002L6749o8348r3407l5049k4823o6128K6426J11294l1409J4346M6319
$$ 154002 190751 122403 28996 -6053 -30876 -97004 -70578 40716 9307 23653 69972
1235F9972M1516p703r0644M6116l2634J03441j62560o5513L1179J18805n2241
$$ 69972 111488 103785 13141 59257 26623 130064 -32496 -98009 -66830 51975 -266
1224b66M7564k8220l6386J11037J6099j35948l0679J18374n3724P7269M0801k3258
$$ -266 47298 19078 -17308 93729 109828 -26120 -56799 61575 7851 85120 125921 102663
1212A02663Q9076l7772j36022J3274N5801O3474m2087j624N7631n3194K2177O5208
$$ 102663 191739 153967 17945 31219 87020 150494 108407 106783 164414 111220 133397 198605
1200A98605j47050J0518L9162O7787p1925l7092Q6704j01396q1613O5148m4376
$$ 198605 51555 62073 101235 169022 97097 60005 146709 45313 -36300 28848 -15528
1189a5528J6242R281m2142M1582J12185p2201K0097k0248j3581P1610j3747n9138
$$ -15528 714 9995 -32147 9435 121620 49419 69516 49268 35687 107297 93550 34412
1177C4412p3997J04571K2110l3209J12141J63l5489m3824k086r0489j04687L6951
$$ 34412 -39585 64986 87096 53887 166028 166191 130702 86878 84792 -5697 -110384 -73433
1165g3433J28260L6246j00247L6975k6564k0241N9819k1795J8814r776L1372J9836
$$ -73433 54827 91073 -9174 27801 1237 -19004 40815 19020 37834 28058 59430 79266
1153G9266n9374J55942r7425j18673Q405J34526M62r1839M0921N4627m293M8041
$$ 79266 19892 175834 78409 -40264 -31859 102667 103129 11290 52211 106838 102545 150586
1141A50586K4350r7954j84697J22836J13643j44744q0399l6743l2763J32238R1620
$$ 150586 174936 76982 -107715 15121 128764 -15980 -96379 -133122 -165885 -33647 57973
1130E7973L1372M2049r1362k1086m8108J64642J18099l47868r43K5421j3853P8322
$$ 57973 89345 131394 40032 18946 -29162 135480 253579 -94289 -95232 -69811 -83664 -5342
1118e342K2646k8113j3055N116o4402J08302P0256m0753L4117o1321l5293Q6422
$$ -5342 17304 -10809 -23864 -18748 -83150 25152 95408 54655 88772 27451 -7842 78580
1106G8580o0148R295j73769L5100J09876L6945N0522J46982o2680q3423L3581
$$ 78580 18432 27727 -146042 -110942 -1066 35879 86401 233383 170703 87280 120861
1095A20861j13345N5003q3040J34661N8732J36219k46026j6071J36210j97241
$$ 120861 7516 62519 -20521 114140 172872 309091 63065 46994 183204 -14037
1085a4037l1849J84198j3505j08982l6084p6665J39239j30136O6219L1765j6945
$$ -14037 -45886 138312 124807 15825 -20259 -96924 42315 -87821 -21602 10163 -6782
1074f782O4851j2652o71j0432k6486N0587p3149o3319J34763j4885J38631K19567
$$ -6782 58069 45417 44746 34314 7828 58415 -14734 -78053 56710 41825 180456 400023
1062D00023k29339l4575j06691N6622J17809r6114j20666l6907Q021N8600J05189
$$ 400023 170684 136109 29418 86040 203849 107735 -12931 -49838 -41817 16783 121972
1051A21972o8172N9498m7025l1578K0810o970q6564n1200M1471L9896q5085j2913
$$ 121972 53800 113298 66273 34695 55505 48535 -38029 -89229 -47758 -7862 -92947 -105860
1039a05860k3926P6459Q9214p6256J18096r0939n6969Q6709n5913P3761m9116
$$ -105860 -129786 -53327 35887 -40369 77727 -13212 -70181 16528 -39385 34376 -14740
1028a4740J6817J84427j05373m4658J79180k06786j49604J04203J529j4927j11022
$$ -14740 2077 186504 81131 36473 215653 8867 -140737 -36534 -35005 -49932 -160954
1017a60954N1327N9589j62042K10657J18081J0302j00060M5566J04309j42007
$$ -160954 -109627 -50038 -212080 -1423 116658 126960 26900 72466 176775 34768
1007C4768J096q1770J1249j42770O8463J52696N6108K9023n1554k16951N3694
$$ 34768 35864 -45906 -34657 -177427 -108964 43732 99840 128863 77309 -139642 -85948
996h5948J41525Q2070p9804j3711K0091M603j7499N7982k9803r2312J27866j0631
$$ -85948 55577 137647 57843 44132 64223 68826 51327 109309 79506 -12806 115060 104429
984A04429o9753j18884n1445M3386M1174l3233j97252J6475J30090R1705M441
$$ 104429 34676 -84208 -135653 -92267 -51093 -84326 -281578 -265103 -135013 -43308 -38867
973c8867J12311J48852j55554n1293L689k3459O7404J3531l7646L2895Q5842m6256
$$ -38867 73444 222296 66742 15449 19138 -4321 63083 76614 38968 71863 157705 111449
961A11449p0122P6649R878J3323k3199r472j10874j49716K0691P0998o9336P1225
$$ 111449 41327 117976 127854 141177 117978 108506 -2368 -152084 -131393 -60395 -129731 -58506
949e8506J75490m1793n1346n9130O3692M0400M1892j45520j05980J15644L4609
$$ -58506 116984 75191 23845 -35285 28407 68807 110699 -34821 -140801 -25157 9452
938I452j46058J75031l6460j52670l8462J7972J07369N681J06502m1083J8827
$$ 9452 -136606 38425 1965 -150705 -189167 -171195 -63826 -58145 48357 7274 26101
927B6101P8083j09641r7354J403p1627J76246M9830j33359N9974j7385j27875
$$ 26101 104184 -5457 -102811 -101408 -173035 3211 53041 -80318 -20344 -37729 -165604
916a65604P2354J11740j08928j39681J81565L3859K346m5199R6810j08265Q6676
$$ -165604 -93250 18490 -90438 -230119 -48554 -14695 -12349 -57548 39262 -69003 17673
905A7673J07655m5452o8561J29071o0956o5094m0016P553J18382P3763r3925n1368
$$ 17673 125328 79876 11315 140386 79430 14336 -25680 -18127 100255 174018 80093 28725
893B8725n1569r9811J05465O0553o1305n7955J818Q7731P7399k0266q3100J45666
$$ 28725 -22844 -122655 -17190 43363 -17942 -75897 -74079 13652 91051 70785 -12315 133351
881A33351o9416p0392O4425j00058r653K7220j38033J00094M7789P4896K7113
$$ 133351 63935 -6457 57968 -42090 -51743 -24523 -162556 -62462 -14673 60223 87336
870H7336j47444o4429J14890J6908k4437J00509l4731q8978p8233m4125J1856
$$ 87336 -60108 -124537 -9647 7261 -17176 83333 48602 -40376 -118609 -162734 -150878
859a50878Q9701j26457O644j29060J74477P2308P4919m32m7677k8100p7686K0155
$$ -150878 -61177 -187634 -180990 -310050 -135573 -63265 11654 11222 -36455 -64555 -142241 -122086
847a22086M7404J2696J9556Q647J56910r6163K1147l4749P998r2836j8669K01173
$$ -122086 -74682 -61986 -42430 -33783 123127 26964 48111 13362 21360 -71476 -90145 111028
835A11028o0700j3096J15031k35776j868J31327j6414r6251K6555J20526j29983
$$ 111028 50328 37232 152263 -83513 -85381 45946 29532 -66719 -40164 80362 -49621
824d9621j05919K644N526N6049J05657m190k2893j6537j05983N9203J05798J02536
$$ -49621 -155540 -152896 -147370 -91321 14336 10146 -12747 -29284 -135267 -76064 29734 132270
812A32270j525j208m7822O100N6969m528j15788l4436J21103m2719j24903p8517
$$ 132270 130745 129537 81715 87815 144784 140256 24468 -9968 111135 68416 -56487 -135004
800a35004p115K7734N9993p0499O149J53335o9382M3614M1865q6236R3939o6834
$$ -135004 -142119 -114385 -54392 -124891 -118742 34593 -34789 8825 50690 -35546 58393 -8441
788h441L0453K0075M6908N8093l9072j02283M0266k2995j7805J3884k5083K2634
$$ -8441 22012 42087 88995 147088 108016 5733 45999 23004 5199 19083 -6000 16634
776A6634j43739p3388R2943K248j1940j2039r8470K02123P0214o7134R2298L429
$$ 16634 -127105 -200493 -107550 -105302 -117242 -129281 -227751 -25628 44586 -22548 69750 73179
764G3179j56597j16721J44209k8411n2191L1385L2523j37440j442N4862P8182
$$ 73179 -83418 -200139 -55930 -84341 -136532 -105147 -72624 -210064 -211506 -156644 -78462
753g8462N8341M838J36984l5173j46243P1008l9645j048p1839O6218J61396j43399
$$ -78462 -20121 -15283 121701 86528 -59715 11293 -28352 -29400 -101239 -35021 126375 -17024
741a7024j15194J34939N5306j10398n5023p1525j7726N8555Q8220J23532p8599
$$ -17024 -132218 2721 58027 -52371 -107394 -178919 -196645 -138090 -49870 73662 -4937
730d937N9525K9005o4636J36248j49127J2510m4805j9690O0281l3914K6494p3791
$$ -4937 54588 83593 18957 155205 6078 18588 -26217 -45907 14374 -19540 6954 -66837
718f6837l9078j9236N0743Q368J05991l7287k402k716j21766j34900J17937k0411
$$ -66837 -105915 -125151 -74408 -66040 39951 2664 262 -2454 -124220 -259120 -141183 -161594
706a61594J08712J4855o7119n580M4285j0785r21J79552q1958m6532L0893r9580
$$ -161594 -52882 -38027 -105146 -110726 -66441 -77226 -78147 101405 19447 -27085 3808 -95772
694i5772q8627J29002P3400j6760j83621J31569R063j04083l0950L3752J31194
$$ -95772 -184399 -55397 18003 1243 -182378 -50809 -41746 -145829 -176779 -143027 -11833
683a1833O7274K5408j49177p5718J7997J00022Q2939j2787m2513k4427k4487p6428
$$ -11833 55441 80849 -68328 -144046 -126049 -26027 56912 44125 1612 -22815 -47302 -123730
671a23730j4324o6887k0840O1554L3603J19855M0285j11081q0143R7786L633o8635
$$ -123730 -138054 -204941 -225781 -164227 -130624 -10769 29516 -81565 -161708 -63922 -60289 -128924
659a28924J40619K8035M0383l6799L9162j74622j4685N4850L5960q3345l4804
$$ -128924 11695 39730 80113 43314 82476 -92146 -106831 -51981 -16021 -99366 -134170
648a34170Q5209m2360L9284k04904O3643J03530j37621M2939L0302J33970N3682
$$ -134170 -48961 -91321 -52037 -256941 -193298 -89768 -227389 -184450 -154148 -20178 33504
637C3504J3471n4935q0241L6119M2804P2970q1885p8248K6407o0250J2845P6031
$$ 33504 46975 -7960 -88201 -52082 -9278 63692 -18193 -96441 -70034 -130284 -117439 -41408
625d1408m6444L8151o8975Q6776P2083q7185r825p4982O9375l4486m3070L7091
$$ -41408 -87852 -49701 -118676 -31900 40183 -47002 -56827 -131809 -62434 -96920 -139990 -102899
613a02899L0173M3003j06210m5095L9931J06932j30823Q691J29235l6063o650
$$ -102899 -72726 -29723 -135933 -181028 -141097 -34165 -164988 -156297 -27062 -63125 -69775
602f9775j24697P2662r015p1195J45679J0755J6373k3387k7045P503m2761j386
$$ -69775 -194472 -121810 -130825 -202020 -56341 -45586 -29213 -52600 -79645 -72142 -114903 -116289
590a16289p8187k0211J51852j28211L5532P9828j9252K1696k8149J5526j6768
$$ -116289 -194476 -214687 -62835 -191046 -155514 -75686 -94938 -73242 -101391 -85865 -102633
579a02633L602j2209L9449J1445M5847m1826k0107j29465O8115P3690Q3656N1059
$$ -102633 -99031 -111240 -71791 -60346 -14499 -56325 -76432 -205897 -137782 -64092 19564 70623
567G0623j4113q647n2415Q7993o5108R197N1865O8101k35249j1268J57263M3743
$$ 70623 56510 47863 -4552 83441 18333 27530 79395 147496 -87753 -99021 58242 101985
555A01985j38631n8719K5932m1692K9149k1748L5725j14601m945j8783J19882
$$ 101985 -36646 -95365 -69433 -111125 -81976 -103724 -67999 -182600 -187545 -206328 -86446
544h6446m9700o1758K568o1146J06425l2742J68404J21260n3637j93907k1263
$$ -86446 -136146 -197904 -195336 -256482 -150057 -182799 -14395 106865 53228 -140679 -161942
533a61942R9259K0924P727q4915j4333j5298j33581Q1006N6005o329L3115M2884
$$ -161942 -62683 -41759 -34032 -118947 -133280 -148578 -282159 -201153 -145148 -151477 -118362 -75478
521g5478J9258k21660L9552L7142P0408n8818P8550M3599m6942P6511J570N8802
$$ -75478 -56220 -277880 -238328 -201186 -130778 -189596 -111046 -67447 -114389 -37878 -36308 22494
509B2494m6232L6745K1148j03680o1676l3344J34180L4297m4130j5094p5520j5487
$$ 22494 -23738 13007 34155 -69525 -131201 -164545 -30365 3932 -40198 -55292 -130812 -146299
497a46299P0222q573m7470Q4728j06959o6543J17517K3473N8052o151N6244j1167
$$ -146299 -76077 -84650 -132120 -47392 -154351 -220894 -103377 -79904 -21852 -28003 28241 17074
485A7074k74343R5705Q0657N9895k5396p8823N4185q4810M2285O8448j24564J51901
$$ 17074 -257269 -161564 -80907 -21012 -46408 -125231 -71046 -155856 -113571 -45123 -169687 -17786
473a7786q9490q6457L7654O7241J68647M767n8543K994O3899k9535j29682r1086
$$ -17786 -107276 -193733 -156079 -88838 79809 84576 26033 29027 92926 63391 -66291 -157377
461a57377l6776k4522o0307O6612J08818P3917l2823l3928j2605m3380J46985
$$ -157377 -194153 -218675 -278982 -212370 -103552 -29635 -62458 -96386 -108991 -152371 -5386
450e386L6831q1544p544o1309M2184R9151k8308p9437q078k2534n3011K8375k1038
$$ -5386 31445 -50099 -57643 -118952 -76768 22383 -5925 -85362 -93440 -115974 -168985 -140610 -161648
437a61648k3770J03458P0545n4497J9022j20111n49R267J12564j4699m3224r5067
$$ -161648 -185418 -81960 -11415 -65912 -46890 -167001 -167550 -158283 -45719 -60418 -103642 -198709
425a98709l7383M6764r057q4275J51929j42424n31q3211N1721J03246Q0533N3806
$$ -198709 -236092 -189328 -198385 -282660 -130731 -273155 -273686 -356897 -305176 -201930 -121397 -67591
413f7591j77895J19843K1975K2636O1638R8008O5538j25662j19640j00271N4389
$$ -67591 -245486 -125643 -103668 -81032 -19394 78614 144152 18490 -101150 -201421 -147032
402a47032R1510n7708o2362j15748M65J31411M2472j75381J58097J62906n7711
$$ -147032 -55522 -113230 -175592 -291340 -290875 -159464 -116992 -292373 -134276 28630 -29081
391b9081j11195K16113o9430l1313K9859j36623l1770m5333J42832M2621k8997
$$ -29081 -140276 75837 6407 -24906 4953 -131670 -163440 -208773 -65941 -23320 -52317
380e2317K7491j17986Q6231p3949N3916N7219Q246q2747Q0631k2106M9776n1455
$$ -52317 -24826 -142812 -56581 -130530 -76614 -19395 -11149 -93896 -13265 -35371 14405 -37050
368c7050k522r4J3206J21110j17889J5063L2276o5706p5723M5931j52181r732
$$ -37050 -39572 -39666 -26460 94650 -23239 -8176 24100 -41606 -117329 -71398 -223579 -233311
356b33311J39786k1827J3232P7952j4801M6329j79080J6388M4813J33960p9065
$$ -233311 -93525 -115352 -102120 -24168 -38969 7360 -171720 -155332 -110519 23441 -55624
345e5624R7389j0472j40356J1782R3045M9835j36619J370r179M0821m9421J6k2517
$$ -55624 41765 31293 -109063 -97281 -4236 45599 -91020 -89650 -98829 -58008 -107429 -107413 -129930
332a29930M4062m6230p4497R2747K7082L9608l640m8308n7385N9218k7794j30545
$$ -129930 -85868 -132098 -206595 -113848 -86766 -47158 -50798 -99106 -156491 -97273 -125067 -255612
320b55612J98023J04633n3760l2976r3084k6634j7294M2121o2717o4372J01365
$$ -255612 -57589 47044 -6716 -39692 -132776 -159410 -176704 -134583 -197300 -261672 -160307
309a60307P6314j7042K0192L8372k7240j65876j01013N4238J24805Q3618J1499
$$ -160307 -83993 -101035 -80843 -42471 -69711 -235587 -336600 -282362 -157557 -73939 -62440
298f2440J05180j67700q747N2993O463J04795j17454K917k1734p2621j3225J43238
$$ -62440 42740 -124960 -133707 -80714 -74251 30544 -86910 -83993 -105727 -178348 -191573 -48335
286d8335R4533J2931o8507p1029O4514l3305P8639j14798k7277O515M5856l8861
$$ -48335 46198 59129 -9378 -80407 -15893 -49198 29441 -85357 -112634 -106119 -60263 -99124
274i9124r3580R3845k056L3796j91525J29520J29867j28092P293r3568O9139J93706
$$ -99124 -192704 -98859 -100915 -67119 -258644 -129124 743 -127349 -120056 -213624 -144485 49221
262D9221m0091j71121K5925O6694q3695m0260q580k0200Q3607O5182j46225O3734
$$ 49221 9130 -161991 -136066 -69372 -153067 -193327 -201907 -222107 -138500 -73318 -219543 -155809
250a55809o127n4165L6729n3809P5157J83219O6405o8095j20290l657p4649p724
$$ -155809 -161936 -216101 -179372 -233181 -158024 25195 91600 23505 -96785 -100442 -175091 -182815
238a82815r619J05958L0354K5132J2009j28855J40354l940K950j08622j2709J4019
$$ -182815 -192434 -86476 -56122 -30990 -18981 -147836 -7482 -11422 -8472 -117094 -129803 -115784
226a15784j02728L9717o8184R6304J82550j85720l352O9974L1190j34954j7592
$$ -115784 -218512 -178795 -246979 -150675 31875 -153845 -157197 -87223 -56033 -190987 -208579
215b08579K2635J43051p152L3423J13761j64845j58164o026o0304N5102J00403
$$ -208579 -185944 -42893 -50045 -16622 97139 -67706 -225870 -231896 -292200 -237098 -136695
204a36695k8373n2655K27Q4691K090l5417r0989r764L9061R0784j6315m9386J15497
$$ -136695 -165068 -217723 -217496 -132805 -130715 -166132 -257121 -266885 -227824 -137040 -153355 -202741 -87244
191h7244Q761j4401P1263j61890L6971j987J12997L1977j67490o1723R4804j2507
$$ -87244 -78483 -92884 -21621 -183511 -146540 -148527 -35530 -3553 -171043 -232766 -137962 -150469
179a50469O5271q5994N3837M8992k8255N5221q8521J35261q823j03553o3325j776
$$ -150469 -85198 -171192 -117355 -68363 -96618 -41397 -129918 5343 -3480 -107033 -170358 -172134
167a72134Q193j5709l6395r2072J80618R6116j40839Q7959O3851J6878K0112N8492
$$ -172134 -163941 -179650 -216045 -308117 -127499 -31383 -172222 -84263 -20412 -3534 16578 75070
155G5070r9783q0436L0462j10382N2431N8492q827P8427L1845n7729j16273n0076
$$ 75070 -24713 -105149 -74687 -185069 -132638 -74146 -82973 -4546 27299 -30430 -146703 -196779
143a96779P7275P8106J9535m9803l2430n3150r855N4848k5321R1717l2967p9010
$$ -196779 -119504 -41398 -21863 -71666 -104096 -157246 -167101 -112253 -137574 -45857 -78824 -157834
131a57834J7551p1074k3694L684Q498K6116L0935J5598r6519K1903j0089L5071
$$ -157834 -140283 -211357 -235051 -231367 -222869 -196753 -165818 -150220 -246739 -224836 -234925 -199854
119a99854j29701J32833K3098j0830J06121J213j89539l2573Q2647P9555N0447
$$ -199854 -329555 -196722 -173624 -184454 -78333 -77120 -266659 -299232 -216585 -137030 -86583
108h6583N808N47o0830M59J04220L1050r2124K1481p8214l4210M8085N0126K3129
$$ -86583 -80775 -80228 -141058 -140599 -36379 -5329 -97453 -75972 -154186 -188396 -140311 -90185 -67056
95f7056j02382n1270K6355j09980Q0819j0912K388l3374J8450L2707M1727j1935
$$ -67056 -169438 -220708 -194353 -304333 -223514 -234426 -232038 -265412 -246962 -214255 -172528 -184463
83a84463m2675J2820R375Q3468O1802m1618l1985o3027J110o187l4537n060Q8363
$$ -184463 -227138 -214318 -204943 -121475 -59673 -101291 -133276 -196303 -195193 -201380 -235917 -240977 -152614
70a52614r0388M2965k3161M9868Q5571m6372p636M3897l4274J2762Q9794j05425
$$ -152614 -243002 -200037 -223198 -173330 -87759 -134131 -141767 -97870 -132144 -119382 -29588 -135013
58a35013r3540J01994O8067j5838M0432k4312p027j01514L4194n7592l3916K7606
$$ -135013 -228553 -126559 -58492 -74330 -33898 -58210 -65237 -166751 -132557 -190149 -224065 -196459
46a96459o6732n8087J09693O0065k5363j23580R6394R6745n4425O9060m0190j7334
$$ -196459 -263191 -321278 -211585 -151520 -176883 -300463 -204069 -107324 -161749 -92689 -132879 -150213
34a50213n0520J5382L7479j0449j0129q7537K3294J05782q5529O0922M585R56
$$ -150213 -200733 -185351 -147872 -158321 -168450 -255987 -232693 -126911 -212440 -151518 -146933 -145977
22a45977L3906r1491q851P651p4406O8353P8105j4624L9115O431k092j1614N4729
$$ -145977 -112071 -203562 -212413 -204762 -279168 -210815 -132710 -147334 -108219 -101788 -103880 -115494 -60765
9f0765n8373n7776r09q4113J6046L3428L5309j7225k1324
$$ -60765 -119138 -176914 -177823 -261936 -245890 -212462 -177153 -194378 -215702
0b15702
$$ -215702
$$ Imaginary data points
##PAGE= N=2
##DATA TABLE= (X++(I..I)), XYDATA
16383b778794J86956M0741K8838k807N8682P3350o119k009Q7525M1695j0556J4207
$$ -2778794 -2591838 -2551097 -2522259 -2525066 -2466384 -2393034 -2399153 -2401162 -2313637 -2271942 -2282498 -2268291
16371b268291l8404J0615J44653K9880p1502O624R4428Q213O7237J76714O6049
$$ -2268291 -2306695 -2296080 -2151427 -2121547 -2193049 -2186425 -2091997 -2083784 -2016547 -1839833 -1773784
16360a773784j08823K6334L5502L5011J47688M8965j2794l323N1584l1736N1237
$$ -1773784 -1882607 -1856273 -1820771 -1785760 -1638072 -1589107 -1601901 -1605224 -1553640 -1585376 -1534139
16349a534139N5750N8410k8284K8870O0044N5188M5771q9236J09977O1386N0274
$$ -1534139 -1478389 -1419979 -1448263 -1419393 -1359349 -1304161 -1258390 -1347626 -1237649 -1176263 -1125989
16338a125989R4926n7528j32177J19192M4518P413q178J00410p207J60827J09952
$$ -1125989 -1031063 -1088591 -1220768 -1101576 -1057058 -1049645 -1057823 -957413 -964620 -803793 -693841
16327f93841q4398O086N8167n063J4751Q9607R2074R468R093M8085l4507j01L1406
$$ -693841 -778239 -772153 -713986 -719049 -704298 -614691 -522617 -513149 -504056 -455971 -490478 -490579 -459173
16314d59173N4071N6946Q5587P9486j05901j3473N1877R5107R7778l6124o076
$$ -459173 -405102 -348156 -262569 -183083 -288984 -302457 -250580 -155473 -57695 -93819 -99895
$$ [...]
##END NTUPLES=NMR SPECTRUM
##END=
