##TITLE=1H_DE-80H_X3
 200.13MHz, d2o
 8 sc
 
 19ns.26.2.2025
##JCAMPDX= 6.0         $$ Bruker NMR JCAMP-DX V2.0
##DATA TYPE= NMR SPECTRUM
##DATA CLASS= NTUPLES
##ORIGIN= UXNMR, Bruker Analytische Messtechnik GmbH
##OWNER= pz
$$ XWIN-NMR		Version 3.5
$$ Tue Jun 10 10:17:13 2025 Russian Standard Time (UT+4h)  Yarkov@DPX200
##.OBSERVE FREQUENCY= 200.1313
##.OBSERVE NUCLEUS= ^1H
##.ACQUISITION MODE= SIMULTANEOUS
##.ACQUISITION SCHEME= undefined
##.AVERAGES= 8
##.DIGITISER RES= 18
##SPECTROMETER/DATA SYSTEM= spect
##.PULSE SEQUENCE= zg30
##.SOLVENT NAME= CDCl3
##.SHIFT REFERENCE= (INTERNAL, CDCl3, 0, 15.5375)
##AUDIT TRAIL= $$ (NUMBER, WHEN, WHO, WHERE, WHAT)
$$ ##TITLE= Audit trail, XWIN-NMR		Version 3.5
$$ ##JCAMPDX= 5.01
$$ ##ORIGIN= Bruker BioSpin GmbH
$$ ##OWNER= Yarkov
$$ C:/Bruker/XWIN-NMR/data/yarkov2/nmr/H-C/1/pdata/1/auditp.txt
$$ ##AUDIT TRAIL=  $$ (NUMBER, WHEN, WHO, WHERE, WHAT)
(   1,<2025-06-10 10:16:01.96 +0400>,<Yarkov>,<DPX200>,
      <created by zg, POWCHK disabled, PULCHK disabled
       configuration hash MD5:
       00 E9 B6 7A A2 85 ED C7 34 08 36 98 17 FE 4E 26
       data hash MD5: 16K
       CB 26 67 09 29 50 CA 5C A7 B1 CC B4 AF 7D 4A 99>)
(   2,<2025-06-10 10:16:09.12 +0400>,<Yarkov>,<DPX200>,
      <Start of raw data processing
       efp BC_mod = 2 LB = 0.25 FT_mod = 6 PKNL = 1 PHC0 = -1710.501 PHC1 = 9.76656 SI = 16K 
       data hash MD5: 16K
       B5 8A 24 66 A7 A7 CC 50 AF 2F 56 A4 04 37 31 02>)
(   3,<2025-06-10 10:16:27.54 +0400>,<Yarkov>,<DPX200>,
      <abs ABSG = 5 
       data hash MD5: 16K
       FA EF 72 D7 F0 A6 F9 85 47 02 EB 54 A5 D4 52 A2>)
$$ ##END=
$$ 
$$ hash MD5
$$ F1 F8 74 F2 BE 54 0A 93 02 00 CF AD EC E2 D4 79
##$RELAX= 
##$RELAX= 
##$RELAX= 
##$RELAX= 
##$RELAX= 
##$RELAX= 
$$ Bruker specific parameters
$$ --------------------------
##$DU= <C:/Bruker/XWIN-NMR>
##$EXPNO= 1
##$NAME= <H-C>
##$PROCNO= 1
##$TYPE= <nmr>
##$USER= <yarkov2>
##$AMP= (0..31)
100 100 100 100 100 100 100 100 100 100 100 100 100 100 100 100 100 100 
100 100 100 100 100 100 100 100 100 100 100 100 100 100 
##$AQSEQ= 0
##$AQ_mod= 1
##$AUNM= <au_zg>
##$AUTOPOS= <>
##$BF1= 200.13
##$BF2= 200.13
##$BF3= 200.13
##$BF4= 200.13
##$BF5= 200.13
##$BF6= 200.13
##$BF7= 200.13
##$BF8= 200.13
##$BYTORDA= 1
##$CFDGTYP= 0
##$CFRGTYP= 5
##$CHEMSTR= <none>
##$CNST= (0..31)
1 1 145 1 1 1 1 1 1 1 1 1 1 1 1 1 1 1 1 1 1 1 1 1 1 1 1 1 1 1 1 1 
##$CPDPRG= <>
##$CPDPRG1= <>
##$CPDPRG2= <>
##$CPDPRG3= <>
##$CPDPRG4= <mlev>
##$CPDPRG5= <mlev>
##$CPDPRG6= <mlev>
##$CPDPRG7= <mlev>
##$CPDPRG8= <mlev>
##$CPDPRGB= <>
##$CPDPRGT= <>
##$D= (0..31)
0 0.7 0 0 0 0 0 0 0 0 0 0.03 0 0 0 0 0 0 0 0 0 0 0 0 0 0 0 0 0 0 0 0 
##$DATE= 1749536161
##$DBL= (0..7)
120 120 120 120 120 120 120 120 
##$DBP= (0..7)
150 150 150 150 150 150 150 150 
##$DBP07= 0
##$DBPNAM0= <>
##$DBPNAM1= <>
##$DBPNAM2= <>
##$DBPNAM3= <>
##$DBPNAM4= <>
##$DBPNAM5= <>
##$DBPNAM6= <>
##$DBPNAM7= <>
##$DBPOAL= (0..7)
0.5 0.5 0.5 0.5 0.5 0.5 0.5 0.5 
##$DBPOFFS= (0..7)
0 0 0 0 0 0 0 0 
##$DE= 6
$$ [...]
##$SUBNAM3= <"">
##$SUBNAM4= <"">
##$SUBNAM5= <"">
##$SUBNAM6= <"">
##$SUBNAM7= <"">
##$SUBNAM8= <"">
##$SUBNAM9= <"">
##$SW= 18.0517328524113
##$SWIBOX= (0..15)
0 0 2 0 0 0 0 0 0 0 0 0 0 0 0 0 
##$SW_h= 3612.71676300578
##$TD= 16384
##$TD0= 1
##$TE= 0
##$TE2= 300
##$TE3= 300
##$TEG= 300
##$TL= (0..7)
0 120 120 120 120 120 120 120 
##$TP= (0..7)
150 150 150 150 150 150 150 150 
##$TP07= 0
##$TPNAME0= <>
##$TPNAME1= <>
##$TPNAME2= <>
##$TPNAME3= <>
##$TPNAME4= <>
##$TPNAME5= <>
##$TPNAME6= <>
##$TPNAME7= <>
##$TPOAL= (0..7)
0.5 0.5 0.5 0.5 0.5 0.5 0.5 0.5 
##$TPOFFS= (0..7)
0 0 0 0 0 0 0 0 
##$TUNHIN= 0
##$TUNHOUT= 0
##$TUNXOUT= 0
##$USERA1= <user>
##$USERA2= <user>
##$USERA3= <user>
##$USERA4= <user>
##$USERA5= <user>
##$V9= 5
##$VALIST= <valist>
##$VCLIST= <CCCCCCCCCCCCCCC>
##$VD= 0
##$VDLIST= <DDDDDDDDDDDDDDD>
##$VPLIST= <PPPPPPPPPPPPPPP>
##$VTLIST= <TTTTTTTTTTTTTTT>
##$WBST= 1024
##$WBSW= 4
##$XGAIN= (0..3)
0 0 0 0 
##$XL= 0
##$YL= 0
##$YMAX_a= 518948
##$YMIN_a= -527102
##$ZGOPTNS= <>
##$ZL1= 120
##$ZL2= 120
##$ZL3= 120
##$ZL4= 120
##$ABSF1= 15.47033
##$ABSF2= -2.581519
##$ABSG= 5
##$ABSL= 3
##$ALPHA= 0
##$AQORDER= 0
##$ASSFAC= 0
##$ASSFACI= 0
##$ASSFACX= 0
##$ASSWID= 0
##$AUNMP= <proc_1d>
##$AZFE= 0.1
##$AZFW= 0.1
##$BCFW= 0
##$BC_mod= 2
##$BYTORDP= 0
##$COROFFS= 0
##$CY= -3
##$DATMOD= 1
##$DC= 0
##$DFILT= <>
##$DTYPP= 0
##$F1P= 0
##$F2P= 0
##$FCOR= 1
##$FTSIZE= 16384
##$FT_mod= 6
##$GAMMA= 0
##$GB= 0
##$INTBC= 1
##$INTSCL= 3.241238e-09
##$ISEN= 128
##$LB= 0.25
##$LEV0= 0
##$LPBIN= 0
##$MAXI= 10000
##$MC2= 0
##$MEAN= 0
##$ME_mod= 0
##$MI= 1.114404
##$NCOEF= 0
##$NC_proc= -5
##$NLEV= 6
##$NOISF1= 3.799351
##$NOISF2= 2.8
##$NSP= 0
##$NTH_PI= 0
##$NZP= 0
##$OFFSET= 15.53755
##$PC= 1
##$PHC0= -1710.501
##$PHC1= 9.76656
##$PH_mod= 1
##$PKNL= yes
##$PPARMOD= 0
##$PSCAL= 0
##$PSIGN= 0
##$REVERSE= no
##$SF= 200.129996828192
##$SI= 16384
##$SIGF1= 3
##$SIGF2= 2
##$SINO= 0.751879
##$SIOLD= 32768
##$SREGLST= <19F.Aceton>
##$SSB= 0
##$STSI= 16384
##$STSR= 0
##$SW_p= 3612.71676300578
##$SYMM= 0
##$S_DEV= 0
##$TDeff= 16384
##$TDoff= 0
##$TI= <>
##$TILT= no
##$TM1= 0
##$TM2= 0
##$TOPLEV= 0
##$USERP1= <user>
##$USERP2= <user>
##$USERP3= <user>
##$USERP4= <user>
##$USERP5= <user>
##$WDW= 1
##$XDIM= 16384
##$YMAX_p= 309477395
##$YMIN_p= -107524
$$ End of Bruker specific parameters
$$ ---------------------------------
##NTUPLES= NMR SPECTRUM
##VAR_NAME=  FREQUENCY,     SPECTRUM/REAL,   SPECTRUM/IMAG
##SYMBOL=    X,             R,               I
##VAR_TYPE=  INDEPENDENT,   DEPENDENT,       DEPENDENT
##VAR_FORM=  AFFN,          ASDF,            ASDF
##VAR_DIM=   16384,         16384,           16384
##UNITS=     HZ,            ARBITRARY UNITS, ARBITRARY UNITS
##FACTOR=    0.220516191357247, 1,           1
##FIRST=     3109.52982672114, 0,            0
##LAST=      -503.18693628464, 0,            0
##MIN=       -503.18693628464, -107524,      0
##MAX=       3109.52982672114, 309477395,    0
$$ Real data points
##PAGE= N=1
##DATA TABLE= (X++(R..R)), XYDATA
$$ [...]
6160B301850P1423J06031J44126R1921K7846j02518j79167j36006j53082j71472
6150B000952j51318j30015j26813p0449m4958o6451m1807m3605p6044p6211q390
6139A164891l6697l2761J376K5627O2808J0418J1369N2510M1632M151j6160n9463
6127A229701o3648r2055j09253r8756q6045m4809r4195q4763j2587J594P651k9603
6115E23232j6305m6737k5919K2245P99l751k225j1022J1438P626o622J3028M6291
6102E12078M1913m118Q2J6476N3534N9058M1849P7244R8439J11172O7175J05801
6090A180703N7859m1K5585k2468l2496k4213r286n919L8888M1237j990K8052N1912
6077A327823M4657Q7238O3133J14266J51995J69500J73857J84452J51754Q0475
$$ plain form
6160 2301850 2373273 2479304 2623430 2715351 2743197 2640679 2461512 2325506 2172424 2000952
6150 2000952 1849634 1719619 1592806 1522357 1477399 1410948 1369141 1325536 1249492 1173281 1164891
6139 1164891 1128194 1095433 1096809 1122436 1185244 1195662 1207031 1259541 1301173 1305324 1289164 1229701
6127 1229701 1166053 1073998 964745 865989 779944 735135 640940 556177 543590 545184 552835 523232
6115 523232 506927 460190 434271 456516 457315 453564 451339 440317 451755 459381 452759 465787 512078
6102 512078 553991 549873 549955 566431 619965 679023 720872 798116 896555 1007727 1074902 1180703
6090 1180703 1238562 1238521 1264106 1241638 1209142 1184929 1175643 1169724 1208612 1249849 1247859 1275911 1327823
6077 1327823 1372480 1459718 1522851 1637117 1789112 1958612 2132469 2316921 2468675 2549150
6067B549150J45350R2964Q9043O0808m5629r3795j31388q2313o5139j30387m3093
6056B345571k2275l5117l6460l852k013K3693J5974J8683P0633N5526J01769J26493
6044B658625J75267K30460K35447J68790P3357o2748j92534k02705k56184k63478
6034B564297k36549k51212j89433j29760j53991q4574o0396n8956o7881l3064
6024A298481Q623j2377l5407l6261O28j3547j234L1204L2651N2067P6703Q3004
6012A484535N2125M1395M251p9323j40480j54411j09948j27969j09787j15958
6002G44430n9836j4234m4034p8828l4881j1140k6977j9389j428m447n199k9000
5990D15037m0597j153k2483j2814n8002m529k153j7073l9810j916M448l741Q476
$$ plain form
6067 2549150 2694500 2787464 2876507 2937315 2891686 2797891 2666503 2584190 2519051 2388664 2345571
6056 2345571 2323296 2288179 2251719 2247867 2245854 2269547 2285521 2304204 2374837 2430363 2532132 2658625
6044 2658625 2833892 3064352 3299799 3468589 3541946 3479198 3286664 3083959 2827775 2564297
6034 2564297 2327748 2076536 1887103 1757343 1603352 1518778 1458382 1399426 1331545 1298481
6024 1298481 1307104 1294727 1259320 1223059 1223687 1210140 1208906 1240110 1272761 1324828 1401531 1484535
6012 1484535 1536660 1578055 1582306 1502983 1362503 1208092 1098144 970175 860388 744430
6002 744430 684594 670360 626326 547498 512617 501477 474500 455111 453683 449236 444037 415037
5990 415037 374440 373287 350804 337990 279988 275459 273306 256233 216423 214507 218955 215214 223690
5977B23690j4598q551J4814n816k9597k9636l8193L7126K7597K1274J0782k8110
5965A80782k4271K4980O956m807k6383m6619K6p15M435J9710L755k502k5894Q123
5951A17576J9733j0632m604K3638K7963L318r305j312J0907L2877j5936k7427
5939A66796j0556N0938l7705J7736L7254j219o303j5245n616O547k5003j202r409
5926A67013j5225K2586k3630J2741R39j1645j76O402K0349K7259j4325k1696M165
5913A74757J144P107J589J0255J922m7987J3975J2795l814j99l742n280j1013
5900A51509j7806N561m340m5963k5848L0899j1421J1840L3923p599M6694k2151
5888A45298l5947j4465j1248n090j6119L1496p460O506J5624j6432O630R424l0601
$$ plain form
5977 223690 209092 200541 215355 209539 179942 150306 112113 149239 176836 198110 208892 180782
5965 180782 156511 181491 188447 183640 157257 110638 110664 109949 114384 134094 137849 135347 109453 117576
5951 117576 137309 126677 122073 145711 173674 176992 167687 166375 177282 210159 194223 166796
5939 166796 156240 207178 169473 187209 224463 223244 216941 201696 196080 202627 177624 176422 167013
5926 167013 151788 174374 150744 163485 164424 152779 152603 159005 179354 206613 192288 170592 174757
5913 174757 175901 183008 184597 194852 196774 148787 162762 175557 171743 171544 167802 162522 151509
5900 151509 133703 139264 134924 88961 63113 94012 82591 94431 128354 120755 167449 145298
5888 145298 109351 94886 83638 78548 62429 93925 86465 92971 108595 92163 98793 108217 77616
5875G7616j732k7585j2416L3553p452k69j2271j7219l626J3485j2725m718Q554
5862C3195j4039j9321j1126J9644K3907J2439k9645J4340q092J5547J1901l3841
5850A4909j5782P070J6057K0413j8878k2145J763P37K9575M065O474k2310k4706
5837b758K0625N592m1883k4792K2354K4290K0373M480j4356l0382j7569L1036
5825b990K839N577m759j135M7217R189m6281j6439j860j7439J4394j4165k530
5812b8382R697r309o022K3522p297l1651P241K4308M9934Q920k9343j9325k9906
5799c7613K1402j7258n198J3478j4988m431j0243R693m6365o904M2037K7952n670
5786c4108K2350J6139j0873j182j1581P71M020q345k447L726k1290P015p586j9048
$$ plain form
5875 77616 75884 48299 35883 69436 61984 61715 49444 32225 28599 42084 29359 24641 33195
5862 33195 19156 -165 -11291 8353 32260 44699 15054 29394 21302 36849 48750 14909
5850 14909 -873 6197 22254 42667 23789 1644 3407 4144 33719 37784 44258 21948 -2758
5837 -2758 17867 23459 -18424 -43216 -20862 3428 23801 28281 13925 -16457 -34026 -2990
5825 -2990 -151 5426 667 -468 46749 55938 9657 -6782 -8642 -26081 -11687 -25852 -28382
5812 -28382 -18685 -27994 -34016 -10494 -17791 -49442 -42201 -17893 32041 40961 11618 -7707 -37613
5799 -37613 -16211 -33469 -38667 -25189 -40177 -44608 -54851 -45158 -91523 -98427 -56390 -28438 -34108
5786 -34108 -11758 4381 -6492 -7674 -19255 -18484 -14464 -22809 -25256 -21530 -42820 -35805 -43391 -62439
5772f2439n553K0755J4982k3678j5031K6449M222j8120J2949O462j681K6783K846
5759a1054m5219p90j039K1250l89k0272K1693l507k2536M1050K5625k9091j9855
5746d4134L60K6186j446n1249K2452L7758J1645Q159P102j5473r888q255Q488
5733h295l0618r578K2356o418K3086j2712q539M4502N330j8405j6054j1993k2328
5720d9666j9111L1556J9484n959J9815j7808m2565j2467M3002M7866j0976K9044
5708C2215k3014k4665K4362j1395M125K2777K5776N92k7726j4470J6113q487k5644
5695i441K5280j882N619m400j9860l7246l713R829p240K862K9358O564j0553J789
5681a3034J9791j6834k423J3498j2074j9645J2015J6739K2064K650l377k2327
$$ plain form
5772 -62439 -67992 -47237 -32255 -55933 -70964 -44515 -40293 -58413 -45464 -39002 -40683 -13900 -11054
5759 -11054 -56273 -57063 -58102 -36852 -37241 -57513 -35820 -39327 -61863 -20813 4812 -24279 -44134
5746 -44134 -43774 -17588 -19034 -70283 -47831 -10073 1572 9731 16833 1360 -8528 -16783 -8295
5733 -8295 -38913 -48491 -26135 -32553 -9467 -22179 -30718 13784 19114 709 -15345 -27338 -49666
5720 -49666 -68777 -37221 -17737 -23696 -3881 -21689 -64254 -76721 -33719 14147 3171 32215
5708 32215 9201 -15464 8898 -2497 1628 24405 50181 50773 23047 8577 24690 16203 -9441
5695 -9441 15839 13957 19576 15176 -4684 -41930 -45643 -35814 -43054 -40192 -10834 -4270 -14823 -13034
5681 -13034 6757 -10077 -12500 998 -11076 -30721 -18706 -1967 20097 22747 19370 -2957
5669b957O358L384m9479K8217Q301J8790J2477l5183J5609o38j3502j5136r323
5656c3082J7427J0481k7539P508L3117j165l7677j275K0136j6391k01J0754J8130
5643B23L125J1277k4708o915L0955P339j6726j0552q793L5230K5160l2740k450
5630A0425Q366j1447l0934K4358O9403j874j6217m2442j185j9431K5188M6419
5618F0629l4564J6136J6625r914n115n302o393K652q857K4418J5592l3951L6540
5605F8496M9418r262r998P1535j7861j144J0787q911l759N5514J7712l0303N3309
5592B45533K4279l1080K824J4201K1621K4838J8741K2057M1790K3889j420K6020
5580D33293M0893J7315J382L2373r860J1498N6825M4461L2667J4713M359P806
$$ plain form
5669 -2957 3401 6785 -42694 -14477 -6176 12614 25091 -10092 5517 4879 -8623 -23759 -33082
5656 -33082 -15655 -5174 -32713 -25205 7912 6747 -30930 -32205 -12069 -28460 -28661 -17907 223
5643 223 3348 14625 -10083 -16998 13957 21296 4570 -5982 -14775 20455 45615 12875 10425
5630 10425 18791 7344 -23590 768 70171 68297 52080 9638 8453 -10978 14210 60629
5618 60629 26065 42201 58826 48912 43797 38495 32102 34754 25897 50315 65907 31956 68496
5605 68496 117914 108652 98654 170189 152328 151184 161971 153060 149301 204815 222527 192224 245533
5592 245533 269812 238732 241556 255757 277378 302216 320957 343014 384804 408693 407273 433293
5580 433293 474186 491501 492883 525256 515396 526894 583719 628180 660847 675560 679919 687725
5568F87725K4106K5134M7815L2904L466M765N8496P9647J9798L5013O6016N4772
5556A139657m650O5018L3017O1906K0554N0714j2255K2586M0707j5244L807l0979
5544A374838k2379m4934n3847k3796K419l0933n31k912Q045K3511K5763J3210
5532A268454N6543O2022J1534K6383O2653O5522R6607P9166O6152K5358o1295
5521A759099p8502p6321j08893j38620j20679j02800o3990r5279n6526l0347k8752
5510H58390J9904O581j6756K04M5822K4999L2248M2174P3772R2897R3818Q8110
5498A362163J07379J15771M1435j9698r6551j04022r9640j12519j47512j07952
5488I38854o9861p6998n6643k6274m6517l0649j4178J8747j5899L5941L3416M198
$$ plain form
5568 687725 711831 736965 784780 817684 821150 825915 884411 964058 983856 1018869 1084885 1139657
5556 1139657 1135007 1200025 1233042 1294948 1315502 1366216 1353961 1376547 1417254 1402010 1405817 1374838
5544 1374838 1352459 1307525 1253678 1229882 1232301 1201368 1200837 1197925 1205970 1229481 1255244 1268454
5532 1268454 1324997 1387019 1398553 1424936 1487589 1553111 1649718 1728884 1795036 1820394 1759099
5521 1759099 1680597 1604276 1495383 1356763 1236084 1133284 1069294 974015 917489 887142 858390
5510 858390 878294 884875 868119 868323 914145 939144 971392 1013566 1087338 1180235 1274053 1362163
5498 1362163 1469542 1585313 1626748 1607050 1510499 1406477 1306837 1194318 1046806 938854
5488 938854 868993 791995 735352 709078 662561 631912 617734 636481 620582 656523 689939 694137
5476F94137K7686L2523O7874M5586N2510P9902O7638R1187O635k9613q8731j18589
5464I28745q6914q0565m0881m6259o9116n0179m4893o905j7054j1214N058q781
5452D71042l873J7174K5987l9991N7122L8925L0810P6549Q0404J0257Q1718L0320
5440H76444J6252j3770o191K6286N111j1631p053l1767n866j3560M7364N8572
5428I40191N6991K9044O2636N1481M7590R5259J06163J39316J80429J09142N2071
5417A870313k2294n7380r255n2779m9893l5239q634k8259n0139j5012M58J856
5405A543743K801K2851J11579P7837M6091J13309J12938Q4235P1126R3763J56629
5394B436902J66146J93766K39324J91620N5248p2183j58208j92561k01758j73966
$$ plain form
5476 694137 721823 754346 822220 867806 920316 1000218 1067856 1159043 1165678 1136065 1047334 928745
5464 928745 841831 761266 720385 674126 605010 554831 509938 503033 485979 474765 479823 471042
5452 471042 467169 484343 510330 470339 527461 566386 597196 673745 754149 764406 846124 876444
5440 876444 892696 878926 872735 899021 904132 892501 885448 853681 847815 834255 881619 940191
5428 940191 997182 1026226 1088862 1140343 1187933 1283192 1389355 1528671 1709100 1818242 1870313
5417 1870313 1848019 1790639 1781384 1728605 1678712 1643473 1634839 1606580 1556441 1541429 1541887 1543743
5405 1543743 1546544 1569395 1680974 1758811 1804902 1918211 2031149 2115384 2186510 2280273 2436902
5394 2436902 2603048 2796814 3036138 3227758 3283006 3210823 3052615 2860054 2658296 2484330
5384B484330j23973j56766j34350p2275j03377l8797n0458l3470J3209J9849N7572
5373A861494Q3405M8075K3092L7426K0153k8266k3692l5313K7854N55m9876j26638
5361A838269j13088j34706j66657j25755q6055j36031r5833l9624o1823n1305
5351H27392p161k4227o6496j4893R790j2493n283k1056K7436j6715o631j2916
5339F76747k0796m1538l7506o2333o2470l6907k1368l3096p1441k4521J0634j4517
5327B60888m8260L730o771j1185l917m7744o762K8318o3765l0909K8060L0804
5315A32487k5337k6092j4175J6191L5712j3728m337M1404p799k8787j6684J140
5303H9995k3170k340K3356J6454r119k23n8905j9128N576K9840j1452J2451L4445
$$ plain form
5384 2484330 2360357 2203591 2069241 1996966 1893589 1854792 1804334 1770864 1784073 1803922 1861494
5373 1861494 1944899 1992974 2016066 2053492 2073645 2045379 2021687 1986374 2014228 2014783 1964907 1838269
5361 1838269 1725181 1590475 1423818 1298063 1212008 1075977 980144 940520 878697 827392
5351 827392 820231 796004 729508 714615 724405 711912 706629 685573 713009 696294 689663 676747
5339 676747 655951 614413 576907 514574 452104 415197 393829 360733 289292 264771 275405 260888
5327 260888 212628 216358 209587 198402 194485 146741 139979 168297 104532 73623 101683 132487
5315 132487 107150 81058 66883 83074 118786 105058 100721 142125 134326 105539 88855 89995
5303 89995 66825 64485 87841 104295 95176 94953 36048 16920 22496 52336 40884 53335 87780
5290H7780j3530j5863j2284Q72R998l0760k2142L5766j2673k5057O0881K1893
5278H4881m6282p723N405m8498K0986k8640J044M1876q364j0471j0593r703k7991
5265d4073J8459r18J4999j337j5689L098J1627j5893J0229m979J5586k0515J8083
5252a1323L8929q410j5373n516k2733j6498J9131k3432j6122K3382j6880j4343
5240f9188J5187k731k0550J2505J6894L327j6952J6721J9754K7647j9394m0595
5228e7375M2318M6284k5105l0850k1220k8812M6253J7486j7217p538K8340J5282
5216G846M117j5158l4475j8658P221M0345k1808k6521J0457J9775K17L617j9475
5203d2500M959K6591k3466J6235q961j3396J821r255R050j8818L8051j2009m2298
$$ plain form
5290 87780 74250 58387 46103 46975 56973 26213 4071 39837 27164 2107 62988 84881
5278 84881 38599 30876 36281 -12217 8769 -19871 -18827 23049 14685 4214 -6379 -16082 -44073
5265 -44073 -25614 -26532 -11533 -12870 -28559 -25461 -13834 -29727 -19498 -24477 -8891 -29406 -11323
5252 -11323 27606 19196 3823 -1693 -24426 -40924 -21793 -45225 -61347 -37965 -54845 -69188
5240 -69188 -54001 -56732 -77282 -64777 -47883 -44556 -61508 -44787 -25033 2614 -16780 -57375
5228 -57375 -15057 31227 6122 -24728 -45948 -74760 -28507 -11021 -28238 -35776 -7436 7846
5216 7846 11963 -3195 -37670 -56328 -49107 -8762 -30570 -57091 -46634 -26859 -26642 -23025 -42500
5203 -42500 -37541 -10950 -34416 -18181 -27142 -40538 -38717 -47972 -38922 -57740 -19689 -31698 -73996
5190g3996J7993k3731R814P847p656q003k91p482L6752q443j6191K1425K3840
5177b8122p559L376q305l1973l428Q092J3486j1483P021p01j8707J0138M050P470
5163e6645L394J1396j5668k713M241k943J8187j0889j2184Q375Q517m534j4688
5150f6154K7233L7739j4585k7790n357K35j6648k0455J7942j8421N877L0248K7703
5137b2433R071k4020Q402M988k3544l6587L1679R989K6600p748r137N248p674
5124c5166j2107q055J9542j3122n651M7507k0903j8617O44J6384J4336Q804l7378
5111d3782n548m755k1691J8528j7912J2076K1677N5630o914m7249J6484L0705
5099G249R245l838l0842K1999K543q454K809J0344L8368Q624J074L3047R581k5793
$$ plain form
5190 -73996 -56003 -79734 -69920 -62073 -69729 -77732 -78023 -85505 -48753 -57196 -73387 -51962 -28122
5177 -28122 -35681 -32305 -40610 -72583 -76011 -67919 -54433 -65916 -58895 -59596 -78303 -68165 -64115 -56645
5163 -56645 -53251 -41855 -57523 -60236 -55995 -58938 -40751 -51640 -63824 -55449 -46932 -51466 -66154
5150 -66154 -38921 -1182 -15767 -43557 -48914 -48679 -65327 -85782 -67840 -86261 -80384 -50136 -22433
5137 -22433 -13362 -37382 -28980 -23992 -47536 -84123 -52444 -42455 -15855 -23603 -32740 -27492 -35166
5124 -35166 -47273 -55328 -35786 -48908 -54559 -7052 -27955 -46572 -45928 -29544 -15208 -6404 -43782
5111 -43782 -49330 -54085 -75776 -57248 -75160 -63084 -41407 14223 7309 -39940 -23456 7249
5099 7249 16494 12656 -18186 3813 6356 -2098 711 11055 49423 58047 59121 92168 101749 75956
5085G5956j1979j2245o192k415J2949k107N3340K6660J0604J8454K626j0918L8257
5072A92990j7727M1815J9925m0442K3236L3109K1541M4627L3616L4708q668M7038
5060D25768O1915K0534O5687M6950O0273Q4468O0898M7298P6116O5476J25462
5049A140845J32429J37803J19387J39405J21671J64907J87893J87845K18948K82949
5039B834082L72621M84831O03016O66502M72938K28665J72287K79650M96339M54087
5029G065018J66020k3910J25606L53592O96269O45886j25280q17462r68631q20784
5019F296324p31777o22907n32399m22078k98295k97144l43983l28053k73784k51638
5009B194266k05371j65811j49176j17200j46304q4363j10890l3326m7846m4256
$$ plain form
5085 75956 63977 51732 45540 43125 56074 53967 107307 133967 144571 163025 165651 154733 192990
5072 192990 175263 217078 237003 196561 219797 252906 274447 319074 352690 387398 378730 425768
5060 425768 487683 508217 573904 620854 681127 765595 826493 873791 949907 1015383 1140845
5049 1140845 1273274 1411077 1530464 1669869 1791540 1956447 2144340 2332185 2551133 2834082
5039 2834082 3206703 3691534 4294550 4961052 5433990 5662655 5834942 6114592 6610931 7065018
5029 7065018 7231038 7207128 7332734 7686326 8382595 9028481 8903201 8085739 7117108 6296324
5019 6296324 5564547 4941640 4409241 3987163 3688868 3391724 3047741 2719688 2445904 2194266
5009 2194266 1988895 1823084 1673908 1556708 1410404 1326041 1215151 1181825 1133979 1089723
4999A089723p3766j08606p5967m2701m0859j3382l9044n9410j7766K0788k5104
4988F13906n5962m6156o246P661j4958j5751k5312j6587n3665J2378n0889k5752
4976C22667J8795m0338k8247J8693J9725L4944J6116k4813l6643J1616j0982j1463
4964B90070m3836l6745J0512l8693j6926j4776N774L749O27r912K4077J617J5462
4951A91000k5662k1477l1113o128K4570j4323K6636j393l114l0858R197k4075
4939I3260m022k803J6161j6229K7485J5034k0419k7411k871l279k4747k728K2025
4926F9456o890L6733L7173q73j9103N825j2341m0292l941J3301p000K998N555
4913H0601K0809J2053k4707k560J8772R2J878j8523L0334J7920n04K4383p210
$$ plain form
4999 1089723 1015957 907351 831384 788683 747824 734442 695398 635988 618222 639010 613906
4988 613906 557944 511788 505542 513203 498245 482494 457182 440595 386930 399308 348419 322667
4976 322667 341462 301124 272877 291570 311295 346239 362355 337542 300899 312515 301533 290070
4964 290070 246234 209489 220001 181308 164382 149606 155380 159129 159756 149844 173921 175538 191000
4951 191000 165338 143861 112748 106620 131190 116867 143503 142110 138996 108138 117335 93260
4939 93260 89238 86435 102596 86367 113852 128886 108467 81056 78185 74906 50159 47431 69456
4926 69456 62566 99299 136472 135599 116496 122321 109980 69688 65747 79048 72048 75046 80601
4913 80601 101410 113463 88756 86196 104968 105060 106938 88415 118749 136669 136165 160548 153338
4900A53338J5234m7333k4219j474j658j7558P982J2861J7129l2327l939J4859
4888I2895K1771l2527l5754N859L7053j3701q143k70r63L3480m5116j7573K6219
4875F3230L748K9769l776l7154K1096L172j2975r982j9898m369L9730N954k4245
4862E4300J095O149L841K7991R472O288M529J5441J7513p178m58J2973l3995J0027
4848A27988M2626J1141j137j674J4383q548o257J4412L1105J7236n668J5824K9160
4835B80591k0215L6146L2566M8273k516J3101J1260P509j9521l1611j6108K5854
4823C65329K0134K1860N340m4802L0135J7994L7847P395J15P134J0269R322K6721
4810E14793R579K7867M7749J9070L6915N9113L7178J8293L8943L3986L0757L1665
$$ plain form
4900 153338 168572 121239 97020 95546 93888 76330 84312 97173 114302 81975 78036 92895
4888 92895 114666 82139 46385 52244 89297 75596 67453 67183 66220 99700 54584 37011 63230
4875 63230 66978 96747 92971 55817 76913 80085 67110 57128 37230 32861 72591 78545 54300
4862 54300 55395 61544 65385 93376 102848 109136 113665 129106 146619 139441 138983 151956 117961 127988
4848 127988 170614 181755 180618 178944 193327 184779 178522 192934 224039 241275 235607 251431 280591
4835 280591 260376 296522 329088 377361 374845 387946 399206 406715 387194 355583 339475 365329
4823 365329 385463 407323 412663 367861 397996 415990 453837 461232 461347 468481 478750 488072 514793
4810 514793 524372 552239 599988 619058 655973 715086 752264 770557 809500 843486 874243 905908
4798I05908M0760M9092K3920J6682j5517N8999K3157O125L4995L5993L1698M8151
4786A259963P5719M3495R0267M1806K9819O0491R1135P2014M1289J09131J11035
4775B026164Q5854J34893J49106J03906J34315K08947J69888J80304J65483K22824
4765C581684K42200K38365K95435K73176L26327L54554L32792L65526L67799L65936
4755F743794M01082M36413N37112N34727N61718O19118P09995O76841O73354P50847
4745A2645001Q17910J033753J249232J506284J724922J817286J563276J150160
4737B3507824Q41028P10423O94654O35843M98010L44234K52641K91324M78419
4728B8254400N91039O33979O44979P16955Q84038J128439J266211J230378J135131
$$ plain form
4798 905908 946668 995760 1019680 1036362 1020845 1079844 1103001 1109126 1144121 1180114 1211812 1259963
4786 1259963 1335682 1379177 1469444 1511250 1541069 1601560 1692695 1764709 1805998 1915129 2026164
4775 2026164 2112018 2246911 2396017 2499923 2634238 2843185 3013073 3193377 3358860 3581684
4765 3581684 3823884 4062249 4357684 4630860 4957187 5311741 5644533 6010059 6377858 6743794
4755 6743794 7144876 7581289 8118401 8653128 9214846 9833964 10543959 11220800 11894154 12645001
4745 12645001 13462911 14496664 15745896 17252180 18977102 20794388 22357664 23507824
4737 23507824 24348852 25059275 25753929 26389772 26887782 27232016 27484657 27775981 28254400
4728 28254400 28845439 29479418 30124397 30841352 31725390 32853829 34120040 35350418 36485549
4719C6485549J054367R63478R58414J062492J168635J380740J600749J834405
4711D6508829K044503K193026J968168J040298j10421r52070j387763j524224
4703D9780346j552515j607301j583195j365071j135568j054999j156150j340961
4695C8984586j458151j407732j301773j129186r49446q47961p87252p07516o05645
4686B9789924m56562k45614j51349j36923k52441l04931k60869k16789m17661
4677B7346785j016387j618241j892415j897231j740646j575831j307387j087159
4669A5211488r43364p89088p46014p23426o53324n70275m93120n05761m74729
4660I312387m25029m07881m02619l56438l46872l48355l52630l17990k75332k64908
$$ plain form
4719 36485549 37539916 38503394 39461808 40524300 41692935 43073675 44674424 46508829
4711 46508829 48553332 50746358 52714526 53754824 53644403 52692333 51304570 49780346
4703 49780346 48227831 46620530 45037335 43672264 42536696 41481697 40325547 38984586
4695 38984586 37526435 36118703 34816930 33687744 32738298 31890337 31103085 30395569 29789924
4686 29789924 29333362 29087748 28936399 28799476 28547035 28242104 27981235 27764446 27346785
4677 27346785 26330398 24712157 22819742 20922511 19181865 17606034 16298647 15211488
4669 15211488 14268124 13479036 12733022 12009596 11356272 10785997 10292877 9787116 9312387
4660 9312387 8887358 8479477 8076858 7720420 7373548 7025193 6672563 6354573 6079241 5814333
4650E814333k90620k34324k42780k32434j84704j76011j24783j94997j61363j32974
4640C839343r0304j23473q7899j02537m6115l7970o5983l0758l869o3139m7294
4629C140002o4548k4117k3711m8591o4285m7882l4172l9903l3386n4497j09442
4618B595468q7396o0262p0787j00342j05729q1585p8034m5177o7824o5512n5911
4607A776909l7667o0712k1876p5919j8583k0236j9482l0201k1609K2924k0566
4596A472982k5858j752m5024l3740p602m5829n9114j944o4263p9074o393n4331
4584A048058l3836m5117k179k2030o8498k1972j2154J1863l2132j9502m1901l4967
4572G25633j8296l1648M89j1971q513j6837j2542k6208J4932j4156o3679P319
$$ plain form
4650 5814333 5523713 5289389 5046609 4814175 4629471 4453460 4328677 4133680 3972317 3839343
4640 3839343 3749039 3625566 3537667 3435130 3389015 3351045 3285062 3254304 3250435 3187296 3140002
4629 3140002 3075454 3051337 3027626 2979035 2914750 2866868 2832696 2792793 2759407 2704910 2595468
4618 2595468 2508072 2447810 2377023 2276681 2170952 2089367 2011333 1966156 1898332 1832820 1776909
4607 1776909 1739242 1678530 1656654 1580735 1562152 1541916 1522434 1492233 1470624 1493548 1472982
4596 1472982 1447124 1445372 1400348 1366608 1359006 1313177 1254063 1252119 1187856 1108782 1102389 1048058
4584 1048058 1014222 969105 966926 944896 876398 854426 842272 854135 822003 802501 760600 725633
4572 725633 707337 675689 676178 664207 655694 638857 626315 600107 615039 600883 537204 544523
4560E44523o372M1904n988m3915l0803k3253n05j1419j2078J2627j2195o721L1394
4547D77199l2408P311j8519j871j5101p14K0173l7852k6638J0071P640J0203p281
4534C92213J1343K5575o179j1399k7317l4350r11L5460j4863J2518n374l3583
4522C43133L9684l895M748r572k6676J4808K0383M132J4467j6311j6534k244k3629
4509C42494k145k2277R180j4391K6884r289l1201L6916J6716k782k4281m4698
4497B81126q527j9388k2803J478K4343n079R515J8881k1542o432J2915M624l4890
4484B34221j184J5754n3105J6016J43m4092J5728k7243j6637M5506M696k4502
4472A65301R48o185l2520m3065J8846M525K8396J1172K8547N037m1015K2460k4574
$$ plain form
4560 544523 538151 580055 574067 530152 499349 476096 475591 464172 452094 464721 452526 445805 477199
4547 477199 444791 452102 433583 431712 416611 415897 436070 398218 371580 381651 389291 399494 392213
4534 392213 403556 429131 422952 411553 384236 349886 348975 384435 369572 382090 376716 343133
4522 343133 382817 378922 383670 374098 347422 362230 382613 386745 401212 384901 368367 366123 342494
4509 342494 340349 318072 327252 312861 339745 330456 299255 336171 352887 350105 325824 281126
4497 281126 272599 253211 230408 231886 256229 251150 260665 279546 258004 251572 264487 269111 234221
4484 234221 233037 248791 195686 211702 211845 167753 183481 156238 139601 185107 189803 165301
4472 165301 166249 160064 127544 84479 103325 107850 136246 147418 175965 181002 139987 162447 137873
4459A37873k2446J0896o253m389j165J9769J7364j5619k7559J9593n359J1929
4447A34634n895N11j2840k3253o176j9643N0576K0547Q040J7385J597k449j5630
4434A47404k6827m037Q601L2548K8593K9342k0903j7177K2322j3395L0042j3436
4422B03077j7010j0003R457j0799j6717O407M7050m650j4406M6329P2791N955
4410C17481j6716k1832j8367k165L2996J8509K591L4673p671j1292n963N9894
4398C82138k223j1305M1266l2756m6954O052r837j8794j1697K2106j5099j8097
4386B84800J2223j6003k7352j4985O221K8162R559l1080J2137K2813k2350j2031
4374B52114p306L2356j2086J0128j8821J9358L4659k4553k1169K8425l8991m8160
$$ plain form
4459 137873 115427 126323 120070 115681 114516 134285 151649 136030 108471 128064 122705 134634
4447 134634 128739 129250 116410 93157 86981 67338 117914 138461 146501 163886 165483 163034 147404
4434 147404 120577 116540 125141 157689 186282 215624 194721 177544 199866 186471 216513 203077
4422 203077 186067 176064 185521 174722 158005 164412 211462 206812 192406 238735 311526 317481
4410 317481 300765 278933 260566 258401 291397 309906 312497 347170 339499 328207 322244 382138
4398 382138 379915 368610 409876 377120 330166 336218 326381 307587 295890 317996 302897 284800
4386 284800 297023 281020 253668 238683 244904 273066 282625 251545 263682 286495 264145 252114
4374 252114 244808 277164 265078 275206 256385 275743 310402 285849 264680 293105 254114 205954
4362B05954k4139M959j0447J1351L1860l6824k6597K2060j2082q128K0631k3417
4350A55181J9828K6772J8621p184j9619L531K9912J5707R272J5051m480M327J5946
4337B82865L3395J4454j1467k751l4467q785r241L083l7224J0804R019o979K6397
4324B69103p683K080j9171J0392N2107l5708j742j2995K2458Q098J4774Q459j5127
4311B95045l061J0086R026k183m179l4035k2867N3976P8497k4663J237J6333K1200
4298C94412J8692J5181j5037J4875L1525k7991K3281M8995P717L6698P182L6598
4286E92128R225J7190O2207M0108J3940M3395L6449L4987O9654J7850O7766P5702
4274A080601P5228R2261P6178Q3909O1919J24142J41505J34289J52219J65686
$$ plain form
4362 205954 181815 186774 176327 187678 219538 182714 156117 178177 166095 157967 178598 155181
4350 155181 175009 201781 220402 213218 193599 197130 227042 242749 252021 267072 262592 266919 282865
4337 282865 316260 330714 319247 316496 282029 273244 264003 267086 229862 240666 249685 242706 269103
4324 269103 261420 263500 244329 254721 306828 271120 269378 256383 278841 286939 301713 310172 295045
4311 295045 291984 302070 311096 308913 304734 270699 247832 301808 380305 355642 356879 373212 394412
4298 394412 413104 428285 413248 428123 459648 431657 454938 503933 511650 548348 555530 592128
4286 592128 601353 618543 680750 720858 734798 778193 814642 849629 919283 937133 1004899 1080601
4274 1080601 1155829 1248090 1324268 1408177 1470096 1594238 1735743 1870032 2022251 2187937
4264B187937J47460J41774J66713J46671J95142K17973K44514K29592K49608L08259
4254D235643L08858L88279M31245M49867M12740M05638L65990K83643K61421K43031
4244G786355K91873L57936L94343M52615N85063O40601P49630Q18563P94300O96829
4234A3568108N61884L96021K67895J49920P6593R7119J87200K99554M23129N59301
4224A6586724O69520P57459Q19304P70837N98903M17679J57031j22003l33862
4215B0321592l66064m05299l76495k71072o9143N6299K00188L32227L42592L07517
4205B0072342K24136M459k94759n04322o91875q04249q68968p96282p21083n73913
4195A5045486m27935k62283j79577r5448o0162j12719k45912l99355n54187o94029
$$ plain form
4264 2187937 2335397 2477171 2643884 2790555 2985697 3203670 3448184 3677776 3927384 4235643
4254 4235643 4544501 4932780 5364025 5813892 6226632 6632270 6998260 7281903 7543324 7786355
4244 7786355 8078228 8436164 8830507 9283122 9868185 10508786 11258416 12076979 12871279 13568108
4234 13568108 14129992 14526013 14793908 14943828 15020421 15117540 15304740 15604294 16027423 16586724
4224 16586724 17256244 18013703 18833007 19603844 20202747 20620426 20777457 20655454 20321592
4215 20321592 19955528 19550229 19173734 18902662 18833519 18889818 19090006 19422233 19764825 20072342
4205 20072342 20296478 20300937 20006178 19501856 18809981 18005732 17136764 16340482 15619399 15045486
4195 15045486 14617551 14355268 14175691 14080243 14020081 13907362 13661450 13262095 12707908 12013879
4185A2013879p69589p38749p22798o18212n58767m91512m05633k86771k21995
4176G199853k07986j55771k43460k79400l59915m30404m00701l52575l76500k96841
4166D096300k54858k28734k35492j85181j21137j19601j08877j27492j06794r7198
4156B510936j28478j21278j02785j05000j00576j09721q6310m6659p1770q1403
4146A556956k9411m5361o6916p6329m6731l353j3575k4490q6424n3800j4711n0035
4134A045820l7752k6156k5143J552M757l1204n0820J9385p134o468p889k5678
4122H53270k9796Q858p540J0151j8530L4260J7662p090j2442l2000l2172k1547
4110G63084k8515p505J587m1624k7321n832m383p125m5235k7702J7334p685K4475
$$ plain form
4185 12013879 11244290 10505541 9782743 9164531 8605764 8114252 7708619 7421848 7199853
4176 7199853 6991867 6836096 6592636 6313236 5953321 5522917 5122216 4769641 4393141 4096300
4166 4096300 3841442 3612708 3377216 3192035 3070898 2951297 2842420 2714928 2608134 2510936
4156 2510936 2382458 2261180 2158395 2053395 1952819 1843098 1756788 1710129 1638359 1556956
4146 1556956 1527545 1482184 1415268 1338939 1292208 1288855 1275280 1250790 1164366 1110566 1095855 1045820
4134 1045820 1008068 981912 956769 958321 963078 931874 881054 900439 893305 886837 878948 853270
4122 853270 823474 832332 824792 834943 816413 850673 868335 861245 848803 816803 784631 763084
4110 763084 734569 727064 728651 687027 659706 653874 649491 642366 597131 569429 586763 579078 603553
4097F03553K1178K2582J5640o398r212j1235K873K6087J5249J4744r267K5164
4085G10958P493Q75j9532M478k0891L096J2411J3978N6836j1110K3123J261O735
4072G89711L6830M0758K7104k4862N5775N5537P4372L0891K7233M1576J5867L3898
4060A204690N6449M6072N367L6913N3582P6195O4520L3192N4347M5065P8680P1029
4048A826101J3271K888q170M757L5097L0143N9768R3377P8810L9887J09079P3284
4036B358292J1957j5263n2684j9415n0048n5782j8707j2463J6013L8926L8940
4025B239766Q3696R0078l455j9318p1759o9626o9672p6782l5333o9470l1985J189
4013A967329J5781K7837J5006k077k3776k5575l2028k570m5715n859K6605j9689
$$ plain form
4097 603553 624731 647313 662953 656555 647343 636108 638981 665068 680317 695061 685794 710958
4085 710958 718451 719326 699794 704272 683381 686477 698888 712866 769702 758592 781715 782976 789711
4072 789711 826541 867299 894403 869541 925316 980853 1055225 1086116 1113349 1154925 1170792 1204690
4060 1204690 1261139 1307211 1312578 1349491 1403073 1479268 1543788 1576980 1631327 1676392 1755072 1826101
4048 1826101 1839372 1842260 1834090 1838847 1873944 1904087 1963855 2057232 2136042 2175929 2285008 2358292
4036 2358292 2370249 2354986 2302302 2282887 2232839 2177057 2158350 2145887 2161900 2200826 2239766
4025 2239766 2323462 2413540 2410085 2390767 2319008 2249382 2179710 2102928 2067595 1998125 1966140 1967329
4013 1967329 1983110 2010947 2025953 2023876 2000100 1974525 1942497 1939927 1894212 1888353 1914958 1895269
4001A895269j8949L3768K7538J3547K9722q461M991J5886M2265M359M4033N2861
3989B136829K3779L4169N5071N3522K7745J7796N0942M5291N5694J7939j0655
3978B508122O3487J01525N9246Q3979L8289K7351L7317L1373M8707J5337L1935
3967C046668O669L7874L5491M7330N8296M8377j2645Q210N6747j0264O0042P4088
3955C456883P4179j5507l2447N675K5848L3369R21P4849N9038L5390N0765N7406
3943C826369N2534J5072L3165j3460J697L7761O4833Q5025j2935l9568l3319n5975
3931C961199j7483K0061p880K7221K9785N2466P5589J15298J32405J31089K01108
3920D720858K59731K73455K24896K09388J42548O9926N8585P7919Q3201O2789
$$ plain form
4001 1895269 1876320 1910088 1937626 1951173 1980895 1972434 1977425 1993311 2035576 2039935 2083968 2136829
3989 2136829 2160608 2194777 2249848 2303370 2331115 2348911 2399853 2445144 2500838 2518777 2508122
3978 2508122 2571609 2673134 2732380 2816359 2854648 2881999 2919316 2950689 2999396 3014733 3046668
3967 3046668 3053337 3091211 3126702 3174032 3232328 3280705 3268060 3276270 3333017 3322753 3382795 3456883
3955 3456883 3531062 3515555 3483108 3488783 3514631 3548000 3548921 3623770 3682808 3718198 3768963 3826369
3943 3826369 3878903 3893975 3927140 3913680 3915377 3953138 4017971 4102996 4090061 4050493 4017174 3961199
3931 3961199 3943716 3963777 3955897 3983118 4012903 4065369 4140958 4256256 4388661 4519750 4720858
3920 4720858 4980589 5254044 5478940 5688328 5830876 5900802 5959387 6037306 6120507 6183296
3910F183296Q5167J09791J54344J98206J97629K13673K53079L44883L55825L62797
3900H458690L92657N30905O57983P05051P97677Q07711P93584P60447P76364Q60551
3890A5541620R46311J136952J372883J628495J840608J998617J793747J299653
3882B7558886P68776M49002L60966M13248M25865L38719M33611O91643J004617
3873C2445333J238584J376001J455635J309598J018138P31034N03914M30080L04774
3864D0813091K88456L35908M58038P02776R78912J369583J848101K297795K629801
3855E1722461K849676K623433J349783l89582j911405k637951k794043k582994
3847D8229378k289251k007926j711616j410736j021072o92600m16465k80781j91965
$$ plain form
3910 6183296 6268463 6378254 6532598 6730804 6928433 7142106 7395185 7740068 8095893 8458690
3900 8458690 8851347 9382252 10040235 10745286 11542963 12350674 13144258 13904705 14681069 15541620
3890 15541620 16487931 17624883 18997766 20626261 22466869 24465486 26259233 27558886
3882 27558886 28327662 28776664 29137630 29550878 29976743 30315462 30749073 31440716 32445333
3873 32445333 33683917 35059918 36515553 37825151 38843289 39574323 40078237 40508317 40813091
3864 40813091 41101547 41437455 41895493 42598269 43577181 44946764 46794865 49092660 51722461
3855 51722461 54572137 57195570 58545353 58155771 56244366 53606415 50812372 48229378
3847 48229378 45940127 43932201 42220585 40809849 39788777 39096177 38679712 38398931 38206966
3838C8206966k38808m68266q59542j253456j531181j655767j521947j260843r73470
3829B8443686p53913n55204m18400l17343j20522o3937l12094q30567j310868
3820B3760838j556475j618118j513955j373175j215564j038788q67084p49488
3812A3828191o55363o71317o35778n67470m96297m37601m16761l32533l16877
3803I298194k76010j93781j51157j51962j31050j02449o0321j09892o6131l3644
3793H021797n1932q6851j00754j15787j59332j88483k76751k40554j86484j80370
3783F434499j35633j29262j25787n7291o4517l5920k0091o1848o5176l7646j9605
3772E681723n1651l6204n3847J2657k2504j4882j4733n4457q6029n8869m768l3639
$$ plain form
3838 38206966 37968158 37499892 36640350 35386894 33855713 32199946 30677999 29417156 28443686
3829 28443686 27689773 27134569 26716169 26398826 26278304 26214367 25902273 25071706 23760838
3820 23760838 22204363 20586245 19072290 17699115 16483551 15444763 14577679 13828191
3812 13828191 13172828 12501511 11865733 11298263 10801966 10364365 9947604 9615071 9298194
3803 9298194 9022184 8828403 8677246 8525284 8394234 8291785 8231464 8121572 8055441 8021797
3793 8021797 7969865 7883014 7782260 7666473 7507141 7318658 7041907 6801353 6614869 6434499
3783 6434499 6298866 6169604 6043817 5986526 5922009 5886089 5865998 5804150 5738974 5701328 5681723
3772 5681723 5630072 5593868 5540021 5552678 5530174 5515292 5500559 5446102 5360073 5301204 5296436 5262797
3760E262797m0365n2301o9886k9512m6513q833J9225L6235K9084Q7394P4789Q0580
3748E342694R6097N9667M1245M9124J06998J00104J45850J62085J84053J89474
3738F477391K71083K90721L48431K99847L10183L33132M06495M36995M23638M77014
3728A0074930N07687N94453O55866P23674Q50389R25266J043765J198663J331060
3719A7905753J451530J667860J938173K126267K287247K389493K370645K176695
3711C4313663J926867J631468J170490P08484K89708j04161m06083o10895o07769
3702C8311772m69258l15211r0113J44114K33604K44638J03172j62681m68126q75855
3692C6656056j244342j646577j911161k116699k267123k229577k134015k048817
$$ plain form
3760 5262797 5222432 5170131 5100245 5070733 5024220 5015387 5034612 5070847 5099931 5187325 5262114 5342694
3748 5342694 5438791 5498458 5539703 5588827 5695825 5795929 5941779 6103864 6287917 6477391
3738 6477391 6748474 7039195 7387626 7687473 7997656 8330788 8737283 9174278 9597916 10074930
3728 10074930 10582617 11177070 11832936 12556610 13406999 14332265 15376030 16574693 17905753
3719 17905753 19357283 21025143 22963316 25089583 27376830 29766323 32136968 34313663
3711 34313663 36240530 37871998 39042488 39750972 40040680 39936519 39530436 38919541 38311772
3702 38311772 37842514 37527303 37437190 37581304 37814908 38059546 38162718 38000037 37531911 36656056
3692 36656056 35411714 33765137 31853976 29737277 27470154 25240577 23106562 21057745
3684B1057745j831714j656913j492432j284488j117114r53803q46447p36117o46117
3675A0492600n33330m88766m55266m14914l49682l58309l07926k39601k33225
3666G111581k27498j74321j99084j74968j62671j14114j50138j57066j39063r4437
3656E518221q7166j06903r8079p3440r3144j18192r6955q3790j02045n2692m4235
3645D561580n3303j9210l8535K0420l4699n1294o576j7715Q20L1730M0464K8310
3633D461992K9298K8670J3812K6828M7532P6863Q6748M7644P9911M4573O7566
3622E011437P9398N9680R2082O0571J01634Q7413Q9448J36193R7615Q3027P6393
3611E974891Q2434P2969R5006P6083J05409Q6547P2924J34663J47226J91536J96898
$$ plain form
3684 21057745 19226031 17569118 16076686 14792198 13675084 12721281 11874834 11138717 10492600
3675 10492600 9959270 9470504 9015238 8600324 8250642 7892333 7584407 7344806 7111581
3666 7111581 6884083 6709762 6510678 6335710 6173039 6058925 5908787 5751721 5612658 5518221
3656 5518221 5431055 5324152 5226073 5152633 5059489 4941297 4844342 4760552 4658507 4605815 4561580
3645 4561580 4508277 4489067 4450532 4470952 4436253 4384959 4378383 4360668 4361488 4393218 4433682 4461992
3633 4461992 4491290 4519960 4533772 4560600 4608132 4684995 4771743 4819387 4899298 4943871 5011437
3622 5011437 5090835 5150515 5242597 5303168 5404802 5492215 5581663 5717856 5815471 5898498 5974891
3611 5974891 6057325 6130294 6225300 6301383 6406792 6493339 6566263 6700926 6848152 7039688 7236586
3600G236586J59874J91739K36962K47734K83321K70740L29754L34220M32011M35400
3590A0158341N49774N82424O46198P45230Q26657R27319J048398J247231J364905
3581A8096477J562547J707260J784461J802910J791192J665055J422552J201744
3573C1034198R34422O65295M11283K50728J10614R0081J51354K18085K81250K95448
3563C4442758K90809K13110O09j89145m80696p40431j016412j315126j563017
3554B9642459j652842j735359j698344j591427j484586j275683j101825r40931
3546A8161462p50963o10920m54258l92719k43328j17459m5383O9093J25952K32518
3536A5973995L42121M08205M49186N73138O99062Q00220Q89740R73953J078352
$$ plain form
3600 7236586 7396460 7588199 7825161 8072895 8356216 8626956 8956710 9290930 9722941 10158341
3590 10158341 10708115 11290539 11936737 12681967 13508624 14435943 15484341 16731572 18096477
3581 18096477 19659024 21366284 23150745 24953655 26744847 28409902 29832454 31034198
3573 31034198 31968620 32633915 33045198 33295926 33406540 33496621 33647975 33866060 34147310 34442758
3563 34442758 34733567 34946677 34947286 34758141 34277445 33537014 32520602 31205476 29642459
3554 29642459 27989617 26254258 24555914 22964487 21479901 20204218 19102393 18161462
3546 18161462 17410499 16799579 16345321 15952602 15709274 15591815 15546432 15615525 15741477 15973995
3536 15973995 16316116 16724321 17173507 17746645 18445707 19245927 20135667 21109620 22187972
3527B2187972J244134J402201J530873J698969J916298K096052K328341K598249
3519C7003089K943858L261219L529011L731279L767754L763635L623595L424490
3511F5047930L330110L183859L005440K734623K357265J855364J308641P79086
3503H3602318L22779k00151n56088r40453j265082j494586j661200j881816k009688
3494G3916033k159222k330413k426302k472988k474129k439489k369385k169833
3486E5074272j969682j696050j346860r54105m58247M4930O84898J110791R24366
3477E1414313P21313R26367J453272J985644K729183K911942K414547K171813
3469F6728394K527229K983210L338811L638071L698520L731852L618376L395440
$$ plain form
3527 22187972 23432106 24834307 26365180 28064149 29980447 32076499 34404840 37003089
3519 37003089 39946947 43208166 46737177 50468456 54236210 57999845 61623440 65047930
3511 65047930 68378040 71561899 74567339 77301962 79659227 81514591 82823232 83602318
3503 83602318 83925097 83724946 83168858 82228405 80963323 79468737 77807537 75925721 73916033
3494 73916033 71756811 69426398 67000096 64527108 62052979 59613490 57244105 55074272
3486 55074272 53104590 51408540 50061680 49107575 48649328 48694258 49379156 50489947 51414313
3477 51414313 52135626 53061993 54515265 56500909 59230092 62142034 64556581 66728394
3469 66728394 69255623 72238833 75577644 79215715 82914235 86646087 90264463 93659903
3461I3659903L028073K599701K239085J899993J683951J770556K083461K505992
3453A11470715L037587L661089M218620M221948L628548L072460K689960K078414
3445A38079341J309213J88775j796747l775708n047641n718821n913400n784654
3437A11540358n429356m924003m378225l707223l205654k808832k520033k372999
3429H2194033k391448k552042k771723l080340l351141l539637l552560l549503
3421E7405639l471981l317001l119702k847361k540561k220769j972752j665957
3413C6249555j386792j128043r29740p06136n08208k97408j36554L9280J80540
3404C1376494L48652N15265P87021R95263J256992J491406J738882J890879J958135
$$ plain form
3461 93659903 96687976 99287677 101526762 103426755 105110706 106881262 108964723 111470715
3453 111470715 114508302 118169391 122388011 126609959 130238507 133310967 136000927 138079341
3445 138079341 139388554 139577329 137780582 134004874 128957233 123238412 117325012 111540358
3437 111540358 106111002 101186999 96808774 93101551 89895897 87087065 84567032 82194033
3429 82194033 79802585 77250543 74478820 71398480 68047339 64507702 60955142 57405639
3421 57405639 53933658 50616657 47496955 44649594 42109033 39888264 37915512 36249555
3413 36249555 34862763 33734720 32804980 32098844 31590636 31293228 31156674 31195954 31376494
3404 31376494 31725146 32240411 33027432 34022695 35279687 36771093 38509975 40400854 42358989
3395D2358989J901847J836891J722777J579726J493874J360011J087966P60641
3387E4102722L69691O155k62983m91314o52912p15915p68421q34780p50003p56545
3377D9245695p12401o59342o45208o56482p14389q87441j036600j169852j402827
3368D1361153j550830j721150j880794j889419j907401j844388j747882j611657
3360B7207632j495219j343260j145144r60970q00579o32828m49947l22759l62967
3351A9693959m05510l40044k45734k07177j56383m9267K7938R1805J71319K72285
3341A8853191M21898O49774R10659J043247J144047J231422J209749R61308J62433
3332B6587728o54736r99704r76954q66009o48776m50662l34841j95275j40029
$$ plain form
3395 42358989 44260836 46097727 47820504 49400230 50894104 52254115 53342081 54102722
3387 54102722 54472413 54478568 54215585 53724271 53071359 52355444 51587023 50752243 50002240 49245695
3377 49245695 48533294 47873952 47228744 46572262 45857873 44970432 43933832 42763980 41361153
3368 41361153 39810323 38089173 36208379 34318960 32411559 30567171 28819289 27207632
3360 27207632 25712413 24369153 23224009 22263039 21462460 20829632 20379685 20056926 19693959
3351 19693959 19288449 18948405 18702671 18495494 18339111 18289844 18317782 18409587 18580906 18853191
3341 18853191 19275089 19924863 20835522 21878769 23022816 24254238 25463987 26425295 26587728
3332 26587728 25932992 24933288 23956334 23090325 22441549 21990887 21656046 21460771 21320742
3323B1320742m1537J7175N5312J06281O9523J05209J97462K65858L30514M74976
3313B2901515O25559Q50674J099742J259671J524392J633812J680855J339542
3305C2915762O48181L0514n3790K11661N81545R28398J276819J506547J727029
3296C9772666J908720K004266K109445K217792K275556K204093K036575J836267
3288E6365380J528747J288244J090700R22220P63850O05104L90445N9103k64154
3279F2749639n61632p55055q46316r22062j113439j382958j598707j758095j906627
3270E1904748k045173k097759k211939k318905k419420k567561k564141k542237
3262C3137613k441649k366229k267319k140310j962500j806161j609720j409914
$$ plain form
3323 21320742 21279205 21296380 21351692 21457973 21527496 21632705 21830167 22096025 22426539 22901515
3313 22901515 23527074 24377748 25477490 26737161 28261553 29895365 31576220 32915762
3305 32915762 33563943 33594457 33540667 33752328 34333873 35262271 36539090 38045637 39772666
3296 39772666 41681386 43685652 45795097 48012889 50288445 52492538 54529113 56365380
3288 56365380 57894127 59182371 60273071 61195291 61959141 62564245 62954690 63013793 62749639
3279 62749639 62188007 61432952 60586636 59664574 58551135 57168177 55569470 53811375 51904748
3270 51904748 49859575 47761816 45549877 43230972 40811552 38243991 35679850 33137613
3262 33137613 30695964 28329735 26062416 23922106 21959606 20153445 18543725 17133811
3254A7133811j234513j082201r80381q51133p05599o52712n42805m96671m53746
3245A0134050l87240l84711l11059k66111k65249j96548k05815j83169j37356
3236G796792j24964q5828q0145m5230n169K4971l3j7142l893K5011J2983r1407
3224G405946q1692q3479j05818q6851j29502j37570j31798j05476j01718j11668
3214F330374j32485j28535j37857j43862j66504j61848j71318j77894j48024j88446
3204D773601j83163j79444j70942j47707j27851j09280o9095p8534l7192r5468
3194C574925q1954m4964l0838J2282k1853r5989q0665q357J327K674m923J3059
3182C234724J8154k3460J8558N0221o494J1635M1143j9330J39j8660j585K7682
$$ plain form
3254 17133811 15899298 14817097 13836716 12985583 12279984 11627272 11084467 10587796 10134050
3245 10134050 9746810 9362099 9051040 8784929 8519680 8323132 8117317 7934148 7796792
3236 7796792 7671828 7586000 7505855 7460625 7455456 7480427 7480394 7463252 7459359 7484370 7497353 7405946
3224 7405946 7324254 7240775 7134957 7048106 6918604 6781034 6649236 6543760 6442042 6330374
3214 6330374 6197889 6069354 5931497 5787635 5621131 5459283 5287965 5110071 4962047 4773601
3204 4773601 4590438 4410994 4240052 4092345 3964494 3855214 3786119 3707585 3670393 3574925
3194 3574925 3492971 3448007 3417169 3429451 3407598 3311609 3230944 3222587 3223914 3226588 3221665 3234724
3182 3234724 3252878 3229418 3247976 3298197 3291703 3303338 3344481 3325151 3325290 3306630 3305045 3332727
3170C332727j1827L1252L5378M7303N3681J5527j0613K8487O0791J5541J3134
3159C611381J3060j8056m9784p039J0077k6812k5842L944l5326l7162k3313L741
3147C418869k2163j5635k572L0328K0924K5481L3510K2942n619m7623L436k4847
3135C437031n6792q0784k7841j221k7578k9231m6794o1677J5668K9036j5652K3412
3123C157577P5118O3512M8037O9257J35928J10895J00401R0514J53591J31889
3113D136719J53014J63438J68305J56380J40420J80282J71271J25589J59081J37153
3103E691652J58117J62204J74376J45281J68197J98925J82379K31595K66587K52822
3093G632135K77947K95467L87491M07829M24336M60569M63262N74117O46938O43810
$$ plain form
3170 3332727 3320900 3352152 3387530 3434833 3488514 3504041 3493428 3521915 3582706 3598247 3611381
3159 3611381 3624441 3606385 3556601 3549562 3559639 3532827 3506985 3510929 3475603 3438441 3415128 3418869
3147 3418869 3396706 3381071 3378499 3408827 3429751 3455232 3488742 3511684 3506065 3458442 3461878 3437031
3135 3437031 3380239 3299455 3271614 3270393 3242815 3213584 3166790 3105113 3120781 3149817 3134165 3157577
3123 3157577 3232695 3296207 3344244 3413501 3549429 3660324 3760725 3851239 4004830 4136719
3113 4136719 4289733 4453171 4621476 4777856 4918276 5098558 5269829 5395418 5554499 5691652
3103 5691652 5849769 6011973 6186349 6331630 6499827 6698752 6881131 7112726 7379313 7632135
3093 7632135 7910082 8205549 8593040 9000869 9425205 9885774 10349036 10923153 11570091 12213901
3083A2213901P24405Q32088Q41907Q78417J016315J128992J271685J538824J742622
3074B2189156J930729K160744K420011K541357K476234K522679K694732K952459
3066D1888101L255209L403039L626652M057534M727715N514252O241595O884295
3058G9598392P659044Q583630R609522J0694048J2119744J4229873J7222466K1024153
3050A80740872K5523656K9939259L1610752K5730464J3330004K602388j160483
3043C08316912l20824j943571j0601425k1910985k8556926k9299291k6862403
3036A88821487k3586254k0778204j8308968j5540128j2785806j0477353q783900
3029G8560874p527692o488220n616182m880454m254500l725434l220361k772845
$$ plain form
3083 12213901 12938306 13770394 14612301 15490718 16507033 17636025 18907710 20446534 22189156
3074 22189156 24119885 26280629 28700640 31241997 33718231 36240910 38935642 41888101
3066 41888101 45143310 48546349 52173001 56230535 60958250 66472502 72714097 79598392
3058 79598392 87257436 95841066 105450588 116144636 128264380 142494253 159716719 180740872
3050 180740872 206264528 236203787 267814539 293545003 306875007 309477395 308316912
3043 308316912 307996088 306052517 295451092 273540107 244983181 215683890 188821487
3036 188821487 165235233 144457029 126148061 110607933 97822127 87344774 78560874
3029 78560874 71033182 64544962 58928780 54048326 49793826 46068392 42848031 40075186
3021D0075186k444505k212153k059167j869924j692215j582783j482792j369388
3013B5362259j282579j185060j091137j039550r77585r32040q88316q24785p46123
3004A6395084o72872o06794o26610o05033n33757n49398n13860m72065m54133
2995A1360562l89268l95823l96299l94724l41532l13988l14921k94115l34916
2986H184976k87164k58721k33014j95809j73607k06655j88323j40838j61547j44770
2976F194528j17658j09471j16332p3509p8506o3111m3073p6799q9603l3736p8642
2965E314088j06103j01959r9267q4576j08915j06684j12427j44946j29436j13085
2955D206690j13639j06644r8005j25513j32216p4056m7266n2332n2714n5554m2759
$$ plain form
3021 40075186 37630681 35418528 33359361 31489437 29797222 28214439 26731647 25362259
3013 25362259 24079680 22894620 21803483 20763933 19786348 18854308 17965992 17141207 16395084
3004 16395084 15722212 15115418 14488808 13883775 13350018 12800620 12286760 11814695 11360562
2995 11360562 10971294 10575471 10179172 9784448 9442916 9128928 8814007 8519892 8184976
2986 8184976 7897812 7639091 7406077 7210268 7036661 6830006 6641683 6500845 6339298 6194528
2976 6194528 6076870 5967399 5851067 5777558 5699052 5635941 5592868 5516069 5426466 5392730 5314088
2965 5314088 5207985 5106026 5006759 4922183 4813268 4706584 4594157 4449211 4319775 4206690
2955 4206690 4093051 3986407 3888402 3762889 3630673 3556617 3509351 3457019 3404305 3348751 3305992
2944C305992n4252j4433k5313j0601k2561m0517l4923o4508k4439m8261j06839
2933B859345o0671j7143p0297o5856q0405l9931l0863l1887j1292M7053K0647
2922B518700n2838j3001j3005P633L5552M59l1781j2235l389n1606n5723l7381
2910B291385l8561P652P076l4371k0849l4638j3346l5120p0422j5233r60k6711
2898B015902n1649j5244j1191j1615o899n1071j5563j0721J9984o696k5480l8071
2886A791686l9787j6780n8919l1951k2829p2103r0396j3690n6467n8204l0452
2875A300108k7949j1130j648j5284j1928j6806R692N3256K4529K790J0037K3457
2863A339124o684K5488Q090M3531J979N439l0354j5439J3083j6000J7396l4258
$$ plain form
2944 3305992 3251740 3237307 3211994 3201393 3178832 3138315 3103392 3038884 3014445 2966184 2859345
2933 2859345 2798674 2781531 2711234 2645378 2564973 2525042 2494179 2462292 2451000 2498053 2518700
2922 2518700 2465862 2452861 2439856 2447489 2483041 2483500 2451719 2439484 2436095 2384489 2328766 2291385
2910 2291385 2252824 2260476 2267552 2233181 2212332 2177694 2164348 2129228 2058806 2043573 2042613 2015902
2898 2015902 1964253 1949009 1937818 1926203 1919304 1868233 1852670 1841949 1861933 1855237 1829757 1791686
2886 1791686 1751899 1735119 1676200 1644249 1621420 1549317 1458921 1445231 1388764 1330560 1300108
2875 1300108 1272159 1261029 1259381 1244097 1232169 1215363 1225055 1278311 1302840 1305630 1315667 1339124
2863 1339124 1332440 1357928 1366018 1409549 1411528 1416967 1386613 1371174 1384257 1368257 1385653 1351395
2851A351395k5295l2043l4521J4959j2816L252n573l8516K5291o197J1468p393
2839A244011J0532j0278k0130n1654l2851J4446J3282k7731k0733M9110L6720
2828A204724j9454n3927k1770n919K0656k9328k3110k9852j8180k6038n7646k6532
2816I13624l4276k1067k8098J7543P8M783J6246k7111k2590r126k362K0569K936
2803H31149K230Q445J5928M0583N440k8214L5737K3035k1923L4089j1646L6334
2791I71187q257j0216J2540J8485K589l694M3290J2470M4691L9855J2984j3618
2779A122306j3867L3539K2071M6973O4562K4579o420M5587R7659Q8038J05564
2768A630591R9434J57401J61981J56731J55121Q7664L2829N739k3299J5573n3067
$$ plain form
2851 1351395 1326100 1294057 1259536 1274495 1261679 1264931 1259358 1220842 1246133 1239936 1251404 1244011
2839 1244011 1254543 1244265 1224135 1172481 1139630 1154076 1167358 1139627 1118894 1168004 1204724
2828 1204724 1185270 1131343 1109573 1103654 1124310 1094982 1071872 1042020 1023840 997802 940156 913624
2816 913624 879348 858281 830183 847726 847804 852587 868833 841722 819132 810006 807644 828213 831149
2803 831149 833379 841824 857752 898335 903775 875561 911298 934333 912410 946499 934853 971187
2791 971187 962930 952714 965254 983739 986328 982634 1025924 1038394 1083085 1122940 1135924 1122306
2779 1122306 1108439 1141978 1164049 1211022 1275584 1300163 1293743 1339330 1436989 1525027 1630591
2768 1630591 1730025 1887426 2049407 2206138 2361259 2448923 2481752 2487491 2464192 2479765 2426698
2757B426698j42479j71060j23074j50706j69698j18262r5714n0294r8458o7600
2747A239353l2129l2617n4381l6022m9358k0756m586l2380o2730k9228j9767J0227
2735H75626p890j353j8779l9278m57q888j192k1777J1682O689n110n0222j7353
2722G21698K3372l755j3062p552j3282p835m912p162l8183J9786L1284j8994L7164
2709G18567J4509l0172l7256l1823J3505j7661R824J9081J4116j7211k9133j2737
2697F13609j4042J3949l8750P747N805P867J2568P309r226L072l9373M338Q463
2684E83336l540M3050k9895n2875L7264k184l2972J7377j8412j0710k0696J2551
2672E22294M623j176m832L6522q738k6387j382M312J0731j1907k2486k6365L5731
$$ plain form
2757 2426698 2284219 2113159 1990085 1839379 1669681 1551419 1455705 1405411 1306953 1239353
2747 1239353 1207224 1174607 1120226 1084204 1034846 1014090 1009504 977124 914394 885166 865399 875626
2735 875626 867736 866383 847604 808326 807869 798981 797789 776012 787694 794383 789273 739051 721698
2722 721698 745070 741315 728253 720701 707419 699584 694672 687510 649327 669113 700397 681403 718567
2709 718567 733076 702904 665648 633825 647330 629669 639493 658574 672690 655479 626346 613609
2697 613609 599567 613516 574766 582513 588318 596185 608753 616062 606836 609908 570535 574873 583336
2684 583336 579796 622846 592951 540076 577340 575156 542184 559561 541149 530439 509743 522294
2672 522294 526917 525741 520909 557431 548693 522306 520924 525236 535967 524060 501574 475209 510940
2659E10940R737m35j7610N751j9312N215K0922p430J7999j8885J2138O506K3980
2646E49516J7342k4009l26q678j9831L596R252m3975j1148M7647n317q947l1622
2633D73500l867k2986N641N6455k4286J8621K0680o0617l7204K5835J292l2091
2621D20973L64J640K3784J1961j0194o936K2873l3070P500n104k6974N805M13
2608D13035J545j5959L8719J9459j6184k4322K0240L7214j0974k8782K974k674
2596D34291m82N7323j1908j5235r886j3713m747K4839K0494j6032l7220L30j040
2583D27014k9194j3894j9255j9136K8947R391l4008L0532J4513J0582j0736j0043
2571C84713k3977K1330Q938j4988l57J8628J8260P269L994j724j1388k1619J581
$$ plain form
2659 510940 520677 520242 502632 508383 489071 494286 515208 507778 525777 506892 519030 525536 549516
2646 549516 566858 542849 542523 533845 514014 517610 526862 482887 471739 519386 514069 505122 473500
2633 473500 469633 446647 452288 508743 484457 503078 523758 463141 425937 451772 453064 420973
2621 420973 421337 422977 446761 458722 448528 441592 464465 431395 438895 433791 406817 412622 413035
2608 413035 414580 398621 437340 456799 440615 416293 436533 473747 462773 433991 436965 434291
2596 434291 433809 491132 479224 463989 454103 440390 435643 460482 480976 464944 427724 428054 427014
2583 427014 397820 383926 364671 345535 374482 383873 349865 380397 394910 405492 394756 384713
2571 384713 360736 382066 391004 376016 375659 394287 412547 419816 423810 422086 410698 389079 390660
2558C90660K8163O503j9294j5659j042l044P120J9288R71K0235j1656j890Q657
2545D29012m1899p001L5274j1231m1782q876J2713M71l6617K9162R308L5615n018
2532C99131m674j4313J519j0383l8912j0272L4070o780L6722j1657j4853l981
2520C55617M98K163j6909K0504k0069J1264n491L4097j1542l586K3240O258j6843
2507C79201j2022J299J0945l6850k10r113q383J3289J8549j5602J1294k603K919
2494C52713L398J6196k2153K739K2099j4800J7556L0733o3973m1723m535J311
2482B99561M8398l3945k5685J0355N22J1913J8216k2206j14R615o336l4736k6615
2469B48943J8483K9435R888k3070K646J9752j9322k200L967L387K7389J203j1999
$$ plain form
2558 390660 418823 425326 406032 390373 389331 386287 393407 412695 413666 433901 422245 420355 429012
2545 429012 387113 380112 415386 404155 362373 353497 366210 366681 330064 359226 368534 404149 399131
2532 399131 394457 380144 381663 371280 332368 322096 356166 349386 386108 374451 359598 355617
2520 355617 356115 358278 341369 361873 341804 353068 347577 381674 370132 366546 389786 396044 379201
2507 379201 367179 368478 379423 342573 342363 333250 324867 338156 356705 341103 352397 349794 352713
2494 352713 356111 372307 350154 352893 374992 360192 377748 408481 344508 302785 298250 299561
2482 299561 347959 314014 288329 298684 299206 311119 329335 307129 307015 316630 310294 275558 248943
2469 248943 267426 296861 306749 283679 286325 306077 286755 284555 288522 291909 319298 320501 308502
2456C08502j8991k8364k345L9017K035l4868O964K9825l7092N645M75K2589K2422
2443C15814l581j79j4506j1087m1036j8652L5762M4429l2576l5201p838K2983
2431B54332Q611Q310j7181K8204k8354L708L3809K220j5878j7212j065p648J7661
2418B69517J33j1549J6505J9525q541j1623r624K5646m2949p010J8492k4906M5947
2405B79563m268l9589k955N2567K3615m9552J8109L1634k8890r719j2665J0306
2393B68156K9415R712J3370J686n092K5455K970j3857m1210N751J8351O402m462
2380C16647R269J6738l6285k4813L2334N5670l2525n2629k4421M823K0286J3868
2368B98962M6410q226m0622M346k7965J5615J6268l29k0008K9356o57k769j3911
$$ plain form
2456 308502 289511 261147 258802 297819 299854 264986 271950 301775 264683 270328 270803 293392 315814
2443 315814 312233 312054 297548 286461 245425 226773 262535 306964 274388 239187 231349 254332
2431 254332 262943 271253 254072 282276 253922 257630 291439 293659 277781 260569 259504 251856 269517
2418 269517 269650 258101 274606 294131 285590 273967 264343 289989 247040 240030 258522 233616 279563
2405 279563 275295 235706 232751 285318 308933 259381 277490 309124 280234 270515 257850 268156
2393 268156 297571 307283 320653 322339 317247 342702 345672 331815 290605 296356 314707 321109 316647
2380 316647 325916 342654 306369 281556 313890 369560 337035 284406 259985 264808 285094 298962
2368 298962 345372 337146 296524 300870 272905 288520 304788 304459 284451 313807 313150 310381 296470
2355B96470Q802P054k800J8634q199k119K0032j8432k3956j118j6527K6719J0189
2342C14749j2547J3005Q744J7421L636j3008L6381J5015m8275K0827R32j6502
2330C40378L849J0124K9210L8430r679j7009K7663L5961K9485j1022J765M4889
2318E24044N094L2394K9697O399K8518J2784P1598L3311N5177P8224R7071J00372
2306A074683R6734L2844O6352R8226O4884P4373J09724P3382J65721J96364J70956
2295B224243J78519J76697J54918K53354K55627K85419L56378M97963N93033P88372
2285E764523J060487J483478J994072R34482o83856j251808j224327j162871r79882
2276E934298q06002p78624o58682n12676m03450k88090k06455j77463j19010j17602
$$ plain form
2355 296470 305272 312326 309526 328160 319961 317842 337874 319442 295486 294368 277841 304560 314749
2342 314749 302202 315207 323951 341372 345008 332000 368381 383396 335121 355948 356880 340378
2330 340378 344227 354351 383561 421991 412312 395303 422966 458927 488412 477390 479155 524044
2318 524044 529138 561532 591229 597628 626146 638930 710528 743839 799016 877240 974311 1074683
2306 1074683 1171417 1204261 1270613 1368839 1433723 1508096 1617820 1691202 1856923 2053287 2224243
2295 2224243 2402762 2579459 2734377 2987731 3243358 3528777 3885155 4383118 4976151 5764523
2285 5764523 6825010 8308488 10302560 11237042 10553186 9301378 8077051 6914180 5934298
2276 5934298 5128296 4349672 3690990 3178314 2774864 2486774 2280319 2102856 1983846 1866244
2266A866244j61023j45492j24654p5645o3977o3093r5335q3685n3992o7747l6833
2255H94768l2768j7893j3107m9401j7766o6418k9753P196o7841l0720L045J883
2243E81225j6285k9877m1607j1297J288J3435L16l465l2320q136j0209m1153k546
2230C99369r172O570j4735K9289m0444L013j9579k1147l3104P356L4828J6359
2218C58603R462j3492l5629k7124l029L0748j72l2106K4195n112j7115j4849K752
2205B77132l505M321o666J3652O87j428j4607k9688K5892K3074r192j7521J1311
2192B73462p656l0102k0892j3210M0613o226J7894m163l8239j803Q499l634J719
2179B16262L2652m716o826k5259J6433k8524N056O528p78R662j8354k254K1211
$$ plain form
2266 1866244 1705221 1559729 1435075 1359430 1295453 1232360 1137025 1053340 999348 931601 894768
2255 894768 862000 844107 831000 781599 763833 697415 667662 674858 607017 576297 579342 581225
2243 581225 564940 535063 493456 482159 483447 496882 497198 493733 461413 453277 443068 401915 399369
2230 399369 390197 396767 382032 411321 370877 373890 354311 333164 300060 307416 342244 358603
2218 358603 368065 354573 318944 291820 288791 319539 319367 287261 311456 306344 289229 274380 277132
2205 277132 273627 277948 271282 284934 285621 284193 269586 239898 265790 288864 279672 262151 273462
2192 273462 265806 235704 214812 201602 242215 235989 253883 249720 211481 209678 218177 214543 216262
2179 216262 248914 244198 237372 212113 228546 200022 205078 211606 210828 220490 202136 199882 221093
2166B21093p45j8393J7398k1290L240K6707l961k5446J4805J9222j8519J5253
2154B29364k4448J2702J9009n0808k376r738K5235K9810J8171L0261k4099k0772
2142B32311j1767l1743K9364q315j7160J6359j7220J1309K6470q806j9624j9165
2130A82013L0748p212J5734Q480k8275n974k100K845k276k0137O700N227m886
2117A80887K6581K7643m6583j0494k4050K2539K643l4834K4552K3965m1475K0327
2105A71701q850L0214m738j701l148m33J4863k1555k3635j1931N4829J3590j6142
2092A93064q009K0394l603P728m4333p632R302p160K2421R542j5573J3508j3301
2079A76348j4504J5596K9149k2205p157j2461J8713K510p116k6178L8590N589
$$ plain form
2166 221093 220348 201955 219353 198063 201303 228010 224049 198603 213408 232630 214111 229364
2154 229364 204916 217618 236627 185819 183443 173705 198940 228750 246921 277182 253083 232311
2142 232311 220544 188801 218165 209850 192690 209049 191829 203138 229608 220802 201178 182013
2130 182013 212761 205549 221283 229763 201488 195514 193414 196259 193983 173846 180546 185773 180887
2117 180887 207468 235111 188528 178034 153984 176523 179166 144332 168884 192849 151374 171701
2105 171701 162851 193065 188327 186626 183478 183045 197908 176353 152718 140787 195616 209206 193064
2092 193064 185055 205449 201846 209574 165241 157609 166911 159751 182172 191714 176141 189649 176348
2079 176348 161844 177440 206589 184384 177227 164766 183479 185989 178873 152695 191285 196874
2067A96874j6199K3867K0076j3908j1704j2452j7823P20j8202j9909Q081L2330
2055A71751j7158J631k597j3194l374K5567k1027k4114K5168l9319r661L7778
2043A31451j832j3103P920K6435J4806J6733R320k5819J3208r995j0076l2409
2031A26639J6305Q635p427K8150k1815J498k5496l7301N6067J3062l9001K7216
2019A46532K5833K4363l3949o667M4123J579j6503J599n829k4211J8181q656K2823
2006A89218j8397k8477K3243J3087q798j4257J838K0220m01l2201J918L3972n495
1993A75470k4151l6895J137l456L7596J4728l9491J697j4607O302L537K4312k1096
1980A25083N17J6099l080j2105o757j0839K1393J7500J096p972K4415n896R826
$$ plain form
2067 196874 180675 204542 224618 210710 199006 186554 168731 169451 151249 131340 139421 171751
2055 171751 154593 156224 153627 140433 137059 162626 141599 117485 142653 103334 93673 131451
2043 131451 129619 116516 124436 150871 165677 182410 191730 165911 179119 169124 159048 126639
2031 126639 142944 151579 144152 172302 150487 151985 126489 89188 145255 158317 119316 146532
2019 146532 172365 196728 162779 156112 200235 201814 185311 186910 181081 156870 175051 166395 189218
2006 189218 170821 142344 165587 178674 169876 155619 157457 177677 177276 145075 146993 180965 175470
1993 175470 151319 114424 115561 112105 149701 164429 124938 126635 112028 118330 121867 146179 125083
1980 125083 125600 141699 138619 126514 119757 108918 130311 147811 148907 140935 165350 159454 169280
1967A69280k7003q510j700J7q934J6667R203k8549J9181j2722n41L470m201Q783
1953A34441J7588j9555k071j8820R032K5775O185j0882Q737j4568j9475j1426
1941A04961M218J9407J8612O236q526O739l5362L9535k1550m7285J9170k761L5062
1928A38456J1170k8899L272L945L903k8262O869m854J5758j0189q174K6917k726
1915A27186j7956k2906J2296N886Q591P550M1174j6562n0142J5526J3808L497
1903A27948J0147K0186j0961j5853J1404j9881o655L699K9801k9572J5203l308
1891A32158m2372N515L1679O643k3308O143o396K5426j36K7559l1697l3654L0720
1878A28280J4369j7847j1030j7802N724k6719K303R280n617J2050K8799K6179
$$ plain form
1967 169280 142277 133767 132067 132084 123150 139817 149020 120471 139652 126930 126389 129859 125658 134441
1953 134441 152029 132474 130403 111583 120615 146390 152575 141693 150430 135862 116387 104961
1941 104961 109179 128586 147198 153434 144908 151647 116285 155820 134270 86985 106155 103394 138456
1928 138456 149626 120727 123999 127944 131847 103585 110454 105600 121358 111169 102995 129912 127186
1915 127186 109230 86324 98620 104506 113097 120647 161821 145259 95117 110643 124451 127948
1903 127948 138095 158281 147320 131467 142871 122990 116335 120034 149835 120263 135466 132158
1891 132158 89786 95301 126980 133623 110315 116458 110062 135488 135352 162911 131214 97560 128280
1878 128280 142649 124802 113772 95970 101694 74975 77278 86558 80941 92991 121790 147969
1866A47969j1985J7167l654l3764j271K4693j0833o641k725j912j2755K3467J1903
1853A39659k0401n0423N136L3692J2741P609l1054j0199J3334J9153j0997J306
1841A09556K1885Q709k5438l1359r358J7799r431O546J2152l4621J6008K6676
1829A09124J9358m5392N455k991J0228j9018J780O856q09J1737q220n548K5436
1816A07996k4855j4203J7057O283k4261K3133K0552J3186J1883n0779j3886K3496
1804I5602Q968k4156Q92J0674j6374P016K0075k5026j1952K5522k6419m262L5644
1791I6204o085k505P896j3413l2013P562K9841K6649l093j6105l8547K560J3622
1778G2573J4449J9350m109M275j5645k0448j4171Q974N5351J1688L922q158j36
$$ plain form
1866 147969 135984 153151 149497 115733 114462 139155 128322 121681 118956 117044 104289 127756 139659
1853 139659 119258 68835 73971 107663 120404 128013 96959 86760 100094 119247 108250 109556
1841 109556 131441 140150 114712 83353 73995 91794 82363 88909 101061 66440 82448 109124
1829 109124 128482 83090 88545 85554 95782 76764 78544 85400 84591 96328 88108 82560 107996
1816 107996 83141 68938 85995 92278 68017 91150 111702 124888 136771 85992 72106 95602
1804 95602 104570 80414 81306 91980 75606 82622 102697 77671 65719 91241 64822 60560 96204
1791 96204 90119 87614 95510 82097 50084 57646 87487 114136 111043 94938 56391 58951 72573
1778 72573 87022 106372 102263 106538 90893 70445 56274 65248 120599 132287 136209 128051 127915
1765A27915j1650k7929p754J7605k7618l82j2004M3259J6399j0526J3478n0844
1753F9949p864J1954J2405M799j697J3427j5772r680P61L7417P524l4107k9068
1740F0048J0719Q189k742j138r439M491K6792K171n82J0047m0601n4858L0452
1727D3549L2444M1804j8990k2132K3729J3682j6030k3604O593l950p776J2809
1715H2128l45J3349J7911o9161J3417M5890l963k7085M4572j1857p988J7592j6186
1702I8274M701j1977j8994L7119k2416k3126J4124L773j2455L5657l457q218L145
1689I6150k2337N652J6759j8284k0603K9819k0736P750J2462L8758k987k7061
1677I5342P315j5600R780m852k4924M839J755L3022j4071j0789l2186k0336O906
$$ plain form
1765 127915 116265 88336 80582 98187 70569 70187 58183 101442 117841 107315 120793 69949
1753 69949 62085 74039 86444 91243 89546 102973 87201 77521 78282 115699 123223 89116 60048
1740 60048 70767 78956 76214 75076 65637 70128 96920 99091 98509 108556 67955 13097 43549
1727 43549 75993 117797 98807 76675 100404 114086 98056 74452 81045 77095 69319 82128
1715 82128 81783 95132 113043 43882 57299 103189 99226 72141 116713 104856 96868 114460 98274
1702 98274 102975 90998 72004 109123 86707 63581 77705 81478 69023 104680 101223 93005 96150
1689 96150 73813 79465 96224 77940 57337 87156 66420 74170 86632 125390 122403 95342
1677 95342 102657 87057 96837 91985 67061 71900 73655 106677 92606 81817 49631 29295 36201
1664C6201K1208m0627J0242M9061k9596J4757j5736l2917j5476N0348K0330R547
1652G7342K0620p005m3116K8363j5464j4362j866M293o465k3185M6917n222k6972
1639C3878J3114k0434K5789P50n26j5533O2K3531J1568R811Q245l870k7747j70
1625E8468N098J5107k8779l718K679L0145j6083Q611m0271K5520J8681j0667J9999
1612H4790J2674J5548l1903J55j6434K9557q405l0325M596K6975k3197j7749N447
1599E1729N561M1195M975j3178j3876Q825k9850o274K1625J6973j4609k9207q362
1586C5527j6246L3451J73j5282N2734m996l664j0126n351K1688j5782L695K045
1573G7866J558m335k3263J2597M0745k3802k7903o870J7179j6935q739M0480k5515
$$ plain form
1664 36201 57409 16782 27024 76085 46489 61246 45510 12593 -2883 47465 67795 77342
1652 77342 97962 90957 47841 76204 60740 46378 44512 48805 42340 19155 66072 60850 33878
1639 33878 46992 26558 52347 53097 52571 37038 37100 60631 72199 82010 90255 86385 58638 58468
1625 58468 63566 78673 49894 46176 48855 79000 62917 71528 31257 56777 75458 64791 84790
1612 84790 97464 113012 81109 81264 64830 94387 85982 55657 60253 87228 64031 46282 51729
1599 51729 57290 98485 103460 90282 76406 85231 55381 49107 70732 87705 73096 43889 35527
1586 35527 19281 52732 52905 37623 90357 85361 81697 71571 66220 87908 72126 75821 77866
1573 77866 79424 75089 51826 64423 105168 81366 53463 46593 63772 46837 38098 78578 53063
1560E3063m157O814k0007j3873K3721Q563j7758q712M310J6001j8680J6642J3763
1547E9690K4337l2898p397K2085k1977O996K0540l6050l38N080M1761J8041q655
1534I1215R774k7401q047k6864j3121J4843L334J2676J9851m056l934N170P494
1521H0934j5186J4219r647j6052K1369K6120n2085j3811J3730J6699o977k0971
1509C8342P607J6227J1322M331m3863l653K9993k0962R208m982k1476P000j1001
1496A8093M2934K6112k2294k2139r888J702M3426N84n3074l683j229L3802J9425
1483G3771o915l6336k2114L0923J0785P581M7818l6345j4954O857J7650J1356
1471I0077m4479j5333j7220K9620j1306J824N876J3449j7771j3303K5591K2323
$$ plain form
1560 53063 48906 55720 35713 21840 45561 54124 36366 27654 31964 47965 29285 45927 59690
1547 59690 84027 51129 43732 65817 43840 50836 71376 35326 34988 40068 81829 99870 91215
1534 91215 100989 73588 65541 38677 25556 40399 43733 56409 76260 72204 68270 73440 80934
1521 80934 65748 79967 70320 54268 75637 101757 49672 35861 49591 66290 59313 38342
1509 38342 45949 62176 73498 77829 33966 30313 60306 39344 48552 43570 22094 29094 18093
1496 18093 61027 87139 64845 42706 32818 34520 77946 78530 25456 21773 20544 54346 73771
1483 73771 66856 30520 8406 39329 50114 57695 105513 69168 54214 61071 78721 90077
1471 90077 45598 30265 13045 42665 31359 33183 39059 52508 34737 21434 47025 69348
1459F9348p068L498J8186m35j2060k2369J9284l9263k7645K7496J8500K6442J27
1446G4041j3564j4817P250N293j2546K758m403J5282k0386L0047j3536J8688m989
1433F9118l2343q214K0670Q691J0903j018j8958j1034J9168J1017j1764q336j4339
1420C3561m4164K6941J0173l6955K3117K9343l8598l507L9509j3888K8555Q315
1408F2402k2308R550M446k269L1564J2375O743m7355J3206K4514k1140l9139j2607
1395A9982J0068j5473j9075K818M5449Q273l16K7900J196Q054k0598J1092k0914
1382E8456K4851q694k386P139m2068J3498k096r722M6938q675k4153k3715j3010
1369A6363N6067R290l1235J0733L2297J3468l0276n6188j8873N926L2187K7548
$$ plain form
1459 69348 62280 65778 83964 83529 71469 49100 68384 29121 1476 28972 47472 73914 74041
1446 74041 60477 45660 52910 58203 45657 48415 44012 59294 38908 68955 55419 74107 69118
1433 69118 36775 28561 49231 57922 68825 67807 48849 37815 56983 68000 56236 47900 33561
1420 33561 -10603 16338 26511 -10444 12673 42016 3418 -89 39420 25532 54087 62402
1408 62402 40094 49644 54090 51821 83385 95760 102503 55148 68354 92868 71728 32589 19982
1395 19982 30050 14577 -4498 -1680 43769 52042 51726 79626 80822 88876 68278 79370 58456
1382 58456 83307 74613 72227 79366 37298 50796 48700 38978 85916 77241 53088 29373 16363
1369 16363 72430 81720 50485 61218 93515 106983 76707 20519 1646 7572 39759 67307
1357F7307J5437r993m3352J71L4404j0103J0971k0026q352K7428p631n104k1645
1344B9512r668J6639P582J7866k1023j2424k5875j670k2318L2374p595k6079J3951
1331h728J339j845J8034L2020l3725J5102L4M1859L9739J1061o4991n7531M8346
1318D0714j1934O833j7803l2713K0772J0667K6235j6985k3050L2539J2367o302
1306D1340L2057P444l8210Q470l764k1895J4727J1327J9483j459o0937k009K934
1293I508J1712k188k7111J7398L7069P231j9819l035l4881j8228j763K3419P763
1280G075q444K6208M9059l0547k3356m010j713k2739J5766L9462J1813K218J7103
1267G7895k3610n3652K7786J1471Q315N24k6912P049j2899K581J0892k8988K185
$$ plain form
1357 67307 82744 72751 29399 29570 63974 53871 64842 44816 36464 63892 56261 51157 29512
1344 29512 19844 36483 44065 61931 40908 28484 2609 939 -21379 10995 3400 -22679 -8728
1331 -8728 -7389 -9234 8800 40820 7095 22197 22231 64090 103829 114890 49899 -7632 40714
1318 40714 28780 35613 17810 -14903 5869 16536 42771 25786 2736 35275 47642 41340
1306 41340 73397 80841 42631 51101 47337 25442 40169 51496 70979 69520 8583 6574 9508
1293 9508 21220 19032 -8079 9319 46388 53619 33800 30765 -4116 -22344 -24107 -688 7075
1280 7075 -1369 24839 73898 43351 19995 15985 14272 -8467 7299 46761 58574 60792 77895
1267 77895 54285 633 28419 39890 48205 48729 21817 28866 15967 18548 29440 452 2637
1254B637K7082N4807q829m6649r931p583J162L8368n5452k610K148r53j1682j204
1240a8689K58j0394N2639J8084m5366O86l44j1253K8562j1711j4876M0056J4712
1227D2364j4420P721l2185K4498j3057j8113K5902J7315n521j4891J2405N736
1215C7754m881L5366q657j8845k7260M034M4217J5771l1261k0975n080n104j4671
1202D08J7495j2591r897M1815M570k0661o662J271M006J1573K282K4150k0051
1189C7708k2092L556Q677R75j5537j758p188O93K0617P241J2612q709P860j2396
1175C2259j2511J4676n133J8687L727k9518k7009r873J9526k5268J4522L7925
1163C2010l3627N022J3852P153j4188K111K2496j7830j2161J4994q313k2893l682
$$ plain form
1254 2637 29719 84526 75697 29048 19117 11534 12696 51064 -4388 -6998 -4850 -5803 -17485 -18689
1240 -18689 -18431 -28825 23814 41898 -3468 -2782 -3126 -14379 14183 2472 -12404 27652 42364
1227 42364 27944 35665 3480 27978 14921 -3192 22710 40025 34504 19613 32018 37754
1215 37754 32873 68239 59582 40737 13477 17511 61728 77499 46238 25263 20183 15079 408
1202 408 17903 5312 -4585 37230 41800 21139 14477 15748 19754 31327 33609 57759 37708
1189 37708 15616 19172 27849 28824 13287 11529 4341 5034 25651 32892 45504 36795 44655 32259
1175 32259 19748 34424 29291 47978 51705 22187 -4822 -14695 4831 -20437 -5915 32010
1163 32010 -1617 3405 17257 24410 10222 12333 34829 16999 4838 19832 11519 -11374 -15056
1150a5056K8824K7129j3389j8161j5032O344J0227Q38K1627J751k5675j7931J6733
1137H229K7060k1343J814R656R916L707k4358k376R804K8894k904r863j5749J8190
1123D0677R857k5682p887J3828O557o781J5851j5970p963j9852J3368n94Q731
1110B4140n495k9074J4340J747K425n893L5647k5646L83M2636o780k0722k7984
1097b76K9839q860Q264J8343n658j7163j0964j8731P051K5110j4878k727j0351
1084a001n281k3385K9247L0575j6220J0463K918j9407J422J0570j0015o593p477
1071d184J3609o543n568J5494J149J2947K369j1959j1737r453J5086R511J6257
1058C6978q779l7340r366Q154j629N274M210j6647j7833N3376r088j9286J1296
$$ plain form
1150 -15056 13768 40897 27508 9347 -5685 659 10886 11724 33351 35102 9427 -8504 8229
1137 8229 35289 13946 15760 25416 35332 39039 14681 12305 22109 51003 48099 38236 22487 40677
1123 40677 50534 24852 16965 30793 37350 30569 46420 30450 22487 2635 16003 15409 24140
1110 24140 18645 -10429 3911 5658 8083 2190 37837 12191 12574 55210 48430 27708 -276
1097 -276 29563 20703 28967 47310 41652 24489 13525 -5206 1845 26955 12077 9350 -1001
1084 -1001 -6282 -29667 -420 30155 13935 24398 27316 7909 9331 19901 9886 3293 -4184
1071 -4184 9425 2882 -2686 12808 13957 26904 29273 17314 5577 -3876 11210 20721 36978
1058 36978 28199 -9141 -18507 -10353 -11982 -6708 -2498 -19145 -36978 16398 7310 -11976 -680
1045f80p112K1604Q281n00l8386J5513j3552R847J5271j0409P255k9746K1385
1032a229L5066k8151p357K5742J2069j1890q112L8885j199j7254j5792R046j5231
1019A4593P501j0805k3364Q475M3990J0992l3510j0044n493m080K0763L54k6456
1006g084J0399j5708L0332K1943K1683k1195l4428M4359P639j5612r934k3050
994I344K7463k4721j8777K0832m019j7312j4383j6536O549L9884k8834J3791J9496
981A2777K3664o402p2990P810K2998K6590r083p133J8588M799m284j7485l8888
968c9039J2369K150J148L7558k2727j2749O537L106O857j0376J3136j7957K2731
955B744J4149k2878J1367j4367l932L5572p927l106j2579j0664J9517J5070p956
$$ plain form
1045 -680 -7792 13812 22093 21593 -16793 -1280 -14832 -4985 10286 -123 7132 -22614 -1229
1032 -1229 33837 5686 -1671 24071 36140 24250 16138 55023 53824 36570 20778 29824 14593
1019 14593 22094 11289 -12075 -3600 40390 51382 17872 7828 2335 -1745 19018 19372 -7084
1006 -7084 3315 -12393 17939 39882 61565 40370 5942 50301 57940 42328 32394 9344
994 9344 36807 12086 -6691 14141 10122 -7190 -21573 -38109 -31560 8324 -20510 -6719 12777
981 12777 36441 30039 -42951 -35141 -12143 14447 5364 -1769 16819 21618 17334 -151 -39039
968 -39039 -26670 -24520 -23372 14186 -8541 -21290 -14753 -11647 -4790 -15166 -2030 -19987 2744
955 2744 16893 -5985 5382 -8985 -12917 22655 14728 11622 -957 -11621 7896 22966 15010
942A5010j6940o982l173L0343q769k7390J6228J3554j0062p684J0266k9210K8403
929C594K3497q348m0326J696O5946J3399j4850j4771j196k9834r14L4698k3666
916H925q783j9583J4944J6695J7227n082k8689k0966m745q137Q313L5605J8997
903B4721m9l0361l930N191J131k7072P302J9155l824l525K3415m0830q845J0755
889b6766N807J2522O940j2242L0198j7791K4129j7692M144j4587l3512J5583l3
876b3300Q614K2612k5952K755o306N376L476m407o775n53o57K1004r034J1644
862a503O408K758k228L663l1697O174O369Q453M4938m6693l20Q723l095P7o47
847A380L611l6431j3580K6639M3462j4345o4349L3962J2819J5510k7166j0177
$$ plain form
942 15010 -1930 -8912 -12085 18258 9489 -17901 -1673 11881 1819 -5865 4401 -24809 3594
929 3594 27091 18743 -21583 -19887 46059 59458 44608 29837 28641 -1193 -2107 32591 8925
916 8925 142 -19441 -4497 12198 29425 24343 -4346 -25312 -30057 -38194 -29881 5724 24721
903 24721 24672 -5689 -9619 -4428 -3297 -30369 -23067 -3912 -7736 -11261 12154 -28676 -37521 -26766
889 -26766 -20959 -8437 -1497 -13739 16459 -1332 22797 5105 9249 -5338 -38850 -23267 -23300
876 -23300 -14686 7926 -18026 -15271 -21577 -16201 -12725 -17132 -23907 -24460 -25117 -4113 -13147 -1503
862 -1503 4905 7663 5435 9098 -22599 -16425 -10056 -1603 43335 -3358 -3678 5045 1950 2027 1380
847 1380 4991 -31440 -45020 -18381 25081 10736 -53613 -19651 -6832 8678 -18488 -28665
835b8665j3624K7671J349k2257Q28K3371j8874J0286r545J2436L0272k1377k2219
822c0348P011j9140J2029L4255j5476J1507J866K1860j3336j0920l182N139K6400
809B7665m8923L3105P161n8344n872J1392L3889j2553R803M2014l6381l8588k066
796c7698Q806L5215j1628J0521k604j0707L2985r018j7520K3493P963n0957j8648
783c9797L9022l572J1092P846j7167j2810l2157K1872J3452j9174j0426J6319
771b5500k42J7911P584p351p633J0602k2165j8814P109J8948k5265J7723K5985
758a108l1789J0043J6154j2020k1347m362J8036R62K9730j4302J6984j1801k6709
745c1529P962M432O336J5672k1036j690k0392j349M1311j9464j0717O00j9113
$$ plain form
835 -28665 -42289 -14618 -13269 -35526 -34698 -11327 -30201 -19915 -29460 -17024 13248 -8129 -30348
822 -30348 -23337 -42477 -30448 3807 -11669 -162 1704 23564 10228 -692 -3874 1265 27665
809 27665 -21258 11847 19008 -39336 -45208 -33816 73 -12480 -2677 39337 2956 -35632 -37698
796 -37698 -28892 6323 -5305 5216 2612 -8095 24890 15872 -1648 21845 29808 -21149 -39797
783 -39797 -775 -4347 6745 14591 -2576 -15386 -47543 -25671 -12219 -31393 -41819 -25500
771 -25500 -25742 -7831 -247 -7598 -15231 -4629 -26794 -45608 -38499 -19551 -44816 -27093 -1108
758 -1108 -32897 -22854 -6700 -18720 -40067 -44429 -26393 -25431 4299 -10003 6981 -4820 -31529
745 -31529 -23567 -19135 -12799 2873 -18163 -19853 -40245 -41594 -283 -19747 -30464 -29864 -48977
732d8977L5999J5045j3650j1682k5571m998j3072m999J3982Q258M3479K719m184
719g651M1875J7530J515n1700N979o459J8931k1043j9423J0959K1869j1025k3972
706b2615K398K7451j9975k1104J5471L4440l3406L5739K465j5871k4569j929J7365
693d140r058k6944j454K8191L653K3411k1859o929Q636k3250j6093J3567K7183
680e086j0907L1585r049j0475l8257J3800L0209P774k3754j3341R537l589m803
667b6356q214R800K3769p997l3915K079j7424K1557M5460k232l8709J936j9144
654d9390M0448J971m1021L1682J1004L3945j3616m0067j1290j0929n225q118P07
641e9899J8189L0849l5214j4553K2018K5339k550k2490l3060K7769M3801R975
$$ plain form
732 -48977 -12978 2067 -11583 -23265 -48836 -53834 -66906 -71905 -57923 -49665 -6186 -3467 -7651
719 -7651 34224 51754 53269 1569 7548 1089 20020 -1023 -20446 -9487 12382 1357 -22615
706 -22615 -20217 7234 -12741 -33845 -18374 16066 -17340 18399 20864 4993 -19576 -21505 -4140
693 -4140 -13198 -40142 -41596 -13405 -9752 13659 -8200 -15129 -6493 -29743 -45836 -32269 -5086
680 -5086 -15993 15592 6543 -3932 -42189 -28389 1820 9594 -14160 -27501 -17964 -21553 -26356
667 -26356 -34570 -24770 -1001 -8998 -42913 -40834 -58258 -36701 8759 6527 -32182 -30246 -49390
654 -49390 -8942 -6971 -47992 -16310 -5306 28639 15023 -25044 -36334 -47263 -52488 -60606 -59899
641 -59899 -41710 -10861 -46075 -60628 -38610 -13271 -15821 -38311 -71371 -43602 199 10174
629A0174o18j4350n670L819M50J905j7991O318n485o314P430q137O024o308J7811
614a0942n024R644K882l2429J3701J3362l0980j0598L5850o984j4858Q296k331
601c0411j6898L8830K365j5519J85j0343Q536J9536k7705L63J7529j6462j0395
588d0389Q062K7906L210j0907K2142Q024j2930n6329l2613J0270K3944J5264k319
575c6665K6957p456O96o54j2947J2037m624l526k5957K4395M929q903K7243r484
561a3959k2395j4076j2032K7595O999j005J5330r145k0235r279M7967q3J5299
548A0981L4079n9102k3048J6347j0086j8263L8262q137J003j5627O223L686o51
535b4333J4723j8872O925L5810q970l0490K183j3419N769J0211J109J2691j7854
$$ plain form
629 10174 9556 -4794 -10464 -6645 -6195 -4290 -22281 -15963 -21448 -27762 -20332 -28469 -22445 -28753 -10942
614 -10942 -15966 -6322 -3440 -35869 -22168 -8806 -39786 -50384 -14534 -21518 -36376 -28080 -30411
601 -30411 -47309 -8479 -6114 -21633 -21448 -31791 -23255 -3719 -31424 -31061 -13532 -29994 -40389
588 -40389 -32327 -4421 -1211 -12118 10024 18048 5118 -51211 -83824 -73554 -49610 -34346 -36665
575 -36665 -9708 -17164 -16468 -17122 -30069 -18032 -22656 -26182 -52139 -27744 -22815 -31718 -4475 -13959
561 -13959 -36354 -50430 -62462 -34867 -27868 -28873 -13543 -22688 -42923 -52202 -4235 -4318 10981
548 10981 45060 -14042 -37090 -20743 -30829 -49092 -10830 -18967 -17964 -33591 -27368 -23682 -24333
535 -24333 -9610 -28482 -21557 14253 5283 -25207 -23024 -36443 -30674 -20463 -19354 -6663 -24517
522b4517k7171J4588K7879k2453k9593J3368j317k2992R633K0486J8250k5733
510d9572J765K251j6672L4254M066l529K1841l3433r512k151R14J7785M399J08
496b7486j5101K2672l0573J0961j3959K0086K7689J4018k3220J0537J2793j5000
484f583k3379j9798K8136K8790k8279Q714j5068J6002j5118K4332O892k2279k214
471a9852Q7k3254J2180J7695j1216j5610R204K6803J9034k6415k4799J248J9260
458a5635q630J7504j6713o808j4320j9771L0351q399K5916L363l4731j3232J8777
445d2328l3669K4531N856j1322J6181K49P023r815J8184J0827K5774l3512k2017
432d4038l746K3627K045n872q907l3535L4624P347J3116j1939j2007l829J9732
$$ plain form
522 -24517 -51688 -37100 -9221 -31674 -61267 -47899 -49216 -72208 -62575 -42089 -23839 -49572
510 -49572 -47807 -45556 -62228 -27974 -23908 -27437 -5596 -39029 -48541 -50692 -49778 -31993 -27594 -27486
496 -27486 -42587 -19915 -50488 -39527 -53486 -33400 -5711 8307 -14913 -4376 8417 -6583
484 -6583 -29962 -49760 -21624 7166 -21113 -12399 -27467 -11465 -26583 -2251 4641 -17638 -19852
471 -19852 -19765 -43019 -30839 -13144 -24360 -39970 -30766 -3963 15071 -11344 -36143 -34895 -15635
458 -15635 -24265 -6761 -23474 -30282 -44602 -64373 -34022 -42421 -16505 -13142 -47873 -61105 -42328
445 -42328 -75997 -51466 -45610 -56932 -40751 -40502 -33479 -43294 -25110 -14283 11491 -22021 -44038
432 -44038 -47784 -24157 -22112 -27984 -36891 -70426 -35802 -28455 -15339 -27278 -39285 -43114 -23382
419b3382O896k309q628j2946p687P215j9822p82L031q420J8536Q174n884L1220
405a4788k7008J219L800K0627m445r138l8145J3848j466Q576j0462K2032L1433
392c917l0680k2653K6700R03J0967P809R193r419l3031L0909J6646k5350m911
379b6834O528j6524j0671R330k8647J6075J0219J7695j0963n668J6975J6233j1080
366a7332O49J4569j2451q911q666r920J1449J4660j8241J432K3296o74j5778K0825
352e093k1905J8226j4269J8831N858k6021l527M429L575j7457n3497M1519J3671
339c5660K091k4408K2501j3815N889K7741j6747M190J8444k3570r725N514j6624
326e4179L8501m5171j4798L7361Q442K0047k9693J6352k4065q263J7839M2737
$$ plain form
419 -23382 -16486 -18795 -27423 -40369 -48056 -40841 -60663 -61445 -58414 -66834 -48298 -40124 -46008 -14788
405 -14788 -41796 -40577 -36777 -16150 -20595 -29733 -67878 -54030 -55496 -46920 -57382 -35350 -3917
392 -3917 -34597 -57250 -30550 -29647 -18680 -10871 -1678 -11097 -44128 -13219 3427 -21923 -26834
379 -26834 -20306 -36830 -47501 -38171 -66818 -50743 -40524 -22829 -33792 -39460 -22485 -6252 -17332
366 -17332 -16683 -2114 -14565 -23476 -32142 -42062 -30613 -15953 -34194 -32762 -9466 -10140 -25918 -5093
352 -5093 -26998 -8772 -23041 -4210 1648 -24373 -27900 -23471 -19896 -37353 -90850 -49331 -35660
339 -35660 -33569 -57977 -35476 -49291 -43402 -15661 -32408 -28218 -9774 -33344 -43069 -37555 -54179
326 -54179 -15678 -60849 -75647 -38286 -29844 -9797 -39490 -23138 -47203 -55466 -37627 5110
314E110l5439k1598J9066K436K1309k8062J3138j5356j7717J170L3086K3217r104
301h744r416k6188k1485K2643r833J3624j2909j5125J6359j7504o590J4889j5044
288g5323J5259J6673j6643J4282j0228k653J0790j3038l2232l063J0260K0501
276f5415K5425n139K9572n679l913k6119k1166L3074L13Q766K0884l9076k549
263e1022J3464K6758J3125j6475M809j1413j9942J8390J9593l8558j8675K0095
251c9851M2916k8486m4852N236J4730K2289P033P180j7883j5650J96j688k1452
238g0282j6521L3799J618m320J3771J454m1657q707M6257J0949k2490j9238J7255
225e8112j5473j005M1320J6157k6921m19L223k1794j1622L6935K2000k5935j4011
$$ plain form
314 5110 -30329 -51927 -32861 -30425 -9116 -37178 -24040 -39396 -57113 -55943 -22857 360 -8744
301 -8744 -18160 -44348 -65833 -43190 -53023 -39399 -52308 -67433 -51074 -68578 -75168 -60279 -75323
288 -75323 -60064 -43391 -60034 -45752 -55980 -58633 -47843 -60881 -93113 -96176 -85916 -65415
276 -65415 -39990 -45129 -15557 -21236 -25149 -51268 -72434 -39360 -39047 -30281 -9397 -48473 -51022
263 -51022 -37558 -10800 2325 -14150 -9341 -20754 -40696 -22306 -2713 -41271 -59946 -39851
251 -39851 3065 -25421 -70273 -65037 -50307 -28018 -20985 -13805 -31688 -47338 -47142 -48830 -70282
238 -70282 -86803 -53004 -51386 -55706 -41935 -40481 -82138 -90845 -44588 -33639 -56129 -75367 -58112
225 -58112 -73585 -74590 -33270 -17113 -44034 -44453 -41230 -63024 -74646 -37711 -15711 -41646 -55657
212e5657K9439J447k5339o062j046K5047r470J1802K6084r942Q578K2577r99l8177
198b1718Q905K1961l4098l202K3220q846J9345j6576k6540N023j9184L722K3750
185b4238J2755o009L132k7277j9462m1361L5843K6834o737j0748J4576p710Q577
172d1825Q387R235l3382j5955l746J6209K1211N012N951j8311L9295j3297r860
159c1076q44j2683k8169r154L1186J4236O042J3507l1087M988L431p594J5778
146c1439j13R467L9724R47j8315k5774m3641j5668p307M544o275K5259L7589r746
132d0748o392k5307L3716p250k1771J7285j5723J3162J5665m307l7039Q611N03
119f9595J3909R560k0610K3736j5764j2028q887Q509L994P633K210j121j3684
$$ plain form
212 -55657 -26218 -24771 -50110 -56172 -57218 -32171 -41641 -29839 -3755 -13697 -5119 17458 16459 -21718
198 -21718 -12813 9148 -24950 -28152 -4932 -13778 5567 -11009 -37549 -32526 -51710 -47988 -24238
185 -24238 -11483 -17492 -14360 -41637 -61099 -102460 -66617 -39783 -46520 -57268 -42692 -50402 -41825
172 -41825 -33438 -24203 -57585 -73540 -77286 -61077 -39866 -34854 -28903 -47214 -7919 -21216 -31076
159 -31076 -31920 -44603 -72772 -81926 -50740 -36504 -30462 -16955 -48042 -43054 -39623 -47217 -31439
146 -31439 -31552 -22085 17639 18586 271 -25503 -69144 -84812 -92119 -87575 -93850 -68591 -31002 -40748
132 -40748 -47140 -72447 -38731 -45981 -67752 -50467 -66190 -53028 -37363 -41670 -78709 -70098 -69595
119 -69595 -55686 -46126 -66736 -43000 -58764 -70792 -79679 -71170 -67176 -59543 -57333 -58454 -72138
106g2138J5132j4035J5246J3304n819m066k6997m66L9022J6446k3658j5027M060
93e8996K0754l084l3683J1507J9078j031N783j4975k0454N012k315J5327L382
80e3695J763J0790k3752J5128R103p752J6086R538K4576l1557l9602J1869J1057
67d6448K2458P948l9328j3705K8618m53k4329o826j396o350K7780J331L522q953
53e6131k5857N177J7827K2220K2034j0045k7764K1609P125k0783K758j442l67
40d3639J2796J5125k7725N360n70j3996P600q100j805k3519r106J7557O419k240
26f5843R920K7146l1143j8336O502L497K2840N133j3050J7855m391k570k3281
13f5721J2247P93Q319n085k0361r018J3961j7765J2491K069J8401k188J3560
$$ plain form
106 -72138 -57006 -71041 -55795 -42491 -48310 -52376 -79373 -79839 -40817 -24371 -48029 -63056 -58996
93 -58996 -38242 -41326 -75009 -63502 -44424 -45455 -39672 -54647 -75101 -70089 -72404 -57077 -53695
80 -53695 -51932 -41142 -64894 -49766 -40663 -48415 -32329 -22791 1785 -29772 -69374 -57505 -46448
67 -46448 -23990 -16042 -55370 -69075 -40457 -40910 -65239 -72065 -73461 -79811 -52031 -50700 -47178 -56131
53 -56131 -81988 -76811 -58984 -36764 -14730 -24775 -52539 -30930 -23805 -44588 -41830 -43272 -43639
40 -43639 -30843 -15718 -43443 -38083 -38653 -52649 -45049 -53149 -54954 -78473 -87579 -70022 -63603 -65843
26 -65843 -55923 -28777 -59920 -78256 -71754 -68257 -45417 -40284 -53334 -35479 -39870 -42440 -65721
13 -65721 -53474 -52681 -44362 -49447 -69808 -78826 -64865 -82630 -70139 -68070 -49669 -51857 -38297
0c8297
$$ plain form
0 -38297
$$ Imaginary data points
##PAGE= N=2
##DATA TABLE= (X++(I..I)), XYDATA
16383a170111L7777K2976L7433j5518P928J0158L754K4516J2997K4264K4639J758
16371i77429k724J3449N824K7684J9530J3553O614J8371K1558J6217K8449j0637
16359h19541m606J5354J8553Q981J3968J2102J9542J3018O646O886K2016K3391
16347f63690M5210m583J1383M825K0083n272O935J6507K2413M1723l4710R326
16335e29850L949O1728L7749k8409J5849j2891L2545M6109k5745J2672K650M594
16323c79050J8918K9428N321K2073J9595l6562K4624N3333Q629k3184Q30O1458
16311a94587K4042j5837K5940K7778k668k3467J6368J8070K8662J8624j626n27
16299g9228k836N488J8210J6866J1530r1l538K773M1468Q053J5658K0444j137
$$ plain form
16383 -1170111 -1132334 -1109358 -1071925 -1087443 -1079515 -1069357 -1065603 -1041087 -1028090 -1003826 -979187 -977429
16371 -977429 -980153 -966704 -960880 -933196 -913666 -900113 -893499 -875128 -853570 -837353 -808904 -819541
16359 -819541 -824147 -808793 -790240 -781259 -767291 -755189 -735647 -722629 -715983 -709097 -687081 -663690
16347 -663690 -618480 -623063 -611680 -606855 -586772 -592044 -585109 -568602 -546189 -504466 -539176 -529850
16335 -529850 -525901 -464173 -426424 -454833 -438984 -451875 -419330 -373221 -398966 -386294 -383644 -379050
16323 -379050 -360132 -330704 -325383 -303310 -283715 -320277 -295653 -242320 -233691 -256875 -256045 -194587
16311 -194587 -170545 -186382 -160442 -132664 -135332 -158799 -142431 -124361 -95699 -77075 -78701 -79228
16299 -79228 -82064 -76576 -58366 -41500 -29970 -30061 -33599 -30826 10642 18695 34353 54797 53660
16286E3660M7645k926l3542J2421K2811K1636n256P238J2768J3603N658J8637
16274A74353L3130o223P167j4067J4435J9731J6309j829O74K2448J5664J6208
16262B98000P923j193P158J1680K3693M987J5568j1853L271k640J6914K2347j4360
16249C81495J6647J1907j0110M685J5543J7930N3875j5826n026J423J5162K2276
16237E09981k7687k1715J9731K1075j0640N1244P982k9519k547N3493K0740l3004
16225E59134l3500L8749j8594N387L3222l609K0970N915k1769k8084L2732K3361
16213F13914K9413k122k8033K2112n278J6540K5170p091k8321K9181J7922J3557
16201F96964K7564k8215P04j2501k8093K6369K5826q439J1410K5334J0575j2165
$$ plain form
16286 53660 101305 98379 64837 77258 100069 121705 116449 123687 136455 150058 155716 174353
16274 174353 207483 201260 208427 194360 208795 228526 244835 243006 243680 266128 281792 298000
16262 298000 305923 304730 311888 323568 347261 352248 367816 355963 359234 356594 373508 395855 381495
16249 381495 398142 410049 399939 404624 420167 438097 491972 476146 471120 472543 487705 509981
16237 509981 482294 460579 480310 501385 490745 541989 549971 520452 517905 571398 592138 559134
16225 559134 525634 564383 545789 551176 584398 580789 601759 607674 585905 557821 590553 613914
16213 613914 643327 641205 613172 635284 630006 646546 671716 664625 636304 665485 683407 696964
16201 696964 724528 696313 697017 684516 656423 682792 708618 700179 711589 736923 747498 735333
16189G35333M683K4504m119k1705M4241j2758l064K3196l3051K2167N954J2720
16177G98101J1892j5933p30k510m054J282K1009K9810k8434P226Q982l217K2643
16164H46067r097J8061l100p116J408P646q032J4473j2657L652M217J3689r158
16151H60053n204j0779j3082J5925K2924L795J3401K0637k4871j64l5717J4510
16139H61428L1021J7243j766J3449J9680j2606k2945J7708K3401j995J7023n770
16127I55871r172k2016J4345o529M305L491m34J386M82J2241q297r623L585j8810
16113I20825l065K8929Q226l0927J6669j6861J7596P091j1830J4442J502j9330
16101I33267j0201J6503M861K6838J237j0166L072K6925K204l8007j9191L0163
$$ plain form
16189 735333 740016 764520 760401 738696 782937 770179 767115 790311 757260 779427 785381 798101
16177 798101 809993 794060 793330 790820 786766 788048 809057 838867 810433 817659 826641 823424 846067
16164 846067 836970 855031 851931 844815 846223 853869 845837 860310 847653 851305 855522 869211 860053
16151 860053 854849 844070 830988 846913 869837 873632 887033 907670 882799 882635 846918 861428
16139 861428 892449 909692 907926 921375 941055 928449 905504 923212 946613 944618 961641 955871
16127 955871 946699 924683 939028 932499 936804 940295 939861 941247 941729 953970 945673 936050 939635 920825
16113 920825 917760 946689 954915 923988 940657 923796 941392 948483 936653 951095 952597 933267
16101 933267 923066 939569 944430 971268 972505 962339 965411 992336 994540 956533 937342 967505
16089I67505j7308J3818m79j0795K8325J3494j5314m683r551k5906L3284J7019
16077I89409J5287n542k6463J3009j3607j1384N942k848p438j135L5934k4564
16065I66600l5161J5191J0719J1673K0307p601J2845K414K232q323M969K2854
16053A018719l2358k5397L1496N319J036j3486K332L1446k1839k1574p173J4333
16041I82854J6697j0208O278K0598k8727J4825m177j0086K6069P077n815J4309
16029A029694l0045K9386k5951N24Q627k9801j2570J8407m2M5090m5314k9358
16017I58647K9623K0168K663j4888J0305J677j1275j2904J2264J1431J245J1427
16005A020383J635k1917l424Q571L4940k866k405j3165j6868k0837J8041k9697
$$ plain form
16089 967505 950197 964015 963536 952741 981066 994560 979246 974563 965012 939106 972390 989409
16077 989409 1004696 999154 972691 985700 972093 960709 966651 963803 956365 955230 991164 966600
16065 966600 931439 946630 957349 969022 989329 981728 994573 996987 999219 990896 995865 1018719
16053 1018719 986361 960964 992460 997779 998815 985329 987661 1019107 997268 975694 968521 982854
16041 982854 999551 989343 995621 1016219 987492 1002317 998140 988054 1014123 1021200 1015385 1029694
16029 1029694 999649 1029035 1003084 1003608 1012235 982434 969864 988271 988229 1033319 988005 958647
16017 958647 988270 1008438 1011101 996213 1006518 1008195 996920 984016 996280 1007711 1008956 1020383
16005 1020383 1022018 1000101 996677 1005248 1040188 1037322 1034917 1021752 1004884 984047 1002088 972391
15993I72391J7947K1040k6906m7331K1902M0575J2543l0462J7344n232k201Q934
15981A000544o943M394j1473R665j4942j6614L1447K2301j0350K2231j0282j3343
15969A006635L656K5616K0319l117l8232j3118J9575j0526L1501j3562N987K6334
15957A061068m6626j8064r420k461N4205K651j4233j9951L1384p208j8778j1549
15945A001018l0866L1913M198N3773m118m0578m881j2295m997K234J9946M349
15933A019696N913j1012q372k0628j381J1867l9804L1365L1271L985k42l5356
15921I87302k4680K9406j8673K3242K4268k3077j4656K4092L0087l79r766l3672
$$ plain form
15993 972391 990338 1011378 984472 937141 959043 999618 1012161 981699 999043 993811 991610 1000544
15981 1000544 993601 997995 986522 996187 981245 964631 996078 1018379 1008029 1030260 1019978 1006635
15969 1006635 1010291 1035907 1056226 1053109 1014877 1001759 1021334 1010808 1042309 1028747 1034734 1061068
15957 1061068 1014442 996378 986958 984497 1038702 1041353 1027120 1007169 1038553 1031345 1012567 1001018
15945 1001018 970152 1002065 1006263 1060036 1055918 1015340 1010459 998164 993167 995401 1015347 1019696
15933 1019696 1025609 1014597 1006225 985597 984216 996083 956279 987644 1018915 1022900 1022658 987302
15921 987302 962622 992028 973355 996597 1020865 997788 983132 1007224 1037311 1036932 1027166 993494
$$ [...]
##END NTUPLES=NMR SPECTRUM
##END=
