##TITLE=1H_DE-80H_X3
 200.13MHz, d2o
 8 sc
 
 19ns.26.2.2025
##JCAMPDX= 6.0         $$ Bruker NMR JCAMP-DX V2.0
##DATA TYPE= NMR SPECTRUM
##DATA CLASS= NTUPLES
##ORIGIN= UXNMR, Bruker Analytische Messtechnik GmbH
##OWNER= pz
$$ XWIN-NMR		Version 3.5
$$ Tue Jun 10 10:24:04 2025 Russian Standard Time (UT+4h)  Yarkov@DPX200
##.OBSERVE FREQUENCY= 200.1313
##.OBSERVE NUCLEUS= ^1H
##.ACQUISITION MODE= SIMULTANEOUS
##.ACQUISITION SCHEME= undefined
##.AVERAGES= 8
##.DIGITISER RES= 18
##SPECTROMETER/DATA SYSTEM= spect
##.PULSE SEQUENCE= zg30
##.SOLVENT NAME= CDCl3
##.SHIFT REFERENCE= (INTERNAL, CDCl3, 0, 15.5265)
##AUDIT TRAIL= $$ (NUMBER, WHEN, WHO, WHERE, WHAT)
$$ ##TITLE= Audit trail, XWIN-NMR		Version 3.5
$$ ##JCAMPDX= 5.01
$$ ##ORIGIN= Bruker BioSpin GmbH
$$ ##OWNER= Yarkov
$$ C:/Bruker/XWIN-NMR/data/yarkov2/nmr/H-C/1/pdata/1/auditp.txt
$$ ##AUDIT TRAIL=  $$ (NUMBER, WHEN, WHO, WHERE, WHAT)
(   1,<2025-06-10 10:22:55.23 +0400>,<Yarkov>,<DPX200>,
      <created by zg, POWCHK disabled, PULCHK disabled
       configuration hash MD5:
       00 E9 B6 7A A2 85 ED C7 34 08 36 98 17 FE 4E 26
       data hash MD5: 16K
       28 58 FC 32 88 27 03 4D 3A 0F 80 AB 80 A2 8D 2F>)
(   2,<2025-06-10 10:23:01.46 +0400>,<Yarkov>,<DPX200>,
      <Start of raw data processing
       efp BC_mod = 2 LB = 0.25 FT_mod = 6 PKNL = 1 PHC0 = -1710.501 PHC1 = 9.76656 SI = 16K 
       data hash MD5: 16K
       E5 99 8D A4 7E 97 F2 40 36 25 A7 37 67 93 79 C6>)
(   3,<2025-06-10 10:23:05.48 +0400>,<Yarkov>,<DPX200>,
      <abs ABSG = 5 
       data hash MD5: 16K
       50 CD 61 19 35 A1 A7 F5 E3 C1 75 60 C0 10 63 A6>)
$$ ##END=
$$ 
$$ hash MD5
$$ 11 41 13 40 AF 0F B6 E0 3E 89 B7 05 F8 5E C3 D4
##$RELAX= 
##$RELAX= 
##$RELAX= 
##$RELAX= 
##$RELAX= 
##$RELAX= 
$$ Bruker specific parameters
$$ --------------------------
##$DU= <C:/Bruker/XWIN-NMR>
##$EXPNO= 1
##$NAME= <H-C>
##$PROCNO= 1
##$TYPE= <nmr>
##$USER= <yarkov2>
##$AMP= (0..31)
100 100 100 100 100 100 100 100 100 100 100 100 100 100 100 100 100 100 
100 100 100 100 100 100 100 100 100 100 100 100 100 100 
##$AQSEQ= 0
##$AQ_mod= 1
##$AUNM= <au_zg>
##$AUTOPOS= <>
##$BF1= 200.13
##$BF2= 200.13
##$BF3= 200.13
##$BF4= 200.13
##$BF5= 200.13
##$BF6= 200.13
##$BF7= 200.13
##$BF8= 200.13
##$BYTORDA= 1
##$CFDGTYP= 0
##$CFRGTYP= 5
##$CHEMSTR= <none>
##$CNST= (0..31)
1 1 145 1 1 1 1 1 1 1 1 1 1 1 1 1 1 1 1 1 1 1 1 1 1 1 1 1 1 1 1 1 
##$CPDPRG= <>
##$CPDPRG1= <>
##$CPDPRG2= <>
##$CPDPRG3= <>
##$CPDPRG4= <mlev>
##$CPDPRG5= <mlev>
##$CPDPRG6= <mlev>
##$CPDPRG7= <mlev>
##$CPDPRG8= <mlev>
##$CPDPRGB= <>
##$CPDPRGT= <>
##$D= (0..31)
0 0.7 0 0 0 0 0 0 0 0 0 0.03 0 0 0 0 0 0 0 0 0 0 0 0 0 0 0 0 0 0 0 0 
##$DATE= 1749536574
##$DBL= (0..7)
120 120 120 120 120 120 120 120 
##$DBP= (0..7)
150 150 150 150 150 150 150 150 
##$DBP07= 0
##$DBPNAM0= <>
##$DBPNAM1= <>
##$DBPNAM2= <>
##$DBPNAM3= <>
##$DBPNAM4= <>
##$DBPNAM5= <>
##$DBPNAM6= <>
##$DBPNAM7= <>
##$DBPOAL= (0..7)
0.5 0.5 0.5 0.5 0.5 0.5 0.5 0.5 
##$DBPOFFS= (0..7)
0 0 0 0 0 0 0 0 
##$DE= 6
$$ [...]
##$SUBNAM3= <"">
##$SUBNAM4= <"">
##$SUBNAM5= <"">
##$SUBNAM6= <"">
##$SUBNAM7= <"">
##$SUBNAM8= <"">
##$SUBNAM9= <"">
##$SW= 18.0517328524113
##$SWIBOX= (0..15)
0 0 2 0 0 0 0 0 0 0 0 0 0 0 0 0 
##$SW_h= 3612.71676300578
##$TD= 16384
##$TD0= 1
##$TE= 0
##$TE2= 300
##$TE3= 300
##$TEG= 300
##$TL= (0..7)
0 120 120 120 120 120 120 120 
##$TP= (0..7)
150 150 150 150 150 150 150 150 
##$TP07= 0
##$TPNAME0= <>
##$TPNAME1= <>
##$TPNAME2= <>
##$TPNAME3= <>
##$TPNAME4= <>
##$TPNAME5= <>
##$TPNAME6= <>
##$TPNAME7= <>
##$TPOAL= (0..7)
0.5 0.5 0.5 0.5 0.5 0.5 0.5 0.5 
##$TPOFFS= (0..7)
0 0 0 0 0 0 0 0 
##$TUNHIN= 0
##$TUNHOUT= 0
##$TUNXOUT= 0
##$USERA1= <user>
##$USERA2= <user>
##$USERA3= <user>
##$USERA4= <user>
##$USERA5= <user>
##$V9= 5
##$VALIST= <valist>
##$VCLIST= <CCCCCCCCCCCCCCC>
##$VD= 0
##$VDLIST= <DDDDDDDDDDDDDDD>
##$VPLIST= <PPPPPPPPPPPPPPP>
##$VTLIST= <TTTTTTTTTTTTTTT>
##$WBST= 1024
##$WBSW= 4
##$XGAIN= (0..3)
0 0 0 0 
##$XL= 0
##$YL= 0
##$YMAX_a= 630557
##$YMIN_a= -622844
##$ZGOPTNS= <>
##$ZL1= 120
##$ZL2= 120
##$ZL3= 120
##$ZL4= 120
##$ABSF1= 15.53755
##$ABSF2= -2.514301
##$ABSG= 5
##$ABSL= 3
##$ALPHA= 0
##$AQORDER= 0
##$ASSFAC= 0
##$ASSFACI= 0
##$ASSFACX= 0
##$ASSWID= 0
##$AUNMP= <proc_1d>
##$AZFE= 0.1
##$AZFW= 0.1
##$BCFW= 0
##$BC_mod= 2
##$BYTORDP= 0
##$COROFFS= 0
##$CY= -3
##$DATMOD= 1
##$DC= 0
##$DFILT= <>
##$DTYPP= 0
##$F1P= 0
##$F2P= 0
##$FCOR= 1
##$FTSIZE= 16384
##$FT_mod= 6
##$GAMMA= 0
##$GB= 0
##$INTBC= 1
##$INTSCL= 3.241238e-09
##$ISEN= 128
##$LB= 0.25
##$LEV0= 0
##$LPBIN= 0
##$MAXI= 10000
##$MC2= 0
##$MEAN= 0
##$ME_mod= 0
##$MI= 1.114404
##$NCOEF= 0
##$NC_proc= -5
##$NLEV= 6
##$NOISF1= 3.799351
##$NOISF2= 2.8
##$NSP= 0
##$NTH_PI= 0
##$NZP= 0
##$OFFSET= 15.52653
##$PC= 1
##$PHC0= -1710.501
##$PHC1= 9.76656
##$PH_mod= 1
##$PKNL= yes
##$PPARMOD= 0
##$PSCAL= 0
##$PSIGN= 0
##$REVERSE= no
##$SF= 200.129999033518
##$SI= 16384
##$SIGF1= 3
##$SIGF2= 2
##$SINO= 0.751879
##$SIOLD= 32768
##$SREGLST= <19F.Aceton>
##$SSB= 0
##$STSI= 16384
##$STSR= 0
##$SW_p= 3612.71676300578
##$SYMM= 0
##$S_DEV= 0
##$TDeff= 16384
##$TDoff= 0
##$TI= <>
##$TILT= no
##$TM1= 0
##$TM2= 0
##$TOPLEV= 0
##$USERP1= <user>
##$USERP2= <user>
##$USERP3= <user>
##$USERP4= <user>
##$USERP5= <user>
##$WDW= 1
##$XDIM= 16384
##$YMAX_p= 292410315
##$YMIN_p= -118437
$$ End of Bruker specific parameters
$$ ---------------------------------
##NTUPLES= NMR SPECTRUM
##VAR_NAME=  FREQUENCY,     SPECTRUM/REAL,   SPECTRUM/IMAG
##SYMBOL=    X,             R,               I
##VAR_TYPE=  INDEPENDENT,   DEPENDENT,       DEPENDENT
##VAR_FORM=  AFFN,          ASDF,            ASDF
##VAR_DIM=   16384,         16384,           16384
##UNITS=     HZ,            ARBITRARY UNITS, ARBITRARY UNITS
##FACTOR=    0.220516191357247, 1,           1
##FIRST=     3107.32448709006, 0,            0
##LAST=      -505.392275915716, 0,           0
##MIN=       -505.392275915716, -118437,     0
##MAX=       3107.32448709006, 292410315,    0
$$ Real data points
##PAGE= N=1
##DATA TABLE= (X++(R..R)), XYDATA
$$ [...]
$$ plain form
6081 10142955 10680056 11060077 11254979 11313904 11351534 11313141 11161332 10824242 10375070 9960927
6071 9960927 9638486 9398927 9283633 9209150 9160617 9164534 9267078 9364264 9549663 9778434
6061 9778434 10057291 10457078 10964972 11595397 12407764 13323465 14332895 15398711 16312537
6052 16312537 16714158 16419976 15383138 14018342 12642718 11393544 10341160 9357581 8510011
6043 8510011 7808412 7277008 6841907 6521861 6289046 6123303 5975884 5882896 5843473 5816892
6033 5816892 5780917 5792902 5860687 5957413 6119932 6411760 6753201 7182646 7660148 8074054
6023 8074054 8285787 8146119 7679596 6943030 6135044 5402780 4778996 4295992 3949979 3598467
6013 3598467 3257400 3007417 2828036 2631433 2479823 2372243 2254990 2198712 2144034 2048319
$$ packed form
6081A0142955N37101L80021J94902N8925L7630l8393j51809l37090m49172m14143
6071I960927l22441k39559j15294p4483m8533L917J02544R7186J85399K28771
6061I778434K78857L99787N07894O30425Q12367R15701J009430J065816R13826
6052A6312537M01621k94182j036838j364796j375624j249174j052384r83579q47570
6043H510011p01599n31404m35101l20046k32815j65743j47419r2988l9423k6581
6033E816892l5975J1985O7785R6726J62519K91828L41441M29445M77502M13906
6023H074054K11733j39668m66523p36566q07986p32264o23784m83004l46013l51512
6013C598467l41067k49983j79381j96603j51610j07580j17253n6278n4678r5715
$$ plain form
6003 2048319 1933280 1856428 1756712 1674423 1637206 1577416 1519944 1473152 1390435 1325491 1293230
5992 1293230 1244526 1189853 1145965 1129537 1121769 1108983 1103729 1058457 1030462 1023520 998819 983196
5980 983196 940282 905765 924675 925388 901765 922144 919427 917722 906464 940824 935177 899453 908334
5967 908334 943941 922669 889891 929829 954881 947403 946669 984496 1028725 1017289 1028764 1041366
5955 1041366 1032239 1011662 990953 1012588 1012603 1003961 1014918 1032317 1023989 1020039 1024922 1027900 1038241
5942 1038241 1045945 1043976 1042680 1038648 1087156 1115363 1126105 1120021 1143470 1143879 1108195 1138782 1110417
5929 1110417 1078363 1101497 1104175 1098490 1048349 1041144 1023432 1005053 1013931 956301 937239 936165
5917 936165 924539 908419 906963 878862 887464 842765 825143 848236 841526 809588 788992 776982
$$ packed form
6003B048319j15039p6852r9716q2289l7217n9790n7472m6792q2717o4944l2261
5992A293230m8704n4673m3888j6428p768j2786n254m5272k7995o942k4701j5623
5980I83196m2914l4517J8910P13k3623K0379k717j705j1258L4360n647l5724Q881
5967I08334L5607k1272l2778L9938K5052p478p34L7827M4229j1436J1475J2602
5955A041366r127k0577k0709K1635J5q642J0957J7399q328l950M883K978J0341
5942A038241P704j969j296m032M8508K8207J0742o084K3449M09l5684L0587k8365
5929A110417l2054K3134K678n685n0141p205j7712j8379Q878n7630j9062j074
5917I36165j1626j6120j456k8101Q602m4699j7622K3093o710l1938k0596j2010
$$ plain form
5905 776982 747945 747180 725396 689484 683125 674515 641798 625368 606452 591926 564903 541120
5893 541120 521884 538152 555948 532959 501755 489649 493850 461540 418110 388234 410139 410687
5881 410687 392894 371947 366829 408114 382414 346721 332740 314304 312908 297989 321134 309594
5869 309594 264713 261056 267467 247369 236362 240400 210979 199092 202636 214470 207302 210666 193202
5856 193202 197478 183456 180354 194311 188838 217766 203172 171289 184769 177690 123135 98480
5844 98480 125155 141859 140773 117018 122203 96848 140710 123183 110448 104657 91948 74516
5832 74516 86253 102328 78194 77471 78389 93287 139226 161398 156766 128493 108385 118455 127559
5819 127559 121949 119264 129730 76811 72890 77969 52557 82858 78217 43761 64446 51204 56699
$$ packed form
5905G76982k9037p65k1784l5912o359q610l2717j6430j8916j4526k7023k3783
5893E41120j9236J6268J7796k2989l1204j2106M201l2310m3430k9876K1905N48
5881D10687j7793k0947n118M1285k5700l5693j3981j8436j396j4919K3145j1540
5869C09594m4881l657O411k0098j1007M038k9421j1887L544J1834p168L364j7464
5856A93202M276j4022l102J3957n473K8928j4594l1883J3480p079n4555k4655
5844I8480K6675J6704j086k3755N185k5355M3862j7527j2735n791j2709j7432
5832G4516J1737J6075k4134p23R18J4898M5939K2172m632k8273k0108J0070R104
5819A27559n610k685J0466n2919l921N079k5412L0301m641l4456K0685j3242N495
$$ plain form
5806 56699 89115 109436 95143 90249 94126 78613 81869 68822 53264 48370 78252 71212 38526
5793 38526 84385 63619 53564 86095 66667 55333 51238 67215 76265 71595 50221 24966
5781 24966 27541 34813 49438 10936 15873 53403 45344 5955 33286 26202 22541 33717 41686
5768 41686 48937 32969 40722 91969 104356 86500 64345 69222 78484 99260 118349 113864 71835
5755 71835 81570 69778 52207 76118 89123 98653 62218 64610 117841 133241 133346 112381 82148
5742 82148 105920 111730 132794 131246 121787 136526 123076 123617 128854 74336 92051 105878 99685
5729 99685 103570 103083 116327 107808 122086 132989 158901 147912 161457 194674 201307 204624 210012
5716 210012 201729 196439 167641 141920 130522 123230 128549 113996 104437 98856 109038 101881 89751
$$ packed form
5806E6699L2416K0321j4293m894L877j5513L256j3047j5558m894K9882p040l2686
5793C8526M5859k0766j0055L2531j9428j1334m095J5977R050m670k1374k5255
5781B4966K575P272J4625l8502M937L7530q059l9389K7331p084l661J1176P969
5768D1686P251j5968P753N1247J2387j7856k2155M877R262K0776J9089m485m2029
5755G1835R735j1792j7571K3911J3005R530l6435K392N3231J5400J05k0965l0233
5742H2148K3772N810K1064j548r459J4739j3450N41N237n4518J7715J3827o193
5729I9685L885m87J3244q519J4278J0903K5912j0989J3545L3217O633L317N388
5716B10012q283n290k8798k5721j1398p292N319j4553r559n581J0182p157j2130
$$ plain form
5703 89751 98401 104739 125316 162761 150099 107043 101434 103649 101360 145217 146242 141119 146558
5690 146558 180302 187886 200292 224311 190182 191258 230355 169997 93817 80062 105597 117119
5678 117119 121178 143940 145052 152171 117261 109891 145487 152361 165440 159275 168401 164281 176951
5665 176951 227444 249650 231513 234157 281643 295533 229550 237478 285754 319659 324380 306451
5653 306451 298586 268558 258003 258848 257340 245618 248169 235078 236763 274432 285796 290867 276603
5640 276603 249970 298943 338113 319107 338419 343144 356436 363420 376503 399054 441663 487628
5628 487628 508246 549872 568703 599772 624143 635040 615380 582123 579232 580639 617579 608681
5616 608681 612143 652667 654613 681136 682144 706802 731931 781549 805164 827370 889593 931501
$$ packed form
5703H9751Q650O338K0577L7445j2662m3056n609K215k289M3857J025n123N439
5690A46558L3744P584J2406K4019l4129J076L9097o0358p6180j3755K5535J1522
5678A17119M059K2762J112P119l4910p370L5596O874J3079o165R126m120J2670
5665A76951N0493K2206j8137K644M7486J3890o5983P928M8276L3905M721j7929
5653C06451p865l0028j0555Q45j508j1722K551j3091J685L7669J1364N071j4264
5640B76603k6633M8973L9170j9006J9312M725J3292O984J3083K2551M2609M5965
5628D87628K0618M1626J8831L1069K4371J0897j9660l3257k891J407L6940q898
5616F08681L462M0524J946K6523J008K4658K5129M9618K3615K2206O2223M1908
$$ plain form
5604 931501 990858 1045040 1073515 1099109 1170792 1229514 1285891 1340995 1377479 1415871 1508655 1573453
5592 1573453 1621223 1661466 1753185 1843678 1901889 1987850 2023400 2124310 2135330 2142184 2201484
5581 2201484 2302699 2385726 2460796 2545752 2618854 2695627 2748080 2844999 3000639 3161986 3312421
5570 3312421 3437036 3636448 3828838 4016237 4268972 4476815 4650039 4741298 4748477 4712400
5560 4712400 4669641 4572971 4478200 4365412 4201750 4048352 3954423 3901624 3892344 3899375 3976383
5549 3976383 4054165 4153233 4266556 4355153 4487733 4671297 4866655 5149532 5467609 5841084
5539 5841084 6273183 6696370 7103637 7372758 7342748 6997008 6422891 5875944 5385527 4895025
5529 4895025 4564932 4265850 4037954 3883516 3806103 3750319 3709668 3696987 3764418 3847868 3948658
$$ packed form
5604I31501N9357N4182K8475K5594P1683N8722N6377N5104L6484L8392R2784O4798
5592A573453M7770M0243R1719R0493N8211Q5961L5550J00910J1020O854N9300
5581B201484J01215Q3027P5070Q4956P3102P6773N2453R6919J55640J61347J50435
5570C312421J24615J99412J92390J87399K52735K07843J73224R1259P179l6077
5560D712400m2759r6670r4771j12788j63662j53398r3929n2799r280P031P7008
5549C976383P7782R9068J13323Q8597J32580J83564J95358K82877L18077L73475
5539E841084M32099M23187M07267K69121l0010l45740n74117n46947m90417m90502
5529D895025l30093k99082k27896j54438p7413n5784m0651j2681O7431Q3450J00790
$$ plain form
5518 3948658 4104742 4311373 4503629 4773175 5114430 5500943 5922565 6388850 6898697 7328039
5508 7328039 7507463 7324022 6832859 6197038 5577739 5042878 4598677 4210644 3905903 3643574
5498 3643574 3459275 3357294 3276441 3227475 3161562 3183283 3226143 3257991 3347260 3496288 3643626
5487 3643626 3854118 4115548 4386323 4699916 5046284 5403592 5631346 5673265 5426347 4953478
5477 4953478 4419456 3983691 3674943 3421573 3231629 3086149 2942979 2836569 2801965 2802376
5467 2802376 2770569 2735278 2719748 2752997 2776030 2852724 2945379 3086463 3227957 3377308 3543319
5456 3543319 3769615 4016036 4231500 4370824 4387763 4358755 4325243 4286917 4308488 4361520 4406580
5445 4406580 4461671 4554573 4731039 4968572 5199837 5483019 5756274 5964993 6285952 6646649
$$ packed form
5518C948658J56084K06631J92256K69546L41255L86513M21622M66285N09847M29342
5508G328039J79424j83441m91163o35821o19299n34861m44201l88033l04741k62329
5498C643574j84299j01981q0853m8966o5913K1721M2860L1848Q9269J49028J47338
5487C643626K10492K61430K70775L13593L46368L57308K27754M1919k46918m72869
5477D953478n34022m35765l08748k53370j89944j45480j43170j06410l4604M11
5467B802376l1807l5291j5530L3249K3033P6694R2655J41084J41494J49351J66011
5456C543319K26296K46421K15464J39324J6939k9008l3512l8326K1571N3032M5060
5445D406580N5091R2902J76466K37533K31265K83182K73255K08719L20959L60697
$$ plain form
5435 6646649 7154442 7790995 8474206 9175739 9662214 9822423 9630413 9226545 8788233 8401991
5425 8401991 8134257 7966486 7787699 7676567 7646816 7648303 7696587 7732303 7833948 8049667
5415 8049667 8350666 8770303 9288366 9770331 10217504 10627170 11075641 11666129 12485754 13489320
5405 13489320 14614380 15733962 16568809 16744765 16203250 15135150 13945719 12932811 12079118
5396 12079118 11335844 10679411 10109991 9624335 9220596 8890945 8673167 8539127 8520037 8545097
5386 8545097 8659535 8821532 9055571 9241001 9352103 9387793 9382785 9460123 9540292 9633790 9639237
5375 9639237 9457038 9007704 8345362 7590566 6882903 6246942 5711481 5266552 4835108 4456931
5365 4456931 4132777 3895318 3663083 3501582 3377733 3283949 3158433 3075591 3056286 3054826
$$ packed form
5435F646649N07793O36553O83211P01533M86475J60209j92010m03868m38312l86242
5425H401991k67734j67771j78787j11132k9751J487M8284L5716J01645K15719
5415H049667L00999M19637N18063M81965M47173M09666M48471N90488Q19625J003566
5405A3489320J125060J119582Q34847J75956n41515j068100j189431j012908q53693
5396A2079118p43274o56433n69420m85656m03739l29651k17778j34040j9090K5060
5386H545097J14438J61997K34039J85430J11102L5690n008P7338Q0169R3498N447
5375I639237j82199m49334o62342p54796p07663o35961n35461m44929m31444l78177
5365D456931l24154k37459k32235j61501j23849r3784j25516q2842j9305j460
$$ plain form
5355 3054826 3053088 2995952 2936397 2790336 2633480 2467979 2302730 2140069 1992589 1847453
5345 1847453 1726888 1628932 1559272 1489512 1399134 1328535 1258278 1213076 1172388 1110179 1042952
5334 1042952 1041534 1036004 1007078 973924 930453 893188 863028 881423 854284 805474 805601 767688
5322 767688 766330 776263 752723 752291 752593 756451 752554 735636 694564 685838 682340 642047 625956 616636
5308 616636 618709 585946 563697 555291 550464 612041 600228 581864 539931 519157 517504 504814
5296 504814 469606 463352 435114 455980 448707 452597 463741 478713 488979 468195 447129 440062
5284 440062 433969 438748 417669 408261 427811 403543 365066 379158 372477 352387 378112 368750 391362
5271 391362 416303 436824 390747 371230 375229 394286 366813 324981 320879 344456 362596 351312
$$ packed form
5355C054826j738n7136n9555j46061j56856j65501j65249j62661j47480j45136
5345A847453j20565r7956o9660o9760r0378p0599p0257m5202m0688o2209o7227
5334A042952j418n530k8926l3154m3471l7265l0160J8395k7139m8810J27l7913
5322G67688j358R933k3540m32L02L858l897j6918m1072q726l498m0293j6091r320
5308F16636K073l2763k2249q406m827O1577j1813j8364m1933k0774j653j2690
5296E04814l5208o254k8238K0866p273L890J1144J4972J0266k0784k1066p067
5284D40062o093M779k1079r408J9550k4268l8477J4092o681k0090K5725r362K2612
5271C91362K4941K0521m6077j9517L999J9057k7473m1832m102K3577J8140j1284
$$ plain form
5259 351312 330719 311631 341687 400136 366141 359380 342280 323206 347965 339721 331991 337632
5247 337632 348263 338074 313916 312053 328129 296240 293231 280558 301232 317752 304248 315345
5235 315345 328908 341081 317528 313498 335652 335580 321173 350632 366055 355393 364530 376980 350259
5222 350259 303391 329557 343830 330997 333227 310308 311863 310135 310644 296912 295313 294739 289486
5209 289486 296361 279480 307715 313854 309031 294340 256050 312847 352835 346760 343565 335885 313301
5196 313301 330829 290290 313153 316709 289877 311712 328328 305145 311423 282750 243586 263450
5184 263450 276657 269018 278799 294579 311595 291890 309286 307388 317690 305529 301032 296146 285489
5171 285489 303153 297400 322894 330329 331504 313496 328071 331487 291637 297007 321612 303212 299994
$$ packed form
5259C51312k0593j9088L0056N8449l3995o761j7100j9074K4759q244p730N641
5247C37632J0631j0189k4158j863J6076l1889l009j2673K0674J6520j3504J1097
5235C15345J3563J2173k3553m030K2154p2j4407K9459J5423j0662R137J2450k6721
5222C50259m6868K6166J4273j2833K230k2919J555j728N09j3732j599n74n253
5209B89486O875j6881K8235O139m823j4691l8290N6797L9988o075l195p680k2584
5196C13301J7528m0539K2863L556k6832K1835J6616k3183O278k8673l9164J9864
5184B63450J3207p639R781J5780J7016j9705J7396j898J0302j2161m497m886j0657
5171B85489J7664n753K5494P435J175j8008J4575L416l9850N370K4605j8400l218
$$ plain form
5158 299994 304612 328945 329151 316408 308630 344526 321009 323079 306783 304532 320904 350655 348136
5145 348136 383499 369005 338084 339185 342297 374007 391220 364134 361411 395255 361866 348970
5133 348970 385702 385939 404071 422480 422368 414682 414595 424088 416331 443884 474232 477597 474636 488786
5119 488786 459290 477363 530644 561667 584429 592749 573602 581734 610996 616363 592972 600291
5107 600291 640214 640004 621215 610133 665651 697377 717539 728193 754418 753418 777685 797475
5095 797475 801632 828923 866089 911438 948154 997872 1060347 1083694 1143074 1213211 1301281 1355209
5083 1355209 1407712 1484703 1561599 1637034 1729813 1825893 1905250 2009248 2149766 2279768 2395539
5072 2395539 2484232 2498389 2556127 2657213 2777952 2858044 2990553 3134072 3324821 3484826
$$ packed form
5158B99994M618K4333K06j2743p778L5896k3517K070j6296k251J6372K9751k519
5145C48136L5363j4494l0921J101L112L1710J7213k7086k723L3844l3389j2896
5133C48970L6732K37J8132J8409j12p686q7R493p757K7553L0348L365k961J4150
5119D88786k9496J8073N3281L1023K2762Q320j9147Q132K9262N367k3391P319
5107F00291L9923k10j8789j1082N5518L1726K0162J0654K6225j000K4267J9790
5095G97475M157K7291L7166M5349L6716M9718O2475K3347N9380P0137Q8070N3928
5083A355209N2503P6991P6896P5435R2779R6080P9357J03998J40518J30002J15771
5072B395539Q8693J4157N7738J01086J20739Q0092J32509J43519J90749J60005
$$ plain form
5062 3484826 3674733 3891771 4131749 4439596 4748609 5020586 5369758 5821380 6285447 6828894
5052 6828894 7462455 8188802 9026023 10013139 11123890 12187808 13215787 14261915 15656438
5043 15656438 17105058 18136023 18711171 19158484 20023681 21717162 23247633 23344424 21751819
5034 21751819 18888729 16037402 13896798 12411575 11340046 10450330 9679716 8910104 8102017
5025 8102017 7173365 6337120 5688767 5132089 4697273 4318631 4029841 3735241 3492489 3275526
5015 3275526 3062214 2893757 2762956 2583903 2449821 2352839 2243085 2148415 2079399 1984045
5005 1984045 1900055 1832011 1756562 1695075 1634014 1554008 1518013 1475795 1442156 1381561 1337472
4994 1337472 1297775 1262772 1228948 1186874 1137723 1129305 1108727 1086808 1077837 1059461 1063931 1034386
$$ packed form
5062C484826J89907K17038K39978L07847L09013K71977L49172M51622M64067N43447
5052F828894O33561P26347Q37221R87116J110751J063918J027979J046128J394523
5043A5656438J448620J030965N75148M47313Q65197J693481J530471R6791j592605
5034B1751819k863090k851327k140604j485223j071529q89716p70614p69612q08087
5025H102017r28652q36245o48353n56678m34816l78642k88790k94600k42752k16963
5015C275526k13312j68457j30801j79053j34082r6982j09754r4670o9016r5354
5005A984045q3990o8044p5449o1487o1061q0006l5995m2218l3639o0595m4089
4994A337472l9697l5003l3824m2074m9151q418k0578k1919q971j8376M470k9545
$$ plain form
4982 1034386 1015691 994528 962487 913800 906460 859619 833151 798549 765521 750007 741695 732576
4970 732576 727126 716850 704983 691647 658347 699020 713178 695200 679043 655333 642399 653683
4958 653683 629162 612439 619012 615489 641861 623337 601726 591980 634546 609913 607295 637652
4946 637652 646596 643866 648119 644652 629676 653841 641081 614950 645201 638902 632196 675762 695020
4933 695020 667293 669087 670485 687053 704140 705040 692366 687521 706192 688656 681306 668552 680021
4920 680021 696500 670181 700205 700085 718971 738198 739381 729862 710885 691278 661335 685866
4908 685866 681959 668657 656122 636883 593415 619833 603715 603054 589994 590440 571187 557725 566024
4895 566024 575207 589807 576874 588750 589717 555172 563524 548150 577452 590213 576893 572749 580030
$$ packed form
4982A034386j8695k1163l2041m8687p340m6841k6468l4602l3028j5514q312r119
4970G32576n450j0276j1867j3336l3300M0673J4158j7978j6157k3710j2934J1284
4958F53683k4521j6723O573l523K6372j8524k1611r746M2566k4633k618L0357
4946F37652Q944k730M253l467j4976K4165j2760k6131L0251o299o706M3566J9258
4933F95020k7727J794J398J6568J7087R00j2674m845J8671j7536p350j2754J1469
4920F80021J6479k6319L0024j20J8886J9227J183r519j8977j9607k9943K4531
4908F85866l907j3302j2535j9239m3468K6418j6118o61j3060M46j9253j3462Q299
4895E66024R183J4600j2933J1876R67l4545Q352j5374K9302J2761j3320m144P281
$$ plain form
4882 580030 604892 564770 559423 593934 606965 606737 616700 605125 588778 571441 601434 615368
4870 615368 597127 617531 627901 639513 636972 643019 648375 645831 684126 666170 662524 679818 682694
4857 682694 693715 708047 737508 720183 686244 717725 760983 783069 797479 784853 867242 879704
4845 879704 844542 857620 906998 929558 927909 958429 1007080 989958 1001830 1008563 1012314 1038749
4833 1038749 1078440 1114297 1102945 1118767 1163894 1206954 1239445 1274324 1291613 1352809 1389368
4822 1389368 1427535 1470975 1561369 1599350 1625380 1669944 1737193 1783046 1847333 1941751 2042089
4811 2042089 2093303 2129256 2178190 2272723 2307755 2368499 2444395 2517894 2605986 2687894 2768268
4800 2768268 2832344 2938305 3053156 3139930 3285225 3389207 3524565 3661390 3808812 3967716
$$ packed form
4882E80030K4862m0122n347L4511J3031k28R963j1575j6347j7337K9993J3934
4870F15368j8241K0404J0370J1612k541O047N356k544L8295j7956l646J7294K876
4857F82694J1021J4332K9461j7325l3939L1481M3258K2086J4410j2626Q2389J2462
4845H79704l5162J3078M9378K2560j649L0520M8651j7122J1872O733L751K6435
4833A038749L9691L5857j1352J5822M5127M3060L2491L4879J7289O1196L6559
4822A389368L8167M3440R0394L7981K6030M4564O7249M5853O4287R4418J00338
4811B042089N1214L5953M8934R4533L5032O0744P5896P3499Q8092Q1908Q0374
4800B768268O4076J05961J14851Q6774J45295J03982J35358J36825J47422J58904
$$ plain form
4790 3967716 4191459 4396150 4580260 4779539 4954411 5193805 5431209 5697193 6009620 6303966
4780 6303966 6557988 6880397 7220815 7596628 7957800 8342053 8788538 9327932 9866244 10411351
4770 10411351 10960261 11528792 12098462 12753094 13431651 14184581 15030034 15921460 16832948
4761 16832948 17737007 18708053 19728979 20909091 22291085 23944497 25808280 27853650
4753 27853650 29897256 31666745 32908872 33707512 34306887 34892040 35486969 36009199 36399162
4744 36399162 36713019 37168396 37719044 38457601 39278562 40156153 41125411 42286780 43590459
4735 43590459 45025788 46469810 47805692 48982849 50105870 51196421 52437224 53927201
4727 53927201 55611060 57544110 59725553 62030376 64266319 66019073 66727773 66136739
$$ packed form
4790C967716K23743K04691J84110J99279J74872K39394K37404K65984L12427K94346
4780F303966K54022L22409L40418L75813L61172L84253M46485N39394N38312N45107
4770A0411351N48910N68531N69670O54632O78557P52930Q45453Q91426R11488
4761A6832948R04059R71046J020926J180112J381994J653412J863783K045370
4753B7853650K043606J769489J242127P98640N99375N85153N94929N22230L89963
4744C6399162L13857M55377N50648P38557Q20961Q77591R69258J161369J303679
4735D3590459J435329J444022J335882J177157J123021J090551J240803J489977
4727E3927201J683859J933050K181443K304823K235943J752754P08700n91034
$$ plain form
4719 66136739 64500466 62333435 60181478 58162439 56270785 54582587 53015652 51686736
4711 51686736 50414892 48984848 47353110 45617322 43904306 42317434 40984537 39874285
4703 39874285 38959507 38123924 37320191 36605348 36065291 35776422 35586128 35363782 35043131
4694 35043131 34671949 34250551 33759212 32947694 31526373 29467747 27090784 24718353 22743443
4685 22743443 21111185 19763351 18627154 17654442 16772037 15936985 15153928 14439421 13792530
4676 13792530 13162930 12590783 12127463 11648456 11208842 10824228 10415136 10007536 9598434
4667 9598434 9270243 8924408 8595249 8283331 7946317 7620798 7310263 7033116 6744388 6522115
4657 6522115 6317137 6090770 5930801 5744547 5626427 5534717 5477345 5397949 5333780 5327680 5293217
$$ packed form
4719F6136739j636273k167031k151957k019039j891654j688198j566935j328916
4711E1686736j271844j430044j631738j735788j713016j586872j332897j110252
4703C9874285r14778q35583q03733p14843n40057k88869j90294k22346l20651
4694C5043131l71182m21398m91339q11518j421321k058626k376963k372431j974910
4685B2743443j632258j347834j136197r72712q82405q35052p83057p14507o46891
4676A3792530o29600n72147m63320m79007m39614l84614m09092m07600m09102
4667I598434l28191l45835l29159l11918l37014l25519l10535k77147k88728k22273
4657F522115k04978k26367j59969j86254j18120r1710n7372p9396o4169o100l4463
$$ plain form
4646 5293217 5279150 5243657 5210746 5186645 5159356 5145859 5198559 5213026 5184763 5164261 5182098
4635 5182098 5175931 5122493 5045680 4944055 4782655 4622175 4477573 4272517 4104368 3982577
4625 3982577 3844952 3664250 3540535 3444743 3366975 3269854 3210990 3150352 3076745 3066645 3010556
4614 3010556 2970889 2971413 2960227 2933763 2894504 2851278 2846090 2864263 2845867 2795278 2742018 2720616
4602 2720616 2674687 2593532 2461800 2392417 2278010 2157281 2032874 1974022 1922751 1854098 1777673
4591 1777673 1728062 1668753 1599460 1546251 1490825 1456825 1428498 1353406 1317954 1319432 1248845 1266077
4579 1266077 1243575 1213251 1223509 1172422 1156114 1128272 1100535 1047612 1026107 1031535 1028402 1027952
4567 1027952 991898 986067 968039 933366 911692 901881 868450 906384 882294 901909 897426 864818
$$ packed form
4646E293217j4067l5493l2911k4101k7289j3497N2700J4467k8263k0502J7837
4635E182098o167n3438p6813j01625j61400j60480j44602k05056j68149j21791
4625C982577j37625j80702j23715r5792p7768r7121n8864o0638p3607j0100n6089
4614C010556l9667N24j1186k6464l9259m3226n188J8173j8396n0589n3260k1402
4602B720616m5929q1155j31732o9383j14407j20729j24407n8852n1271o8653p6425
4591A777673m9611n9309o9293n3209n5426l4000k8327p5092l5452J478p0587J7232
4579A266077k2502l0324J0258n1087j6308k7842k7737n2923k1505N428l133m50
4567A027952l6054n831j8028l4673k1674r811l3431L7934k4090J9615m483l2608
$$ plain form
4555 864818 864305 859376 836568 782601 776672 808887 824996 829095 817991 804456 820797 797295 765097
4542 765097 788226 756199 735062 717516 689595 699907 704466 690407 702928 679442 678469 707156
4530 707156 691192 638258 642250 646724 615506 624807 628827 622471 606020 617061 592832 596643 556759
4517 556759 526337 549946 584142 556267 533370 537519 503284 472940 492794 505336 483757 493085
4505 493085 477070 462680 462178 438580 432302 432887 428543 444118 449700 410443 427134 443615 445788
4492 445788 458320 447333 444956 438201 440567 447790 447597 427255 431657 438717 439486 407069 390210 373098
4478 373098 405293 373769 349732 348877 338842 343401 348323 349223 324470 363945 377418 377711 395213
4465 395213 369960 357910 354644 324891 311474 350928 380730 382355 393082 385753 368246 364830
$$ packed form
4555H64818n13m929k2808n3967n929L2215J6109M099j1104j3535J6341k3502l2198
4542G65097K3129l2027k1137j7546k7921J0312M559j4059J2521k3486r73K8687
4530G07156j5964n2934L992M474l1218R301M020o356j6451J1041k4229L811l9884
4517E56759l0422K3609L4196k7875k2897M149l4235l0344J9854J2542k1579R328
4505D93085j6015j4390n02k3598o278N85m344J5575N582l9257J6691J6481K173
4492D45788J2532j0987k377o755K366P223j93k0342M402P060P69l2417j6859j7112
4478C73098L2195l1524k4037q55j0035M559M922R00k4753L9475J3473K93J7502
4465C95213k5253j2050l266k9753j3417L9454K9802J625J0727p329j7507l416
$$ plain form
4453 364830 356319 371435 379779 367577 380858 396659 408002 398563 378679 363267 399019 431463
4441 431463 442538 430719 422188 407209 410502 416070 419633 425679 412547 447318 444554 420206 443045
4428 443045 460173 496739 474525 487634 485356 461790 471386 515623 517377 472798 491636 520303
4416 520303 512560 506873 556084 565613 573278 554100 555625 583552 583593 553827 509224 483532 496349
4403 496349 448121 415745 433045 453718 436645 411048 433838 413058 394069 417430 423409 423034
4391 423034 408753 383893 381619 416336 430225 403363 418051 428074 462207 441433 441941 437106
4379 437106 434264 408102 391531 356950 381308 371064 357993 371805 350407 349587 335266 329658
4367 329658 362729 407971 407244 369950 352232 342841 359103 394789 348171 334288 367602 358694
$$ packed form
4453C64830q511J5116Q344j2202J3281J5801J1343r439j9884j5412L5752L2444
4441D31463J1075j1819q531j4979L293N568L563O046j3132L4771k764k4348K2839
4428D43045J7128L6566k2214J3109k278k3566R596M4237J754m4579J8838K8667
4416E20303p743n687M9211R529P665j9178J525K7927M1k9766m4603k5692J2817
4403D96349m8228l2376J7300K0673j7073k5597K2790k0780j8989K3361N979l75
4391D23034j4281k4860k274L4717J3889k6862J4688J0023L4133k0774N08m835
4379D37106k842k6162j6571l4581K4358j0244j3071J3812k1398q20j4321n608
4367C29658L3071M5242p27l7294j7718r391J6262L5686m6618j3883L3314q908
$$ plain form
4355 358694 363036 397520 408883 426060 453140 471286 474001 503517 512074 482255 474727 469184 433585
4342 433585 451112 436510 412264 438397 431534 445447 487578 462962 475590 483238 508650 524096
4330 524096 539459 528382 523465 536533 533233 552384 599141 609803 595988 620452 654886 640432
4318 640432 625524 629559 642036 677770 690239 700050 730375 790661 805738 810617 874121 902200
4306 902200 889838 915534 939902 1001628 1055730 1112446 1161127 1214251 1264120 1299667 1372372 1419716
4294 1419716 1476383 1550734 1586389 1664065 1740218 1785388 1866807 1973140 2122603 2201103 2328975
4283 2328975 2441473 2581390 2772537 2909482 3059668 3235514 3424751 3577882 3786846 4005905
4273 4005905 4194642 4437497 4663431 4929762 5244982 5531547 5863055 6236502 6637304 7062316
$$ packed form
4355C58694M342L4484J1363J7177K7080J8146K715K9516Q557k9819p528n543l5599
4342D33585J7527j4602k4246K6133o863J3913M2131k4616J2628P648K5412J5446
4330E24096J5363j1077m917J3068l300J9151M6757J0662j3815K4464L4434j4454
4318F40432j4908M035J2477L5734J2469R811L0325O0286J5077M879O3504K8079
4306I02200j2362K5696K4368O1726N4102N6716M8681N3124M9869L5547P2705M7344
4294A419716N6667P4351L5655P7676P6153M5170Q1419J06333J49463P8500J27872
4283B328975J12498J39917J91147J36945J50186J75846J89237J53131K08964K19059
4273D005905J88737K42855K25934K66331L15220K86565L31508L73447M00802M25012
$$ plain form
4263 7062316 7516387 7990667 8395343 8763135 9100180 9345893 9584667 9839767 10127384 10459618
4253 10459618 10914834 11477157 12104509 12805488 13537856 14317428 15020482 15528993 15803977
4244 15803977 15921912 15935004 15874835 15825309 15835597 15968598 16251712 16652614 17203893 17848123
4234 17848123 18481437 19017923 19422479 19582751 19437464 19066250 18518811 17907788 17373876
4225 17373876 16929793 16601500 16467890 16386042 16467258 16592972 16703554 16696771 16508330 16174557
4215 16174557 15620313 14935392 14166762 13387715 12714811 12081555 11541873 11143708 10836548
4206 10836548 10578802 10359171 10111160 9799862 9492781 9124876 8635032 8105091 7622503
4197 7622503 7151310 6713047 6319738 5953258 5614001 5330890 5094049 4864058 4622333 4411322
$$ packed form
4263G062316M54071M74280M04676L67792L37045K45713K38774K55100K87617L32234
4253A0459618M55216N62323O27352P00979P32368P79572P03054N08511K74984
4244A5803977J17935J3092o0169m9526J0288J33001K83114M00902N51279O44230
4234A7848123O33314N36486M04556J60272j45287l71214n47439o11023n33912
4225A7373876m44083l28293j33610q1848Q1216J25714J10582o783j88441l33773
4215A6174557n54244o84921p68630p79047o72904o33256n39682l98165l07160
4206A0836548k57746k19631k48011l11298l07081l67905m89844n29941m82588
4197G622503m71193m38263l93309l66480l39257k83111k36841k29991k41725k11011
$$ plain form
4187 4411322 4216157 3977347 3742808 3533171 3364873 3177071 2971840 2808447 2680780 2540701
4177 2540701 2419363 2329968 2222558 2143716 2111703 2055190 1990780 1921156 1876587 1852003 1801588
4166 1801588 1754732 1706855 1660143 1630387 1568449 1503800 1474115 1435552 1391894 1340667 1336360 1299665
4154 1299665 1240447 1246981 1249756 1226830 1207890 1182294 1138871 1112788 1090031 1050741 1050537 1019314
4142 1019314 1003818 989222 1012087 1025910 994499 996768 993151 1015830 1007888 1027239 1032514 981152
4130 981152 981492 1011244 1026320 1011198 996305 1004903 982018 949234 958459 979453 999476 1003827 982065
4117 982065 971119 1006283 1003401 999741 1015522 1020423 1017427 1026358 1007657 1024622 1062774 1070745 1083362
4104 1083362 1097242 1140912 1181151 1181584 1231124 1284253 1293878 1293766 1325092 1389904 1394715 1386400 1418165
$$ packed form
4187D411322j95165k38810k34539k09637j68298j87802k05231j63393j27667j40079
4177B540701j21338q9395j07410p8842l2013n6513o4410o9624m4569k4584n0415
4166A801588m6856m7877m6712k9756o1938o4649k9685l8563m3658n1227m307l6695
4154A299665n9218O534K775k2926j8940k5596m3423k6083k2757l9290k04l1223
4142A019314j5496j4596K2865J3823l1411K269l617K2679p942J9351N275n1362
4130I81152L40K9752J5076j5122j4893Q598k2885l2784R225K0994K0023M351k1762
4117I82065j0946L5164k882l660J5781M901k996Q931j8701J6965L8152P971J2617
4104A083362J3880M3670M0239M33M9540N3129R625j12L1326O4812M811q315L1765
$$ plain form
4091 1418165 1465703 1473783 1572635 1642884 1659574 1736116 1829841 1863540 1934569 2035307 2099930
4080 2099930 2197202 2322865 2464500 2608393 2714446 2765281 2866357 2926241 2945237 2995551
4070 2995551 3091665 3226763 3382760 3522967 3690673 3834279 3994696 4091060 4129637 4155509
4060 4155509 4195211 4211320 4292666 4378238 4409788 4490244 4597825 4752240 4965661 5173553 5391864
4049 5391864 5550931 5578861 5517749 5369400 5180855 4993287 4871488 4810448 4805732 4815116 4862307
4038 4862307 4918024 4995817 5088862 5141871 5127442 5079044 4959089 4857964 4725085 4675348 4649197
4027 4649197 4647896 4653343 4649893 4652496 4693089 4727805 4712552 4698291 4676161 4625262 4559967 4556302
4015 4556302 4543954 4560243 4586848 4561243 4590845 4617018 4647516 4743506 4841675 4913773 4997873
$$ packed form
4091A418165M7538Q080R8852P0249J6690P6542R3725L3699P1029J00738O4623
4080B099930R7272J25663J41635J43893J06053N0835J01076N9884J8996N0314
4070B995551R6114J35098J55997J40207J67706J43606J60417R6364L8577K5872
4060D155509L9702J6109Q1346Q5572L1550Q0456J07581J54415K13421K07892K18311
4049E391864J59067K7930o1112j48349j88545j87568j21799o1040m716R384M7191
4038D862307N5717P7793R3045N3009j4429m8398j19955j01125j32879m9737k6151
4027D649197j301N447l450K603M0593L4716j5253j4261k2130n0899o5295l665
4015D556302j2348J6289K6605k5605K9602K6173L0498R5990R8169P2098Q4100
$$ plain form
4004 4997873 5133704 5257803 5357657 5473893 5638492 5755609 5915616 6046028 6157717 6286080
3994 6286080 6399287 6519071 6635254 6767015 6883992 7054495 7275302 7476155 7671208 7793713
3984 7793713 7860299 7935103 8015591 8112500 8223184 8298998 8368372 8439125 8540172 8636616 8720769
3973 8720769 8777418 8815731 8876449 8951081 9058066 9187215 9304684 9399871 9399871 9354735 9304950 9268506
3961 9268506 9356447 9484323 9606912 9719065 9851939 9944812 9978938 9959828 9907640 9887073 9892706
3950 9892706 9905341 9956381 9992709 10017024 9931199 9833967 9730274 9643717 9620181 9673683 9753989
3939 9753989 9833671 9958950 10128015 10383996 10687861 11044194 11443049 11852765 12261476 12685520
3929 12685520 13082523 13394112 13603470 13721555 13808484 13997691 14210087 14487563 14792285 15106723
$$ packed form
4004D997873J35831J24099R9854J16236J64599J17117J60007J30412J11689J28363
3994F286080J13207J19784J16183J31761J16977J70503K20807K00853J95053J22505
3984G793713O6586P4804Q0488R6909J10684P5814O9374P0753J01047R6444Q4153
3973H720769N6649L8313O0718P4632J06985J29149J17469R5187%m5136m9785l6444
3961I268506Q7941J27876J22589J12153J32874R2873L4126j9110n2188k0567N633
3950I892706J2635N1040L6328K4315q5825r7232j03693q6557k3536N3502Q0306
3939I753989P9682J25279J69065K55981L03865L56333L98855M09716M08711M24044
3929A2685520L97003L11589K09358J18085Q6929J89207K12396K77476L04722L14438
$$ plain form
3919 15106723 15465311 15843544 16269571 16697848 17136509 17599556 18100118 18704750 19392107
3910 19392107 20244928 21261730 22435191 23621820 24803628 25998937 27188415 28428624
3902 28428624 29818819 31376670 33176484 35270340 37510180 39805061 41779054 43172146
3894 43172146 44016397 44512212 44924860 45392573 45933091 46568408 47400005 48543882 49949760
3885 49949760 51567414 53258792 54798013 56059456 57007236 57591897 57913175 58146721 58420889
3876 58420889 58760944 59144123 59698083 60525792 61670420 63348576 65569587 68268283 71321088
3867 71321088 74327314 76662657 77433246 76243679 73390934 69770532 66329890 63433208
3859 63433208 61099104 59187224 57586366 56246062 55181436 54465454 54035099 53682122 53285477
$$ packed form
3919A5106723L58588L78233M26027M28277M38661M63047N00562O04632O87357
3910A9392107Q52821J016802J173461J186629J181808J195309J189478J240209
3902B8428624J390195J557851J799814K093856K239840K294881J973993J393092
3894D3172146Q44251M95815M12648M67713N40518O35317Q31597J143877J405878
3885D9949760J617654J691378J539221J261443R47780N84661L21278K33546K74168
3876E8420889L40055L83179N53960Q27709J144628J678156K221011K698696L052805
3867G1321088L006226K335343P70589j189567k852745l620402l440642k896682
3859F3433208k334104j911880j600858j340304j064626p15982m30355l52977l96645
$$ plain form
3850 53285477 52659912 51660299 50232765 48427556 46376271 44348854 42561497 41130672
3842 41130672 40122111 39420905 38951365 38630907 38485246 38403048 38236008 37706719 36646267
3833 36646267 35028239 33075684 31150729 29424723 27908658 26558702 25387469 24379369
3825 24379369 23435465 22532685 21641485 20798466 20069071 19464574 19024557 18699418 18454341
3816 18454341 18265233 18083671 17979508 17947007 17913624 17904248 17857771 17826055 17794574 17740078 17665209
3805 17665209 17501481 17229884 16893126 16508837 16041980 15597956 15158230 14673167 14226970
3796 14226970 13908677 13694694 13578363 13541376 13586417 13671717 13807995 13926035 13936345 13899476
3786 13899476 13805296 13728980 13730325 13742928 13746975 13804063 13875446 13921263 13924920 13905014 13790379 13616596
$$ packed form
3850E3285477o25565r99613j427534j805209k051285k027417j787357j430825
3842D1130672j008561p01206m69540l20458j45661q2198j67040n29289j060452
3833C6646267j618028j952555j924955j726006j516065j349956j171233j008100
3825B4379369r43904r02780q91200q43019p29395o04497m40017l25139k45077
3816A8454341j89108j81562j04163l2501l3383r376m6477l1716l1481n4496p4869
3805A7665209j63728k71597l36758l84289m66857m44024m39726m85063m46197
3796A4226970l18293k13983j16331l6987M5041Q5300J36278J18040J0310l6869
3786A3899476r4180p6316J345J2603M047N7088P1383M5817L657j9906j14635j73783
$$ plain form
3774 13616596 13469533 13405693 13349833 13235557 13058558 12891509 12767671 12685618 12652795 12705314
3764 12705314 12844258 13039036 13228648 13428490 13611184 13725819 13745792 13727311 13726732 13741837
3754 13741837 13867219 14042569 14301370 14643898 15021405 15446104 15918586 16373656 16739172
3745 16739172 17114368 17579902 18078742 18641508 19219351 19809969 20475240 21228765 22093900
3736 22093900 23005072 24038272 25183873 26514732 28049169 29794753 31758565 34035496
3728 34035496 36543669 39208441 41998693 44703648 47234443 49381202 51138045 52365922
3720 52365922 53055585 53210474 52910756 52253323 51390905 50530041 49798110 49308357 49125875
3711 49125875 49164463 49318453 49404246 49259755 48825735 47872564 46476278 44620360 42407261
$$ packed form
3774A3616596j47063o3840n5860j14276j76999j67049j23838q2053l2823N2519
3764A2705314J38944J94778J89612J99842J82694J14635J9973j8481n79J5105
3754A3741837J25382J75350K58801L42528L77507M24699M72482M55070L65516
3745A6739172L75196M65534M98840N62766N77843N90618O65271P53525Q65135
3736B2093900R11172J033200J145601J330859J534437J745584J963812K276931
3728C4035496K508173K664772K790252K704955K530795K146759J756843J227877
3720E2365922O89663J54889k99718o57433q62418q60864p31931m89753j82482
3711D9125875L8588J53990Q5793j44491m34020r53171j396286j855918k213099
$$ plain form
3702 42407261 39884522 37127965 34353031 31594680 28958772 26533467 24316266 22354254
3694 22354254 20609573 19082649 17774198 16647647 15686800 14839012 14058980 13352318 12698759
3685 12698759 12147861 11656377 11206899 10817681 10459726 10157879 9884455 9619608 9351079
3676 9351079 9139549 8955556 8767146 8595310 8440716 8311228 8127804 7972294 7837812 7688028
3666 7688028 7549333 7411388 7263017 7106383 6961429 6833909 6727748 6648181 6602765 6538654
3656 6538654 6493382 6436853 6386392 6368645 6348612 6298997 6245688 6219538 6218838 6208542 6260572 6336271
3644 6336271 6329035 6340304 6373637 6414712 6480250 6523116 6610174 6683995 6772077 6848431 7002455
3633 7002455 7164421 7305179 7444152 7639002 7835305 8038247 8244953 8400791 8477851 8570716
$$ packed form
3702D2407261k522739k756557k774934k758351k635908k425305k217201j962012
3694B2354254j744681j526924j308451j126551r60847q47788p80032p06662o53559
3685A2698759n50898m91484m49478l89218l57955l01847k73424k64847k68529
3676I351079k11530j83993j88410j71836j54594j29488j83424j55510j34482j49784
3666G688028j38695j37945j48371j56634j44954j27520j06161p9567m5416o4111
3656F538654m5272n6529n0461j7747k0033m9615n3309k6150p00j0296N2030P5699
3644F336271p236J1269L3333M1075O5538M2866Q7058P3821Q8082P6354J54024
3633G002455J61966J40758J38973J94850J96303K02942K06706J55838P7060R2865
$$ plain form
3623 8570716 8633147 8682005 8708426 8731243 8782996 8755481 8738949 8778275 8825879 8816534 8861822 8914175
3611 8914175 8968989 9004877 9025467 9014549 9003672 8949199 8880032 8871240 8891722 8907967 8936787 8966372
3599 8966372 9009054 9029256 9098856 9173759 9295074 9471256 9715998 10055740 10409920 10775750
3589 10775750 11194313 11602612 12008398 12416415 12810258 13236806 13668465 14120392 14568739
3580 14568739 15048404 15468932 15895729 16255642 16488920 16665486 16774326 16794553 16763800 16655822
3570 16655822 16471650 16245451 16061494 15837083 15664328 15517241 15370780 15300987 15298981 15379978
3560 15379978 15509794 15665104 15857288 16159877 16478123 16881700 17289921 17724170 18161262
3551 18161262 18722228 19302299 19983925 20734286 21526547 22416575 23371868 24409582 25570295
$$ packed form
3623H570716O2431M8858K6421K2817N1753k7515j6532L9326M7604r345M5288N2353
3611H914175N4814L5888K0590j0918j0877n4473o9167q792K0482J6245K8820K9585
3599H966372M2682K0202O9600P4903J21315J76182K44742L39742L54180L65830
3589A0775750M18563M08299M05786M08017L93843M26548M31659M51927M48347
3580A4568739M79665M20528M26797L59913K33278J76566J08840K0227l0753j07978
3570A6655822j84172k26199j83957k24411j72755j47087j46461o9793k006Q0997
3560A5379978J29816J55310J92184L02589L18246M03577M08221M34249M37092
3551A8161262N60966N80071O81626P50361P92261Q90028R55293J037714J160713
$$ plain form
3542 25570295 26876823 28271205 29815019 31450524 33285138 35323833 37564539 40045120
3534 40045120 42772779 45808503 49213439 52963320 57058143 61450501 66066140 70710587
3526 70710587 75223135 79551228 83685963 87617060 91362148 94870541 98017050 100608503
3518 100608503 102563874 103902111 104677233 104957201 104762043 104190228 103268976 102105384 100626723
3509 100626723 98978357 97186258 95222732 93119111 90897999 88633304 86315528 84064510
3501 84064510 81997474 80145761 78561368 77288447 76492485 76287306 76866756 78332186 80624277
3492 80624277 83604511 87322237 90921025 93931720 96555658 99628635 103943374 109867191
3484 109867191 116053519 119737785 120059041 117697182 115136290 114102872 114735006 116491837
$$ packed form
3542B5570295J306528J394382J543814J635505J834614K038695K240706K480581
3534D0045120K727659L035724L404936L749881M094823M392358M615639M644447
3526G0710587M512548M328093M134735L931097L745088L508393L146509K591453
3518A00608503J955371J338237P75122K79968j95158n71815r21252j163592j478661
3509A00626723j648366j792099j963526k103621k221112k264695k317776k251018
3501H4064510k067036j851713j584393j272921p95962k05179N79450J465430K292091
3492H0624277K980234L717726L598788L010695K623938L072977M314739N923817
3484A09867191O186328L684266L21256k361859k560892j033418O32134J756831
$$ plain form
3476 116491837 118616667 120935248 123352744 125738854 127883304 129613087 130967824 132027408
3468 132027408 133052008 134331687 136222656 138780968 141901892 145610533 149425791 152336824
3460 152336824 154194733 155326054 156505163 158052817 159491430 158085008 152169918 142000621
3452 142000621 129544602 117591966 107067582 97904590 89754061 82366280 75835191 70163420
3444 70163420 65229948 61004452 57305857 54077920 51248368 48781882 46596220 44594673
3436 44594673 42732690 41085725 39553442 38103013 36725038 35463242 34278769 33140011
3428 33140011 32085177 31120992 30173063 29304627 28506902 27808362 27194936 26634569 26065348
3419 26065348 25552608 25042983 24616524 24185948 23803758 23418153 23097550 22773136 22524290
$$ packed form
3476A16491837K124830K318581K417496K386110K144450J729783J354737J059584
3468A32027408J024600J279679J890969K558312L120924L708641L815258K911033
3460A52336824J857909J131321J179109J547654J438613j406422n915090j0169297
3452A42000621j2456019j1952636j0524384r162992q150529p387781o531089n671771
3444G0163420m933472m225496l698595l227937k829552k466486k185662k001547
3436D4594673j861983j646965j532283j450429j377975j261796j184473j138758
3428C3140011j054834r64185r47929q68436p97725o98540o13426n60367n69221
3419B6065348n12740n09625m26459m30576l82190l85605l20603l24414k48846
$$ plain form
3410 22524290 22389331 22289279 22173970 22056385 21944616 21822530 21749527 21747645 21828712 21977835
3400 21977835 22159885 22327318 22311978 22029379 21491290 20908832 20440803 20057328 19809010 19607024
3390 19607024 19492163 19376062 19256857 19105868 19041576 19040701 19041592 19071485 19115780 19143350 19106394
3379 19106394 19022041 18989386 19012371 19082918 19244577 19522087 19888895 20403086 21003525 21532063
3369 21532063 21974933 22324503 22729937 23163375 23658888 24225317 24934898 25806551 26728747
3360 26728747 27735852 28825993 30069294 31471999 33145668 35080668 37178069 39486932
3352 39486932 42248919 45785411 50212664 55303454 60992008 66514264 71684165 74896071
3344 74896071 74231363 69922298 63305180 56942116 52064128 48535723 45734032 43395428
$$ packed form
3410B2524290j34959j00052j15309j17585j11769j22086p3003j882Q1067J49123
3400B1977835J82050J67433j5340k82599n38089n82458m68029l83475k48318k01986
3390A9607024j14861j16101j19205j50989o4292q75Q91K9893M4295K7570l6956
3379A9106394q4353l2655K2985P0547J61659K77510L66808N14191O00439N28538
3369B1532063M42870L49570M05434M33438M95513N66429P09581Q71653R22196
3360B6728747J007105J090141J243301J402705J673669J935000K097401K308863
3352C9486932K761987L536492M427253N090790N688554N522256N169901L211906
3344G4896071o64708m309065o617118o363064m877988l528405k801691k338604
$$ plain form
3336 43395428 41472862 40009296 39082087 38585532 38429185 38640466 39152563 39981539 41094143
3327 41094143 42605422 44470062 46716248 49553123 53367220 58004282 63292417 69053054
3319 69053054 74587168 79616378 82121513 80852613 76355911 70330477 65244327 61838800
3311 61838800 59848005 58867425 58424354 58460157 58904005 59688399 60772048 61950382 63233915
3302 63233915 64510704 65596958 66345234 66710378 66720013 66345970 65629602 64628259 63354219
3293 63354219 61698997 59686530 57336276 54707171 51878597 48942109 45956264 42932141
3285 42932141 39965534 37124998 34446953 31974643 29678177 27579394 25739045 24028194
3277 24028194 22466649 21027532 19704021 18497175 17404172 16411029 15477586 14697450 13942592
$$ packed form
3336D3395428j922566j463566r27209m96555j56347K11281N12097Q28976J112604
3327D1094143J511279J864640K246186K836875L814097M637062N288135N760637
3319F9053054N534114N029210K505135j268900m496702o025434n086150l405527
3311F1838800j990795r80580m43071L5803M43848P84394J083649J178334J283533
3302F3233915J276789J086254P48276L65144R635l74043p16368j001343j274040
3293F3354219j655222k012467k350254k629105k828574k936488k985845l024123
3285D2932141k966607k840536k678045k472310k296466k098783j840349j710851
3277B4028194j561545j439117j323511j206846j093003r93143r33443p80136p54858
$$ plain form
3268 13942592 13236007 12595770 12028835 11551205 11088996 10685664 10291085 9978167 9643611
3259 9643611 9325159 9069047 8828651 8616410 8443420 8263273 8109709 7974819 7852716 7775885
3249 7775885 7731204 7682455 7638483 7632161 7682359 7753904 7771838 7814686 7870591 7908633 7923790 7894745
3237 7894745 7864994 7788877 7688448 7582277 7446127 7270995 7064117 6891056 6706628 6521233
3227 6521233 6322126 6186012 6032428 5862922 5724880 5580485 5416140 5289731 5178967 5065367
3217 5065367 4929510 4811526 4715132 4607803 4483698 4418945 4361914 4310060 4263097 4205365 4145008
3206 4145008 4089078 4066644 4050593 4060364 4052510 4054643 4010067 3998526 4003352 4026788 4041369 4018908
3194 4018908 4052726 4117357 4066332 4101036 4110771 4063283 4098638 4084559 4133345 4162049 4174869 4177811
$$ packed form
3268A3942592p06585o40237n66935m77630m62209m03332l94579l12918l34556
3259I643611l18452k56112k40396k12241j72990j80147j53564j34890j22103p6831
3249G775885m4681m8749m3972o322N0198P1545J7934M2848N5905L8042J5157k9045
3237G894745k9751p6117j00429j06171j36150j75132k06878j73061j84428j85395
3227F521233j99107j36114j53584j69506j38042j44395j64345j26409j10764j13600
3217E065367j35857j17984r6394j07329j24105o4753n7031n1854m6963n7732o0357
3206D145008n5930k2434j6051R771p854K133m4576j1541M826K3436J4581k2461
3194D018908L3818O4631n1025L4704R735m7488L5355j4079M8786K8704J2820K942
$$ plain form
3182 4177811 4176963 4145755 4094181 4106176 4093194 4089738 4152596 4189532 4175431 4154872 4146974 4170965
3170 4170965 4214234 4230999 4190069 4217934 4247057 4205378 4221763 4221620 4190235 4169747 4194957 4193775
3158 4193775 4187722 4125855 4103909 4129933 4170606 4227020 4242288 4288880 4344744 4361273 4391621 4458998
3146 4458998 4478757 4496987 4470601 4468962 4512370 4537079 4574568 4604057 4658154 4708764 4763714 4862413
3134 4862413 4942639 5030578 5135243 5243072 5355653 5524256 5712233 5884009 6044876 6218859
3124 6218859 6368236 6523132 6667543 6799077 6994514 7191135 7397320 7665214 7899800 8150351
3114 8150351 8448231 8741899 9044213 9365112 9735921 10112706 10549383 11089190 11650043 12250640
3104 12250640 12869339 13549525 14311490 15171537 16202156 17423549 18792095 20316851 21951204
$$ packed form
3182D177811q48l1208n1574J1995j2982l456O2858L6936j4101k0559p898K3991
3170D170965M3269J6765m0930K7865K9123m1679J6385j43l1385k0488K5210j182
3158D193775o053o1867k1946K6024M0673N6414J5268M6592N5864J6529L0348O7377
3146D458998J9759J8230k6386j639M3408K4709L7489K9489N4097N0610N4950R8699
3134D862413Q0226Q7939J04665J07829J12581J68603J87977J71776J60867J73983
3124F218859J49377J54896J44411J31534J95437J96621K06185K67894K34586K50551
3114H150351K97880K93668L02314L20899L70809L76785M36677N39807N60853O00597
3104A2250640O18699O80186P61965Q60047J030619J221393J368546J524756J634353
$$ plain form
3095 21951204 23493601 24752685 25713200 26448090 27137935 27941212 28818932 29831927 31024923
3086 31024923 32262658 33591942 35080678 36737122 38553155 40647223 42983759 45475484
3078 45475484 48144161 51194334 54667750 58562948 62940519 67839511 73266792 79344177
3070 79344177 86195204 93925049 102371155 111309729 120984382 132018953 145531978 162556681
3062 162556681 183781175 209096135 237549433 265737662 286495358 292410315 281440582
3055 281440582 258367740 231753947 207729205 187575493 169736456 152570013 135892605
3048 135892605 120481021 106782638 94925591 84646017 75759872 68137004 61655912
3041 61655912 56087794 51323421 47247536 43721205 40691878 37993142 35630596 33533993
$$ packed form
3095B1951204J542397J259084R60515P34890O89845Q03277Q77720J012995J192996
3086C1024923J237735J329284J488736J656444J816033K094068K336536K491725
3078D5475484K668677L050173L473416L895198M377571M898992N427281O077385
3070G9344177O851027P729845Q446106Q938574R674653J1034571J3513025J7024703
3062A62556681K1224494K5314960K8453298K8188229K0757696N914957j0969733
3055B81440582k3072842k6613793k4024742k0153712j7839037j7166443j6677408
3048A35892605j5411584j3698383j1857047j0279574q886145p622868o481092
3041F1655912n568118m764373m075885l526331l029327k698736k362546k096603
$$ plain form
3033 33533993 31680840 29965332 28422959 26979173 25574000 24277588 23054552 21914221
3025 21914221 20849692 19848728 18915652 18090274 17323544 16582020 15912334 15300895 14797342
3016 14797342 14246225 13736080 13256852 12765036 12278787 11796759 11373506 10973764 10578806
3007 10578806 10230608 9885772 9532838 9226170 8925234 8693139 8457699 8184899 7929005
2998 7929005 7715439 7481522 7247668 7057249 6877691 6709712 6518216 6357454 6199863 6014074
2988 6014074 5866546 5735752 5627289 5565227 5474191 5362515 5308555 5244513 5161354 5081897 5019714
2977 5019714 4937681 4827207 4756356 4673723 4592075 4474903 4354648 4244085 4139245 4069339
2967 4069339 4014184 3904768 3838550 3824383 3789181 3742960 3726418 3666713 3616992 3554683 3500927
$$ packed form
3033C3533993j853153j715508j542373j443786j405173j296412j223036j140331
3025B1914221j064529j000964r33076q25378p66730p41524o69686o11439n03553
3016A4797342n51117n10145m79228m91816m86249m82028m23253l99742l94958
3007A0578806l48198l44836l52934l06668l00936k32095k35440k72800k55894
2998G929005k13566k33917k33854j90419j79558j67979j91496j60762j57591j85789
2988F014074j47528j30794j08463o2062r1036j11676n3960o4042q3159p9457o2183
2977E019714q2033j10474p0851q2633q1648j17172j20255j10563j04840o9906
2967D069339n5155j09416o6218j4167l5202m6221j6542n9705m9721o2309n3756
$$ plain form
2956 3500927 3430491 3386879 3370589 3334839 3318530 3308091 3304631 3282457 3246862 3211209 3186384 3158255
2944 3158255 3120904 3105227 3060324 3000764 2956014 2904284 2870938 2836600 2838272 2802013 2768990 2725758
2932 2725758 2651876 2624333 2609431 2630264 2587343 2561258 2565203 2565996 2566626 2523315 2541474 2549385 2515937
2919 2515937 2534657 2512167 2488642 2466304 2429395 2412449 2360329 2318699 2277109 2258979 2243317
2908 2243317 2255330 2273733 2243858 2165096 2141277 2102261 2070109 2039638 2003080 2001965 1953811 1910972
2896 1910972 1877164 1883783 1866429 1810911 1783990 1754093 1722619 1714859 1713243 1675127 1646400 1637990
2884 1637990 1666859 1706681 1705415 1701823 1696905 1676751 1651896 1626982 1595336 1534988 1516012 1469039
2872 1469039 1467068 1489364 1490473 1500969 1513151 1472329 1453509 1459951 1452165 1433935 1433845 1402743 1410813
$$ packed form
2956C500927p0436m3612j6290l5750j6309j0439l460k2174l5595l5653k4825k8129
2944C158255l7351j5677m4903n9560m4750n1730l3346l4338J672l6259l3023m3232
2932B725758p3882k7543j4902K0833m2921k6085L945P93O30m3311J8159P911l3448
2919B515937J8720k2490k3525k2338l6909j6946n2120m1630m1590j8130j5662
2908B243317J2013J8403k9875p8762k3819l9016l2152l0471l6558j115m8154m2839
2896A910972l3808O619j7354n5518k6921k9897l1474p760j616l8116k8727q410
2884A637990K8869L9822j266l592m918k0154k4855k4914l1646o0348j8976m6973
2872A469039j971K2296J109J0496J2182m0822j8820O442p786j8230r0l1102Q070
$$ plain form
2859 1410813 1411570 1418316 1412345 1401544 1382235 1391687 1369318 1317858 1329060 1327038 1297015 1277451 1219891
2846 1219891 1225563 1281297 1276836 1266010 1245895 1212173 1220874 1246648 1173004 1199601 1209334 1199128
2834 1199128 1217297 1243756 1252350 1267348 1254039 1258564 1280476 1282759 1257630 1258813 1265458 1262903 1261125
2821 1261125 1266660 1222272 1202084 1232087 1252504 1226893 1251803 1267032 1234246 1242731 1267547 1260497
2809 1260497 1221860 1235091 1251690 1259092 1284759 1314564 1303165 1309911 1310292 1294741 1283812 1251540
2797 1251540 1268416 1312501 1343473 1365413 1378641 1366649 1380266 1402916 1415102 1405808 1454536 1537190
2785 1537190 1583251 1618584 1652905 1666274 1723468 1830659 1952248 2086880 2224270 2380548
2775 2380548 2459131 2489595 2424690 2320997 2181520 2035900 1924179 1845451 1756212 1650594
$$ packed form
2859A410813P57O746n971j0801j9309R452k2369n1460J1202k022l0023j9564n7560
2846A219891N672N5734m461j0826k0115l3722Q701K5774p3644K6597R733j0206
2834A199128J8169K6459Q594J4998j3309M525K1912K283k5129J183O645k555j778
2821A261125N535m4388k0188L0003K0417k5611K4910J5229l2786Q485K4816p050
2809A260497l8637J3231J6599P402K5667K9805j1399O746L81j5551j0929l2272
2797A251540J6876M4085L0972K1940J3228j1992J3617K2650J2186r294M8728Q2654
2785A537190M6061L5333L4321J3369N7194J07191J21589J34632J37390J56278
2775B380548P8583L0464o4905j03693j39477j45620j11721p8728q9239j05618
$$ plain form
2765 1650594 1572703 1476529 1383041 1323844 1254594 1192859 1159959 1142967 1119894 1093604 1048595
2754 1048595 1000902 1010031 986792 940722 902312 909796 898729 882226 869222 859238 852440 838127
2742 838127 846700 867696 868022 851084 849699 843442 795551 793005 782732 809133 803237 776468 773300
2729 773300 752048 775112 797040 791200 767904 755173 760161 772182 752765 733858 757403 783420
2717 783420 755373 732895 717643 695349 680278 700002 686152 683699 653177 626501 662240 693015
2705 693015 687563 670442 686435 694267 658848 643840 639110 626900 626285 642587 636747 659378 662069
2692 662069 676080 625751 619219 632237 599183 604815 645746 609498 590604 588848 542876 576337
2680 576337 594707 591545 588213 591491 594995 581856 574985 538662 506918 525155 502401 516636 544910
$$ packed form
2765A650594p7891r6174r3488n9197o9250o1735l2900j6992k3073k6290m5009
2754A048595m7693R129k3239m6070l8410P484j1067j6503j3004r984o798j4313
2742H38127Q573K0996L26j6938j385o257m7891k546j0273K6401n896k6769l168
2729G73300k1252K3064K1928n840k3296j2731M988J2021j9417j8907K3545K6017
2717G83420k8047k2478j5252k2294j5071J9724j3850k453l0522k6676L5739L0775
2705F93015n452j7121J5993P832l5419j5008m730j2210o15J6302n840K2631K691
2692F62069J4011n0329o532J3018l3054N632M0931l6248j8894j756m5972L3461
2680E76337J8370l162l332L278L504j3139o871l6323l1744J8237k2754J4235K8274
$$ plain form
2667 544910 530991 517576 521454 518947 522146 518432 542616 558262 577718 586805 573491 589629 562976
2654 562976 547887 531265 533770 543190 561881 579661 550004 509025 493487 478680 476451 482301
2642 482301 486439 489396 511505 528423 526030 512944 520174 506595 501752 516309 519523 525936 533184
2629 533184 556223 530550 531593 513253 433198 393228 424539 446127 445321 461846 477049 443081
2617 443081 460584 459640 453027 451045 447662 449595 473848 460477 461781 442191 471460 477656 440433
2604 440433 471078 484224 462901 460032 469787 461107 473478 500943 503619 465847 444012 444014 432498
2591 432498 420032 400345 415602 410613 410055 437879 416064 398256 389482 338594 339328 342659 373103
2578 373103 400028 367118 331508 325959 373365 419733 456938 401519 397879 409909 402694 368099
$$ packed form
2667E44910j3919j3415L878k507L199l714K4184J5646J9456R087j3314J6138k6653
2654E62976j5089j6622K505R420J8691J7780k9657m0979j5538j4807k229N850
2642D82301M138K957K2109J6918k393j3086P230j3579m843J4557L214O413P248
2629E33184K3039k5673J043j8340q0055l9970L1311K1588q06J6525J5203l3968
2617D43081J7503r44o613j982l383J933K4253j3371J304j9590K9269O196l7223
2604D40433L0645J3146k1323k869R755q680J2371K7465K676l7772k1835Kj1516
2591D32498j2466j9687J5257m989n58K7824k1815j7808q774n0888P34L331L0444
2578C73103K6925l2910l5610n549M7406M6368L7205n5419l640J2030p215l4595
$$ plain form
2566 368099 384127 436481 435672 409772 404139 416138 418253 449049 439985 466591 437646 415005 415999
2553 415999 379788 382842 384411 412204 421594 400254 372080 395336 392483 395365 395072 372610 382682
2540 382682 389623 384942 369352 372608 370657 395644 408608 378299 387317 368408 380016 368884 354389
2527 354389 375304 364712 361425 360615 369804 369962 355646 337152 314307 309131 325245 325325 320478 338948
2513 338948 377779 386187 353532 350995 341146 354142 336825 321007 343070 348738 333268 328053 338987
2500 338987 357176 337122 308849 313154 317729 320199 327096 349823 339404 311849 302293 345179 330558
2487 330558 309623 324327 323652 318874 316063 241042 245570 291252 309158 308324 304619 297332 330125
2474 330125 330353 272834 301632 311015 322363 338068 352428 331839 318560 302718 303070 297502 283542
$$ packed form
2566C68099J6028N2354q09k5900n633J1999K115L0796r064K6606k8945k2641R94
2553D15999l6211L054J569K7793R390k1340k8174K3256k853K882k93k2462J0072
2540C82682O941m681j5590L256j951K4987J2964l0309R018j8909J1608j1132j4495
2527C54389K0915j0592l287q10R189J58j4316j8494k2845n176J6114Q0m847J8470
2513C38948L8831Q408l2655k537r849J2996j7317j5818K2063N668j5470n215J0934
2500C38987J8189k0054k8273M305M575K470O897K2727j0419k7555r556M2886j4621
2487C30558k0935J4704o75m778k811p5021M528M5682J7906q34l705p287L2793
2474C30125K28n7519K8798R383J1348J5705J4360k0589j3279j5842L52n568j3960
$$ plain form
2461 283542 262576 263302 255402 283794 313820 322041 336190 348297 339246 307807 310818 312954 302716
2448 302716 293133 297305 285410 271638 275424 274008 259051 253418 297139 303828 269092 267847 283024
2435 283024 244524 259604 252780 259875 253270 251270 260557 267862 265132 254394 262015 279298 257489
2422 257489 246747 290592 323483 312612 281951 286171 292612 271939 272800 273213 285181 325915 283253
2409 283253 290927 303348 289977 299196 304469 270204 307462 311206 306168 268749 274250 272650 295659
2396 295659 290895 283633 285763 306069 298798 305529 336617 350924 311827 296582 325298 321228 312553
2383 312553 324317 305932 320138 328329 325774 325146 332224 329541 325101 293099 286658 321689 330689
2370 330689 366918 371465 348542 354733 353847 342244 325401 342781 368166 376775 379753 365918 395610
$$ packed form
2461B83542k0966P26p900K8392L0026Q221J4149J2107r051l1439L011K136j0238
2448C02716r583M172j1895j3772L786j416j4957n633M3721O689l4736j245J5177
2435B83024l8500J5080o824P095o605k000R287P305k730j0738P621J7283k1809
2422B57489j0742M3845L2891j0871l0661M220O441k0673Q61M13J1968M0734m2662
2409B83253P674J2421j3371R219N273l4265L7258L744n038l7419N501j600K3009
2396B95659m764p262K130K0306p271O731L1088J4307l9097j5245K8716m070q675
2383C12553J1764j8385J4206Q191k555o28P078k683m440l2002o441L5031R000
2370C30689L6229M547k2923O191q86j1603j6843J7380K5385Q609K978j3835K9692
$$ plain form
2357 395610 401665 413533 396125 377028 407404 443653 429881 425707 441089 473203 517048 525120
2345 525120 550047 573281 570990 561310 568216 589426 581729 660452 689190 717118 748501 799756
2333 799756 871260 925514 986195 1097950 1210003 1280144 1277785 1244206 1239200 1263968 1308429 1342587
2321 1342587 1359504 1411108 1471062 1589414 1691605 1829403 1940998 2033318 2132192 2278003
2311 2278003 2456607 2656993 2841335 3099933 3321125 3537215 3743266 4054650 4427449 4740288
2301 4740288 5131094 5548506 6150541 6954604 8014929 9454085 11111125 13362626 15268087
2292 15268087 15683605 14529198 12161740 9948567 8334668 7173483 6258602 5401712 4642510
2283 4642510 4072311 3586007 3270102 3029942 2815463 2641133 2505398 2299317 2090007 1943489
$$ packed form
2357C95610O055J1868j7408j9097L0376L6249j3772m174J5382L2114M3845Q072
2345E25120K4927K3234k291r680O906K1210p697P8723K8738K7928L1383N1255
2333G99756P1504N4254O0681J11755J12053P0141k359l3579n006K4768M4461L4158
2321A342587J6917N1604N9954J18352J02191J37798J11595R2320R8874J45811
2311B278003J78604K00386J84342K58598K21192K16090K06051L11384L72799L12839
2301D740288L90806M17412O02035Q04063J060325J439156J657040K251501J905461
2292A5268087M15518j154407k367458k213173j613899j161185r14881q56890p59202
2283D642510n70199m86304l15905k40160k14479j74330j35735k06081k09310j46518
$$ plain form
2273 1943489 1796600 1673277 1583070 1496558 1414405 1325741 1250798 1199885 1123293 1059242 1021776
2262 1021776 986926 949607 901018 863950 802780 809380 787891 757027 739869 708817 710315 684265
2250 684265 623766 617212 610618 590639 566446 600440 565886 517755 488239 470543 487405 476774
2238 476774 473564 472117 450362 430275 408561 382221 386621 400663 412913 429542 417407 375830
2226 375830 379849 375897 348522 355293 327537 332396 337200 336353 349372 336460 350698 354120 365202
2213 365202 328354 343948 334494 282378 269866 299380 322575 330949 300236 280637 233340 246747
2201 246747 260912 262404 272042 264631 281824 300005 300162 305437 301273 262059 242213 247862 235260
2188 235260 224693 232236 247030 254455 255900 248474 234169 237694 260385 268660 242496 270747 248902
$$ packed form
2273A943489j46889j23323r0207q6512q2153q8664p4943n0913p6592o4051l7466
2262A021776l4850l7319m8589l7068o1170O600k1489l0864j7158l1052J498k6050
2250F84265o0499o554o594j9979k4193L3994l4554m8131k9516j7696J6862j0631
2238D76774l210j447k1755k0087k1714k6340M400J4042J2250J6629j2135m1577
2226C75830M019l952k7375O771k7756M859M804q47J3019j2912J4238L422J1082
2213C65202l6848J5594r454n2116j2512K9514K3195Q374l0713j9599m7297J3407
2201B46747J4165J492R638p411J7193J8181J57N275m164l9214j9846N649j2602
2188B35260j0567P543J4794P425J445p426j4305L525K2691Q275k6164K8251k1845
$$ plain form
2175 248902 274356 263349 229080 260178 238817 226189 212244 194931 216081 239161 225647 242989
2163 242989 242162 212968 235804 219536 218256 244370 237271 212787 260740 263301 244089 234538 243757
2150 243757 237345 222142 226417 217935 185622 161730 189001 189938 202848 237768 247537 197921 183205
2137 183205 173354 181000 191867 165327 138350 169099 147285 163884 146726 143583 136394 147842
2125 147842 148126 151811 163196 159368 177291 156138 160716 173331 159861 218029 222788 183330 160827
2112 160827 164130 173559 148091 144400 107192 157006 157415 151715 148989 149422 160136 163572 155252 123572
2098 123572 129333 160759 143697 127185 138304 155143 186066 169814 165200 152315 135649 142454
2086 142454 170352 175633 139516 131044 138850 141155 135111 162292 166476 166574 162768 151269 152714 141913
$$ packed form
2175B48902K5454j1007l4269L1098k1361j2628j3945j7313K1150K3080j3514J7342
2163B42989q27k9194K2836j6268j280K6114p099k4484M7953K561j9212r551R219
2150B43757o412j5203M275q482l2313k3892K7271R37J2910L4920R769m9616j4716
2137A83205r851P646J0867k6540k6977L0749k1814J6599j7158l143p189J1448
2125A47842K84L685J1385l828J7923k1153M578J2615j3470N8168M759l9458k2503
2112A60827L303R429k5468l691l7208M9814M09n700k726M33J0714L436q320l1680
2098A23572N761L1426j7062j6512J1119J6839L0923j6252m614j2885j6666O805
2086A42454K7898N281l6117q472P806K305o044K7181M184R8l806j1499J445j0801
$$ plain form
2072 141913 162429 147390 159798 164471 137906 130900 143555 160465 148351 118859 127765 142422
2060 142422 144016 158657 134340 152269 130155 128716 126790 147858 127886 121472 156137 129771
2048 129771 137910 100702 79503 113856 133422 136768 154156 137229 150449 156486 161579 143235
2036 143235 133537 202979 156172 131001 137997 174540 172074 191886 184594 179892 215527 240028 213280
2023 213280 225716 236375 224386 231884 170181 177177 165528 165068 150454 134808 149086 150819 155495
2010 155495 131503 110927 118399 132071 119020 116957 104767 87145 87680 91757 94558 101982 111732
1997 111732 103082 93214 96835 98048 108894 93870 111232 113933 90776 92652 95548 120514 88863
1984 88863 84910 111032 155941 148392 126050 133623 116673 94841 58548 74310 117098 104225
$$ packed form
2072A41913K0516j5039J2408M673k6565p006J2655J6910j2114k9492Q906J4657
2060A42422J594J4641k4317J7929k2114j439j926K1068j9972o414L4665k6366
2048A29771Q139l7208k1199L4353J9566L346J7388j6927J3220O037N093j8344
2036A43235r698O9442m6807k5171O996L6543k466J9812p292m702L5635K4501k6748
2023B13280J2436J0659j1989P498o1703O996j1649m60j4614j5646J4278J733M676
2010A55495k3992k0576P472J3672j3051k063j2190j7622N35M077K801P424R750
1997A11732q650r868L621J213J0846j5024J7362K701k3157J876K896K4966l1651
1984H8863l953K6122M4909p549k2342P573j6950k1832l6293J5762M2788j2873
$$ plain form
1972 104225 105296 81526 76720 101795 134087 123201 96408 84111 78247 96414 106889 90284
1960 90284 90896 74554 108498 108945 95778 92136 82822 99167 86986 101497 130940 87773 99884
1947 99884 111567 91479 56755 85111 91892 91773 111022 145229 166579 152259 121953 112425 98987
1934 98987 69397 65247 64033 77357 75960 87898 82948 108931 83198 69911 101959 77985 63303
1921 63303 94544 110339 104027 73536 42642 85924 88457 63156 121604 142586 148310 119599
1909 119599 76988 65644 77656 86861 55503 49696 95854 115845 106495 90488 111634 73065
1897 73065 95502 109928 120636 87318 103712 96817 91686 87227 69908 72076 48418 64496 90077
1884 90077 81935 68137 59590 74043 105382 91033 104146 102994 84519 101526 124388 120470 86913
$$ packed form
1972A04225J071k3770m806K5075L2292j0886k6793j2297n864J8167J0475j6605
1960I0284O12j6342L3944M47j3167l642r314J6345j2181J4511K9443m3167J2111
1947I9884J1683k0088l4724K8356O781j19J9249L4207K1350j4320l0306r528j3438
1934I8987k9590m150j214J3324j397J1938m950K5983k5733j3287L2048k3974j4682
1921F3303L1241J5795o312l0491l0894M3282K533k5301N8448K0982N724k8711
1909A19599m2611j1344J2012R205l1358n807M6158J9991r350j6007K1146l8569
1897G3065K2437J4426J0708l3318J6394o895n131m459j7319K168k3658J6078K5581
1884I0077q142j3798q547J4453L1339j4349J3113j152j8475J7007K2862l918l3557
$$ plain form
1871 86913 90784 84938 106292 67410 74672 102830 85897 73260 73761 53391 80418 111535 72581
1858 72581 84374 89543 90899 44958 88342 100085 50207 42714 66783 28256 37492 69375 119372
1845 119372 93921 69394 78243 72702 81967 84234 95469 88426 103296 107549 88558 80714 85885
1832 85885 86282 83318 63605 80130 110008 116596 109021 120849 78459 43242 51847 54515 78153
1819 78153 59298 75650 89761 75049 54020 61188 50082 75563 61923 71942 74485 73228
1807 73228 40782 30129 56929 69491 98651 88280 79980 69100 86538 82035 85480 81832 100656
1794 100656 72064 42689 45954 46656 59970 58670 58133 45708 13983 30358 42109 23856 11560
1781 11560 33056 50928 31549 21656 35781 97806 86493 82507 75403 42353 65864 102293
$$ packed form
1871H6913L871n846K1354l8882P262K8158j6933j2637N01k0370K7027L1117l8954
1858G2581J1793N169J356m5941M3384J1743m9878p493K4069l8527R236L1883M9997
1845A19372k5451k4527Q849n541R265K267J1235p043J4870M253j8991p844N171
1832H5885L97k964j9713J6525K9878O588p575J1828m2390l5217Q605K668K3638
1819G8153j8855J6352J4111j4712k1029P168j1106K5481j3640J0019K543j257
1807G3228l2446j0653K6800J2562K9160j0371q300j0880J7438m503L445l648J8824
1794A00656k8592k9375L265P02J3314j300n37j2425l1725J6375J1751j8253j2296
1781A1560K1496J7872j9379r893J4125O2025j1313l986p104l3050K3511L6429
$$ plain form
1769 102293 111538 62662 51745 43507 55131 42963 42017 50387 89107 93969 72432 62969 70040
1756 70040 75076 83610 99064 96360 87826 53388 61052 72821 58184 65174 43930 3527 43622
1743 43622 37262 22028 20048 31577 54232 62582 66595 66977 41711 50480 50158 26919 31078 38913
1729 38913 32624 51105 38883 62081 51509 45270 30624 51911 53723 51181 56759 79969 66799
1716 66799 10100 44355 31918 61786 28578 17200 24634 10732 16616 59313 86702 69273
1704 69273 57473 28329 15379 36774 40033 59757 54858 30762 51462 68891 42603 80957
1692 80957 90793 56068 47941 61711 15506 17950 45089 26504 14342 45355 9761 34445
1680 34445 39210 7817 49579 60026 40424 27054 25275 48301 56299 26579 36381 52088 68112
$$ packed form
1769A02293R245m8876j0917q238J1624j2168r46Q370L8720M862k1537r463P071
1756G0040N036Q534J5454k704q534l4438P664J1769j4637O990k1244m0403M0095
1743D3622o360j5234j980J1529K2655Q350M013L82k5266Q769l22k3239M159P835
1729C8913o289J8481j2222K3198j0572o239j4646K1287J812k542N578K3210j3170
1716F6799n6699L4255j2437K9868l3208j1378P434j3902N884M2697K7389j7429
1704F9273j1800k9144j2950K1395L259J9724m899k4096K0700J7429k6288L8354
1692H0957R836l4725q127J3770m6205K444K7139j8585j2162L1013l5594K4684
1680C4445M765l1393M1762J0447j9602j3370j779K3026P998k9720R802J5707J6024
$$ plain form
1667 68112 63898 92188 65064 59914 60175 41304 58469 54989 27734 26287 39081 53521 71074
1654 71074 47219 9482 -3138 14410 38782 40750 38873 58649 59708 8890 2725 2274 -4756
1641 -4756 516 -23811 3258 20473 17972 9188 26873 51992 37322 50159 45034 30154 35620
1628 35620 49120 33337 46497 35716 50124 50065 45973 23700 48345 50569 59705 64647 67928
1615 67928 81333 61088 52364 37579 35246 24176 39684 44925 54616 42361 2136 349 27050
1602 27050 0 -1349 13458 64595 65806 44525 36638 30879 54147 48881 38370 27627 11366
1589 11366 36584 46268 45142 71791 70369 38916 -1401 -728 18619 11999 16771 -3619 29867
1576 29867 63958 50561 58242 34494 16964 25423 16870 14632 25936 12604 65974 78365 58750
$$ packed form
1667F8112m214K8290k7124n150K61j8871J7165l480k7255j447J2794J4440J7553
1654G1074k3855l7737j2620J7548K4372J968j877J9776J059n0818o165m51p030
1641d756N272k4327K7069J7215k501q784J7685K5119j4670J2837n125j4880N466
1628C5620J3500j5783J3160j0781J4408n9m092k2273K4645K224R136M942L281
1615F7928J3405k0245q724j4785k333j1070J5508N241R691j2255m0225j787K6701
1602B7050k7050j349J4807N1137J211k1281p887n759K3268n266j0511j0743j6261
1589A1366K5218R684j126K6649j422l1453m0317O73J9347o620M772k0390L3486
1576B9867L4091j3397P681k3748j7530Q459q553k238J1304j3332N3370J2391j9615
$$ plain form
1563 58750 31330 26191 30784 16270 -2173 17062 13235 -7275 21743 20705 41849 65194 42599
1550 42599 45696 40729 47269 16509 -247 24464 28331 53535 48378 65727 82819 40570 39388
1537 39388 9606 -5970 -4406 19942 71363 61561 27711 10601 57700 58195 60872 50409 42241
1524 42241 22413 24990 42951 44555 52458 62817 54145 37801 15151 11106 5871 6326 34327
1511 34327 31022 32364 51625 39003 71947 36050 -10315 -32821 -22104 -1014 -10078 5639
1499 5639 18727 16409 26690 15883 24775 59588 60736 48067 36684 54356 57999 37312 32914
1486 32914 21772 10116 13110 23885 18062 37009 56981 21661 25714 74850 84088 32953 65353
1473 65353 95581 48286 28672 36631 21924 45552 8075 27543 18943 31595 51471 26713
$$ packed form
1563E8750k7420n139M593j4514j8443J9235l827k0510K9018j038K1144K3345k2595
1550D2599L097m967O540l0760j6756K4711L867K5204n157J7349J7092m2249j182
1537C9388k9782j5576J564K4348N1421r802l3850j7110M7099M95K677j0463q168
1524D2241j9828K577J7961J604P903J0359q672j6344k2650m045n235M55K8001
1511C4327l305J342J9261j2622L2944l5897m6365k2506J0717K1090r064J5717
1499E639J3088k318J0281j0807Q892L4813J148j2669j1383J7672L643k0687m398
1486C2914j1142j1656K994J0775n823J8947J9972l5320M053M9136R238n1135L2400
1473F5353L0228m7295j9614P959j4707K3628l7477J9468q600J2652J9876k4758
$$ plain form
1461 26713 31307 56311 19137 14895 22269 5050 -18820 -18203 24536 24102 19829 26987 25638 59338
1447 59338 41949 799 16777 23091 19668 8264 25295 -4265 15476 13919 25210 25312 32068
1434 32068 41918 24638 20627 40849 31176 23878 70550 34629 -505 44010 31487 54141 31060
1421 31060 15952 20930 15582 33363 33714 43614 36791 28309 31678 48847 56478 35017 39114 25854
1407 25854 -5899 -7640 -12195 -11601 7071 28474 27208 29247 23226 54815 70602 59376 20101
1394 20101 12185 60648 15902 9262 38553 16963 9357 30552 33022 7588 9502 23663 31284
1381 31284 16467 15175 27669 36619 32986 3042 -27626 -146 -4710 29965 19460 -3204 -21789
1368 -21789 10147 39617 15542 -3363 14698 14209 -4052 5377 -22795 -11632 -11281 -22614 -25815
$$ packed form
1461B6713M594K5004l7174m242P374j7219k3870O17M2739m34m273P158j349L3700
1447E9338j7389m1150J5978O314l423j1404J7031k9560J9741j557J1291J02O756
1434C2068R850j7280m011K0222r673p298M6672l5921l5134M4515j2523K2654k3081
1421C1060j5108M978n348J7781L51R900o823q482L369J7169P631k1461M097j3260
1407B5854l1753j741m555N94J8672K1403j266K039o021L1589J5787j1226l9275
1394B0101p916M8463m4746o640K9291k1590p606K1195K470k5434J914J4161P621
1381C1284j4817j292J2494Q950l633k9944l0668K7480m564L4675j0505k2664j8585
1368b1789L1936K9470k4075j8905J8061m89j8261R429k8172J1163L51j1333l201
$$ plain form
1355 -25815 -12468 -19221 6709 11524 16990 -29811 -34425 -24290 -29867 -26379 -17973 -5911 27043
1342 27043 19190 -14934 34038 7498 4917 3414 29703 20314 20035 14022 -4195 -9987 -15622 5611
1328 5611 25490 44316 45821 11699 -18252 240 16774 24989 23015 42106 34304 29417 3370
1315 3370 12375 5163 584 23560 23795 19028 -19750 -18374 21708 7910 -31561 -26531 18401 14691
1301 14691 -9459 -11600 6842 48142 42607 33050 8881 1894 -11789 5574 -6273 -12670 2820
1288 2820 -7374 -20827 16812 44110 48455 21081 2109 2751 6646 3349 -3077 5409 -15392
1275 -15392 8955 15708 24609 8370 15083 19792 -2591 -1813 -11802 12728 57606 43193 9351
1262 9351 -17814 4326 523 -9593 -3394 -9381 -3804 -1555 8650 31330 18466 18587 1150
$$ packed form
1355b5815J3347o753K5930M815N466m6801m614J0135n577L488Q406J2062L2954
1342B7043p853l4124M8972k6540k581j503K6289r389k79o013j8217n792n635K1233
1328E611J9879J8826J505l4122k9951J8492J6534Q215j974J9091p802m887k6047
1315C370R005p212m579K2976K35m767l8778J376M0082j3798l9471N030M4932l710
1301A4691k4150k141J8442M1300n535r557k4169o987j3683J7363j1847o397J5490
1288B820j0194j3453L7639K7298M345k7374j8972O42L895l297o426Q486k0801
1275a5392K4347O753Q901j6239O713M709k2383P78r989K4530M4878j4413l3842
1262I351k7165K2140l803j0116O199n987N577K249J0205K2680j2864J21j7437
$$ plain form
1249 1150 18898 26910 12546 6541 3607 37105 28064 -17353 -18936 -30898 9443 31118 -514
1236 -514 -13032 -7897 41097 26189 7362 15958 -3618 10168 29538 14605 -24999 -37419 -7813
1223 -7813 -9279 25446 31578 -14390 -20980 655 16051 -9437 4789 13033 626 13373 22048
1210 22048 24544 43165 15057 6849 9159 -8382 5884 -18707 25101 5248 6190 62724 54209
1197 54209 4923 13688 2762 19148 26042 3408 -15169 7558 4044 -21631 -22832 -13558 14927
1184 14927 12333 -17130 -22193 -1372 -24739 -21290 -31103 -12141 -19142 -11797 816 5191 -651
1171 -651 -10195 -1676 37039 38207 25897 23135 12788 25624 -26605 -39548 -15475 -28378 -11972
1158 -11972 16395 -1005 -7651 -44158 -40726 -23523 -16279 -10066 -35088 -20329 -5894 -15388 -15769
$$ packed form
1249A150J7748Q012j4364o005k934L3498r041m5417j583j1962M0341K1675l1632
1236e14j2518N135M8994j4908j8827Q596j9576J3786J9370j4933l9604j2420K9606
1223g813j466L4725O132m5968o590K1635J5396k5488J4226Q244j2407J2747Q675
1210B2048K496J8621k8108q208K310j7541J4266k4591M3808j9853R42N6534q515
1197E4209m9286Q765j0926J6386O894k2634j8577K2727l514k5675j201R274K8485
1184A4927k594k9463n063K0821k3367L449r813J8962p001P345J2613M375n842
1171f51r544Q519L8715J168j2310k762j0347J2836n2229j2943K4073j2903J6406
1158a1972K8367j7400o646l6507L432J7203P244O213k5022J4759J4435r494l81
$$ plain form
1145 -15769 -33807 -10366 11086 -31229 -3861 9168 -34631 -64940 -35116 -41364 -59848 -40420
1133 -40420 -32922 -18035 -36438 -53590 -33709 -15943 -35314 2780 18498 21091 -7363 -11882
1121 -11882 32424 28722 3704 6911 22038 46407 57210 27715 10167 11599 43344 43605 29751
1108 29751 21138 1646 26860 9104 -21705 -8780 -22626 10164 52609 37606 14420 -5645
1096 -5645 -14586 -4357 -21445 -18037 -8687 -13634 -8297 -10126 -44319 -23204 1980 -4326 -5231 -8294
1082 -8294 -21942 24801 -4801 -6809 -4444 15364 -17097 -1447 1972 -13886 26010 -2833 -10303
1069 -10303 -10654 -25114 -34533 -7400 9307 4375 -18944 -8376 -20876 -32390 -20194 -1668 -21609
1056 -21609 -20484 11119 21581 10192 -15748 -50424 -25887 10846 8023 -9438 -30436 4191
$$ packed form
1145a5769j8038K3441K1452m2315K7368J3029m3799l0309K9824o248j8484J9428
1133d0420P498J4887j8403j7152J9881J7766j9371L8094J5718K593k8454m519
1121a1882M4306l702k5018L207J5127K4369J0803k9495j7548J432L1745K61j3854
1108B9751q613j9492K5214j7756l0809J2925j3846L2790M2445j5003k3186k0065
1096e645q941J0229j7088L408R350m947N337j829l4193K1115K5184o306r05l063
1082h294j3648M6743k9602k008K365J9808l2461J5650L419j5858L9896k8843p470
1069a0303l51j4460r419K7133J6707m932k3319J0568j2500j1514J2196J8526j9941
1056b1609J125L1603J0462j1389k5940l4676K4537L6733k823j7461k0998L4627
$$ plain form
1044 4191 8998 -39785 -5036 -21988 20787 13666 -2260 -15314 6941 29625 4830 10148 2108
1031 2108 -1142 6900 29430 20158 11544 11686 28781 12050 14299 27495 -11019 -3423 3237 -12139
1017 -12139 6125 -6461 -4179 -1453 -7201 -29963 11806 50375 27296 -1630 -40730 -18465
1005 -18465 -17216 -2175 -11065 -10855 42227 59855 12100 -19390 -859 1676 -25784 -34236 -15378
992 -15378 2696 -4230 2278 -20156 -40895 -14367 -24515 13721 -8369 -801 9003 24246 17523
979 17523 -1077 19091 3091 -30518 -34250 -16896 -6132 -55204 -74944 -40807 -57668 -58013 -24795
966 -24795 -41058 -42386 -20400 -30181 -40227 -20854 -14189 -35567 -3554 3657 -8075 1464 -11520
953 -11520 5126 -4290 -3953 -27924 -39419 -16681 25803 7260 -10362 -12399 -31852 -15473 -4437
$$ packed form
1044D191M807m8783L4749j6952M2775p121j5926j3054K2255K2684k4795N318q040
1031B108l250Q042K2530r272q614J42J7095j6731K249J3196l8514P596O660j5376
1017a2139J8264j2586K282K726n748k2762M1769L8569k3079k8926l9100K2265
1005a8465J249J5041q890K10N3082J7628m7755l1490J8531K535k7460q452J8858
992a5378J8074o926O508k2434k0739K6528j0148L8236k2090P568R804J5243o723
979A7523j8600K0168j6000l3609l732J7354J0764m9072j9740L4137j6861l45L3218
966b4795j6263j328K1986r781j0046J9373O665k1378L2013P211j1732R539j2984
953a1520J6646r416L37k3971j1495K2738M2484j8543j7622k037j9453J6379J1036
$$ plain form
940 -4437 9418 -12198 -24675 -35221 -41439 -4093 18307 -15409 15921 24806 6545 -12213 -26175
927 -26175 -15899 -24203 -39154 -8730 -27198 -26561 -11558 -1600 -41924 -67654 -72016 -59006 -42609
914 -42609 -27920 15459 38140 12410 -16228 -37674 -19557 -6365 -13648 -9164 -17351 -4623 13060
901 13060 25427 -20861 -7152 11364 5810 -17673 -19110 -6722 -5919 -29853 7970 26976 10102
888 10102 -11549 -20468 -15912 -15492 -37974 -19796 -1104 -30238 -5833 -34590 -48269 -25487 4085
875 4085 -13691 -17487 -5983 -26679 -50636 -52365 -13599 -24292 -18104 11758 3475 -4766 369
862 369 16345 10493 -9397 -10064 17325 -28628 -51136 -72358 -39873 -8486 -20148 -16445 -8117
849 -8117 -6989 -34453 -58837 -49068 276 -10511 -10821 18747 9411 -7837 -28643 -11660 -35624
$$ packed form
940d437J3855k1616j2477j0546o218L7346K2400l3716L1330Q885j8261j8758j3962
927b6175J0276q304j4951L0424j8468O37J5003R958m0324k5730m362J3010J6397
914d2609J4689M3379K2681k5730k8638k1446J8117J3192p283M484q187J2728J7683
901A3060J2367m6288J3709J8516n554k3483j437J2388Q03k3934L7823J9006j6874
888A0102k1651q919M556M20k2482J8178J8692k9134K4405k8757j3679K2782K9572
875D085j7776l796J1504k0696k3957j729L8766j0693O188K9862q283q241N135
862C69J5976n852j9890o67K7389m5953k2508k1222L2485L1387j1662L703Q328
849h117J128k7464k4384R769M9344j0787l10K9568r336j7248k0806J6983k3964
$$ plain form
836 -35624 -47458 -4209 -14982 -32057 -37461 -23640 -27553 -25283 -5182 2284 3095 14392 6423
823 6423 13183 -9707 4982 33279 12977 -11665 -11807 6506 -12336 -31324 -38246 -64451 -38295
810 -38295 -4273 -35875 -23932 -34418 -25986 14214 -11916 -30811 -38002 -45254 -26744 -14363 -31721
797 -31721 -21833 -29700 -13022 30485 -10997 -31267 -36641 -48747 -42346 -46628 -35564 -41808 669
784 669 10358 -10634 -32658 -44877 -42192 -69603 -27150 3242 -12414 -16596 -30390 12561 6039
771 6039 -28598 -5094 -22754 -33187 -20290 -24383 -71498 -48284 -2875 998 2483 -6983 -7791
758 -7791 -9198 3802 -29658 -31220 -6864 19083 17912 -21960 -49872 -32249 -28176 -3173 -18459
745 -18459 -23154 -4921 3308 -14964 -15246 -6110 -45349 -41324 -41639 -45154 -50470 -47042 -26692 -12348
$$ packed form
836c5624j1834M3249j0773j7075n404J3821l913K270K0101P466Q11J1297p969
823F423O760k2890J4689K8297k0302k4642j42J8313j8842j8988o922k6205K6156
810c8295L4022l1602J1943j0486Q432M0200k6130j8895p191p252J8510J2381j7358
797c1721R888p867J6678M3507m1482k0270n374j2106O401m282J1064o244M2477
784F69R689k0992k2024j2219K685k7411M2453L0392j5656m182j3794M2951o522
771F039l4637K3504j7660j0433J2897m093m7115K3214M5409L873J485r466q08
758g791j407J3000l3460j562K4356K5947j171l9872k7912J7623M073K5003j5286
745a8459m695J8233Q229j8272k82R136l9239M025l15l515n316L428K0350J4344
$$ plain form
731 -12348 -13101 6808 -7159 -5313 -13336 -5959 -6374 -49664 -20856 794 -28856 -18119 -5359
718 -5359 158 -17743 5866 -9014 -12997 -30297 -2226 20465 -13697 -7141 4039 -20071 -10610
705 -10610 10186 1747 5494 21052 63765 51726 37901 9642 17268 11729 -10878 3288 10466
692 10466 28175 4598 -10020 -11872 -4696 -29310 -17083 31984 27172 31767 21593 36626 8703
679 8703 -15347 -16856 -23036 -14980 15244 32496 16511 -5185 -21038 -39696 -14067 -5408 -57012
666 -57012 -21420 -24067 -44367 -58855 -71683 -58411 -48807 -14543 -20962 -24916 -26497 9171 22145
653 22145 14931 12463 -17964 -28218 -28194 -6475 -6593 -17598 -62014 -34264 -47714 -60692 -39067
640 -39067 -25102 1066 -14912 -9025 -415 -1118 -15819 -7789 -9571 -20356 -17559 -14506 -9186 -37408
$$ packed form
731a2348p53J9909j3967J846q023P377m15m3290K8808K1650k9650J0737J2760
718e359N517j7901K3609j4880l983j7300K8071K2691l4162O556J1180k4110R461
705a0610K0796q439L747J5558M2713j2039j3825k8259P626n539k2607J4166P178
692A0466J7709k3577j4618j852P176k4614J2227M9067m812M595j0174J5033k7923
679H703k4050j509o180Q056L0224J7252j5985k1696j5853j8658K5629Q659n1604
666e7012L5592k647k0300j4488j2828J3272R604L4264o419l954j581L5668J2974
653B2145p214k468l0427j0254K4K1719j18j1005m4416K7750j3450j2978K1625
640c9067J3965K6168j5978N887Q610p03j4701Q030j782j0785K797L053N320k8222
$$ plain form
626 -37408 -53903 -37529 -21273 -7155 -16337 -708 -18577 -59269 -35304 -2578 -18365 -25281
614 -25281 -2668 -21113 -29024 -46433 -19200 -8288 -17122 -6630 -21723 -40075 -48798 -29383 -43340
601 -43340 -44353 -33065 -9261 1738 30025 2314 -10918 -6852 -12437 -10450 -5414 -30573 -16640
588 -16640 -10746 -16416 1438 -6870 4040 -12150 -9160 5552 -38241 -33924 -7467 5350 -7067
575 -7067 -42409 -5539 -3355 -16439 7119 -22585 -35725 -8371 2742 -2221 44755 41135 5324
562 5324 -5862 -12422 -10574 9141 20522 -5400 -50135 -16917 20015 5222 -16434 -31643 -33458
549 -33458 -8622 45991 -3981 21280 751 -14567 16076 1669 -11970 -11707 3608 29283
537 29283 13259 -17552 -789 20390 -7372 -19490 793 3245 -2095 -21182 6571 -29578
$$ packed form
626c7408j6495J6374J6256J4118r182J5629j7869m0692K3965L2726j5787o916
614b5281K2613j8445p911j7409K7233J0912q834J0492j5093j8352q723J9415j3957
601d3340j013J1288K3804J0999K8287k7711j3232M066n585J987N036k5159J3933
588a6640N894n670J7854q308J0910j6190K990J4712m3793M317K6457J2817j2417
575g067l5342L6870K184j3084K3558k9704j3140K7354J1113m963M6976l620l5811
562E324j1186o560J848J9715J1381k5922m4735L3218L6932j4793k1656j5209j815
549c3458K4836N4613m9972K5261k0529j5318L0643j4407j3639K63J5315K5675
537B9283j6024l0811J6763K1179k7762j2118K0283K452n340j9087K7753l6149
$$ plain form
525 -29578 -4718 27227 -10175 -30892 -35577 -18457 -42947 -45080 -32728 -36978 -57722 -36127 -15476
512 -15476 -11570 -6163 7219 13430 -4612 -5148 -10316 -33234 6402 23114 -3905 -43933 -52731
499 -52731 -18199 -8457 14855 31283 -6287 -4892 -27771 -21098 -3958 -630 30813 19085 -2197
486 -2197 -38255 -54288 -42917 -24074 -7599 -6784 1226 5774 11868 -1555 -19211 -18635 3913 -9169
472 -9169 -35340 15032 17446 -30469 -38922 -14824 -39996 -39035 -27367 -19508 -20949 -24541 -24298 -2429
458 -2429 9517 -3174 16566 -6420 21522 42229 3808 -23817 -10631 -16371 -3993 23978
446 23978 30554 905 -16379 13456 9313 3976 7280 -13935 -14782 -30438 -25885 -10112 -13030 -422
432 -422 -16368 -1199 -27038 -27733 -1260 12332 -24985 -19558 -18038 -18034 33628 12111 -13823 -22996
$$ packed form
525b9578K4860L1945l7402k0717m685J7120k4490k133J2352m250k0744K1595K0651
512a5476L906N407J3382O211j8042n36n168k2918L9636J6712k7019m0028q798
499e2731L4532R742K3312J6428l7570J395k2879O673J7140L328L1443j1728k1282
486b197l6058j6033J1371J8843J6475Q15Q010M548O094j3423j7656N76K2548j3082
472i169k6171N0372K414m7915q453K4098k5172R61J1668P859j441l592K43K1869
458b429J1946j2691J9740k2986K7942K0707l8421k7625J3186n740J2378K7971
446B3978O576k9649j7284K9835m143n337L304k1215q47j5656M553J5773k918J2608
432d22j5946J5169k5839o95K6473J3592l7317N427J520MN1662k1517k5934r173
$$ plain form
418 -22996 -54418 -71320 -82425 -49077 -14345 -4492 -7015 -11 27247 11966 -5325 -7321 -4436
405 -4436 38786 -1556 -31641 -14989 -4284 17136 -12133 -5181 -11001 -22330 -41411 -47977 -40972
392 -40972 -10802 -11045 -54998 -24875 -18007 5205 14276 -9378 -980 7369 27101 9690 9503 -9994
378 -9994 -10315 -18103 9039 8930 -12583 21964 -16948 -2889 -22647 -34654 -17101 3921 -10309
365 -10309 -22549 1740 -7167 -12121 4502 13235 9276 -16829 -3527 49396 32751 15306 8866
352 8866 -5481 -20755 -5936 -25871 -4496 25829 -23106 -8168 -1188 -19082 -8165 -12765 -14269
339 -14269 -13036 -18994 4193 -1792 931 -14893 -32103 -36768 -7324 22318 44173 19773 -6744
326 -6744 -22115 -25246 8753 1537 -4749 -9706 1019 24033 18330 -9287 -2718 -18580 -16902 -23662
$$ packed form
418b2996l1422j6902j1105L3348L4732R853k523P004K7258j5281j7291j996K885
405d436M3222m0342l0085J6652J0705K1420k9269O952n820j1329j9081o566P005
392d0972L0170k43m3953L0123O868K3212R071k3654Q398Q349J9732j7411j87j9497
378i994l21p788K7142j09k1513L4547l8912J4059j9758j2007J7553K1022j4230
365a0309j2240K4289q907m954J6623Q733l959k6105J3302N2923j6645j7445o440
352H866j4347j5274J4819j9935K1375L0325m8935J4938O980j7894J0917m600j504
339a4269J233n958K3187n985K723j5824j7210m665K9444K9642K1855k4400k6517
326f744j5371l131L3999p216o286m957J0725K3014n703k7617O569j5862J678o760
$$ plain form
312 -23662 -2522 -12113 4791 6226 18456 7504 -7765 -35194 -19177 3529 5408 11127 -25840
299 -25840 -62243 -56327 -10868 -10547 5359 -3652 3692 -3067 -31917 -9952 -5118 -13178 -15268 -39396
285 -39396 -56250 -68132 -56348 -26100 -4940 27843 15999 15387 44431 3496 14390 12908 -35062
272 -35062 -18949 10748 26339 7928 18231 185 -7829 5019 8564 -10857 -18385 -28120 -18810
259 -18810 4401 11850 16802 10859 11760 -14714 -8156 -6622 -23701 -5773 11942 -21715 -18442 -11070
245 -11070 -4645 1570 25307 16124 8317 -12594 -39749 -10819 -2718 -11008 -14312 -22817 -8517 -5001
231 -5001 -10029 -12003 -10703 24289 13301 -4350 19421 15642 41991 14244 -34637 16328 -6832
218 -6832 -21083 2965 11379 24167 24797 7428 -18597 -27653 -35369 -7839 32550 25918 2186
$$ packed form
312b3662K1140r591J6904J435J2230j0952j5269k7429J6017K2706J879N719l6967
299b5840l6403N916M5459L21J5906r011P344o759k8850K1965M834q060k090k4128
285c9396j6854j1882J1784L0248K1160L2783j1844o12K9044m0935J0894j482m7970
272c5062J6113K9697J5591j8411J0303j8046q014J2848L545j9421p528r735R310
259a8810K3211P449M952n943R01k6474O558J534j7079J7928J7715l3657L273P372
245a1070O425O215K3737r183p807k0911k7155K8930Q101q290l304q505J4300L516
231e001n028j974J300L4992j0988j7651K3771l779K6349k7747m8881N0965k3160
218f832j4251K4048Q414J2788O30j7369k6025r056p716K7530M0389o632k3732
$$ plain form
205 2186 12028 -17392 -25911 2002 -775 -9418 -884 -11638 -9579 5962 32159 40240 19769 -15865
191 -15865 82 -8885 -3230 13447 32312 -805 -30978 31519 37109 32256 39707 21854 15963
178 15963 -587 -30136 -36651 -40684 -59106 -41308 -18230 -8242 -3982 -5030 -38 -1241 21691
165 21691 6452 -20695 -13723 -13915 -13336 1570 -13793 -10629 -17360 -33680 -29845 -17796 -28972 -18628
151 -18628 6994 -2721 -15730 -12616 -2260 35508 39553 -2891 9362 24821 16683 -2383 1891
138 1891 16968 -5138 -4080 1696 16379 23566 8862 -11239 -21091 -12286 2182 13847 15945
125 15945 9791 -10512 -18369 -17468 -20737 8556 -6076 9689 -12374 -18080 15374 3168 -18212
112 -18212 8091 5790 5980 2627 4131 -7557 -9600 7358 -15514 -3794 -19336 -24913 16043
$$ packed form
205B186R842k9420q519K7913k777q643Q534j0754K059J5541K6197Q081k0471l5634
191a5865J5947q967N655J6677J8865l3117l0173O2497N590m853P451j7853n891
178A5963j6550k9549o515m033j8422J7798K3078R988M260j048M992j203K2932
165B1691j5239k7147O972j92N79J4906j5363L164o731j6320L835J2049j1176J0344
151a8628K5622r715j3009L114J0356L7768M045m2444J2253J5459q138j9066M274
138A891J5077k2106J058N776J4683P187j4704k0101r852Q805J4468J1665K098
125A5945o154k0303p857R01l269K9293j4632J5765k2063n706L3454j2206k1380
112a8212K6303k301J90l353J504j1688k043J6958k2872J1720j5542n577M0956
$$ plain form
99 16043 19128 -5090 -20360 -39823 -29641 -41650 -27074 7584 4766 328 31492 28447 14636
86 14636 -4572 5109 21117 5357 12336 31795 21059 15421 43755 26536 15429 14988 -15460
73 -15460 -8351 2069 22365 25318 10051 2039 -11622 19947 6970 -8403 -4 -2657 6361
60 6361 9678 16161 13143 -14232 -20584 97 2332 9900 14664 -14976 -29398 -26728 -21842 -23467
46 -23467 -25713 -20974 999 14598 18288 16547 12813 3509 7252 21862 7691 8748 16114 -2848
32 -2848 -7726 7376 26612 20663 5937 3302 -17868 -2430 -1964 6104 -746 1366 -13233 9624
18 9624 10291 -13879 -23597 -21127 1632 17561 -1551 7581 -8189 -3686 8535 -16153 -8394 30593
4 30593 29204 8551 16082 -4925
$$ packed form
99A6043L085k4218j5270j9463J0182j2009J4576L4658k818m438L1164l045j3811
86A4636j9208R681J6008j5760O979J9459j0736n638K8334j7219j1107m41l0448
73a5460P109J0420K0296K953j5267q012j3661L1569j2977j5373Q399k653R018
60F361L317O483l018k7375o352K0681K235P568M764k9640j4422K670M886j625
46b3467k246M739K1973J3599L690j741l734r304L743J4610j4171J057P366j8962
32b848m878J5102J9236n949j4726k635k1170J5438M66Q068o850K112j4599K2857
18I624O67k4170r718K470K2759J5929j9112R132j5770M503J2221k4688P759L8987
4C0593j389k0653P531k1007
$$ plain form
0 -4925
$$ packed form
0d925
$$ Imaginary data points
##PAGE= N=2
##DATA TABLE= (X++(I..I)), XYDATA
$$ plain form
16383 -1310894 -1279175 -1296991 -1283045 -1256255 -1231077 -1204382 -1198245 -1191245 -1182588 -1153391 -1125406 -1112650
16371 -1112650 -1098712 -1092802 -1096951 -1076166 -1065822 -1031547 -1011401 -988955 -973520 -959614 -944957 -928124
16359 -928124 -914381 -919646 -890524 -868317 -853509 -843016 -833183 -797255 -768383 -759916 -753160 -750831
16347 -750831 -735417 -720030 -691835 -683248 -664253 -628262 -625160 -624882 -608681 -594567 -598317 -578726
16335 -578726 -550265 -525154 -526082 -504101 -476750 -447490 -445776 -427220 -411216 -398449 -388303 -415010
16323 -415010 -405093 -375097 -325572 -315483 -313383 -292978 -279722 -260872 -222159 -206642 -229054 -227955
16311 -227955 -222473 -226454 -192356 -155315 -139595 -143473 -114595 -93424 -59879 -68529 -62874 -49126
16299 -49126 -42346 -8184 -20681 -13204 258 -4669 25756 57094 97672 101752 92342 101251 110253
$$ packed form
16383a310894L1719j7816J3946K6790K5178K6695O137P000Q657K9197K7985J2756
16371a112650J3938N910m149K0785J0344L4275K0146K2446J5435J3906J4657J6833
16359i28124J3743n265K9122K2207J4808J0493R833L5928K8872Q467O756K329
16347g50831J5414J5387K8195Q587J8995L5991L102K78J6201J4114l750J9591
16335e78726K8461K5111r28K1981K7351K9260J714J8556J6004J2767J0146k6707
16323d15010R917K9996M9525J0089K100K0405J3256J8850L8713J5517k2412J099
16311b27955N482l981L4098L7041J5720l878K8878K1171L3545q650N655J3748
16299d9126O780L4162j2497P477J3462m927L0425L1338M0578M080r410Q909R002
$$ plain form
16286 110253 127571 124566 135803 160297 179285 185402 222449 244199 248469 266434 237723 257139
16274 257139 264755 280467 311904 327619 328348 347256 358998 349623 358942 387427 399954 403299 387462
16261 387462 367146 393817 392113 403808 434508 453521 437852 466476 457712 443786 451874 485840
16249 485840 533130 545086 542198 554512 560419 593384 609947 574030 584646 596465 583083 619144
16237 619144 623637 621344 638725 674514 654721 661230 680061 668136 661065 685889 695198 734581
16225 734581 690170 717936 752299 740577 740487 738809 780397 785089 741673 766311 782343 800000
16213 800000 781557 792079 812454 801738 827063 838651 845853 843985 867410 857142 859136 870793
16201 870793 911346 896963 895648 908341 902448 876442 877537 864088 860436 890198 902713 923269
$$ packed form
16286A10253J7318l005J1237K4494J8988O117L7047K1750M270J7965k8711J9416
16274B57139P616J5712L1437J5715P29J8908J1742r375R319K8485J2527L345j5837
16261C87462k0316K6671j704J1695L0700J9013j5669K8624q764j3926Q088L3966
16249D85840M7290J1956k888J2314N907L2965J6563l5917J0616J1819j3382L6061
16237F19144M493k293J7381L5789j9793O509J8831j1925p071K4824R309L9383
16225G34581m4411K7766L4363j1722r0j678M1588M692m3416K4638J6032J7657
16213H00000j8443J0522K0375j0716K5325J1588P202j868K3425j0268J994J1657
16201H70793M0553j4383j315J2693n893k6006J095j3449l652K9762J2515K0556
$$ plain form
16189 923269 954337 934565 956505 952754 975099 992969 992467 999318 1027180 998381 1003017 1040663
16177 1040663 998097 1014448 1027685 1008725 1017431 988139 998140 998757 1027665 1037347 1039591 1009709
16165 1009709 991831 993322 1009734 1041765 1052179 1052998 1046052 1072702 1086699 1075644 1124217 1088901
16153 1088901 1086651 1102086 1083501 1096883 1079526 1102059 1125619 1138042 1101386 1080590 1107663
16142 1107663 1113557 1098196 1084127 1109420 1110109 1095525 1099767 1107615 1102141 1084060 1099025 1134996
16130 1134996 1151084 1135852 1165061 1131250 1138726 1160027 1191015 1190105 1182254 1157496 1119352 1143951
16118 1143951 1145979 1152471 1179501 1198731 1177740 1172017 1211193 1192246 1181428 1185938 1184326 1182801
16106 1182801 1181317 1172920 1154984 1167719 1197271 1188824 1172692 1154127 1177846 1184667 1176990 1194922
$$ packed form
16189I23269L1068j9772K1940l751K2345J7870n02O851K7862k8799M636L7646
16177A040663m2566J6351J3237j8960Q706k9292J0001O17K8908R682K244k9882
16165A009709j7878J491J6412L2031J0414Q19o946K6650J3997j1055M8573l5316
16153A088901k250J5435j8585J3382j7357K2533K3560J2423l6656k0796K7073
16142A107663N894j5361j4069K5293O89j4584M242P848n474j8081J4965L5971
16130A134996J6088j5232K9209l3811P476K1301L0988r10p851k4758l8144K4599
16118A143951K028O492K7030J9230k0991n723L9176j8947j0818M510j612j525
16106A182801j484q397j7936J2735K9552q447j6132j8565K3719O821p677J7932
$$ plain form
16094 1194922 1210258 1202533 1197632 1174993 1174842 1155048 1168177 1177349 1161731 1171963 1195128 1206828
16082 1206828 1191993 1196974 1217879 1190003 1145035 1170625 1216527 1242236 1238897 1212681 1239243 1208099
16070 1208099 1186488 1206824 1191007 1184356 1206118 1227091 1227048 1219803 1205174 1222791 1210305 1219076
16058 1219076 1210785 1208490 1208826 1196397 1217924 1245829 1232667 1210654 1211095 1232110 1241799 1219953 1221097
16045 1221097 1214704 1208064 1235601 1259659 1271362 1261612 1234661 1211343 1248481 1212533 1201400 1234788
16033 1234788 1255169 1239115 1255176 1255796 1219888 1252864 1297512 1294331 1275391 1232849 1242691 1249179
16021 1249179 1248272 1240733 1235101 1233744 1215176 1222836 1245708 1250377 1248519 1238542 1217450 1206508 1225397
16008 1225397 1253504 1247446 1248903 1251494 1278658 1238639 1235634 1241067 1272255 1275233 1252393 1258681 1293474
$$ packed form
16094A194922J5336p725m901k2639j51j9794J3129R172j5618J0232K3165J1700
16082A206828j4835M981K0905k7876m4968K5590M5902K5709l339k6216K6562l1144
16070A208099k1611K0336j5817o651K1762K0973m3p245j4629J7617j2486Q771
16058A219076q291k295L36j2429K1527K7905j3162k2013M41K1015R689k1846J144
16045A221097o393o640K7537K4058J1703r750k6951k3318L7138l5948j1133L3388
16033A234788K0381j6054J6061O20l5908L2976M4648l181j8940m2542R842O488
16021A249179r07p539n632j357j8568P660K2872M669j858r977k1092j0942J8889
16008A225397K8107o058J457K591K7164m0019l005N433L1188K978k2840O288L4793
$$ plain form
15995 1293474 1289128 1259381 1270582 1276171 1233668 1224695 1208104 1207017 1205936 1193827 1197585 1173284
15983 1173284 1177342 1183970 1201340 1246580 1259172 1240558 1253273 1227588 1239506 1245904 1231138 1227674
15971 1227674 1211252 1228442 1243730 1233235 1261644 1239894 1243412 1234184 1253613 1233903 1244411 1249420
15959 1249420 1241344 1265879 1242768 1209769 1224830 1240433 1257030 1286672 1265985 1263215 1246027 1251882
15947 1251882 1248531 1244541 1235633 1196754 1209540 1242896 1273350 1271977 1236475 1249519 1254042 1259026
15935 1259026 1212974 1246370 1278698 1297765 1281720 1281402 1301208 1290998 1259009 1209905 1223146 1292193
15923 1292193 1275496 1255251 1274333 1262163 1269205 1285478 1262012 1262759 1266225 1255499 1268684 1266559
$$ packed form
15995A293474m346k9747J1201N589m2503q973j6591j087j081j2109L758k4301
15983A173284M058O628J7370M5240J2592j8614J2715k5685J1918O398j4766l464
15971A227674j6422J7190J5288j0495K8409k1750L518r228J9429j9710J0508N009
15959A249420q076K4535k3111l2999J5061J5603J6597K9642k0687k770j7188N855
15947A251882l351l990q908l8879J2786L3356L0454j373l5502J3044M523M984
15935A259026m6052L3396L2328J9067j6045l18J9806j0210l1989m9104J3241O9047
15923A292193j6697k0245J9082j2170P042J6273k3466P47L466j0726J3185k125
$$ [...]
##END NTUPLES=NMR SPECTRUM
##END=
