##TITLE=1H_DE-80H_X3
 200.13MHz, d2o
 8 sc
 
 19ns.26.2.2025
##JCAMPDX= 6.0         $$ Bruker NMR JCAMP-DX V2.0
##DATA TYPE= NMR SPECTRUM
##DATA CLASS= NTUPLES
##ORIGIN= UXNMR, Bruker Analytische Messtechnik GmbH
##OWNER= pz
$$ XWIN-NMR		Version 3.5
$$ Thu Jun  5 11:32:33 2025 Russian Standard Time (UT+4h)  Yarkov@DPX200
##.OBSERVE FREQUENCY= 200.1313
##.OBSERVE NUCLEUS= ^1H
##.ACQUISITION MODE= SIMULTANEOUS
##.ACQUISITION SCHEME= undefined
##.AVERAGES= 8
##.DIGITISER RES= 18
##SPECTROMETER/DATA SYSTEM= spect
##.PULSE SEQUENCE= zg30
##.SOLVENT NAME= CDCl3
##.SHIFT REFERENCE= (INTERNAL, CDCl3, 0, 15.5122)
##AUDIT TRAIL= $$ (NUMBER, WHEN, WHO, WHERE, WHAT)
$$ ##TITLE= Audit trail, XWIN-NMR		Version 3.5
$$ ##JCAMPDX= 5.01
$$ ##ORIGIN= Bruker BioSpin GmbH
$$ ##OWNER= Yarkov
$$ C:/Bruker/XWIN-NMR/data/yarkov2/nmr/H-C/1/pdata/1/auditp.txt
$$ ##AUDIT TRAIL=  $$ (NUMBER, WHEN, WHO, WHERE, WHAT)
(   1,<2025-06-05 11:31:36.70 +0400>,<Yarkov>,<DPX200>,
      <created by zg, POWCHK disabled, PULCHK disabled
       configuration hash MD5:
       00 E9 B6 7A A2 85 ED C7 34 08 36 98 17 FE 4E 26
       data hash MD5: 16K
       D8 F7 0C 35 92 A8 DB C6 D6 38 AB 61 EA D0 47 E7>)
(   2,<2025-06-05 11:31:47.46 +0400>,<Yarkov>,<DPX200>,
      <Start of raw data processing
       efp BC_mod = 2 LB = 0.25 FT_mod = 6 PKNL = 1 PHC0 = -1710.501 PHC1 = 9.76656 SI = 16K 
       data hash MD5: 16K
       8A 36 B2 DB 6D CD 3F 21 66 C7 C9 20 2C 9F B4 A0>)
(   3,<2025-06-05 11:31:53.73 +0400>,<Yarkov>,<DPX200>,
      <abs ABSG = 5 
       data hash MD5: 16K
       1F 51 89 33 6B 42 E2 E6 0D 4B 51 11 61 97 96 8B>)
$$ ##END=
$$ 
$$ hash MD5
$$ CC 56 E9 22 43 4D C7 5D 44 5E 90 81 F0 96 DA 12
##$RELAX= 
##$RELAX= 
##$RELAX= 
##$RELAX= 
##$RELAX= 
##$RELAX= 
$$ Bruker specific parameters
$$ --------------------------
##$DU= <C:/Bruker/XWIN-NMR>
##$EXPNO= 1
##$NAME= <H-C>
##$PROCNO= 1
##$TYPE= <nmr>
##$USER= <yarkov2>
##$AMP= (0..31)
100 100 100 100 100 100 100 100 100 100 100 100 100 100 100 100 100 100 
100 100 100 100 100 100 100 100 100 100 100 100 100 100 
##$AQSEQ= 0
##$AQ_mod= 1
##$AUNM= <au_zg>
##$AUTOPOS= <>
##$BF1= 200.13
##$BF2= 200.13
##$BF3= 200.13
##$BF4= 200.13
##$BF5= 200.13
##$BF6= 200.13
##$BF7= 200.13
##$BF8= 200.13
##$BYTORDA= 1
##$CFDGTYP= 0
##$CFRGTYP= 5
##$CHEMSTR= <none>
##$CNST= (0..31)
1 1 145 1 1 1 1 1 1 1 1 1 1 1 1 1 1 1 1 1 1 1 1 1 1 1 1 1 1 1 1 1 
##$CPDPRG= <>
##$CPDPRG1= <>
##$CPDPRG2= <>
##$CPDPRG3= <>
##$CPDPRG4= <mlev>
##$CPDPRG5= <mlev>
##$CPDPRG6= <mlev>
##$CPDPRG7= <mlev>
##$CPDPRG8= <mlev>
##$CPDPRGB= <>
##$CPDPRGT= <>
##$D= (0..31)
0 0.7 0 0 0 0 0 0 0 0 0 0.03 0 0 0 0 0 0 0 0 0 0 0 0 0 0 0 0 0 0 0 0 
##$DATE= 1749108696
##$DBL= (0..7)
120 120 120 120 120 120 120 120 
##$DBP= (0..7)
150 150 150 150 150 150 150 150 
##$DBP07= 0
##$DBPNAM0= <>
##$DBPNAM1= <>
##$DBPNAM2= <>
##$DBPNAM3= <>
##$DBPNAM4= <>
##$DBPNAM5= <>
##$DBPNAM6= <>
##$DBPNAM7= <>
##$DBPOAL= (0..7)
0.5 0.5 0.5 0.5 0.5 0.5 0.5 0.5 
##$DBPOFFS= (0..7)
0 0 0 0 0 0 0 0 
##$DE= 6
$$ [...]
##$SUBNAM3= <"">
##$SUBNAM4= <"">
##$SUBNAM5= <"">
##$SUBNAM6= <"">
##$SUBNAM7= <"">
##$SUBNAM8= <"">
##$SUBNAM9= <"">
##$SW= 18.0517328524113
##$SWIBOX= (0..15)
0 0 2 0 0 0 0 0 0 0 0 0 0 0 0 0 
##$SW_h= 3612.71676300578
##$TD= 16384
##$TD0= 1
##$TE= 0
##$TE2= 300
##$TE3= 300
##$TEG= 300
##$TL= (0..7)
0 120 120 120 120 120 120 120 
##$TP= (0..7)
150 150 150 150 150 150 150 150 
##$TP07= 0
##$TPNAME0= <>
##$TPNAME1= <>
##$TPNAME2= <>
##$TPNAME3= <>
##$TPNAME4= <>
##$TPNAME5= <>
##$TPNAME6= <>
##$TPNAME7= <>
##$TPOAL= (0..7)
0.5 0.5 0.5 0.5 0.5 0.5 0.5 0.5 
##$TPOFFS= (0..7)
0 0 0 0 0 0 0 0 
##$TUNHIN= 0
##$TUNHOUT= 0
##$TUNXOUT= 0
##$USERA1= <user>
##$USERA2= <user>
##$USERA3= <user>
##$USERA4= <user>
##$USERA5= <user>
##$V9= 5
##$VALIST= <valist>
##$VCLIST= <CCCCCCCCCCCCCCC>
##$VD= 0
##$VDLIST= <DDDDDDDDDDDDDDD>
##$VPLIST= <PPPPPPPPPPPPPPP>
##$VTLIST= <TTTTTTTTTTTTTTT>
##$WBST= 1024
##$WBSW= 4
##$XGAIN= (0..3)
0 0 0 0 
##$XL= 0
##$YL= 0
##$YMAX_a= 398126
##$YMIN_a= -388702
##$ZGOPTNS= <>
##$ZL1= 120
##$ZL2= 120
##$ZL3= 120
##$ZL4= 120
##$ABSF1= 15.52543
##$ABSF2= -2.52642
##$ABSG= 5
##$ABSL= 3
##$ALPHA= 0
##$AQORDER= 0
##$ASSFAC= 0
##$ASSFACI= 0
##$ASSFACX= 0
##$ASSWID= 0
##$AUNMP= <proc_1d>
##$AZFE= 0.1
##$AZFW= 0.1
##$BCFW= 0
##$BC_mod= 2
##$BYTORDP= 0
##$COROFFS= 0
##$CY= -3
##$DATMOD= 1
##$DC= 0
##$DFILT= <>
##$DTYPP= 0
##$F1P= 0
##$F2P= 0
##$FCOR= 1
##$FTSIZE= 16384
##$FT_mod= 6
##$GAMMA= 0
##$GB= 0
##$INTBC= 1
##$INTSCL= 3.241238e-09
##$ISEN= 128
##$LB= 0.25
##$LEV0= 0
##$LPBIN= 0
##$MAXI= 10000
##$MC2= 0
##$MEAN= 0
##$ME_mod= 0
##$MI= 1.114404
##$NCOEF= 0
##$NC_proc= -6
##$NLEV= 6
##$NOISF1= 3.799351
##$NOISF2= 2.8
##$NSP= 0
##$NTH_PI= 0
##$NZP= 0
##$OFFSET= 15.51221
##$PC= 1
##$PHC0= -1710.501
##$PHC1= 9.76656
##$PH_mod= 1
##$PKNL= yes
##$PPARMOD= 0
##$PSCAL= 0
##$PSIGN= 0
##$REVERSE= no
##$SF= 200.130001900637
##$SI= 16384
##$SIGF1= 3
##$SIGF2= 2
##$SINO= 0.751879
##$SIOLD= 32768
##$SREGLST= <19F.Aceton>
##$SSB= 0
##$STSI= 16384
##$STSR= 0
##$SW_p= 3612.71676300578
##$SYMM= 0
##$S_DEV= 0
##$TDeff= 16384
##$TDoff= 0
##$TI= <>
##$TILT= no
##$TM1= 0
##$TM2= 0
##$TOPLEV= 0
##$USERP1= <user>
##$USERP2= <user>
##$USERP3= <user>
##$USERP4= <user>
##$USERP5= <user>
##$WDW= 1
##$XDIM= 16384
##$YMAX_p= 339482111
##$YMIN_p= -985929
$$ End of Bruker specific parameters
$$ ---------------------------------
##NTUPLES= NMR SPECTRUM
##VAR_NAME=  FREQUENCY,     SPECTRUM/REAL,   SPECTRUM/IMAG
##SYMBOL=    X,             R,               I
##VAR_TYPE=  INDEPENDENT,   DEPENDENT,       DEPENDENT
##VAR_FORM=  AFFN,          ASDF,            ASDF
##VAR_DIM=   16384,         16384,           16384
##UNITS=     HZ,            ARBITRARY UNITS, ARBITRARY UNITS
##FACTOR=    0.220516191357247, 1,           1
##FIRST=     3104.45859522367, 0,            0
##LAST=      -508.258167782114, 0,           0
##MIN=       -508.258167782114, -985929,     0
##MAX=       3104.45859522367, 339482111,    0
$$ Real data points
##PAGE= N=1
##DATA TABLE= (X++(R..R)), XYDATA
$$ [...]
8324 -36886 -27082 -21048 -42871 -19776 44189 -12722 -72730 1760 31107 -26627 -21046 41131
8312 41131 -383 -74740 6256 86321 -7250 23754 -38063 -56024 -62846 -43663 -29179 34339
8300 34339 51744 24449 -3097 14804 -34649 -56832 31048 15785 21270 26610 13868 -14732
8288 -14732 -57534 -27831 37139 4524 19896 -14656 -71538 -22778 29106 28262 -61667 -43309
8276 -43309 71888 -2348 -39228 -57282 29455 67907 35215 -17505 46687 -67117 -58709 -57334
8264 -57334 -77107 -77964 -32913 17851 13545 34446 -9391 403 3359 -90349 -103088 -58419 -40786
8251 -40786 -31641 -1461 61420 69635 43774 2298 -9814 -27332 3521 77341 58177 24516
8239 24516 55372 31705 -4093 -43460 -28906 41260 59344 58983 41818 11252 15114 59127
8227 59127 36415 2101 -39355 -55295 5751 14186 46677 108823 38522 -31162 -13730 -43302
8215 -43302 -49647 -20348 -15351 18289 36580 -24808 -64561 58805 137538 138287 35976 24617
8203 24617 17343 1696 91483 42037 79835 60602 204223 196123 207487 216173 496724 -512012
8191 -512012 -985929 -342852 -305655 -199124 -261258 -164474 -213832 -100581 -109149 -95107 -149922
8180 -149922 -133966 -95976 -98509 -135234 -98658 -70212 -116672 -105620 -91649 -85372 -56011 -34867
8168 -34867 -85993 -159767 -142449 -59123 -2347 -63351 -96669 -98806 -51107 -79993 -21494 -56270
8156 -56270 -107335 -80856 -53054 -45719 -93894 -54638 -85367 -69373 -137700 -100473 -31633 -5888
8144 -5888 -72618 -76797 -80277 -42862 -57618 -62970 -54027 -36894 5690 36239 42369 18039 -35266
8131 -35266 -163353 -171273 -67860 -54811 -47026 -63486 -104553 -69882 15857 18533 11600 -40145
8119 -40145 -49828 -76304 -87211 -82844 -55500 -32032 -94373 -105610 -27994 9568 -59163 -124550
8107 -124550 -122947 -110435 -64546 -15884 -84703 -36873 12598 -21004 -83100 -47277 -40182 -107219
8095 -107219 -42663 13332 23220 12861 3366 -7379 -16933 -24154 -2028 6467 -22082 -99288 -91497
8082 -91497 -75380 -79955 -88163 -45058 -50862 -25622 -50478 -61009 -14349 8050 -672 -10016 -7646
8069 -7646 -34805 -45040 -16868 -61715 -68276 -24359 -33576 7350 1697 14993 -30055 -10383 -10038
8056 -10038 -17084 -63236 -41157 6361 -56455 -63409 -17634 -19237 -60661 -18033 -65793 -108739
8044 -108739 -53492 -20251 -55056 -44332 -13698 -71983 -56206 -35797 -7997 -80943 -56825 -36001
8032 -36001 -4863 -15768 -7830 -56673 -68903 -37169 24149 5004 -72631 -48943 -18133 18814
8020 18814 -1339 -34781 -967 32544 41747 -42344 -37732 -96351 -149973 -58202 13876 -31646
8008 -31646 -83746 -62505 -115772 -153129 -109518 -84647 -40524 -29626 2448 33335 6341 5214
7996 5214 -620 -3996 -60765 -74163 -74753 -54774 -147900 -126544 -47552 -12749 -43301 -74022 -82098
7983 -82098 -32209 -13933 -38233 -82300 -89248 -46005 -47652 -13102 -15756 -66269 -58948 -2228 52943
7970 52943 22019 6926 7264 1322 76665 59146 9683 -30242 -39026 -14116 -33519 -10782 -38486
7957 -38486 -29354 -22728 2667 -12840 -26105 2024 -38533 -35312 16245 -35813 25093 30451 -22674
7944 -22674 31147 43512 -10695 -31614 4516 38955 23137 2781 43076 -12824 -16949 -47274
7932 -47274 -56941 -52548 -67033 -32736 36566 30686 56799 4520 -19200 -6542 52304 -30236
7920 -30236 -72941 -62816 -56348 -4574 -58941 -71082 -39736 442 -20041 -30559 -47236 60895
7908 60895 109672 33029 -28512 -7453 -19161 -67278 -2291 13237 -17982 -32926 -59476 -63681
7896 -63681 -41473 59206 -256 -34442 -3436 18117 85217 17241 -13406 -13790 -49640 -79271
7884 -79271 -40059 -31025 -10833 -86241 -112982 -37523 -31569 -52883 -70479 -8727 -16766 -54969
7872 -54969 -27121 37882 79179 36837 -46924 -46921 -56550 -72998 -17052 18128 11203 51936 8194
7859 8194 36012 -70701 -73946 -21861 -69568 -34661 -79224 -108138 -38462 -38534 -32015 -82050 -102640
7846 -102640 -128686 -68217 -58146 -152258 -90918 -44177 -69523 -62872 -77777 -65764 -64111 -54841
7834 -54841 -87202 -108197 -21504 50987 75087 50585 28972 15169 -39304 2571 52862 25707
7822 25707 -10679 -8480 15361 4500 -46301 9966 43181 16902 47266 3578 11564 37214
7810 37214 28632 -35791 -92671 -50786 52125 39544 27758 35026 -27302 -192317 -146983 -172180
7798 -172180 -105968 -92850 -89742 -168240 -172278 -97570 -47623 -67674 -27052 16238 -18297 34987
7786 34987 6381 -35760 -69262 -104169 -80319 -85401 -103277 -51860 -27828 -73890 -83354 -62948
7774 -62948 -46853 -38359 -62050 -30673 -44124 -60998 -30425 -5018 -40722 -73339 -11355 -24711
7762 -24711 -23564 -29851 -96818 -112422 -94251 -79977 -55998 -7263 -33650 -80346 -62097 -11730
7750 -11730 -14495 2506 7421 -71113 -78560 -36667 3008 -12876 -68910 6903 -106345 -149814
7738 -149814 -33133 -17596 -51550 -114658 -71512 -104620 -83766 -45196 2507 -5319 -72378 -103476
7726 -103476 -57940 -59570 -76106 -49133 8921 -8930 -7400 -30554 -100017 -99635 -41647 -2294
7714 -2294 -67691 -31552 -52040 -66087 -63713 -12094 -5906 -86404 -102258 13872 -30548 -22565
7702 -22565 -53412 -85431 -34186 -25091 -94204 -101814 -41641 2438 -8689 5180 22940 4197
7690 4197 -7656 -89030 -121643 -90567 -102002 16614 42819 -42519 -69589 -89500 -77574 -7486
7678 -7486 -59582 -4878 -64057 -74333 -37353 -22558 1534 -50436 -30385 42983 10653 5915
7666 5915 3458 -33850 -55064 -51068 -19352 -39851 -45894 -47535 -61658 -79789 -32797 -49883 -96593
7653 -96593 -76355 -46971 -18716 -60221 -141193 -203355 -78002 33226 25643 32766 -26584 -53125
7641 -53125 -112381 -110533 -68425 -45306 -38974 -66787 -106068 -99341 -103068 -157192 -113816 -41883 -122501
7628 -122501 -143799 -143252 -94916 -77770 -5308 -81671 -59628 -43596 -6801 -49529 -60591 -69125
7616 -69125 -76453 -107408 -155106 -128421 -58204 -10570 -91041 -136908 -61473 -65499 -80897 -90833
7604 -90833 -71471 -8242 -42722 7173 -36741 -5568 -25781 -48698 -101272 -132566 -64803 -94175
7592 -94175 -21703 39885 26352 -4171 -40505 -29001 -23214 -45046 -39619 -70807 -76500 -38711
7580 -38711 -64946 -82271 -72154 -80889 -40136 -24916 -2065 -28059 8431 10951 -55339 -9616
7568 -9616 47174 64437 23546 -65424 -49511 -47274 -44314 20847 -83271 -91892 -47371 -5943
7556 -5943 22005 -20402 -10027 -109600 -92097 -56097 -30472 42852 -36173 31461 -46661 -75572
7544 -75572 -24919 -29917 -14207 -44257 -48954 -45068 -24555 39421 -49487 -95699 -144155 -163599
7532 -163599 -107290 -59471 -36006 -68937 -24390 -9082 26311 -35403 -56190 20653 6852 8181
7520 8181 -13819 -97693 -111215 -9782 -30851 -104990 -103344 -106029 -154115 -142680 -141662 -142740 -58293
7507 -58293 -23358 -52077 -44553 -71580 -85203 -75386 -94303 -49830 -103178 -80328 -87818 -93478 -94797
7494 -94797 -75394 -61950 -44546 -48944 -69318 -109446 -119225 -83293 -150173 -85815 -11298 -77727
7482 -77727 -99524 -60341 -104740 -104746 -50998 -42390 -19692 7826 -80178 -137183 -96391 -103213 -167994
7469 -167994 -130770 -36478 -32311 -35339 -57887 -24889 -15250 -151056 -123923 -109363 -88813 -17095
7457 -17095 -21473 -47353 26584 4005 -25036 -28042 -27315 -19975 -11923 -73459 -59406 -29353 -15913
7444 -15913 -67724 -55155 -16688 -74924 -48077 3289 35738 35265 17147 -7645 -95327 -197177
7432 -197177 -109546 -47333 -90322 7178 18440 -42343 -45032 -87364 -36580 -11216 74654 43169
7420 43169 -39680 10930 31238 -509 -51785 -108666 -80296 -38018 -42166 -61329 -8307 -57568
7408 -57568 -79360 -35266 -20660 13806 47507 49288 57263 39319 -9678 -88948 -61055 -70361
7396 -70361 -121281 -118823 -54043 -68553 -23975 22585 -5404 -29193 -49955 -105542 -55002 -42040
7384 -42040 -48531 36902 13562 -18226 -13558 -24101 -102415 -145446 -154573 -64696 -37056 -17843
7372 -17843 3989 4143 4451 -40493 -28492 -8504 -94651 -84352 -49207 -56003 -45392 32804 72243
7359 72243 -23029 -58229 -67065 -50340 27831 -12260 -32918 -49948 -52263 1885 -21933 13816
7347 13816 -39251 -71875 -72364 -73865 -71163 -108808 -119282 -99861 -37542 -62770 -126065 -184544 -187185
7334 -187185 -146993 -107412 -98135 -79282 -63675 -47361 -28557 -55453 -7388 -57899 -123827 -62452
7322 -62452 -60161 -74782 -128762 -85923 -72046 -108448 -137707 -78320 -29238 -77138 -74234 -77253
7310 -77253 -35391 -9027 -45105 -108618 -74151 -6140 15392 -17667 -57551 -78554 -105737 -93846
7298 -93846 -40495 -11813 -52786 -10947 28885 -29600 -69405 -51490 37153 67430 15557 15898
7286 15898 -24141 -73513 -101987 -116441 -71018 -42902 -20183 2191 -62069 -126757 -105803 -63997
7274 -63997 -12457 -55646 -85876 -78848 -125146 -151394 -139610 -94782 -83248 -108128 -55526 -17977
7262 -17977 -25134 -78632 -110098 -67722 -52951 -89242 -45029 -76788 -99571 -66653 -27355 -58580
7250 -58580 -20801 -45992 -67466 -98310 -115973 47046 46311 -21228 -46834 -39606 -65363 -58672
7238 -58672 -45210 -82132 -110512 -96833 -72987 -45797 -74962 -125426 -120525 -95041 -36867 14710
7226 14710 -21003 -80551 -86934 -127319 -119038 -24363 -26386 -31858 -27222 -50243 -104068 -79726 -87451
7213 -87451 -92300 -128549 -113708 -154798 -90634 -132892 -117099 -58030 -52325 1265 -32391 -53864
7201 -53864 -55379 11261 21472 -21458 -97281 -128621 -65561 -144190 -135284 -59110 -66902 -63088 -88184
7188 -88184 -106379 -76328 15385 47470 -9100 -6761 14392 -2602 -97895 -138817 -90885 -115215
7176 -115215 -111442 -127043 -122569 -11681 -29538 -73523 -24916 -75194 -96235 -91752 -129084 -131168
7164 -131168 -109199 -29597 -6545 -60217 -8371 -48773 -71177 -76853 -79931 -43258 -33130 -54241
7152 -54241 -85423 -50312 -33312 -72339 -64231 -27415 -23299 -29438 -679 -54022 -81370 -114259
7140 -114259 -24410 -23536 -26161 -64265 -28515 -52882 -22012 42542 37922 16135 -6769 -38089
7128 -38089 -21916 16068 84179 95398 125921 93010 79083 102152 1449 51650 89169 52503
7116 52503 26277 -11316 -45792 -36324 -7678 -18444 -35907 8535 1064 24008 -25964 -37604
7104 -37604 -1423 -71797 -100393 -15430 104 27756 -7438 13885 4382 -69595 -75375 7802
7092 7802 34069 75577 13334 -86120 -33796 -41538 -55179 -12958 13515 17194 8711 -59484 -69689
7079 -69689 -18959 -33444 -55023 -67297 -16846 8760 -11468 -46032 -79972 -105600 -66119 71847
7067 71847 17306 -11567 17804 -5713 8473 -22666 44109 65104 17756 -3511 -70261 -51120
7055 -51120 -60591 -111507 -21125 -59980 -90463 -43774 -53047 -63326 -99919 -70913 -33124 -40413
7043 -40413 -58062 -62765 -46806 -66264 -52511 -10114 5263 37873 -130 -20670 -24344 -28694
7031 -28694 -33645 -39883 -863 -8155 -8045 10131 42250 56164 51384 57676 45918 11246 47368
7018 47368 44958 45305 -16482 -33581 4570 14890 -8537 -67114 -61478 -29567 4104 34532 23480
7005 23480 8211 20186 19494 99375 86632 122313 115834 28321 52515 35174 54163 -62353
6993 -62353 -110656 -68418 -18747 -3700 -30087 -32947 -12728 -36089 -19917 -69687 -75179 -25808
6981 -25808 -46645 -42670 -76297 -83067 -12493 2950 -58546 -15956 -14067 -70692 -117810 -81373
6969 -81373 -24313 -2863 -51517 -7856 21661 -3371 -25359 -49040 -73127 -29384 30215 82895
6957 82895 13806 -44971 -33862 8541 37587 -8574 -10738 -36263 -11329 -60233 -125227 -151019
6945 -151019 -65293 -11533 -45874 -76298 -125095 -75291 -48271 14396 -4684 -77074 -69012 -66583
6933 -66583 -54752 -30500 -67158 -50119 -45648 -57831 -48696 -12448 17370 5924 -56797 -67393
6921 -67393 -30729 16448 -34722 -36128 -83544 8873 39 -12562 16229 13915 27928 6569
6909 6569 -33554 -30804 7725 -10584 -61642 -12476 10189 4610 55197 -22852 -3547 -40502
6897 -40502 50511 98319 20522 15042 -44300 -113532 -63356 16473 69544 -4895 -3589 26930
6885 26930 2479 31490 41551 -5190 1131 12705 -1924 -27896 -28477 -7195 -28114 -17843
6873 -17843 4432 43630 52580 33503 -9630 -31184 10057 34088 40440 1375 15491 96509
6861 96509 107809 43178 86802 73430 85305 50992 89541 85151 88400 26703 42651 67020
6849 67020 51457 77693 66628 99788 98267 122694 189024 202509 116197 148584 194560 207200
6837 207200 210831 153149 135346 203109 130697 133606 148025 229805 309987 341389 371376 337765
6825 337765 313048 389994 429265 469512 511544 534340 611695 641989 719370 717313 752784 786905
6813 786905 810174 810488 828392 873733 855925 849608 854037 802610 819858 901228 965580 970391 1098780
6800 1098780 1121738 1158201 1266923 1280187 1376969 1538384 1700652 1893155 2039651 2245817
6790 2245817 2466411 2540995 2667707 2695682 2682467 2768820 2933869 3052425 3075452 2999937 2844487
6779 2844487 2704270 2554360 2452432 2509784 2508010 2474512 2540363 2634274 2750493 2829362 2925449
6768 2925449 3158504 3447454 3736817 4055518 4422493 4874712 5341488 5728196 5951834 5913190
6758 5913190 5955770 6136272 6389469 6587975 6723197 6556384 6126324 5524776 5011454 4607886
6748 4607886 4312633 4104131 3975378 3873736 3825953 3944173 4092456 4207222 4337464 4493670
6738 4493670 4801593 5163627 5628656 6209199 6731015 7271611 7527772 7676382 7725093 7750793
6728 7750793 7951551 8324702 8563055 8466513 7895518 7122190 6332068 5630730 5106213 4759433
6718 4759433 4494607 4180281 3988852 3853213 3805538 3807230 3832728 4011144 4139175 4283256
6708 4283256 4627935 4992249 5358474 5698005 5954951 6021357 5997202 6021568 6062501 6245952
6698 6245952 6415058 6367421 6042870 5462043 4802369 4195111 3747896 3374895 3024985 2830861
6688 2830861 2647989 2459667 2376285 2311812 2208916 2226798 2231118 2241973 2318662 2388702 2524554
6677 2524554 2643073 2773140 2802680 2710890 2736230 2732481 2744821 2835365 2819688 2770756 2524868
6666 2524868 2185228 1907936 1705154 1505380 1290181 1184798 1112958 1109308 968306 873895
6656 873895 899502 825916 757005 729536 807344 823503 773696 779246 804731 774591 742458 749788
6644 749788 754512 754081 761254 734413 748269 616513 528660 520344 514752 475531 398726 404576 372199
6631 372199 355756 331425 264733 178092 137228 232853 232506 189557 159097 171765 293377 338413
6619 338413 276346 284199 258419 232739 212875 111776 107692 189958 177273 111651 102323 62431
6607 62431 119140 140341 117495 123674 122941 101589 145899 129514 123255 69088 85861 90730 65286
6594 65286 47619 95821 88728 76557 61954 85718 149944 78318 71565 101029 97962 71804
6582 71804 38665 62570 99179 174891 100205 20451 32236 81448 107842 61348 61806 54154
6570 54154 47253 84191 73517 67589 52795 -1234 33452 57698 32172 53157 -8299 9833
6558 9833 20592 -761 32946 21618 40059 -5420 31211 80560 85914 62998 75051 66292
6546 66292 106530 125300 114604 76790 26219 48982 59149 15359 -24038 -35622 12299 76824
6534 76824 79369 83799 124686 91921 106773 145184 110666 70828 145082 166732 126942 123554
6522 123554 43646 142620 203532 149691 176049 160626 182310 151979 170707 175769 181920 109333
6510 109333 93884 111298 130248 149073 175491 130259 90971 108153 136948 136032 93975 16730
6498 16730 30619 115212 146244 129356 132100 118362 123421 97803 96002 119023 131066 124361 111669
6485 111669 95011 121669 169249 171966 176748 210029 197624 169986 178799 168266 151261 102372
6473 102372 130926 134290 136009 144525 125650 118219 173775 143082 144331 162999 213485 168988 198773
6460 198773 186421 150000 111262 205153 259484 246038 212080 208321 239576 302657 313415 268130
6448 268130 276815 219885 245389 222845 211457 273007 293581 329104 313751 324478 330523 256388
6436 256388 269857 318320 359332 381804 297141 308146 369266 392330 419337 429720 418566 407777
6424 407777 425730 376558 315868 260767 284376 349708 305114 226768 222918 257790 272898 224420
6412 224420 214837 274097 289212 234935 206969 165517 210190 213372 170036 173489 198426 222059
6400 222059 198035 213145 259405 223778 172716 157677 162381 180013 194409 283303 231161 147284
6388 147284 140590 127176 70828 119268 155308 162086 139079 155476 129759 106706 86023 48806
6376 48806 60100 40903 62151 108872 126674 86787 45454 85982 108434 86897 87028 52778
6364 52778 52747 56702 54326 69281 65203 -18888 15226 17847 -27620 40470 88830 90014 134013
6351 134013 156371 136920 103113 48892 58335 30354 -22344 5951 -6492 49250 4348 -5239
6339 -5239 18428 -5403 -15039 8877 77379 92637 89287 88436 74363 56150 30652 53866 115079
6326 115079 98514 55455 85656 100584 105008 127306 64369 19832 42699 57237 108103 142512
6314 142512 159650 145970 113493 82995 163659 119997 116618 74493 137198 219808 202330 212762
6302 212762 273319 198194 128506 161437 199430 242778 224207 212126 203522 169183 140255 175270
6290 175270 210216 226737 187769 200833 148775 227192 210162 298579 297999 260821 309866 320724
6278 320724 341577 344344 394115 417754 462760 423541 406538 466499 445117 510256 563718 601911
6266 601911 604295 532870 535098 529637 560513 529139 651896 715679 717711 803509 856532 853639
6254 853639 871361 898915 962692 1037838 1063047 1132666 1179240 1265842 1311921 1462792 1531869
6243 1531869 1673021 1785922 1882308 1949134 2065076 2103845 2149763 2215612 2316000 2420873
6233 2420873 2530945 2684331 2887440 3034435 3192410 3315047 3508670 3814713 4021192 4295820
6223 4295820 4579092 4851576 5022429 5217517 5445488 5702537 6052891 6424655 6757548 7101135
6213 7101135 7503412 7924065 8392497 8864876 9314688 9516978 9578269 9593357 9552644 9489478
6203 9489478 9454396 9455499 9422595 9450742 9584645 9856698 10160492 10471498 10637794 10712094 10657943
6192 10657943 10698344 10781944 11022797 11315632 11586642 11963523 12525282 13076737 13655066 14170295
6182 14170295 14344995 13937211 13094869 11973110 10961289 10109488 9434194 8820094 8235307
6173 8235307 7797599 7512932 7274122 7026367 6771143 6611160 6373840 6226634 6253299 6209530
6163 6209530 6291178 6420940 6620568 6784624 7021209 7242155 7522316 7697354 7759420 7516783
6153 7516783 7019057 6362662 5727930 5255740 4861021 4469419 4269400 4123824 3932902 3811965
6143 3811965 3629290 3555942 3488470 3414691 3388353 3446168 3502347 3520454 3561347 3640400 3753228
6132 3753228 3832682 3895887 4142100 4314728 4439583 4590116 4741098 4974595 5168115 5435679
6122 5435679 5743998 6125203 6589427 7119843 7679083 8169334 8522586 8643632 8680960 8677129
6112 8677129 8650210 8682171 8731046 8795954 8877344 8935007 9122137 9460799 9776943 10195474 10721782
6101 10721782 11390738 12154689 13032537 13982207 14997690 16092672 17060102 17705117 18099259
6092 18099259 18495716 18811832 19007282 19029985 18689290 18031059 17248968 16474045 15953661 15632349
6082 15632349 15396997 15223641 15096569 15060386 15069894 15169844 15255535 15533280 15932179 16479233
6072 16479233 17306349 18320762 19431798 20724087 22064855 23346244 24140852 24017659 22874034
6063 22874034 21055795 19134366 17361246 15685057 14153947 12807747 11696762 10814982
6055 10814982 10048844 9516118 9120840 8783527 8556350 8410349 8326957 8264439 8197162 8195603
6045 8195603 8229798 8295927 8491007 8793637 9211857 9696646 10214961 10794481 11176569 11152121
6035 11152121 10646435 9686393 8537501 7529986 6695424 5989999 5401326 4942257 4490848
6026 4490848 4148708 3818321 3581151 3426677 3249115 3089296 3008203 2958948 2827727 2752166
6016 2752166 2666410 2516824 2426153 2248810 2207954 2176294 2075565 1958163 1866501 1918298 1908798
6005 1908798 1713540 1626598 1615782 1563561 1519320 1548838 1517324 1480893 1432091 1391361 1430063
5994 1430063 1423259 1363387 1358739 1420700 1450271 1375696 1336814 1277882 1222288 1223342 1231542 1217942
5982 1217942 1229810 1256132 1232604 1255379 1261087 1238056 1218999 1204120 1156695 1167537 1154259 1211588
5970 1211588 1276496 1304212 1258155 1287735 1291084 1248322 1303936 1339530 1332695 1357938 1319331 1260397
5958 1260397 1276100 1308276 1267151 1232454 1207237 1173036 1187136 1272625 1256978 1270708 1263610 1294019
5946 1294019 1282010 1282144 1243739 1205844 1205544 1130041 1108687 1124974 1033281 1060564 1074608 1077941
5934 1077941 1097610 1102306 1088563 1095524 1105867 1047336 1028254 912498 862379 885901 837399 784882
5922 784882 772802 812309 822177 759863 680173 686014 721673 624906 653944 670793 628906 647422
5910 647422 630821 556079 555402 540954 586466 620628 649205 674525 591733 522103 518036 564167
5898 564167 517203 466388 461224 370853 412678 473751 468249 436838 420495 396729 361704 313690
5886 313690 283011 305444 284530 244664 279188 324918 303090 238470 231110 246885 378226 327195
5874 327195 295247 290441 322015 368785 300528 297451 283085 324965 333785 296005 227841 291893
5862 291893 258128 200757 241337 263030 275669 282559 271232 278327 282451 289756 184246 168720
5850 168720 223300 262394 244747 193256 254900 217271 169814 148593 223120 282966 257194 234677
5838 234677 259570 271712 278485 286423 251072 172275 225151 207276 212747 188445 95176 56622
5826 56622 147515 210655 157728 153948 146493 137561 164661 104107 74959 45828 136644 232926
5814 232926 228501 214816 167738 112837 73910 93322 69458 81948 114183 175035 137849 180933
5802 180933 217505 132816 88895 108001 99394 103220 40050 58909 76391 49538 44049 44137 -1029
5789 -1029 46631 50730 72923 168895 122832 76131 63912 133359 191953 127611 56874 77391
5777 77391 117750 162934 218231 217692 202695 196336 212571 161794 112265 53210 80335 101858
5765 101858 148248 151483 210143 213408 147516 141397 193146 199544 151448 181672 211713 192388
5753 192388 186709 222529 304507 290845 252001 198302 204634 240211 193473 155884 205217 226109
5741 226109 206374 239253 218959 188610 190364 267908 249176 265512 318367 321513 285370 306794
5729 306794 337500 335822 339159 312992 266115 363932 282988 276122 301614 254482 245464 250408 293541
5716 293541 349148 412226 360666 341196 321715 360806 503375 469215 427270 413288 312867
5705 312867 291471 282278 369124 384373 415866 437522 346285 304905 327753 333150 282114 334574
5693 334574 353792 399874 387800 363827 394215 378956 410758 405854 397592 479213 524301 520558
5681 520558 581136 693602 688983 675615 695650 626724 560661 544401 496315 494012 515929 536356
5669 536356 468701 434393 411081 397509 380236 421482 433687 415669 458033 528261 533427 543953
5657 543953 552876 546386 611279 639940 672107 648882 683834 769802 801431 835579 917117 972733
5645 972733 1005676 960271 868637 909056 912408 913427 820388 789082 792887 772837 815757 844431
5633 844431 881766 952350 958039 995262 1086627 1175857 1225193 1154295 1162766 1169363 1237494 1363022
5621 1363022 1473361 1461852 1533672 1547249 1595382 1629218 1723399 1875951 1895359 1947301 2001378
5610 2001378 2052018 2175878 2203907 2274835 2472196 2615130 2685444 2830919 2947058 3111353
5600 3111353 3231093 3290406 3327013 3315251 3311913 3380903 3548314 3605424 3704991 3749504 3807780
5589 3807780 3968952 4114661 4327837 4490778 4693678 4888658 5123072 5400955 5647265 5924492
5579 5924492 6190063 6490648 6679503 6712279 6755139 6746175 6576564 6392314 6111680 5813217
5569 5813217 5621347 5568562 5563838 5545157 5545955 5557472 5551819 5639822 5758100 5900284 6087815
5558 6087815 6267401 6592307 6897566 7299839 7736707 8200842 8721076 9248557 9495289 9396874
5548 9396874 8901905 8231082 7501085 6762788 6246545 5796014 5466705 5183229 4909835 4841477
5538 4841477 4829217 4719981 4715500 4799764 4899633 5037569 5210486 5438280 5753224 6083805
5528 6083805 6477123 6968431 7439388 7953488 8498417 8992079 9249087 9111225 8583961 7731289
5518 7731289 6809469 5986607 5476851 5067220 4704643 4434003 4236803 4093954 3975187 3897544
5508 3897544 3912607 3862053 3889439 3999724 4125685 4258117 4432718 4667025 4997504 5352685
5498 5352685 5806716 6207613 6616788 6973747 7041953 6759757 6120108 5510605 4969941 4552206
5488 4552206 4203092 3926596 3716547 3530359 3456246 3421116 3373143 3375716 3410969 3453338 3597299
5477 3597299 3605531 3651680 3790854 3856824 4060140 4301979 4562326 4786407 5036991 5305275
5467 5305275 5573141 5682468 5670436 5651724 5676607 5666136 5680305 5748513 5846290 5955679 6087710
5456 6087710 6282555 6539599 6849207 7126128 7521130 7919598 8436803 9038466 9838767 10733911
5446 10733911 11705986 12471387 12833078 12792166 12318322 11667727 11021794 10559035 10219037 9960057
5436 9960057 9817628 9763109 9760189 9852686 9991409 10094692 10256634 10482905 10764548 11223979
5426 11223979 11811587 12344305 12824901 13448599 14200923 15109411 16216530 17525632 19100642
5417 19100642 20498883 21193048 20930376 19803515 18172951 16572132 15200861 14062375
5409 14062375 13183769 12338709 11726824 11209046 10715059 10334734 10072468 9889639 9815266 9878450
5399 9878450 10018862 10077240 10255549 10484509 10628605 10715350 10956061 11153983 11328685 11494147
5389 11494147 11443404 11069499 10379478 9491612 8511759 7623080 6903716 6281878 5677221 5213879
5379 5213879 4782444 4408245 4149033 3940614 3741803 3635254 3467015 3380107 3399033 3314402
5369 3314402 3266484 3181010 3113536 3065946 2951726 2797976 2645520 2456224 2262035 2074527
5359 2074527 1914856 1885120 1778807 1688121 1591994 1483403 1393427 1359532 1374650 1317255 1225909
5348 1225909 1152017 1123960 1076985 1042224 1055486 1082444 1026846 1081669 1051110 995157 953941
5337 953941 893692 912067 911387 880756 834403 827577 828909 789888 815815 832051 764822 693216
5325 693216 622467 625970 647092 649749 605950 594587 639247 568252 475657 488393 513192 498047
5313 498047 498009 517646 459138 500420 537142 484613 454481 477776 431267 408615 410915 380872
5301 380872 410410 413531 366200 428476 481432 412305 337017 336445 353355 403883 414952 414524 353094
5288 353094 320093 254818 255125 352300 327614 332458 372871 314950 295283 276474 268605 297404
5276 297404 327405 322166 297568 372326 341939 371115 384369 423429 417100 316700 347342 328438
5264 328438 309648 275763 252231 191902 203848 227269 280864 367785 394937 355525 333353 346605
5252 346605 303945 307755 299396 317771 272432 206667 176799 190804 156692 220760 263560 267116
5240 267116 269164 307609 291336 278732 266694 259551 308555 315969 287262 243508 246353 228870
5228 228870 288534 356546 363295 300156 310565 275591 311528 239187 259755 251992 311729 284201
5216 284201 263019 276015 270813 334952 271789 292601 287228 317411 264336 231979 245515 231671
5204 231671 283752 305043 233428 236364 200087 250676 282572 279884 271095 267868 193425 234697
5192 234697 280870 229805 218466 251872 279502 353023 401674 373631 271490 324529 313580
5181 313580 323636 324266 320451 369187 312719 357195 398477 386862 405111 428472 417164 383905
5169 383905 366080 374849 353147 354715 338324 342350 292368 346482 413412 391910 346987 367073
5157 367073 378799 433758 431728 420085 439977 407586 448471 477138 508631 504214 502710 461166
5145 461166 441365 472867 465461 506608 481469 469186 526157 557968 566720 604193 608020 572051
5133 572051 603879 575862 604283 646882 647873 690153 712178 709560 743322 772198 760604 742031
5121 742031 750504 755688 824102 852821 936181 995609 1000762 1002789 952343 1016976 1108492 1128357
5109 1128357 1150484 1220745 1328662 1440296 1564217 1627870 1643911 1766411 1906446 2064261
5099 2064261 2191209 2281395 2342744 2487293 2691720 2869797 3056112 3319607 3551116 3756377
5089 3756377 3958076 4108576 4333744 4574007 4894270 5191797 5411518 5566873 5711302 5964087
5079 5964087 6174461 6490144 6928685 7418913 7785459 8157022 8599241 9212861 9937622 10647437
5069 10647437 11454525 12375956 13352218 14605536 16106890 17814144 19804926 21739056 23502223
5060 23502223 25165062 26906421 29356381 31880239 33737856 34838362 35935052 37760715
5052 37760715 41353404 45051424 45714841 42545189 36564133 30637765 26121404 23031424
5044 23031424 20753544 19008680 17515154 16044903 14420972 12716101 11170162 9904940
5036 9904940 8872599 8073461 7398494 6768041 6284913 5891537 5535605 5214489 4855343
5027 4855343 4520140 4316255 4129708 3868000 3727892 3603301 3407174 3276403 3105108 2881093
5017 2881093 2771525 2681384 2543912 2460814 2422488 2370288 2235277 2092618 1988524 1888841
5007 1888841 1800621 1768423 1747253 1681634 1679683 1606046 1550749 1596857 1415699 1395979 1440713
4996 1440713 1427753 1399421 1356868 1378696 1350706 1248793 1294560 1228644 1199568 1236097 1110159
4985 1110159 1059859 1043968 1077243 1070337 1088981 1049775 1037514 1042979 1066373 1018416 903426 920405
4973 920405 958841 898874 868101 852159 882671 887467 885115 857410 874661 791907 744957 752233
4961 752233 805321 792786 755654 727732 726093 713168 740599 772542 756508 786602 767535 720372
4949 720372 725726 782428 758910 744275 766792 796853 792192 810049 813375 798318 839328 837199
4937 837199 820268 840023 731460 714425 732313 764622 770998 766469 780718 758432 814294 795028
4925 795028 765106 821847 810242 716229 693388 757493 773992 788237 720581 595758 614688
4914 614688 755696 693336 697991 711320 710361 737765 670584 656334 735469 810468 695322 665094
4902 665094 687412 670624 739734 754639 734216 711006 762381 770613 741274 701725 722781 746612
4890 746612 794178 758800 675248 765474 799370 746007 798762 790489 755179 721749 744517 773899
4878 773899 778403 797870 759293 794832 872215 866989 854669 904706 985651 1003952 999797 965982
4866 965982 934917 964505 967624 994957 1027646 1029783 1052712 1157100 1179196 1233069 1294307 1314182
4854 1314182 1323830 1338526 1291305 1311872 1397175 1366960 1347601 1332262 1338983 1317962 1354415 1458453
4842 1458453 1500435 1511891 1501672 1604698 1674080 1729292 1761509 1886545 1886664 1872602 1941212
4831 1941212 1959566 2048575 2157232 2210789 2286884 2350410 2402516 2481486 2445679 2453887 2540687
4820 2540687 2701383 2819533 2956637 3049406 3128368 3226157 3325904 3505562 3612392 3748807
4810 3748807 3915317 4075512 4204490 4308624 4471416 4670177 4869041 5161219 5443832 5694389
4800 5694389 5967807 6313064 6674353 6952970 7245803 7628545 8024947 8396272 8754773 9197525
4790 9197525 9712004 10266116 10867646 11533225 12109638 12694628 13414846 14042276 14816542 15617265
4780 15617265 16473842 17409035 18409220 19438902 20389861 21456063 22615368 24004220 25737982
4771 25737982 27700323 29970884 32133012 34094062 35566231 36375263 36882878 37441573 38143135
4762 38143135 38648178 39076226 39389375 39737813 40336334 41104289 42079203 43026901 44017512
4753 44017512 45188098 46494792 47919500 49345070 50788140 52083833 53201554 54365324
4745 54365324 55670598 57056968 58711085 60643372 62804133 65114218 67411005 69367244
4737 69367244 70272814 69764460 68073174 65669160 63240493 61027667 58992757 57123586
4729 57123586 55403908 53924658 52551091 51188476 49541332 47663240 45800945 44217295
4721 44217295 42764246 41585976 40614218 39674536 38784104 38001905 37371120 37068138 36888870
4712 36888870 36625183 36409552 35955061 35418647 34860453 34190377 32820394 30764644 28314303
4703 28314303 25756571 23504822 21709504 20283748 19052221 18084678 17254586 16372251 15536230
4694 15536230 14757680 14183105 13576034 12973917 12475722 12010108 11567124 11098208 10602749
4685 10602749 10135094 9740629 9350311 9025504 8768437 8540108 8287112 7986122 7676914
4676 7676914 7415500 7093243 6860955 6679620 6420747 6265106 5996829 5886517 5793230 5713160
4666 5713160 5569677 5465043 5418472 5363083 5382139 5325619 5358143 5319876 5255230 5203454 5185617
4655 5185617 5154644 5148361 5137241 5070622 5034805 5039336 4997872 4920515 4823618 4733497 4550860 4394964
4643 4394964 4258403 4161426 4009016 3858925 3713554 3623233 3552953 3419064 3279751 3150431
4633 3150431 3108351 3092842 3089716 3009738 2939312 2874985 2770445 2768323 2764392 2784515 2752238 2736511
4621 2736511 2709273 2735813 2722865 2617536 2538015 2531129 2470440 2421642 2258525 2157983 2078448
4610 2078448 1924507 1950581 1913814 1774358 1722747 1760795 1717626 1685895 1573098 1562308 1579681
4599 1579681 1476278 1431017 1446856 1452467 1395833 1381645 1336122 1374587 1302232 1234964 1259888
4588 1259888 1207505 1241807 1247859 1293859 1278660 1254422 1176374 1162741 1192411 1139071 1108092 1078632
4576 1078632 1044609 1063001 1088034 1133684 1132688 1030338 1022269 938461 921781 951383 926627 927003
4564 927003 961104 941498 978635 1026554 984289 957062 961444 964385 897157 898301 907955 921125
4552 921125 929492 894735 895283 952836 924626 885625 857275 880562 865170 833041 893990 965675
4540 965675 899035 801271 848462 861987 808729 824083 812735 822963 816100 805309 786642 787661
4528 787661 795476 783661 671372 723119 734487 785726 750354 722163 726976 740188 726707 724284
4516 724284 687255 685791 718735 652867 681535 708246 731282 729310 729644 768507 745511 721018
4504 721018 695921 711517 674051 684020 593205 541179 653809 619526 691009 656228 653700 639189
4492 639189 645313 637334 623298 560346 566222 625937 573288 566448 658682 663435 608657 571253 558499
4479 558499 608808 639528 539252 585866 610248 604703 599500 620855 653085 662541 628243 627222
4467 627222 678116 660628 663216 671461 669982 606969 639072 719034 699455 662743 675761 700306
4455 700306 694360 698140 646040 684027 727663 688423 684052 700387 664850 668562 661324 679681 723380
4442 723380 754707 720527 708342 723949 783299 734487 776875 778424 762055 766854 777256 793964
4430 793964 853223 819359 836737 866575 804280 821651 843484 834742 814231 781763 782644 792469
4418 792469 836545 804305 736037 791394 721733 760357 780786 761839 749669 783083 760132 818682
4406 818682 755201 679506 699389 673975 728145 791106 750835 744431 746090 701700 698752 749142
4394 749142 765842 813957 724836 694700 746470 759064 706855 701913 703959 657896 647534 625747
4382 625747 700215 733292 701342 634755 631394 699159 668327 646488 626061 633361 678319 655949
4370 655949 628653 664490 609554 677049 716765 782662 792295 802559 790732 805195 799578 757939
4358 757939 745921 692352 719994 717541 699152 705746 743659 740139 710789 710325 744497 781191 786389
4345 786389 803368 770081 750702 800006 818897 796298 788345 830232 804142 836727 891471 886443
4333 886443 914336 885754 996144 1030259 982236 985512 987405 1035223 1016770 1107975 1124614 1138645
4321 1138645 1205313 1186731 1272989 1327623 1357469 1364113 1386627 1460374 1595507 1662729 1698412
4310 1698412 1802241 1823371 1825967 1863246 1947647 1995648 2163550 2203208 2316101 2451395 2599490
4299 2599490 2743177 2911932 3057139 3179058 3370733 3588993 3762280 3950289 4182922 4421172
4289 4421172 4610880 4840048 5123406 5430851 5677814 5939552 6314046 6681954 7029061 7385330
4279 7385330 7777998 8316358 8771777 9301115 9712069 10180536 10534266 10822460 11184788 11434578
4269 11434578 11803268 12154792 12628523 13183059 13815101 14634910 15516221 16426398 17247259
4260 17247259 17830760 18331385 18561488 18600828 18652569 18666658 18632975 18700617 18996778 19439540
4250 19439540 20016330 20739847 21487232 22283416 22815380 23150507 23187172 22972232 22565922 22089268
4240 22089268 21569130 20957401 20587622 20282258 20191031 20183965 20283154 20469284 20569000 20633003
4230 20633003 20458562 20099519 19589486 18896045 18043908 17170016 16393855 15634988 14996764
4221 14996764 14491360 14040345 13776703 13537820 13270580 13063793 12743471 12365331 11912181
4212 11912181 11391035 10797953 10105003 9494755 8859340 8288031 7885413 7545103 7136764
4203 7136764 6834828 6473473 6331828 6153127 5906420 5630905 5355772 5114704 4819460 4515334
4193 4515334 4271765 4035478 3767964 3629251 3516096 3428005 3322486 3287523 3204564 3018228
4183 3018228 2954100 2866628 2788350 2645142 2634023 2653302 2542952 2444471 2350415 2321312 2295796
4172 2295796 2232449 2154473 2089806 2017654 1977177 1909556 1893271 1906372 1880791 1783424 1741005
4161 1741005 1724348 1720568 1681391 1722768 1744923 1703105 1644044 1666692 1686216 1688444 1638502 1594313
4149 1594313 1637942 1713119 1680009 1626532 1604818 1565595 1648498 1632696 1617986 1682045 1748849
4138 1748849 1706889 1608750 1594790 1562215 1611620 1673247 1686916 1665064 1674463 1735182 1800828 1804265
4126 1804265 1748754 1679273 1709990 1760687 1719684 1778133 1922870 1943455 1978885 2049151 2077477
4115 2077477 2094489 2143916 2113811 2105016 2290163 2341068 2478680 2525063 2540740 2597779 2582994
4104 2582994 2696005 2742210 2857303 2993016 3120331 3245305 3318077 3420261 3565330 3794904
4094 3794904 3913017 4112743 4333332 4653638 4910458 5059533 5117620 5142822 5265508 5389265
4084 5389265 5562276 5705190 5968728 6197072 6461049 6713819 6924688 7094442 7255233 7373802
4074 7373802 7444376 7417767 7515199 7629511 7669039 7851834 8068043 8291996 8597469 8923960
4064 8923960 9320042 9588680 9706632 9725333 9606158 9274536 8969451 8742176 8571069 8570951
4054 8570951 8556625 8632359 8708546 8873936 9101718 9281792 9337350 9228549 9086417 8859861
4044 8859861 8681002 8526765 8422430 8415187 8361022 8444539 8464041 8487303 8546698 8580634 8520140
4033 8520140 8407642 8391183 8280683 8315441 8358124 8408907 8508116 8533573 8595439 8609315 8677123
4022 8677123 8810453 9000010 9130830 9284080 9470726 9653934 9846769 10066280 10369359 10698918
4012 10698918 10945586 11182531 11304611 11481306 11726879 11944116 12116350 12368792 12578745
4003 12578745 12848382 13206076 13537629 13977924 14420456 14673514 14809624 15016950 15176408
3994 15176408 15350182 15492520 15664980 15834653 16078197 16223830 16311877 16411241 16506649 16620375
3984 16620375 16615169 16674922 16864809 17063727 17170841 17175047 17065215 16873456 16736244 16713823
3974 16713823 16733333 16811358 16888894 16921680 16947087 17006442 17032472 16910066 16716761 16564515 16446713
3963 16446713 16414853 16375181 16323088 16169188 15884016 15610060 15330301 15179059 15132627 15099656
3953 15099656 15159657 15259718 15317297 15523018 15785060 16178654 16579442 16990373 17469115 17790318
3943 17790318 18116020 18341391 18492482 18594506 18639049 18742393 19037701 19338384 19715851 20079174
3933 20079174 20527803 21063149 21627943 22151896 22693540 23320279 23959686 24686463 25506463
3924 25506463 26508390 27579730 28810817 30013076 31330328 32546181 33915238 35496175
3916 35496175 37246995 39157045 41332229 43636870 45983830 47971340 49156120 49880688
3908 49880688 50276613 50576049 51168451 51849812 52583806 53477444 54676057 56268973 58150003
3899 58150003 60103861 61817155 63110866 63977586 64512451 64807698 64903868 64970608 65247716
3890 65247716 65567479 66201110 67107096 68371555 70138333 72351487 74942082 77879321 80823805
3881 80823805 83188952 83933101 82477588 79150699 75045949 71232439 68189799 65852972
3873 65852972 63968272 62505633 61240023 60239420 59558466 59152125 58943725 58611140 58095211
3864 58095211 57088951 55453152 53305706 50958702 48630352 46652560 45177798 44202392
3856 44202392 43478115 42932833 42507948 42281610 42213699 42073642 41628296 40559277 38923980
3847 38923980 36913630 34909976 33175133 31697213 30418338 29229788 28170371 27272584
3839 27272584 26331728 25365501 24361145 23502834 22762451 22225385 21851582 21583586 21383879
3830 21383879 21244739 21155219 21189996 21192907 21270446 21404212 21452199 21412499 21414984 21344480 21241537
3819 21241537 21153723 20865587 20439217 19849504 19141457 18529705 17946852 17430549 16935045 16523875
3809 16523875 16220356 15962296 15885037 15985429 16108031 16383493 16607747 16692625 16734161 16626496
3799 16626496 16536417 16517056 16491965 16512718 16549135 16589634 16739426 16775538 16778299 16694666 16473717
3788 16473717 16293603 16115370 15921598 15890267 15842088 15651492 15378455 15163768 15026449 15007129
3778 15007129 15138347 15288117 15479064 15787429 15988335 16121187 16206270 16241585 16279294 16373313
3768 16373313 16489191 16710596 17019816 17395002 17859140 18351541 18862872 19310919 19737782
3759 19737782 20221365 20740424 21293966 21885790 22526420 23190155 23940496 24723097 25554035
3750 25554035 26545894 27618632 28873273 30227431 31752668 33511875 35596661 37917412
3742 37917412 40565246 43265212 46061406 48835301 51226598 53306371 54866541 55929765
3734 55929765 56352527 56322566 55864226 55016476 54006868 53054747 52294414 51826866 51638479
3725 51638479 51699258 51861634 51787327 51516665 50863313 49718378 48118124 45959392 43409325
3716 43409325 40609198 37667650 34677710 31843068 29136831 26671220 24505580 22589875
3708 22589875 20892328 19451728 18213922 17106268 16109906 15250561 14584171 13883096 13272547
3699 13272547 12790293 12277404 11855512 11454967 11086989 10794284 10498253 10306381 10106879
3690 10106879 9890516 9623887 9416682 9286534 9130401 9048101 8967229 8829104 8686687 8633816
3680 8633816 8528298 8358034 8252873 8093863 7989515 7891353 7794878 7759882 7768620 7772309 7640971
3669 7640971 7597202 7564103 7574891 7491675 7495542 7488823 7444526 7492853 7498250 7515803 7533904 7519017
3657 7519017 7493991 7529269 7631863 7731262 7801056 7935323 8087358 8191369 8264693 8404300
3647 8404300 8535298 8643094 8812811 9006862 9197086 9383828 9534041 9784198 9913084 10039950
3637 10039950 10292205 10507932 10511317 10603872 10674902 10753680 10814506 10875677 10988844 11186631 11224713
3626 11224713 11302429 11394284 11534855 11705675 11907659 12068459 12138418 12358825 12577942 12827708
3616 12827708 13110835 13328161 13595963 13913225 14237954 14632720 15084955 15539275 16144585
3607 16144585 16983218 17826020 18828298 19884375 20947211 22056239 23127933 24077247 24917834
3598 24917834 25666417 26288369 26826811 27289559 27588060 27804487 28031757 28193566 28407614
3589 28407614 28588017 28689613 28808639 28750523 28585932 28296097 27945478 27366162 26696613 25992688
3579 25992688 25222722 24567655 23875179 23248950 22742576 22385698 22184914 22091264 22153819 22339753
3569 22339753 22505430 22751501 23109279 23573419 24106138 24651741 25325135 26067802 26968503
3560 26968503 27863945 28935989 30105832 31379282 32716061 34242501 35932459 37749792
3552 37749792 39774891 42061819 44540916 47266497 50256470 53631154 57244344 61230337
3544 61230337 65714076 70413396 75325485 80308494 85115826 89706489 94054675 98181145
3536 98181145 101978104 105518985 108590906 111298506 113519773 114998056 115693630 115843391
3528 115843391 115553380 114979440 114079098 112969740 111723048 110306068 108662417 106875683
3520 106875683 105035105 103280869 101522517 99799314 98215069 96818307 95720364 94989348
3512 94989348 94783681 95216973 96470469 98547696 101719303 106145832 111804322 118842611
3504 118842611 126068394 131242818 133857172 135497762 138291075 143240750 149976456 154414347
3496 154414347 154001672 149374861 143840256 140167267 138966630 139701286 141616973 144059601
3488 144059601 146950203 150022405 153031576 155785263 158320734 160625457 162884386 165512089
3480 165512089 168964105 173427806 179087616 186061184 193810286 200088888 203557215 204657197
3472 204657197 205485304 207060421 209515930 209966127 204554208 192787146 177123519 161642786
3464 161642786 147874452 136121217 125790164 116668191 108682033 101896654 96098783 91138307
3456 91138307 86833628 82958169 79465573 76312874 73302227 70410024 67504860 64676031
3448 64676031 61795492 59032986 56416919 53947140 51573387 49435272 47411329 45598795
3440 45598795 43996344 42546024 41205272 40000640 39047649 38214923 37483319 36914916 36537847
3431 36537847 36218955 35970257 35901572 35931751 36078170 36377550 36764496 37110962 37490246 37999818
3421 37999818 38586477 39307755 40077827 40746025 41476932 42177065 42948685 43582664 43921947
3412 43921947 43938281 43647329 43254230 42859458 42290023 41798194 41439612 41051563 40755469 40505683
3402 40505683 40132675 39766586 39323915 38981216 38665268 38302946 38107322 37847059 37522876
3393 37522876 37003221 36400689 35694661 34843519 34069749 33542299 33101023 32770561 32406881
3384 32406881 32004643 31845958 31946131 32017465 32174711 32501600 33130757 33961471 35023750
3375 35023750 36174054 37283185 38498764 39705811 41168464 42828530 44724720 47007283
3367 47007283 49711630 52951188 56868170 61907119 67700420 74009007 80423086 86812311
3359 86812311 92712805 94874917 91710945 84076086 75190937 67808267 62245283 58229070
3351 58229070 55076672 52642799 51019369 50092430 49577661 49509630 49787039 50330604 51084513
3342 51084513 52215758 53781391 55692268 58053415 61092763 64988376 69910503 75630804
3334 75630804 82002450 88361367 94814821 100026992 100952449 96729111 88897384 81004909
3326 81004909 75116193 71372037 69258509 68004337 67449553 67538000 68015896 68814430 69917115
3317 69917115 71245490 72659203 73897287 74981834 75623176 75956896 75979433 75746660 75207070
3308 75207070 74415687 73377961 71965914 70233624 68239409 65942467 63450015 60810834
3300 60810834 58077772 55499466 52926371 50302526 47722924 45186787 42767713 40477521
3292 40477521 38329897 36170718 34037798 31980323 29952539 28058915 26273795 24588961
3284 24588961 22977474 21504518 20158260 19003481 17907442 16955443 16104007 15312762 14620355
3275 14620355 14001466 13461019 13017210 12653323 12306501 11959480 11585608 11298124 11069258
3266 11069258 10877630 10660672 10498810 10391355 10349923 10307889 10218700 10219981 10200249 10291059 10298504
3255 10298504 10358229 10359636 10368866 10307508 10322133 10253637 10114709 9963573 9780003 9580568 9387177
3244 9387177 9161526 8897995 8716632 8530686 8340739 8111854 7853094 7699840 7577561 7435610
3234 7435610 7290698 7182488 7000195 6841337 6726969 6579581 6433340 6247653 6166263 6004551
3224 6004551 5918941 5879030 5829915 5749686 5638512 5576208 5479471 5494435 5509850 5436858 5485436
3213 5485436 5420360 5380388 5423481 5408395 5392820 5410153 5437986 5395047 5391277 5416061 5376878 5369185
3201 5369185 5376857 5385620 5397812 5348042 5396695 5413112 5357660 5389676 5358561 5354810 5310104 5386816
3189 5386816 5435754 5427501 5465624 5476391 5505147 5485870 5485437 5541844 5521507 5505168 5466045 5408441
3177 5408441 5423376 5390665 5311711 5329581 5313513 5242111 5237504 5263808 5292837 5332467 5250355 5200635
3165 5200635 5203438 5273437 5369523 5379221 5333486 5335882 5397199 5392820 5394847 5369817 5362253 5452162 5443113
3152 5443113 5509432 5553840 5637119 5719171 5746184 5828670 5910812 6006770 6147744 6326265 6511052
3141 6511052 6663168 6827685 7037529 7182336 7461013 7747244 7948928 8133260 8420520 8744112
3131 8744112 8997985 9186931 9532070 9896068 10284307 10707707 11134729 11568329 12100624 12749084
3121 12749084 13364234 14071551 14792539 15467413 16240183 17183286 18254778 19410180 20720206
3112 20720206 22165515 23601273 25149470 26796700 28604092 30564790 32536639 34404454
3104 34404454 36064855 37417309 38714876 40190872 41869462 43740354 45503282 47244452
3096 47244452 49014185 50872748 53074901 55768523 58929089 62506049 66514414 70956421
3088 70956421 75884294 81359388 87394907 94252067 101728929 109913005 118774579 128406742
3080 128406742 138968757 150785323 164430739 181110514 201656891 226610766 255708198
3073 255708198 287787449 318182566 337683397 339482111 324596647 301282339 278933974
3066 278933974 261154616 244826152 225559133 202092757 177093386 153987391 134372325
3059 134372325 118026885 104395320 92749397 83051127 75031584 68228687 62357301 57230413
3051 57230413 52907648 49152932 45814218 43001625 40544029 38270112 36190044 34394439
3043 34394439 32734495 31008015 29452061 27970213 26625206 25339804 24109988 23012748
3035 23012748 21843390 20826696 19912891 18990161 18166602 17455442 16769636 16111730 15599573
3026 15599573 15021755 14496973 14054425 13570994 13108959 12680861 12286547 11963484 11644957
3017 11644957 11310733 11005731 10654626 10413801 10201907 9938358 9689485 9451556 9212249
3008 9212249 8981904 8784677 8660858 8535725 8313330 8096840 7982108 7849634 7703316 7527265
2998 7527265 7423619 7209971 7062373 6977528 6853818 6697051 6531193 6340092 6155645 6067758
2988 6067758 5919930 5804580 5706048 5600414 5468126 5365302 5244448 5109437 5061940 4901851
2978 4901851 4822489 4665940 4670416 4616593 4483353 4399437 4306405 4244039 4152752 4185466 4076807
2967 4076807 4043660 4000066 3938051 3829079 3783011 3757484 3751741 3721064 3630094 3575529 3634518
2956 3634518 3531726 3494292 3423597 3425845 3416008 3320632 3264756 3199496 3147154 3126009 3087441 2966230
2944 2966230 2968750 3018955 2992239 2892507 2928976 2919673 2925612 2883873 2890926 2887235 2892013 2883474 2829195
2931 2829195 2797564 2782441 2792912 2770951 2756204 2713859 2684753 2631367 2553504 2498523 2488506
2920 2488506 2488924 2436485 2412465 2413768 2355415 2358073 2328214 2290404 2264713 2185729 2136101 2120622
2908 2120622 2123287 2082339 2054045 2061716 2032582 1927999 1860120 1868710 1932340 1917287 1815261 1783049
2896 1783049 1801919 1762251 1783772 1821299 1819829 1742402 1696410 1719427 1676089 1605365 1615381 1672809
2884 1672809 1687610 1622782 1590392 1585170 1637032 1711960 1617723 1615356 1606600 1631720 1657197 1591487
2872 1591487 1587516 1619359 1642325 1571284 1562207 1588977 1516482 1512555 1521216 1511265 1526395 1536008 1555482
2859 1555482 1624078 1648922 1664766 1637647 1644696 1630170 1526050 1576136 1611440 1577384 1571702 1575767
2847 1575767 1587821 1591216 1600698 1573763 1568234 1493051 1480625 1485346 1431120 1403968 1401149 1436021
2835 1436021 1469336 1507733 1461919 1451092 1485601 1489343 1454526 1416846 1469640 1398169 1366917 1421735
2823 1421735 1468084 1468107 1493892 1554563 1544451 1428891 1484797 1511295 1525021 1539299 1587185 1584403
2811 1584403 1567654 1541260 1528403 1534921 1467837 1554285 1579568 1652462 1683126 1648093 1728061 1785221
2799 1785221 1848324 1843822 1819357 1915954 1997900 2075319 2178866 2339970 2474925 2648314 2772425
2788 2772425 2858666 2892163 2818458 2672007 2559906 2430516 2355983 2254180 2146233 2056038
2778 2056038 1952159 1793403 1689318 1604215 1558603 1390425 1317586 1328438 1337300 1282090 1192930
2767 1192930 1144189 1157763 1197189 1201334 1152868 1135360 1161464 1132841 1161160 1109023 1054001 1039605
2755 1039605 1018042 1038276 1024829 1084547 1078433 1027274 995959 1078466 957421 944179 965223
2744 965223 1024673 1024603 1013067 992171 1033766 1113736 1021434 1025301 962402 944706 889549 911391
2732 911391 956681 951586 997320 1006942 964032 940397 862440 879458 871472 857413 831440 798478
2720 798478 767581 845968 808365 830636 867826 841312 782894 800825 777741 797267 770281 814370
2708 814370 757251 744577 740056 774563 829481 820437 747488 730892 787063 762498 731864 740866
2696 740866 746153 728155 753766 747225 783243 773902 767845 715128 757173 730347 732452 770097 724201
2683 724201 726115 726325 675065 719508 753551 690415 651873 647520 685840 694159 770478 772027 702156
2670 702156 641163 751164 760084 773220 821511 790981 731391 702538 696732 659308 640255 662434
2658 662434 652035 596958 575827 587744 639946 629779 619089 596691 582534 622082 705341 695024
2646 695024 759179 687440 659064 681944 700668 711850 678476 657884 693518 671799 622484 573045
2634 573045 614417 615527 639770 648491 557030 492127 534670 603825 557421 560063 634511 644776
2622 644776 680721 627511 539958 580459 582039 614629 582668 536277 611592 543643 544589 483153
2610 483153 436285 517539 543923 577256 570716 586456 602948 582190 571735 562573 577658 632095
2598 632095 573951 482185 514904 550535 533588 546768 573318 542998 548592 569323 549111 580950
2586 580950 559878 515579 503098 464849 443819 517976 491490 477599 510551 533109 587085 621419
2574 621419 618643 651115 602850 629801 620903 615825 528957 514889 507428 473448 490740 521511
2562 521511 463961 405374 488317 542519 514824 488505 483737 450294 473061 460435 447624 440263
2550 440263 487649 453524 421641 424115 452674 396965 404094 470616 421552 430477 484401 398813
2538 398813 356189 422069 474104 480486 460811 474495 464686 474555 486110 419214 393758 442830
2526 442830 431383 442829 464255 456342 543554 470912 418788 424203 389208 440330 508194 483899
2514 483899 443384 477708 466219 414292 343198 378568 407898 408754 409888 321011 336700 386096
2502 386096 397889 366198 388583 391193 363569 425118 458099 381619 413142 401174 376848 386759
2490 386759 354764 410962 385223 392566 392735 353610 433382 453512 442766 423729 404716 418281
2478 418281 466078 443226 469493 472442 460490 439527 497485 493626 410262 431128 422087 467056
2466 467056 422149 421851 438794 448951 444960 474802 469658 492776 459471 422459 443613 488102
2454 488102 416343 437437 460269 443968 371792 434788 428101 480811 493506 481649 448915 408033
2442 408033 424174 388078 416399 432580 435492 412708 413269 402231 457268 444141 472620 405765
2430 405765 382825 463356 418389 383443 378974 371543 392312 436741 415313 400274 371633 391609
2418 391609 429748 418691 388596 400177 437779 448550 486728 537162 506099 422234 365171 466287
2406 466287 493222 460029 477625 436765 481496 438991 487249 516469 526303 528156 537714 563760
2394 563760 525430 487659 485836 445677 457301 406288 491185 495143 543094 578626 534812 560772
2382 560772 555762 490130 452866 495174 550525 582474 528219 534114 483864 527525 544813 615505
2370 615505 698593 737462 720937 739063 732967 744439 722349 692458 745772 808438 905810 939629
2358 939629 989940 961928 1058169 1181962 1193094 1254613 1323820 1333738 1369081 1497348 1579989
2347 1579989 1750245 1931450 1986152 2129118 2275773 2522508 2692836 2841511 2932120 2982625
2337 2982625 2982045 3077097 3175965 3315539 3433426 3629353 3752993 3920349 4061728 4350451
2327 4350451 4585592 4895098 5275458 5684897 6157075 6665817 7179115 7751055 8242248 8714841
2317 8714841 9199148 9777088 10546823 11405421 12361542 13717801 15601424 17955092 20929477
2308 20929477 24505151 29370187 32788797 32779137 29063601 23756689 19231979 15959593 13701628
2299 13701628 11784910 10093462 8788361 7594422 6760957 6163140 5725904 5423189 5031148
2290 5031148 4668584 4313072 3955936 3671119 3435998 3238901 3038661 2843490 2700192 2574650
2280 2574650 2440099 2290090 2142164 2088054 2000803 1875469 1765828 1695610 1611992 1600520
2270 1600520 1535209 1437521 1373384 1334454 1343126 1325212 1242556 1207519 1133742 1092430 1049284 1037300
2258 1037300 1003391 968246 949118 931590 926130 894774 922261 910252 833274 787863 830036 774345
2246 774345 745807 719348 732878 789886 764411 719151 741057 717573 735548 762220 720863 645044
2234 645044 632567 634853 624290 689903 656396 638155 698400 648176 534613 512653 545432 534528
2222 534528 520849 545882 581970 569056 519967 458776 431750 465162 534158 489470 389982 372129
2210 372129 442277 417932 427762 481320 444767 410496 493251 427097 349641 380240 455594 418934
2198 418934 415146 391998 431863 429528 439177 429739 367675 332872 405608 350629 336997 345526 395141
2185 395141 404856 367141 376895 379934 338763 372848 290906 307758 345239 359304 306379 323145
2173 323145 340635 300981 267123 321120 403612 327536 337408 324028 340272 304355 284177 266783
2161 266783 225612 184433 217725 278730 274768 216636 294360 246175 306319 282247 278764 237136
2149 237136 286808 319268 303852 305643 288993 310507 366384 343143 289567 240075 227086 218953
2137 218953 290004 338219 301668 350648 334518 241441 266427 263788 221434 200691 205935 211325
2125 211325 266604 261102 197767 172220 207248 287477 343454 314108 355188 308644 231792 229595
2113 229595 193555 168802 183444 284146 289111 243119 185703 222503 192653 207700 236898 253310
2101 253310 213280 203310 188141 142064 224792 192452 259948 238252 188806 293590 239746 168603
2089 168603 130530 91690 166171 195308 236643 248436 186406 174607 128237 131339 193007 214704
2077 214704 176237 165319 214293 246790 219249 242780 244091 208034 198129 195199 181202 186987
2065 186987 167289 198273 125204 164209 225367 231122 235313 259320 216308 163796 263056 265110
2053 265110 217134 240717 289229 270418 303166 307782 228267 199626 246532 326999 288324 230225
2041 230225 218308 276337 366171 367591 393608 360563 339096 283215 304337 277373 198804 195381
2029 195381 264717 264980 231669 232786 228028 184948 231478 155185 183100 186868 216630 267962 220081
2016 220081 189183 196497 226006 161627 166879 197362 248700 253291 187447 134228 164473 143032
2004 143032 87367 99529 140500 107002 164400 178572 111416 86698 70296 61244 145655 133851
1992 133851 143080 143232 225148 165177 142350 115491 142594 170932 171576 131268 180113 193632 150010
1979 150010 121998 160813 279158 241550 194972 214411 239764 217772 163282 138745 146821 162843
1967 162843 190628 160695 148664 144316 116585 123513 129840 142817 177753 183241 216281 168586
1955 168586 172515 170861 120566 105862 137033 189335 123380 109926 103905 114388 114021 81657 66666
1942 66666 143221 181182 164989 205543 177078 211812 146420 154251 188064 172639 177373 136433
1930 136433 148407 161066 155914 134420 116424 115651 67885 110701 61919 20913 44891 97398
1918 97398 54822 94128 126667 137335 95506 56637 110857 155843 149267 110756 94168 82369
1906 82369 90183 95307 152901 170726 225155 169588 116677 155534 105922 168198 120790 121530 133830
1893 133830 121991 167081 138280 138247 166711 121071 48300 59872 63520 15668 63261 71787 126987
1880 126987 161914 168746 167004 162583 151012 96859 143214 150353 134022 137542 78798 89323 174979
1867 174979 165796 127428 130077 153633 107065 143236 136390 87462 130734 118863 95655 69903
1855 69903 110877 117413 84579 126517 119665 135537 207874 198610 146595 99503 70610 97551
1843 97551 57968 48429 62490 76914 25576 16574 83093 79953 65136 55247 96893 181477 155303
1830 155303 100864 103154 124092 74513 62487 72580 126196 139836 72447 68954 78120 100486
1818 100486 101265 33192 92731 161010 159243 147725 181618 96479 78371 102998 28989 95324
1806 95324 128090 147523 124344 118595 99763 54803 97769 109923 90437 38641 74217 119631
1794 119631 81261 84855 153210 156463 134776 105947 95877 56368 11672 110255 146569 201176
1782 201176 240306 162781 103142 92269 114879 129876 132152 123656 143173 89131 72459 72913
1770 72913 110673 63154 84613 69241 95724 106855 48845 39049 147713 192980 120823 82330
1758 82330 37319 31405 20457 18182 19783 92688 131119 127229 137016 119326 126658 135114 120233
1745 120233 124878 64854 63122 90325 84278 87535 19734 38039 82592 49842 51553 85433 113939
1732 113939 76713 170724 103656 104722 116928 122275 156799 107926 43673 26376 46923 75238
1720 75238 114399 101259 57402 46971 55143 106753 128422 76273 87931 104077 25498 6217
1708 6217 71352 107233 64240 59562 49674 21205 95939 103416 72866 33123 48645 138673 140573
1695 140573 140967 57353 46538 67630 61186 50779 66771 73501 4824 28708 20434 14340 74118
1682 74118 84281 46596 -37970 -41453 -33974 8224 55159 78951 42589 -8791 49941 93418
1670 93418 8476 27141 143072 143693 137219 77913 4392 42774 45942 32554 20339 91137
1658 91137 62116 8425 -10497 -5231 11988 73819 128153 97681 128418 128574 118640 103998 112132
1645 112132 123833 165579 136736 46576 -10308 24072 43427 18642 46224 54636 36245 17135
1633 17135 35631 37543 42996 63411 122811 97823 56780 10949 29160 30756 54199 78216
1621 78216 27904 7427 25271 90838 103992 148462 106985 61608 14146 65665 50889 74631
1609 74631 45837 88330 95264 94018 136299 149692 89932 113350 67061 71637 35550 20993
1597 20993 -12605 52159 96469 63921 1001 14739 22933 -33852 -2108 49186 51027 67785
1585 67785 62297 30796 56255 71548 85809 -37103 -76652 -4669 -46952 7154 713 13474
1573 13474 54879 -12382 -12324 40118 38813 24926 78645 7432 -9311 24960 63259 84395 53924
1560 53924 -22741 -149 13057 -41176 -17593 18641 32518 26014 -22754 49139 48166 40026 4234
1547 4234 31982 57296 20291 61759 64516 15225 -18938 36458 78693 46151 40892 16934
1535 16934 -2369 5467 -3073 -3116 5066 23191 40942 -38632 -26497 54217 79593 45231 27508
1522 27508 64350 123313 58332 24244 16700 80860 60058 59241 82118 39438 -1440 23230
1510 23230 46920 56838 85788 101400 96194 87146 59985 43625 80856 50524 74049 125391
1498 125391 67922 33194 39433 53478 43242 46014 18633 16654 44045 -3287 56921 63152
1486 63152 2641 76443 24985 113687 99339 83810 3008 36718 119636 22690 -40242 -126261
1474 -126261 -93244 -18386 -38288 -14470 -75835 -2692 48419 25915 65504 21078 -7971 -208
1462 -208 -34300 2738 40849 56352 47134 -6162 56690 57509 63519 1059 35308 10949 -5878
1449 -5878 22519 72038 48880 1989 -44321 37766 48724 7088 37261 65395 56853 26297
1437 26297 5859 -10655 -8305 37063 -39688 25135 8455 342 21887 79288 16363 -12739
1425 -12739 -15560 -8124 3283 33845 19864 28018 2254 -56087 8749 46386 -5885 28923
1413 28923 54486 49262 46606 65705 44673 26467 52334 24284 25035 34969 28236 71964 27199
1400 27199 23486 45593 86646 119089 53237 17656 33493 63887 9017 -35023 -45587 28482
1388 28482 46600 15774 -81765 -36400 -52041 -35741 -40214 -54129 48917 75224 47038 52757
1376 52757 6580 -13314 9270 18497 45290 68319 42673 32963 52548 58605 35169 16184
1364 16184 21277 9098 -22724 -5342 23742 56670 12534 26831 -46100 -32725 -4270 24829
1352 24829 22405 60135 32535 -18182 30074 9961 14326 51917 24054 34983 66181 -14973
1340 -14973 47870 84082 23355 71082 79689 41593 6645 125187 124684 41178 3873 18329
1328 18329 69621 29566 -17724 -9768 28877 35443 52342 44886 19786 -7658 32592 -20466
1316 -20466 -22221 16114 7409 23135 11403 14029 -903 56962 104166 65066 28517 2329
1304 2329 -51407 -24203 20231 18617 15240 -75079 -85329 -980 -35393 -69273 -23107 -14467 -21920
1291 -21920 -109858 -86500 -74055 -35749 20466 54505 28914 -2745 21225 15586 57120 56079
1279 56079 -23215 -36635 24067 96467 -4847 -14649 49134 84889 80243 -2433 -43703 45322
1267 45322 46110 18390 18254 -7058 -34036 -33071 43197 17676 23595 28258 85256 90510 37735 1249
1253 1249 4696 -31493 -58663 -46891 -470 -45696 -51553 -22089 16660 -39506 -29876 76965
1241 76965 87352 47216 12521 37258 19058 87456 80191 13415 -467 34696 48942 26677
1229 26677 -15258 -30703 78428 130734 81836 86237 61251 -8049 9747 13574 -8685 -16961
1217 -16961 -1383 -2018 -31587 28805 26352 74326 91685 50803 87996 65742 12882 -19577
1205 -19577 979 21529 60078 33362 55384 115599 103546 22220 36621 60753 62333 66362
1193 66362 -1552 41706 53364 26923 36100 56622 24588 43900 49793 59246 3197 7444 83853
1180 83853 52722 35806 42238 19481 9957 31498 52231 54504 60400 56008 30764 -4799 9172
1167 9172 61369 35934 14660 29526 -42833 -224 -56966 -37495 20793 14800 56467 45290
1155 45290 53422 -1388 8039 39134 32366 17387 37853 133095 41374 -53125 5863 -618 73129
1142 73129 41748 -6639 30933 34569 34836 10901 20804 20159 -16254 -59870 3760 62681 121771
1129 121771 101187 -30352 -17665 6718 -29055 12499 24267 19156 49063 28312 11612 33732
1117 33732 42703 12620 10098 32934 28621 8259 62522 43056 -7852 -17438 11203 -84557 -43898
1104 -43898 -2036 39721 39736 -15460 -35943 23176 29366 22196 48187 -21979 1247 9727 17193
1091 17193 -8960 28363 8798 -21161 39127 78428 109895 88072 65759 14245 -13394 14930
1079 14930 6410 40727 29169 19610 -46162 -62595 -67621 -51702 12123 9002 26039 -18197 -24122
1066 -24122 11106 -18069 321 -622 -15266 -69239 -60989 2182 5775 50000 -5066 46741 57376
1053 57376 25997 6574 20261 -32284 -24098 -13471 -6885 -22947 10937 60753 21807 28918
1041 28918 13791 -12983 -75226 -23618 -17002 10714 19794 -37430 -54717 -50443 -52178 -44735 -11593
1028 -11593 -5660 -270 83840 32216 -57563 -36865 -78884 -70088 55794 32260 -12193 18914
1016 18914 -3980 -66115 -24580 307 8777 3623 48091 80021 72529 47693 -13062 23833
1004 23833 34555 24093 -31253 -14601 14806 28286 39801 12780 53250 65026 80082 72070
992 72070 -1402 -71741 -105315 -59885 -54218 1954 31500 -20121 -620 12598 -31027 -5119
980 -5119 92576 148249 168504 168591 91610 105665 46940 22887 8968 -68724 -68573 -89424 -93561
967 -93561 -58282 -7168 9109 11291 -50754 -71474 -121266 -62363 -38349 -49872 -43565 -107454
955 -107454 -143836 -91441 -10656 6999 16271 46532 22624 15077 -40549 -58551 -44922 7095
943 7095 18443 7329 9240 -5946 1362 -32124 -41119 17643 -17158 -102091 -65071 -19277 -32891
930 -32891 -55922 -5033 -35488 -68161 -79017 -81536 37224 74408 40066 24075 -22416 8069
918 8069 18342 -13065 -2987 50770 20629 -16431 24578 8362 -59836 -71954 -13560 -36384
906 -36384 -42723 -35740 -7324 46952 38092 -7288 -14862 -32846 -23992 -8411 10066 -5332 -54616
893 -54616 -36794 -33780 -51190 -80931 -40828 -13018 -13638 -48806 -55200 24582 84805 86469 45739
880 45739 21953 -21256 -31724 -35953 -54857 -16803 -59581 -84560 -78750 -52137 5622 62159
868 62159 23255 -43291 -23245 19168 -18249 -4551 -3142 -8075 -36444 -47245 -40531 -70767 -64238
855 -64238 -48903 -59840 -2191 90589 29327 -11834 -8026 23694 -22613 -42981 -45437 -98195
843 -98195 -111453 -42264 59215 71372 72952 60259 52706 -52765 -83726 -62611 29074 27220
831 27220 -23537 -50044 -47039 -9528 4501 -22831 -41562 -20256 990 -72837 -134597 -59142
819 -59142 -52320 -40481 5181 19230 -7723 -27476 -69354 -41381 -40611 -38491 46218 75040 9131
806 9131 -31739 -53264 -67213 -34118 -95723 -67570 -48820 -70521 -23802 7554 -21932 -66020
794 -66020 -58057 -56788 -45226 -30276 -30098 13475 55011 28635 76442 29980 -23701 -80504 -37252
781 -37252 -50496 -18771 -22161 2972 21516 -22816 -5155 -1709 -17484 -603 -623 -73989 -25224
768 -25224 -42757 8737 -25868 -97691 -104328 -77599 -158226 -138254 -49556 -36608 -54265 -97838
756 -97838 -41684 -25097 -22991 -44963 188 46697 84968 34985 863 -7869 10015 -91100
744 -91100 -111958 -29040 1749 11673 6696 31305 29283 -17129 -28550 -3748 -3527 -16003 -15592
731 -15592 32240 24686 -15439 25181 -47336 -68957 -94598 -63471 22274 -11145 -8331 -27822
719 -27822 27863 28705 -17185 -20174 15610 890 -26636 -39744 -12955 -19425 27053 -7530 -12322
706 -12322 -8003 26352 2411 -55212 -61000 -78821 -101415 -9406 15253 -44615 -68487 -87434
694 -87434 -39938 -34325 -84114 -13848 44028 11584 22528 -43408 -44552 -79834 -31181 -7022
682 -7022 -21897 -62 -35603 -100584 -60009 -63814 -137571 -88960 -17026 -32757 -37606 -69041 -61809
669 -61809 -34382 -68540 -65878 -6537 -45478 -88836 -44279 11944 -31652 8336 -6891 14788
657 14788 9605 -36947 -46794 -44798 -47170 -30135 -19032 3525 -43710 -34937 27575 -28699 -40368
644 -40368 30530 25416 3181 -15369 -44886 -757 -64963 -76067 -99893 -23284 -5772 -6095 -2297
631 -2297 -16721 -110321 -71532 -22829 -30362 -42220 -43669 -8968 -42480 -36807 23779 44658 40116
618 40116 -20198 -106989 -69070 15133 -9071 -25413 -10541 1969 16088 -7845 -41877 -88464
606 -88464 -87172 -57408 -102292 -95224 -84157 -59179 -55483 15012 -53455 -94648 -68493 -73121 -129104
593 -129104 -58120 37211 3692 -35440 -11948 -38301 -66851 -96292 -123284 -67812 -7488 20430
581 20430 7809 65697 58141 -21145 -70129 -30194 -5567 -28366 -9287 -27018 -28636 24356
569 24356 56573 10965 -31680 -10969 -25289 -22879 -36641 -43260 24952 79073 1168 14221
557 14221 63448 60934 41222 -4871 -16092 -70247 -136201 -56261 -30427 -2718 -27259 -58814
545 -58814 -84664 -57011 -4802 -39713 -100252 -77510 22258 37574 -20524 -8102 -188 -33003
533 -33003 -50659 -54677 -115643 -67363 -70186 -64174 -75279 -43569 45675 15269 -19763 -38547 -19862
520 -19862 20578 -11888 -85666 -35483 42566 -22955 -77867 -54479 8795 22246 64018 98022
508 98022 12844 36098 10182 -49256 -15894 -48770 -4764 33897 31045 17615 13274 2002
496 2002 242 -45539 -111749 -99521 -66397 -45119 -49903 -26087 -87560 -55747 12821 12644 71402
483 71402 -11268 -27785 -13516 17204 51034 62413 8257 -54443 -91547 -32170 1334 -58431
471 -58431 -86956 -87520 -83262 -69460 -89857 -173079 -104217 -38718 -38691 -47170 -21264 -42939 -104468
458 -104468 -122715 -150960 -34155 -21177 -19475 11520 -35500 -10022 -14348 -39718 -12034 48897
446 48897 -16013 -12197 -14738 22915 -32553 -50778 -2902 10160 6264 -60073 -74905 -33246 -55960
433 -55960 -17822 -4189 21143 -7826 5430 17626 53421 67993 -24287 -63363 -86160 -32448
421 -32448 -38645 -92609 -75042 -32215 -83555 -106784 9232 755 -62874 -31238 -14289 -43681
409 -43681 -24253 -26378 18593 6096 -29160 35423 -32944 -97997 -32841 -20128 20044 8039
397 8039 54128 -17968 -104688 -145023 -107491 -41897 -30347 -42688 42711 -38216 -78233 -66953
385 -66953 -39292 -13722 -55486 -43760 -77379 -140311 -71248 -506 -20957 14374 -26175 -84989
373 -84989 -28116 -23444 -83581 -13063 -1928 -29400 -61580 -72547 -139368 -100973 -12138 37899
361 37899 12992 -10767 -27554 -58157 -65563 8308 53823 -17734 -81218 -60856 -18703 3854
349 3854 -36911 -54602 -103446 -28379 -19915 11573 -35459 -54455 -28042 -14014 10973 43507
337 43507 -1000 -60456 -82593 -44962 8185 -63839 -103166 -75901 -91964 -56176 21484 38626
325 38626 65494 32762 -42560 7221 -5484 -34233 -41416 -81705 -58218 27883 11867 22799
313 22799 -31144 -54493 -43477 -75656 -35696 -64779 85 20924 -25440 -31450 -55321 -60833
301 -60833 -63699 -61969 -46672 -9383 -11680 57123 -7213 -41632 -11754 -43517 -61608 -74741 -40175
288 -40175 -60348 39281 31370 -50595 19240 13774 -8448 -20452 -35624 -51776 -6724 -4110 -54043
275 -54043 -75691 -115370 -120796 -140162 -46161 14036 -24149 -40151 -12492 -97669 -90740 -87493 -52184
262 -52184 -29678 -9669 -20390 34967 76358 34648 -53624 -61291 -35332 -41453 42718 23429
250 23429 -13283 -7780 -50370 -86347 -54916 -18798 -73727 -131538 -75395 -63385 -97495 -68281
238 -68281 -98199 -126100 -73402 -1014 19517 9577 5020 3013 -10407 25678 25040 -51403 -42938
225 -42938 -14602 -43198 -22044 -32708 10023 21692 63237 9542 -87175 -79862 -42593 -25142
213 -25142 -102728 -39502 -43630 -26116 -80816 -95955 -100199 -107791 -52717 -65739 -67828 -73507 -29896
200 -29896 -43901 -77397 -51281 -69698 -72298 -2107 3153 32588 9040 -53745 -78619 -41953
188 -41953 -33273 -65807 -58418 -5039 -6206 -16996 -7048 -26830 -23479 6665 -65532 -42470 -25751
175 -25751 -61996 -9173 14436 47910 27566 -12896 -10354 -102840 -111347 -13723 -6612 -47492 -51377
162 -51377 -25578 -25463 10844 29623 -78637 -53951 26933 10371 30040 -12687 -48325 -3162
150 -3162 9937 -26420 -64941 -94516 -67141 -62091 -13892 -62016 -78026 -91200 -32522 -26195 -14458
137 -14458 18834 -23162 -50503 -42054 -21461 25561 21970 7917 14634 24163 -24579 -65602 -48397
124 -48397 -26502 -46329 -37764 207 -7971 -23507 -23774 -45420 -78587 -82333 -38825 -46138 -73223
111 -73223 -87698 -76895 -97710 -56827 -11168 2176 -32953 -69886 -73940 -98412 -54349 -56870
99 -56870 -36699 14885 -19328 -57693 -70878 -100571 -61859 -44020 -53882 -66668 -72446 -50364 -33403
86 -33403 -51621 -23099 -17773 -21055 -52098 -15204 -18350 -5081 -23953 3697 -6532 -31099 534
73 534 38688 2690 11588 5755 7283 -23615 -80637 -97694 -72874 -52869 -83494 -31530 -5398
60 -5398 -45151 -84034 -95977 -15627 -16419 -69729 -51778 -23489 2933 -13242 -10463 -34629 -29115
47 -29115 -20071 16055 -2546 -5434 -54992 -53671 -14372 -10375 -77314 -50689 -28240 -60249 -20897
34 -20897 -32882 -37082 -19570 -15324 -37836 -60112 -55275 -58657 -37296 -12646 27137 -17948 -37813
21 -37813 -54690 -67090 -93999 -86515 -70760 -76673 -74060 -54739 -16048 -950 -727 -3550 -23246
8 -23246 -558 -24434 -58065 -70655 -80191 -7433 -3450 -28189
0 -28189
$$ Imaginary data points
##PAGE= N=2
##DATA TABLE= (X++(I..I)), XYDATA
16383 -1672107 -1692271 -1647792 -1623036 -1631005 -1610822 -1548179 -1505493 -1498204 -1493281 -1470822 -1377092 -1357249
16371 -1357249 -1344730 -1362593 -1347662 -1263243 -1296414 -1277030 -1252184 -1258155 -1252674 -1250754 -1232802 -1176653
16359 -1176653 -1142511 -1145740 -1146261 -1100878 -1128797 -1088479 -1077283 -1001316 -981596 -969624 -989538 -989587
16347 -989587 -936381 -945559 -886174 -847255 -783837 -826212 -836919 -798827 -777395 -783610 -741105 -726597
16335 -726597 -710323 -672437 -616366 -659508 -649583 -619176 -582197 -567301 -563596 -516589 -442912 -425287
16323 -425287 -410681 -463394 -468149 -424312 -347071 -306286 -326213 -337575 -333318 -267605 -245442 -248283
16311 -248283 -214366 -190583 -183547 -179854 -164879 -122007 -89126 -110617 -72235 -42336 5669 -28327
16299 -28327 -62906 -55294 -43587 -24576 32753 40197 8660 64286 138445 171252 111358 105815
16287 105815 82274 120871 92547 139799 198287 211938 195976 202778 227678 280689 278948 256993
16275 256993 289703 335954 366829 356799 337917 313313 374364 482586 504588 490866 475947
16264 475947 406748 467241 537560 496938 474863 502895 530641 542769 580908 610395 602448 641358
16252 641358 665353 721937 695339 616774 677052 662021 687267 670888 684014 717487 721226 744941
16240 744941 749511 787593 804925 838814 826170 854526 906723 849659 856855 889240 869369 853242
16228 853242 838571 888873 916038 926063 915439 953961 927224 933014 963298 1007325 1078280 1064707
16216 1064707 1011778 1011697 1017511 1006328 1105278 1112464 1090068 1072269 1062868 1118147 1086419 1134488
16204 1134488 1106553 1091552 1192881 1141107 1184203 1189453 1131129 1122635 1135256 1135503 1115032 1186302
16192 1186302 1155596 1149785 1177051 1206540 1218959 1224524 1192756 1136299 1190977 1198224 1226161 1276097
16180 1276097 1223563 1214641 1253071 1325627 1259744 1219980 1257691 1311591 1319588 1327821 1318339 1351607
16168 1351607 1363940 1355353 1361571 1349049 1333576 1350783 1326235 1356299 1405563 1342888 1377053 1327125
16156 1327125 1343596 1344110 1356053 1406480 1415885 1367244 1421596 1373576 1398581 1414698 1453837 1399454
16144 1399454 1392160 1427051 1373469 1409832 1419844 1375330 1359411 1374113 1409189 1394529 1472178
16133 1472178 1504435 1453564 1433271 1483530 1565101 1565942 1499471 1474576 1456842 1429718 1465711 1488786
16121 1488786 1506444 1547703 1506042 1518155 1581397 1576278 1578884 1492108 1481305 1496051 1537127 1536493
16109 1536493 1512009 1500864 1503134 1549385 1519334 1573499 1623030 1546047 1512952 1513052 1578813 1593922
16097 1593922 1572473 1545959 1499266 1551551 1527943 1478607 1562638 1507135 1496431 1507931 1542230
16086 1542230 1564440 1528661 1574744 1540695 1515145 1533927 1550884 1608447 1574632 1568613 1510288
16075 1510288 1534591 1506905 1527899 1613264 1571201 1512579 1550628 1537097 1559030 1541110 1486219
16064 1486219 1560557 1515497 1571822 1592862 1612977 1635782 1613018 1542624 1520940 1562891 1604431
16053 1604431 1604829 1582880 1487035 1508866 1561515 1547542 1517244 1544410 1545166 1587906 1626446 1618051
16041 1618051 1614619 1542692 1513677 1512719 1499664 1560662 1612682 1585726 1556103 1475134 1516044 1460743
16029 1460743 1531163 1512304 1495718 1484480 1524891 1560091 1571413 1604150 1573122 1569807 1622847
16018 1622847 1610895 1641889 1632653 1639061 1681203 1639751 1641637 1641861 1591374 1604029 1577780 1602339
16006 1602339 1569402 1618402 1654632 1637574 1587802 1610078 1658966 1619701 1620787 1564268 1601440
15995 1601440 1640722 1640658 1672667 1639299 1546719 1567619 1643864 1637281 1646263 1617774 1589343 1622386
15983 1622386 1632326 1677626 1701147 1662274 1636776 1615832 1623714 1611481 1580460 1639746 1568346 1620041
15971 1620041 1617648 1580605 1585810 1606843 1598124 1568879 1580521 1636909 1620745 1647598 1607962 1603419
15959 1603419 1555214 1594674 1595588 1593130 1596571 1526621 1593888 1644203 1618574 1648221 1654006 1607176
15947 1607176 1610647 1624251 1590353 1597527 1559239 1553584 1556352 1615051 1661646 1674713 1608260 1618770
15935 1618770 1636809 1622611 1651617 1629729 1598585 1630879 1536035 1592585 1589955 1557434 1593866
15924 1593866 1598788 1629125 1596400 1599291 1576143 1580133 1595427 1584355 1577762 1610104 1672962 1612469
15912 1612469 1571544 1601713 1592807 1556532 1578284 1644344 1579152 1599142 1624229 1616160 1676974 1645628
15900 1645628 1611992 1650600 1557228 1565097 1557084 1588880 1638150 1645112 1597223 1656613 1639766 1622025
15888 1622025 1595233 1601585 1557046 1557559 1619598 1608868 1508443 1542421 1518802 1543652 1579485 1625927
15876 1625927 1670990 1649251 1606315 1569836 1616219 1646531 1567177 1581958 1572154 1521091 1547418
15865 1547418 1581530 1561517 1579612 1631333 1582171 1638522 1630710 1645754 1616470 1637376 1592041
15854 1592041 1537015 1608046 1668899 1663077 1637944 1683191 1644105 1556522 1546881 1560306 1579172 1620394
15842 1620394 1676115 1618824 1554231 1511023 1591814 1604945 1609985 1670304 1660013 1619406 1607058
15831 1607058 1606918 1639120 1690729 1679224 1626144 1610261 1623796 1510310 1518248 1624934 1596769
15820 1596769 1522957 1597176 1588147 1636869 1612890 1616535 1610790 1582051 1613686 1648406 1706360 1707119
15808 1707119 1650547 1631572 1625637 1606651 1577051 1567125 1564143 1490562 1588524 1679302 1628905 1601281
15796 1601281 1581742 1569906 1535235 1580514 1664298 1626139 1626186 1710483 1707738 1595581 1584575 1646036
15784 1646036 1580710 1529737 1588572 1612900 1682950 1664058 1627321 1584228 1577551 1617902 1629545
15773 1629545 1609509 1548262 1603882 1631516 1654488 1652683 1641328 1627573 1607396 1612723 1648580 1670327
15761 1670327 1652463 1627616 1615426 1669685 1680004 1625203 1593250 1632512 1701386 1681890 1602116
15750 1602116 1638726 1633441 1703036 1646745 1634396 1607462 1605448 1637388 1608527 1588949 1581166 1617874
15738 1617874 1652923 1562500 1576831 1619989 1631979 1673855 1680449 1647135 1678147 1703931 1627401
15727 1627401 1626729 1597806 1645406 1652400 1618419 1539559 1506631 1583402 1603710 1673634 1626299 1559039
15715 1559039 1520496 1612608 1598815 1589395 1583277 1597615 1671828 1683565 1649487 1698021 1702570 1591219
15703 1591219 1604213 1631280 1639052 1652118 1548784 1520359 1563566 1543685 1617526 1619258 1621109 1631777
15691 1631777 1664727 1652925 1684003 1740382 1680909 1655152 1724294 1698894 1662633 1663205 1638740 1652157
15679 1652157 1612894 1533317 1672447 1652580 1667234 1666362 1584099 1593546 1616638 1639387 1680564 1721965
15667 1721965 1721642 1667924 1705080 1637044 1675846 1661802 1601810 1616582 1610755 1680071 1626012 1607364
15655 1607364 1596045 1638071 1647837 1608349 1589703 1611670 1638022 1660126 1669730 1662497 1675711 1607323
15643 1607323 1674374 1674850 1638012 1668434 1664631 1570302 1507966 1591241 1646504 1591859 1630001 1667998
15631 1667998 1661434 1625817 1655346 1644547 1665062 1703486 1695782 1680018 1660388 1623784 1592690 1619687
15619 1619687 1557065 1594829 1613146 1623667 1605529 1667918 1674170 1666613 1619159 1582526 1589159 1605530
15607 1605530 1592751 1642825 1623501 1598719 1694607 1700904 1665980 1582356 1575364 1586099 1573843 1609142
15595 1609142 1656698 1647540 1645428 1627356 1649401 1679131 1628313 1656249 1678810 1682972 1678566 1659538
15583 1659538 1661205 1652539 1672450 1684297 1711961 1626972 1589325 1670520 1710090 1712987 1634739 1601175
15571 1601175 1594335 1632098 1732366 1705465 1638180 1661087 1683581 1740543 1700042 1634892 1660440
15560 1660440 1696146 1695105 1660969 1599923 1598356 1579599 1569338 1578056 1642600 1611392 1614986 1631718
15548 1631718 1668829 1709734 1670705 1715249 1669068 1694044 1653588 1643082 1645554 1626428 1685569
15537 1685569 1709366 1697486 1695911 1657222 1692481 1704071 1625514 1677500 1636847 1598129 1654318
15526 1654318 1684248 1720386 1661922 1639672 1647743 1661092 1706011 1718071 1719880 1678459 1627394 1609367
15514 1609367 1637495 1650702 1639812 1670252 1699440 1651805 1605608 1592564 1660536 1672323 1656847
15503 1656847 1636105 1632616 1676334 1695775 1718825 1659503 1672225 1648384 1611159 1627719 1629418 1617803
15491 1617803 1595919 1568252 1602958 1609754 1626146 1657071 1624424 1612814 1574447 1644027 1686219
15480 1686219 1659934 1619728 1661770 1674680 1602313 1615565 1665955 1664011 1684860 1654208 1698267
15469 1698267 1728962 1670333 1614185 1663337 1654841 1650236 1617427 1595174 1626165 1671079 1748020 1753382
15457 1753382 1711095 1695604 1672293 1663549 1616875 1734850 1810517 1734008 1706044 1675470 1725778
15446 1725778 1647909 1582417 1627067 1658799 1669563 1651237 1626044 1577645 1565999 1599106 1632571
15435 1632571 1671848 1622116 1597569 1590464 1634171 1614682 1644195 1645649 1651043 1627174 1648411 1659037
15423 1659037 1638242 1650182 1695664 1709443 1710763 1664463 1744004 1683248 1724714 1726393 1737862 1703271
15411 1703271 1594029 1652109 1625720 1656890 1668085 1665298 1681385 1639955 1686540 1692525 1671528
15400 1671528 1693474 1688735 1704013 1638331 1649292 1695214 1699515 1672697 1651439 1620424 1568974 1608886
15388 1608886 1681627 1661897 1649225 1672821 1657453 1621571 1662042 1710197 1732977 1665525 1696561
15377 1696561 1740057 1736291 1717173 1680383 1664455 1669560 1650299 1700877 1712413 1652414 1624552 1689088
15365 1689088 1748268 1699322 1745927 1745643 1703921 1715498 1694878 1664389 1711825 1697043 1677510 1670478
15353 1670478 1635245 1716538 1689993 1667785 1684889 1724044 1706944 1749338 1778666 1721204 1649828
15342 1649828 1621592 1677820 1736191 1662302 1622211 1672584 1666810 1646343 1664254 1694828 1660819
15331 1660819 1678410 1676808 1659179 1685139 1678925 1658730 1667322 1690827 1629606 1629337 1704836 1662819
15319 1662819 1649818 1633968 1699997 1713765 1698008 1704763 1705041 1763734 1753002 1720711 1697789 1715158
15307 1715158 1706022 1647937 1717172 1735005 1688930 1815975 1824270 1778465 1697417 1673567 1643483
15296 1643483 1621665 1656771 1690719 1654798 1633139 1657480 1681989 1645897 1624482 1634064 1672402
15285 1672402 1750859 1780980 1788530 1742889 1744553 1718082 1751451 1788498 1789539 1716498 1657134 1656632
15273 1656632 1690638 1718530 1746406 1665985 1653669 1727312 1653160 1654873 1670494 1706601 1676910
15262 1676910 1625734 1686366 1672820 1725853 1748653 1749866 1760938 1726615 1699466 1664263 1629982
15251 1629982 1726705 1784551 1750625 1685663 1698880 1714167 1683894 1621149 1667478 1699996 1672970
15240 1672970 1711615 1690971 1694154 1716102 1660911 1703318 1724885 1699366 1704597 1750215 1764433 1780083
15228 1780083 1737618 1657137 1688626 1719832 1686702 1654226 1662645 1664125 1743381 1801017 1725516 1758241
15216 1758241 1795994 1772671 1750737 1714489 1705302 1716132 1744374 1738231 1776396 1818201 1829492 1749298
15204 1749298 1722499 1729907 1754500 1749468 1701694 1733535 1783415 1689265 1711728 1682241 1732049 1756365
15192 1756365 1746806 1721200 1724261 1718007 1719457 1698401 1724254 1710569 1740948 1745306 1705803 1736112
15180 1736112 1716513 1743856 1720904 1712816 1727801 1741337 1735369 1758089 1727263 1677721 1690085 1738623
15168 1738623 1713090 1693478 1738606 1762217 1739024 1712610 1704650 1696566 1723078 1696950 1668610 1706465
15156 1706465 1705525 1696027 1736566 1746142 1685539 1647735 1657372 1714129 1767132 1811756 1763095 1775471
15144 1775471 1760980 1734443 1712903 1685518 1687254 1712319 1722623 1742666 1729372 1731984 1759475 1784168
15132 1784168 1731091 1715250 1709250 1691176 1720554 1744152 1758491 1738654 1765841 1758162 1813571 1757195
15120 1757195 1680178 1778320 1757130 1705768 1728545 1711524 1716868 1754173 1794455 1801950 1753278 1731967
15108 1731967 1781138 1816738 1825540 1833109 1796078 1729682 1664705 1704767 1699990 1718481 1735060 1725324
15096 1725324 1708095 1723835 1763408 1734244 1697872 1725366 1767320 1756817 1642187 1643258 1704040
15085 1704040 1758926 1764260 1699819 1649154 1743971 1744130 1697058 1693445 1729715 1739123 1686710 1634079
15073 1634079 1668781 1704785 1713142 1771732 1809677 1785453 1738271 1733561 1703575 1712560 1678951 1719722
15061 1719722 1752739 1813806 1707588 1728024 1804678 1789771 1754981 1725235 1722970 1704840 1674013
15050 1674013 1692004 1678386 1735406 1802442 1729381 1663803 1717915 1730483 1795115 1786386 1671921
15039 1671921 1719872 1784167 1796470 1732008 1716245 1772841 1771874 1756180 1797249 1792244 1761074 1785424
15027 1785424 1786614 1784371 1766631 1783057 1773110 1732282 1713847 1728936 1736560 1779282 1767515 1754902
15015 1754902 1690211 1661113 1684065 1782440 1815190 1742904 1766292 1753626 1726805 1773907 1784571
15004 1784571 1784633 1720988 1693116 1748661 1758339 1751501 1704498 1743012 1795522 1777191 1727676 1700230
14992 1700230 1760597 1750455 1797634 1759283 1759287 1785123 1798745 1783925 1809717 1787685 1692444 1730325
14980 1730325 1746404 1796561 1764911 1752667 1785778 1781440 1730567 1747774 1710903 1711834 1692083 1754983
14968 1754983 1731814 1729724 1703231 1710607 1760312 1818994 1796961 1718234 1722190 1723299 1703043 1737756
14956 1737756 1712386 1774505 1804292 1740345 1748814 1797018 1772619 1749845 1702262 1683689 1742330
14945 1742330 1734359 1799309 1748261 1720857 1755426 1808458 1746737 1708285 1703390 1702704 1757422 1829081
14933 1829081 1880972 1805817 1767287 1804663 1788962 1789110 1811724 1744475 1707194 1670418 1678637 1661724
14921 1661724 1662845 1719726 1764790 1754655 1718544 1711598 1760847 1775567 1768542 1716123 1678771 1677592
14909 1677592 1696609 1722576 1729810 1741001 1705595 1735753 1762565 1709756 1729544 1815168 1817565 1778149
14897 1778149 1790507 1758872 1801416 1790670 1803474 1824010 1788825 1804505 1753252 1764510 1755579
14886 1755579 1766509 1818182 1797376 1749090 1727995 1700080 1756444 1800704 1821114 1811275 1765565
14875 1765565 1767216 1751368 1769586 1808364 1774860 1712266 1743613 1759369 1687195 1673949 1688106
14864 1688106 1726624 1713965 1666889 1681618 1682255 1717760 1730113 1756847 1776360 1706045 1733405 1749694
14852 1749694 1762620 1785582 1853083 1797333 1797668 1778384 1768681 1787284 1734919 1756779 1776097 1729259
14840 1729259 1760087 1801578 1756168 1725548 1737696 1735971 1787237 1797440 1770768 1738511 1774473
14829 1774473 1764169 1779281 1801734 1807672 1821553 1747355 1736237 1700562 1713113 1731537 1752931
14818 1752931 1749353 1747635 1749767 1733830 1749683 1813539 1769616 1681989 1752817 1796676 1772653 1753909
14806 1753909 1770152 1805628 1831316 1837249 1788536 1750099 1763604 1792036 1772327 1750350 1739383
14795 1739383 1756210 1718097 1722259 1746237 1744004 1724543 1741758 1763347 1778542 1813697 1853096 1871245
14783 1871245 1751222 1722072 1755968 1769545 1762755 1842159 1894718 1901212 1832148 1826455 1778034 1738911
14771 1738911 1795159 1863050 1830872 1850099 1796981 1760308 1779472 1804317 1822157 1790807 1773083
14760 1773083 1772486 1810707 1781196 1721030 1674749 1731639 1717221 1744003 1735330 1729953 1722308 1721960 1708177
14747 1708177 1812507 1786643 1809825 1813473 1765045 1770157 1827320 1773225 1792018 1730939 1780024
14736 1780024 1780032 1757990 1773031 1730914 1710605 1719912 1787416 1748343 1755117 1777435 1756459 1707066
14724 1707066 1679757 1739508 1816475 1754628 1746101 1798752 1800449 1773756 1862220 1876825 1864535 1856822
14712 1856822 1766161 1817330 1860590 1862825 1761146 1699171 1790826 1749130 1768609 1756448 1746533
14701 1746533 1753067 1763192 1801045 1788584 1715792 1735508 1754473 1735895 1821005 1900891 1815001
14690 1815001 1741531 1709908 1692311 1743385 1754617 1733603 1799357 1824640 1796574 1792942 1812930
14679 1812930 1748704 1765956 1816667 1779513 1757899 1742989 1810791 1838861 1824871 1835173 1834359 1807623
14667 1807623 1895325 1943388 1863045 1796941 1726365 1767315 1810681 1816400 1802243 1789134 1787498 1723819
14655 1723819 1759552 1775927 1748309 1747618 1798964 1822897 1784706 1764214 1793776 1815818 1836463 1810622
14643 1810622 1791678 1782875 1809890 1835994 1804622 1749206 1763975 1799135 1826666 1837560 1789353
14632 1789353 1761702 1724021 1806723 1835542 1790310 1744652 1741835 1712463 1732382 1790791 1824865
14621 1824865 1874505 1790312 1753900 1821565 1833326 1873286 1800601 1735257 1738472 1753584 1750336 1736863
14609 1736863 1727797 1782573 1797772 1794815 1777794 1800839 1799109 1821659 1826616 1837930 1838071 1851989
14597 1851989 1814065 1796174 1837135 1825383 1798860 1732381 1792803 1843249 1855594 1841664 1745458
14586 1745458 1745132 1810746 1805124 1816094 1781279 1804214 1807518 1799833 1825508 1793214 1806233 1767881
14574 1767881 1724233 1757701 1797647 1815845 1754872 1717208 1725333 1848793 1826602 1759360 1825350
14563 1825350 1820866 1740469 1772856 1835801 1766107 1765926 1798720 1784593 1799236 1854740 1853700 1810435
14551 1810435 1783618 1745652 1772455 1783116 1807130 1826577 1855643 1814240 1789772 1773760 1837623
14540 1837623 1898630 1906718 1834520 1774339 1722040 1796768 1818919 1831776 1834061 1792699 1730208 1688763
14528 1688763 1771957 1765525 1747677 1778586 1860361 1835718 1840606 1876168 1829306 1813953 1756510 1708550
14516 1708550 1715132 1758405 1779758 1772488 1810656 1769417 1834565 1842600 1821753 1820389 1866528 1840429
14504 1840429 1829194 1793407 1843928 1859847 1873962 1863759 1876865 1853074 1837829 1860847 1860923 1880970
14492 1880970 1815385 1781120 1775476 1864432 1821888 1856773 1838318 1825846 1804322 1824126 1840610
14481 1840610 1804122 1788248 1829642 1813971 1810140 1786646 1808887 1771964 1734608 1744381 1783808 1744371
14469 1744371 1726808 1806094 1859015 1823487 1798390 1818114 1782233 1842403 1797524 1808245 1850385
14458 1850385 1905211 1873564 1862491 1829330 1787048 1844154 1891308 1851981 1841591 1845128 1850755 1751655
14446 1751655 1730081 1754637 1760312 1825229 1805937 1750630 1838933 1887138 1880584 1882894 1835529 1827282
14434 1827282 1832231 1822492 1839294 1900137 1944125 1901051 1860973 1814245 1808201 1770353 1799859 1785291
14422 1785291 1799267 1779344 1765843 1803766 1767183 1815143 1792907 1731629 1763917 1793297 1796298
14411 1796298 1822918 1870708 1906076 1860588 1863597 1790158 1789642 1826304 1878089 1839817 1855280 1849309
14399 1849309 1862928 1838020 1805299 1874824 1902195 1868371 1850262 1831174 1852894 1864205 1867652
14388 1867652 1883795 1824059 1818426 1810361 1783823 1716944 1763701 1799625 1788197 1902067 1892032
14377 1892032 1886206 1909468 1923712 1964340 1878130 1892537 1859260 1862958 1825463 1860094 1808776 1777743
14365 1777743 1844638 1833452 1864973 1859376 1848546 1822688 1820493 1795615 1759988 1726652 1784916 1763491
14353 1763491 1779137 1873641 1873724 1896621 1832229 1832850 1911801 1897794 1847259 1779995 1787769 1840989
14341 1840989 1902242 1814897 1839106 1907171 1902986 1881563 1846418 1858885 1891912 1842659 1788770
14330 1788770 1828735 1833840 1850910 1894145 1907418 1850565 1859223 1909226 1864413 1797872 1802188 1815487
14318 1815487 1807280 1816059 1837427 1856391 1911392 1908094 1881074 1857843 1870573 1904425 1883475 1859871
14306 1859871 1857514 1885809 1856604 1814075 1809148 1857221 1859745 1816303 1856464 1886940 1884128 1879950
14294 1879950 1847427 1821714 1870516 1899299 1877845 1866748 1813983 1774753 1755282 1728608 1764509
14283 1764509 1867619 1910009 1912298 1869899 1868976 1906569 1886235 1846866 1807918 1781109 1844115 1877178
14271 1877178 1853967 1855439 1822433 1813243 1824048 1853887 1855655 1843183 1808626 1848837 1848194 1790888
14259 1790888 1793163 1808120 1804810 1824316 1892698 1911877 1847414 1825409 1886436 1936913 1906888 1900942
14247 1900942 1941373 1873103 1831143 1840803 1847474 1819703 1821582 1870683 1873397 1802964 1777023 1802277
14235 1802277 1812917 1853870 1842829 1859399 1876556 1877605 1839710 1835850 1828100 1826584 1939274 1966294
14223 1966294 1938680 1980021 1905684 1902845 1848276 1824336 1887781 1898244 1874433 1877712 1908637 1922352
14211 1922352 1861053 1865416 1860510 1828146 1821271 1842803 1936011 1821822 1853160 1863461 1839921 1858130
14199 1858130 1877349 1797274 1800117 1837313 1896087 1951233 1914468 1929985 1893542 1865517 1845569
14188 1845569 1892651 1913780 1870077 1969859 1937038 1911306 1945728 1853801 1880633 1888387 1847926
14177 1847926 1900799 1853230 1829423 1888498 1866079 1839572 1817354 1832179 1859026 1844634 1827270
14166 1827270 1855496 1830981 1791543 1837664 1882278 1825988 1816075 1863912 1884440 1937092 1840978
14155 1840978 1899064 1976524 1873655 1900159 1883303 1874985 1883205 1894565 1909875 1886013 1954604
14144 1954604 1929654 1895294 1967520 1905332 1876529 1880274 1903010 1842100 1815531 1833352 1864147
14133 1864147 1920447 1905370 1861844 1890788 1878299 1869896 1927086 1905687 1893302 1923589 1985402
14122 1985402 1999944 1942389 1870820 1891505 1935051 1894107 1812535 1846181 1839023 1820448 1867439
14111 1867439 1868337 1887282 1835785 1801956 1808308 1864338 1959583 1867555 1876470 1904446 1925055 1945492
14099 1945492 1909838 1953746 1875679 1852705 1881043 1900610 1861951 1867866 1873750 1867919 1905898 1887949
14087 1887949 1912051 1912783 1881558 1951817 1971500 1900819 1886046 1949933 1986608 1934812 1944052 1895657
14075 1895657 1923009 1923630 1907308 1881904 1924088 1920367 1855139 1880896 1855022 1946513 1937656 1947247
14063 1947247 1937049 1920835 1859054 1849201 1870545 1897884 1915613 1821642 1837747 1819156 1821356 1865691
14051 1865691 1871186 1850165 1825494 1846976 1824384 1791201 1834167 1931026 1929728 1908433 1944359 1989041
14039 1989041 1937046 1893521 1972627 1959362 1947725 1920402 1891799 1858254 1901266 1976420 1921502
14028 1921502 1932420 1909829 1894228 1964380 1970359 1927715 1875805 1879779 1890930 1956638 1939175 1949526
14016 1949526 1976507 1934845 1990176 1913595 1911522 1986880 1926782 1930024 1882076 1940064 1908799 1894554
14004 1894554 1934882 1958992 1946053 1874337 1915813 1915946 1919671 1865443 1816859 1811749 1865353 1897312
13992 1897312 1957323 1947736 1883514 1810583 1820515 1895661 1887356 1946112 1928571 1882802 1944957 1922236
13980 1922236 1908398 1904983 1928237 1941181 1882499 1917631 1946957 1905689 1938704 1955301 1922302
13969 1922302 1913753 1876719 1877140 1904381 1886893 1838531 1945155 1958919 1922198 1910955 1924918 1945921
13957 1945921 1997013 1939314 1938458 1957910 1993036 1964505 1979124 1949691 1931797 1971871 1920196 1911224
13945 1911224 1928118 1905537 1887649 1891670 1973989 2033407 1970267 1912017 1917599 1848603 1834609 1972613
13933 1972613 1916946 1936446 1947802 1925964 1856147 1830625 1888396 1947719 1932529 1891386 1839612
13922 1839612 1886388 1916157 1940443 1999781 2036944 1978329 2040221 2015816 1947237 1927846 1918662
13911 1918662 1890087 1927324 1969892 1965820 1922186 1977320 1956676 1907946 1925859 1898188 1871859
13900 1871859 1855831 1945060 1953951 2017127 2019162 1994220 1956752 1983456 1909797 1900959 1975494 1889762
13888 1889762 1963486 1992704 1929766 1945055 1980391 1949985 1959277 1922164 1918461 1920156 1946496 1966563
13876 1966563 1929147 1954884 1951893 1952360 1943537 1877036 1882900 1916778 1944272 1950582 1916861 1953672
13864 1953672 1961277 1968878 1933963 1974221 1965903 1932192 1990615 1961320 1956432 1936041 1978114 2016803
13852 2016803 2023713 2004167 2000019 1974874 1985963 2000360 1904688 1877854 1897126 1896928 1900358 1955612
13840 1955612 1942166 1971798 1950648 1983793 1947260 1972902 1979587 1935733 1914808 1929176 2001313
13829 2001313 2011224 1943913 1945943 1961174 1936286 1946015 2004634 1929484 1864673 1872124 1889674 1862566
13817 1862566 1916091 1915912 1917978 1864681 1876030 1913761 1950906 2044801 2042019 1998647 1951172 1964834
13805 1964834 1958700 1913005 1944129 1954982 1931254 1980950 1978396 1975434 1923445 1973094 1980425 2001744
13793 2001744 2021501 1995379 1968458 1979154 1980156 1952163 1983418 1946592 1912822 1956776 1929976
13782 1929976 1961781 1939474 1933766 1945687 1959949 1975516 1979936 2000954 1947199 1940143 1958179 1950394
13770 1950394 1994970 2007362 2007105 2021880 1977983 1984533 2010115 1954533 1938950 1988546 2037483 1946500
$$ [...]
##END NTUPLES=NMR SPECTRUM
##END=
