##TITLE=1H_DE-80H_X3
 200.13MHz, d2o
 8 sc
 
 19ns.26.2.2025
##JCAMPDX= 6.0         $$ Bruker NMR JCAMP-DX V2.0
##DATA TYPE= NMR SPECTRUM
##DATA CLASS= NTUPLES
##ORIGIN= UXNMR, Bruker Analytische Messtechnik GmbH
##OWNER= pz
$$ XWIN-NMR		Version 3.5
$$ Wed Jun  4 10:36:13 2025 Russian Standard Time (UT+4h)  Yarkov@DPX200
##.OBSERVE FREQUENCY= 200.1313
##.OBSERVE NUCLEUS= ^1H
##.ACQUISITION MODE= SIMULTANEOUS
##.ACQUISITION SCHEME= undefined
##.AVERAGES= 8
##.DIGITISER RES= 18
##SPECTROMETER/DATA SYSTEM= spect
##.PULSE SEQUENCE= zg30
##.SOLVENT NAME= CDCl3
##.SHIFT REFERENCE= (INTERNAL, CDCl3, 0, 15.5188)
##AUDIT TRAIL= $$ (NUMBER, WHEN, WHO, WHERE, WHAT)
$$ ##TITLE= Audit trail, XWIN-NMR		Version 3.5
$$ ##JCAMPDX= 5.01
$$ ##ORIGIN= Bruker BioSpin GmbH
$$ ##OWNER= Yarkov
$$ C:/Bruker/XWIN-NMR/data/yarkov2/nmr/H-C/1/pdata/1/auditp.txt
$$ ##AUDIT TRAIL=  $$ (NUMBER, WHEN, WHO, WHERE, WHAT)
(   1,<2025-06-04 10:35:14.35 +0400>,<Yarkov>,<DPX200>,
      <created by zg, POWCHK disabled, PULCHK disabled
       configuration hash MD5:
       00 E9 B6 7A A2 85 ED C7 34 08 36 98 17 FE 4E 26
       data hash MD5: 16K
       FF 68 07 0E F8 EE 64 0A ED FD 38 EA 96 F3 D2 35>)
(   2,<2025-06-04 10:35:19.34 +0400>,<Yarkov>,<DPX200>,
      <Start of raw data processing
       efp BC_mod = 2 LB = 0.25 FT_mod = 6 PKNL = 1 PHC0 = -1710.501 PHC1 = 9.76656 SI = 16K 
       data hash MD5: 16K
       64 33 C9 EA C0 FD E3 54 AF A3 AF 07 DF 22 2C 63>)
(   3,<2025-06-04 10:35:26.57 +0400>,<Yarkov>,<DPX200>,
      <abs ABSG = 5 
       data hash MD5: 16K
       E0 1D D1 63 DE F3 F9 98 D8 AD CE DC 2D AE 3D 83>)
$$ ##END=
$$ 
$$ hash MD5
$$ 0E 8C DD 4C 72 D3 9A F0 F2 55 B1 71 AB 1B BC FE
##$RELAX= 
##$RELAX= 
##$RELAX= 
##$RELAX= 
##$RELAX= 
##$RELAX= 
$$ Bruker specific parameters
$$ --------------------------
##$DU= <C:/Bruker/XWIN-NMR>
##$EXPNO= 1
##$NAME= <H-C>
##$PROCNO= 1
##$TYPE= <nmr>
##$USER= <yarkov2>
##$AMP= (0..31)
100 100 100 100 100 100 100 100 100 100 100 100 100 100 100 100 100 100 
100 100 100 100 100 100 100 100 100 100 100 100 100 100 
##$AQSEQ= 0
##$AQ_mod= 1
##$AUNM= <au_zg>
##$AUTOPOS= <>
##$BF1= 200.13
##$BF2= 200.13
##$BF3= 200.13
##$BF4= 200.13
##$BF5= 200.13
##$BF6= 200.13
##$BF7= 200.13
##$BF8= 200.13
##$BYTORDA= 1
##$CFDGTYP= 0
##$CFRGTYP= 5
##$CHEMSTR= <none>
##$CNST= (0..31)
1 1 145 1 1 1 1 1 1 1 1 1 1 1 1 1 1 1 1 1 1 1 1 1 1 1 1 1 1 1 1 1 
##$CPDPRG= <>
##$CPDPRG1= <>
##$CPDPRG2= <>
##$CPDPRG3= <>
##$CPDPRG4= <mlev>
##$CPDPRG5= <mlev>
##$CPDPRG6= <mlev>
##$CPDPRG7= <mlev>
##$CPDPRG8= <mlev>
##$CPDPRGB= <>
##$CPDPRGT= <>
##$D= (0..31)
0 0.7 0 0 0 0 0 0 0 0 0 0.03 0 0 0 0 0 0 0 0 0 0 0 0 0 0 0 0 0 0 0 0 
##$DATE= 1749018913
##$DBL= (0..7)
120 120 120 120 120 120 120 120 
##$DBP= (0..7)
150 150 150 150 150 150 150 150 
##$DBP07= 0
##$DBPNAM0= <>
##$DBPNAM1= <>
##$DBPNAM2= <>
##$DBPNAM3= <>
##$DBPNAM4= <>
##$DBPNAM5= <>
##$DBPNAM6= <>
##$DBPNAM7= <>
##$DBPOAL= (0..7)
0.5 0.5 0.5 0.5 0.5 0.5 0.5 0.5 
##$DBPOFFS= (0..7)
0 0 0 0 0 0 0 0 
##$DE= 6
$$ [...]
##$SUBNAM3= <"">
##$SUBNAM4= <"">
##$SUBNAM5= <"">
##$SUBNAM6= <"">
##$SUBNAM7= <"">
##$SUBNAM8= <"">
##$SUBNAM9= <"">
##$SW= 18.0517328524113
##$SWIBOX= (0..15)
0 0 2 0 0 0 0 0 0 0 0 0 0 0 0 0 
##$SW_h= 3612.71676300578
##$TD= 16384
##$TD0= 1
##$TE= 0
##$TE2= 300
##$TE3= 300
##$TEG= 300
##$TL= (0..7)
0 120 120 120 120 120 120 120 
##$TP= (0..7)
150 150 150 150 150 150 150 150 
##$TP07= 0
##$TPNAME0= <>
##$TPNAME1= <>
##$TPNAME2= <>
##$TPNAME3= <>
##$TPNAME4= <>
##$TPNAME5= <>
##$TPNAME6= <>
##$TPNAME7= <>
##$TPOAL= (0..7)
0.5 0.5 0.5 0.5 0.5 0.5 0.5 0.5 
##$TPOFFS= (0..7)
0 0 0 0 0 0 0 0 
##$TUNHIN= 0
##$TUNHOUT= 0
##$TUNXOUT= 0
##$USERA1= <user>
##$USERA2= <user>
##$USERA3= <user>
##$USERA4= <user>
##$USERA5= <user>
##$V9= 5
##$VALIST= <valist>
##$VCLIST= <CCCCCCCCCCCCCCC>
##$VD= 0
##$VDLIST= <DDDDDDDDDDDDDDD>
##$VPLIST= <PPPPPPPPPPPPPPP>
##$VTLIST= <TTTTTTTTTTTTTTT>
##$WBST= 1024
##$WBSW= 4
##$XGAIN= (0..3)
0 0 0 0 
##$XL= 0
##$YL= 0
##$YMAX_a= 441117
##$YMIN_a= -402044
##$ZGOPTNS= <>
##$ZL1= 120
##$ZL2= 120
##$ZL3= 120
##$ZL4= 120
##$ABSF1= 15.51882
##$ABSF2= -2.53303
##$ABSG= 5
##$ABSL= 3
##$ALPHA= 0
##$AQORDER= 0
##$ASSFAC= 0
##$ASSFACI= 0
##$ASSFACX= 0
##$ASSWID= 0
##$AUNMP= <proc_1d>
##$AZFE= 0.1
##$AZFW= 0.1
##$BCFW= 0
##$BC_mod= 2
##$BYTORDP= 0
##$COROFFS= 0
##$CY= -3
##$DATMOD= 1
##$DC= 0
##$DFILT= <>
##$DTYPP= 0
##$F1P= 0
##$F2P= 0
##$FCOR= 1
##$FTSIZE= 16384
##$FT_mod= 6
##$GAMMA= 0
##$GB= 0
##$INTBC= 1
##$INTSCL= 3.241238e-09
##$ISEN= 128
##$LB= 0.25
##$LEV0= 0
##$LPBIN= 0
##$MAXI= 10000
##$MC2= 0
##$MEAN= 0
##$ME_mod= 0
##$MI= 1.114404
##$NCOEF= 0
##$NC_proc= -6
##$NLEV= 6
##$NOISF1= 3.799351
##$NOISF2= 2.8
##$NSP= 0
##$NTH_PI= 0
##$NZP= 0
##$OFFSET= 15.51882
##$PC= 1
##$PHC0= -1710.501
##$PHC1= 9.76656
##$PH_mod= 1
##$PKNL= yes
##$PPARMOD= 0
##$PSCAL= 0
##$PSIGN= 0
##$REVERSE= no
##$SF= 200.130000577829
##$SI= 16384
##$SIGF1= 3
##$SIGF2= 2
##$SINO= 0.751879
##$SIOLD= 32768
##$SREGLST= <19F.Aceton>
##$SSB= 0
##$STSI= 16384
##$STSR= 0
##$SW_p= 3612.71676300578
##$SYMM= 0
##$S_DEV= 0
##$TDeff= 16384
##$TDoff= 0
##$TI= <>
##$TILT= no
##$TM1= 0
##$TM2= 0
##$TOPLEV= 0
##$USERP1= <user>
##$USERP2= <user>
##$USERP3= <user>
##$USERP4= <user>
##$USERP5= <user>
##$WDW= 1
##$XDIM= 16384
##$YMAX_p= 408670765
##$YMIN_p= -277832
$$ End of Bruker specific parameters
$$ ---------------------------------
##NTUPLES= NMR SPECTRUM
##VAR_NAME=  FREQUENCY,     SPECTRUM/REAL,   SPECTRUM/IMAG
##SYMBOL=    X,             R,               I
##VAR_TYPE=  INDEPENDENT,   DEPENDENT,       DEPENDENT
##VAR_FORM=  AFFN,          ASDF,            ASDF
##VAR_DIM=   16384,         16384,           16384
##UNITS=     HZ,            ARBITRARY UNITS, ARBITRARY UNITS
##FACTOR=    0.220516191357247, 1,           1
##FIRST=     3105.78141733438, 0,            0
##LAST=      -506.935345671399, 0,           0
##MIN=       -506.935345671399, -277832,     0
##MAX=       3105.78141733438, 408670765,    0
$$ Real data points
##PAGE= N=1
##DATA TABLE= (X++(R..R)), XYDATA
$$ [...]
6507H13398m2698M4108O0974m4649K0057l0601J2020o899r931j940J0385J8567
$$ 813398 770700 814808 875782 831133 851190 820589 832609 825710 815779 813839 824224 842791
6495H42791m087K9413L7049K3516j7614k283P8193J3897M148J3918P7678K1879
$$ 842791 838704 868117 905166 928682 911068 908785 986978 1000875 1005023 1018941 1096619 1118498
6483A118498n1151m319j8004l994R5001J27067L6177r9331j2728K1410O2226J26506
$$ 1118498 1067347 1063028 1045024 1041030 1136031 1263098 1299275 1199944 1187216 1208626 1270852 1397358
6471A397358Q5456L3171l2051N5163N7372M3625K5258L2387Q3393P0089J6861
$$ 1397358 1482814 1515985 1483934 1539097 1596469 1640094 1665352 1697739 1781132 1851221 1868082
6460A868082L7170N0086L174K0224J2382k139L654J7300M8999o0189j6369l2918
$$ 1868082 1905252 1955338 1958512 1978736 1991118 1988979 1992633 2009933 2058932 1998743 1982374 1949456
6448A949456L3118l5185l6530p274n6211m0832J7380r054o1098N461R176j7834
$$ 1949456 1982574 1947389 1910859 1903585 1847374 1806542 1823922 1814868 1753770 1759231 1768407 1750573
6436A750573k8676l3117l1333O760m8508l1513m3373k7608l4183q3522k5961l7433
$$ 1750573 1721897 1688780 1657447 1664207 1615699 1584186 1540813 1513205 1479022 1395500 1369539 1332106
6424A332106K0923j8300M373M0471k2709o3208n1360j806K6283k8749l064m9900
$$ 1332106 1353029 1334729 1339102 1379573 1356864 1293656 1242296 1240490 1266773 1238024 1234960 1185060
6412A185060L2729K5026n4499n5399k552L5946n8847m2252O579k4060j4254J599
$$ 1185060 1217789 1242815 1188316 1132917 1130365 1166311 1107464 1065212 1071791 1047731 1033477 1035076
6400A035076N7672K2858j26092L5802K0845j9086m6366K1999K5348Q295L655p4285
$$ 1035076 1092748 1115606 989514 1025316 1046161 1027075 980709 1002708 1028056 1036351 1040006 965721
6388I65721j2481M9902K9717k5475j28663K08j1715J4087N2969L6063l6135k8383
$$ 965721 953240 1003142 1032859 1007384 878721 878929 867214 881301 934270 970333 934198 905815
6376I05815p7953o0950m0897K070J6063k1998k3938l2543N94n4152L7559M1546
$$ 905815 827862 766912 726015 728085 744148 722150 698212 665669 666263 612111 649670 691216
6364F91216O9292j1328o5010K6219j02209j8914L1230l6144L0349L6718K116q0825
$$ 691216 760508 749180 684170 710389 608180 589266 620496 584352 614701 651419 653535 572710
6352E72710K1007P5999m5150j09098K7520L1014n1187p5855O2820l2626Q97M3590
$$ 572710 593717 669716 624566 515468 542988 574002 522815 446960 509780 477154 478051 521641
6340E21641j4166j3335j7790l391j2956J2712J4165P6611k7192l6645k3450J7406
$$ 521641 507475 494140 476350 472959 460003 472715 486880 563491 536299 499654 476204 493610
6328D93610R605j9466J9283L9862k592L4941k594m7480J8320K4245M9L693l6940
$$ 493610 503215 483749 503032 542894 540302 575243 572649 525169 543489 567734 567783 571476 534536
6315E34536J584l102M5064j9415K759j7177n3600M5521P9894J5924n1549K5459
$$ 534536 536120 533018 578082 558667 561426 544249 490649 536170 616064 631988 580439 605898
6303F05898j0834m3992P3575o154n6842p0017J7057N7968k5901Q5993k6125M343
$$ 605898 595064 551072 624647 618493 561651 491634 508691 566659 540758 626751 600626 604969
6291F04969M2471L9035L0861j5714R604o6883M6058J07818k2358L5517o1804J2838
$$ 604969 647440 686475 717336 701622 711226 644343 690401 798219 775861 811378 749574 762412
6279G62412L7347K4040j969L3065K3266j5480J0707J5298O8168O543m5902J0928
$$ 762412 799759 823799 821830 854895 878161 862681 873388 888686 956854 963397 917495 928423
6267I28423O1778J9539J6906J3379N8760L1657j5962K6280P153J9650n636m3025
$$ 928423 990201 1009740 1026646 1040025 1098785 1130442 1114480 1140760 1147913 1167563 1161927 1118902
6255A118902M4270N2026O1731J4020M0114O3174K8163M6365K28P2114L6064J02912
$$ 1118902 1163172 1215198 1276929 1290949 1331063 1394237 1422400 1468765 1468993 1541107 1577171 1680083
6243A680083R6677K574K7242J49956P3967J32043K7485O7186J41018R7562N9709
$$ 1680083 1776760 1779334 1806576 1956532 2030499 2162542 2190027 2257213 2398231 2495793 2555502
6232B555502J06632J41597J05490R8232J06335J07075J16147K29133J90726K00064
$$ 2555502 2662134 2803731 2909221 3007453 3113788 3220863 3337010 3566143 3756869 3956933
6222C956933K40408L29484L22901K39612K06076L01907K84118K96470K93481M19056
$$ 3956933 4197341 4526825 4849726 5089338 5295414 5597321 5881439 6177909 6471390 6890446
6212F890446L45567L99313M61855N80419O68186P18827P55792O76006N51274K24302
$$ 6890446 7236013 7635326 8097181 8677600 9345786 10064613 10820405 11496411 12047685 12271987
6202A2271987m7684j29363j03827q8508k1950j4773L9928J16693J77321K84520
$$ 12271987 12224303 12094940 11991113 11902605 11880655 11865882 11905810 12022503 12199824 12484344
6192A2484344L62858M01363L08681K50188K68843J20571J90689M36742M63031
$$ 12484344 12847202 13248565 13557246 13807434 14076277 14196848 14387537 14824279 15287310
6183A5287310N90029P70926Q71885R44324J098437Q82527J69715o25844j288845
$$ 15287310 15877339 16648265 17520150 18464474 19562911 20445438 20615153 19989309 18700464
6174A8700464j506672j338245j058423r48888p86910p45126n74079m69968l58263
$$ 18700464 17193792 15855547 14797124 13848236 13061326 12316200 11742121 11272153 10913890
6165A0913890j78855k99488j82383r9313j00569J04553J59015J34590L20705M32378
$$ 10913890 10735035 10435547 10253164 10153851 10053282 10157835 10316850 10451440 10772145 11204523
6155A1204523L91292M51964M06325L15275K83605J9197l71636o48717q05909p20979
$$ 11204523 11595815 12047779 12454104 12769379 13052984 13072181 12700545 12051828 11245919 10524940
6145A0524940n76999n26984l29751l10523j87921j24436q6994j7330P5323O502
$$ 10524940 9947941 9420957 9091206 8780683 8592762 8468326 8381332 8364002 8439325 8445827
6135H445827L2010J63056K23051K60397K87974K54390K99067L15870L99721M70634
$$ 8445827 8477837 8640893 8863944 9124341 9412315 9666705 9965772 10281642 10681363 11151997
6125A1151997M50694N19742N51914N47626N89741P11234P61196Q73227J014148
$$ 11151997 11602691 12122433 12674347 13221973 13811714 14522948 15284144 16157371 17171519
6116A7171519J076723J213344J353610J385049J326378J134793R38744P13901
$$ 17171519 18248242 19461586 20815196 22200245 23526623 24661416 25600160 26314061
6108B6314061P00488P19324P28912O82393Q65421Q65244Q01663R85050J169385
$$ 26314061 27014549 27733873 28462785 29145178 30010599 30875843 31677506 32662556 33831941
6099C3831941J364499J543035J959008K388216K531697K519427K335547K134337
$$ 33831941 35196440 36739475 38698483 41086699 43618396 46137823 48473370 50607707
6091E0607707K116846K107902J961463J765490J478795J487540J378732R33137
$$ 50607707 52724553 54832455 56793918 58559408 60038203 61525743 62904475 63837612
6083F3837612N31753J83342P5077L29748P48186R96211J142579R11205N82025
$$ 63837612 64369365 64552707 64627784 64957532 65705718 66701929 67844508 68755713 69337738
6074F9337738L68047K59715L57141N49685R11965J336429K008284K638126K232481
$$ 69337738 69705785 69965500 70322641 70872326 71784291 73120720 75129004 77767130 79999611
6065G9999611R47181m90329j125933j069118j033596j434610k289458l037643
$$ 79999611 80946792 80456463 79330530 78261412 77227816 75793206 73503748 70466105
6057G0466105l387569l232073l046549k936635k705451k323787k022479j645688
$$ 70466105 67078536 63846463 60799914 57863279 55157828 52834041 50811562 49165874
6049D9165874j381069j189831j241359j078361q17258p37657q21714j024966j204043
$$ 49165874 47784805 46594974 45353615 44275254 43457996 42720339 41898625 40873659 39669616
6040C9669616j238279j165057j136224j280442j514939j573357j365709j150190
$$ 39669616 38431337 37266280 36130056 34849614 33334675 31761318 30395609 29245419
6032B9245419r86190j141103j559854j707624j737575j655166j381298j192923
$$ 29245419 28259229 27118126 25558272 23850648 22113073 20457907 19076609 17883686
6024A7883686r61527q60389p78208p07405o63608n31183m89768l52646k74111
$$ 17883686 16922159 16061770 15283562 14576157 13912549 13381366 12891598 12538952 12264841
6015A2264841k49055k80450k83609m51294m57041m57141m88004m81483l84563
$$ 12264841 12015786 11735336 11451727 11000433 10543392 10086251 9598247 9116764 8732201
6006H732201l85469k81865l39573k43291k28071k95839k11426j53629j40633j50474
$$ 8732201 8346732 8064867 7725294 7482003 7253932 6958093 6746667 6593038 6452405 6301931
5996F301931j19921l5597o1961j14879k8495m5604j985L7857N4068K4852K5877
$$ 6301931 6182010 6146413 6084452 5969573 5941078 5895474 5893489 5931346 5985414 6010266 6036143
5985F036143N3538P4254O050m03q5212q5408n8522q5573n4110q5915k5320J0758
$$ 6036143 6089681 6163935 6169985 6169582 6084370 5998962 5940440 5854867 5800757 5714842 5689522 5700280
5973E700280o0036N7605N6052K3288M0869K0768L7930Q8408K5590J3652J10872
$$ 5700280 5640244 5697849 5753901 5777189 5818058 5838826 5876756 5965164 5990754 6004406 6115278
5962F115278J24623J41001R5581J89731K36720K82375L69464K90162L447j34787
$$ 6115278 6239901 6380902 6476483 6666214 6902934 7185309 7554773 7844935 7848382 7713595
5952G713595k56119k14403j81618j57188r1256j4311p8843n0981q92l3138k7295
$$ 7713595 7457476 7243073 7061455 6904267 6813011 6798700 6719857 6668876 6667984 6634846 6607551
5941F607551l2064m7608l055N4295m6296m6387m962R726M4092J44999K54365K41011
$$ 6607551 6575487 6527879 6524824 6579119 6532823 6486436 6481474 6491200 6535292 6680291 6934656 7175667
5929G175667K71659K45368J52235N060j92733m38437m67955m12292l47616k33069
$$ 7175667 7447326 7692694 7844929 7849989 7657256 7218819 6750864 6338572 5990956 5757887
5919E757887k72086k21273k48433j28612j59704j56350j04532j40111j54700l4759
$$ 5757887 5485801 5264528 5016095 4887483 4727779 4571429 4466897 4326786 4172086 4137327
5909D137327j1825j35755p3179r604J3375R190J57111J68400J03859K30753J56030
$$ 4137327 4125502 3989747 3916568 3906964 3920339 3929529 4086640 4255040 4358899 4589652 4745682
5898D745682n864j58849k83507l03530l16574k69886j50668k24491j71892j40910
$$ 4745682 4739818 4580969 4297462 3993932 3677358 3407472 3256804 3032313 2860421 2719511
5888B719511o5356j36076j26422j1943j4108j50386k1249p2450n5538n0108o1844
$$ 2719511 2654155 2518079 2391657 2379714 2365606 2215220 2193971 2121521 2065983 2015875 1954031
5877A954031K0924L25N7818R0842J24292L3233O5505L499o3738j28332k25711
$$ 1954031 1974955 1975280 2033098 2123940 2248232 2281465 2346970 2350469 2286731 2158399 1932688
5866A932688j28829j2087l5173j12388j20503q9832p5967j8209J4835l0196p7702
$$ 1932688 1803859 1791772 1756599 1644211 1523708 1433876 1357909 1339700 1354535 1324339 1246637
5855A246637N5706j04574r0964k9174n441j6676l364M2380l7952n2042L5994M3470
$$ 1246637 1302343 1197769 1106805 1077631 1072190 1055514 1052150 1094530 1056578 1004536 1040530 1084000
5843A084000K9297J0963p1407k0533o0827k4688J5548n924l2999p2646j3080J8081
$$ 1084000 1113297 1124260 1052853 1032320 971493 946805 962353 956429 923430 850784 837704 855785
5831H55785J2260j9090l4507l8954n8363k9742n9895P052l8814l473Q997K8338
$$ 855785 868045 848955 814448 775494 717131 687389 627494 634546 595732 592259 601256 629594
5819F29594J273p7440M5526j4124M5744j179j342N583r1910j7212L1277K3378
$$ 629594 630867 553427 598953 584829 630573 629394 628052 633635 541725 524513 555790 579168
5807E79168J7656r391L98m7292j3326n408K0094l7438l3797m2867j3821j7078
$$ 579168 596824 587433 587831 540539 527213 521805 541899 504461 470664 427797 413976 396898
5795C96898j4153L0207o7792M0479N1767M2610K1165m2662O864R685k1068l0124
$$ 396898 382745 412952 345160 385639 437406 480016 501181 458519 465383 475068 454000 423876
5783D23876K1191k131k9914o4094K3990O9783r538L9746J3720j9768J0469j6312
$$ 423876 445067 442936 413022 348928 372918 442701 433163 472909 486629 466861 477330 461018
5771D61018M6018k7016n40k877k1708M8806P980n2966J3192J19188L4263j6836
$$ 461018 507036 480020 479480 476603 454895 503701 511681 458715 471907 591095 625358 608522
5759F08522r661J9708M4599K7155j6613r10q8853J6342j5921L7228K0229L220
$$ 608522 598861 618569 663168 690323 673710 672800 583947 600289 584368 621596 641825 645045
5747F45045M9219O3329K9566j3717j6274l3583L6841O1429m035J4064m5842j4912
$$ 645045 694264 757593 787159 773442 757168 723585 760426 821855 817820 831884 786042 771130
5735G71130L171L1097L7921r170R5830n0598m9067M6231j482Q297j1106p2195
$$ 771130 774301 805398 843319 834149 929979 879381 830314 876545 875063 883360 872254 800059
5723H00059n874K4085n9530p38P1534m8232K9471r2140q230m3493P3901m0666
$$ 800059 794185 818270 758740 758002 829536 781304 810775 718635 710405 666912 740813 700147
5711G00147l2199J5549m2949n630Q8660L2872n8650K5109q298J3716J7280L8892
$$ 700147 667948 683497 640548 634918 723578 756450 697800 722909 714611 728327 745607 784499
5699G84499o9802L3458M0618j2908l5610L5341o6084K7950j9965O523j341K5721
$$ 784499 714697 748155 788773 775865 740255 775596 709512 737462 717497 724020 722679 748400
5687G48400k7954L5434J561p4902k7147N3842p618j3929L9953N0747O0282P97
$$ 748400 720446 755880 757441 682539 655392 709234 701616 687687 727640 778387 838669 839466
5675H39466j5511L3532N1802r271N1761N0418K1604P6M2181N1155P9126P6892
$$ 839466 823955 857487 909289 900018 951779 1002197 1023801 1023877 1066058 1117213 1196339 1273231
5663A273231M1338N2963q629M2777L0541q15K300J0803M4413O804n8071j7763
$$ 1273231 1314569 1367532 1358903 1401680 1432221 1431406 1433706 1444509 1488922 1495726 1437655 1419892
5651A419892j0052k4624K1457L2293j0434L8856L1921p404L9194R7433P0959L4649
$$ 1419892 1409840 1385216 1406673 1438966 1428532 1467388 1499309 1491905 1531099 1628532 1699491 1734140
5639A734140P4026K7803J35869L7852J03907J24400J25828N1180Q4994J5816j3028
$$ 1734140 1808166 1835969 1971838 2009690 2113597 2237997 2363825 2415005 2499999 2515815 2502787
5628B502787M237K2404r9555m2292J25051K6975j57322P370r892n2606J7572O6023
$$ 2502787 2507024 2529428 2429873 2387581 2512632 2539607 2382285 2389655 2379763 2327157 2344729 2410752
5616B410752L7770K3754J7628j3148J16162P6700J24493Q4061P2429Q9088J79900
$$ 2410752 2448522 2472276 2489904 2476756 2592918 2669618 2794111 2878172 2950601 3039689 3219589
5605C219589J38726R2747R4631J26341Q6566J35958J80997J19265J04655J25107
$$ 3219589 3358315 3451062 3545693 3672034 3758600 3894558 4075555 4194820 4299475 4424582
5595D424582J03200R2790J19279K3878k0741O1486P9864J18231R8699J63486J63327
$$ 4424582 4527782 4620572 4739851 4763729 4742988 4804474 4884338 5002569 5101268 5264754 5428081
5584E428081J81770K42186J98460L83988L54056M43920M56468M90331M92640M11691
$$ 5428081 5609851 5852037 6050497 6434485 6788541 7232461 7688929 8179260 8671900 9083591
5574I083591L03885J82876J68736R5412p6247j48612j22228j43752j31630j02711
$$ 9083591 9387476 9570352 9739088 9834500 9758253 9609641 9487413 9343661 9212031 9109320
5564I109320q2465N3427J07395J67937K04107J31267K27032K01613J45245R5345
$$ 9109320 9026855 9080282 9187677 9355614 9559721 9690988 9918020 10119633 10264878 10360223
5554A0360223K90511L62324N00337O48063P66713P98753O20158K83636p1764l23647
$$ 10360223 10650734 11013058 11513395 12161458 12928171 13726924 14347082 14630718 14558954 14235307
5544A4235307n75729q52147r66900q80321p72597o34391n90442n24781l65553
$$ 14235307 13659578 12807431 11840531 10960210 10187613 9553222 8962780 8437999 8072446
5535H072446l25170j58458j80433p9541M0191P4304J66334J38559O4996J59278
$$ 8072446 7747276 7588818 7408385 7328844 7369035 7443339 7609673 7748232 7813228 7972506
5525G972506L11700L13877N10148M77023N77144N33566L24917J01181k46533n61592
$$ 7972506 8284206 8598083 9108231 9585254 10162398 10695964 11020881 11122062 10875529 10313937
5515A0313937r02938r38093q43863p05842n99292m84404m50276l38610k65866
$$ 10313937 9410999 8472906 7629043 6923201 6323909 5839505 5389229 5050619 4784753
5506D784753j71855k23870j48027j19857n4008O7966L3728N3053O5417J21353
$$ 4784753 4612898 4389028 4241001 4121144 4067136 4135102 4168830 4221883 4287300 4408653
5496D408653K41718K41860K38065M23344L42354L73831L22740N0775k48302n60917
$$ 4408653 4650371 4892231 5130296 5553640 5895994 6269825 6592565 6643340 6395038 5834121
5486E834121o21083m10084l08696l33803k94102k09815j48188j21809q3059p4190
$$ 5834121 5213038 4802954 4494258 4160455 3866353 3656538 3508350 3386541 3303482 3229292
5476C229292k0999m3085N3580M5212P3907J09315J13790J21982J40585J46615
$$ 3229292 3208293 3165208 3218788 3264000 3337907 3447222 3561012 3682994 3823579 3970194
5466C970194J57905K27825J60589K99417R2975N4771q9921j21667n3509l9009
$$ 3970194 4128099 4355924 4516513 4815930 4908905 4963676 4873755 4752088 4698579 4659570
5456D659570N1989J09129J15546J12661K00542J82306K13072L30023L05054L20839
$$ 4659570 4711559 4820688 4936234 5048895 5249437 5431743 5644815 5974838 6279892 6600731
5446F600731M04978N76168P40191P91756R47607Q43634N79806J49562k32826n23682
$$ 6600731 7005709 7581877 8322068 9113824 10061431 10905065 11484871 11634433 11401607 10877925
5436A0877925o21410n55110n19950m21584l97384j96487j50198j19003j07537
$$ 10877925 10256515 9701405 9181455 8759871 8362487 8166000 8015802 7896799 7789262
5427G789262Q4039J30267J95191K94318L01993M14175M58148N64438N82498O91494
$$ 7789262 7873301 8003568 8198759 8493077 8795070 9209245 9667393 10231831 10814329 11505823
5417A1505823Q72779J195319J352574J471027J458099J056899L48393n82834j273516
$$ 11505823 12378602 13573921 14926495 16397522 17855621 18912520 19260913 18678079 17404563
5408A7404563j498443j451383j214676r76191r33528q38212o27807n88433m82535
$$ 17404563 15906120 14454737 13240061 12263870 11330342 10492130 9864323 9275890 8793355
5399H793355l83005j90508j31940n7749K5374O8791J17241K16639K40590K21619
$$ 8793355 8410350 8219842 8087902 8030153 8055527 8124318 8241559 8458198 8698788 8920407
5389H920407K31585L20992K96519K44076K61035k3351m01270p69756r03699q57702
$$ 8920407 9151992 9472984 9769503 10013579 10274614 10251263 9849993 9080237 8176538 7318836
5379G318836p25318o91375n18556n08338m44023l78390l74605k39753j62843k20791
$$ 7318836 6593518 5902143 5383587 4875249 4431226 4052836 3678231 3438478 3275635 3054844
5369C054844j47217l4752q7331q2819o0925k6236o6041o477n0623n4033j86351
$$ 3054844 2907627 2872875 2785544 2702725 2641800 2615564 2549523 2543046 2492423 2438390 2252039
5358B252039j74102j67322j38471L3736k08739p7654m2904n3256j14779r3976
$$ 2252039 2077937 1910615 1772144 1805880 1597141 1519487 1476583 1423327 1308548 1214572
5348A214572r067l9677l7470k983k2084j1782J0066j06063q7667N325r474k9995
$$ 1214572 1205505 1165828 1128358 1125375 1103291 1091509 1101575 995512 907845 913170 903696 873701
5336H73701l544J6258l4252o4680Q7223n2402o1049m8056Q466l1455N289O6156
$$ 873701 870157 886415 852163 787483 874706 822304 761255 713199 721665 690210 695499 761655
5324G61655n8457j4362j2974j2497O046K2325M1472o5776j07649l3887R94k4410
$$ 761655 703198 688836 675862 663365 669411 691736 733208 667432 559783 525896 526890 502480
5312E02480L7434J1772M4444K6865q4613q0770K8469p527l1099J735K7454N358
$$ 502480 539914 551686 596130 622995 538382 457612 486081 478554 447455 449190 476644 482002
5300D82002l4727J070L2097k0546m0158O733M6747k2633K075J0211m2772l2152
$$ 482002 447275 448345 480442 459896 419738 426471 473218 450585 452660 462871 420099 387947
5288C87947k2914O359j4861J8610L4272k5494L544l8601j8823j4627l697L116
$$ 387947 365033 371392 356531 375141 409413 383919 387463 348862 330039 315412 311715 314831
5276C14831N6173l489l7354j6401l8762P1257M461P9552J1584l9640j4946L8117
$$ 314831 371004 367515 330161 313760 274998 346255 350716 430268 441852 402212 387266 425383
5264D25383p843N55k7928o038l5429J7931k2118m8267K4141o0318Q2L2890M614
$$ 425383 417540 418095 390167 384129 348700 366631 344513 296246 320387 260069 260151 293041 297655
5251B97655L3350p229m2876l311L5036L8201o9486L0493M8585m9921M4266J6813
$$ 297655 331005 323776 280900 277589 312625 350826 281340 311833 360418 310497 354763 371576
5239C71576M5944p5570J78R7127j4089l8737M956n3087l5436O2908J1749J895
$$ 371576 417520 341950 342128 439255 425166 386429 391385 338298 302862 365770 377519 379414
5227C79414k2747k2837l7611J4652L2183o0080L693N8413j3404P446K2954k4122
$$ 379414 356667 333830 296219 310871 343054 282974 286667 345080 331676 339122 362076 337954
5215C37954P2423j1040q2727Q176N1336K6257j9228M323m8586k2528K6647M5501
$$ 337954 410377 399337 316610 324786 376122 402379 383151 387474 338888 316360 343007 388508
5203C88508J0731O462o190k1082O717P1003l4957j2563P0768K9351m8972K2543
$$ 388508 399239 405701 399511 378429 385146 456149 421192 408629 479397 508748 459776 482319
5191D82319l9024M632j4253m9794M358K9776L36L308M2100M9464Q112k6796P6130
$$ 482319 443295 447927 433674 383880 388238 418014 418350 421658 463758 513222 521334 494538 570668
5178E70668j9834m8177o4883L4157N0281K3071k1577K0373L3517m8275O414K3289
$$ 570668 550834 502657 437774 471931 522212 545283 523706 544079 577596 529321 535735 559024
5166E59024O4381j0932p4173K0410J9418N1324L8129n3467M440O767k0356j5210
$$ 559024 623405 612473 538300 558710 578128 629452 667581 614114 618554 625321 604965 589755
5154E89755k1789O6056r340J2288K4966m6592Q1803m302q4213N1461M0153J6941
$$ 589755 567966 634022 624682 636970 661936 615344 697147 692845 608632 660093 700246 717187
5142G17187l0985k9628N5755M784J3792N0027m858p2295M576J6075L7483R4098
$$ 717187 686202 656574 712329 717113 730905 780932 776074 703779 708355 724430 761913 856011
5130H56011k655k7282n4455J9431M0301N9462L1086M689K3768K9158K3746K4200
$$ 856011 853356 826074 771619 791050 831351 890813 921899 926588 950356 979514 1003260 1027460
5118A027460K1259K0978K8552j2099n2546N4553J2281P8681K4683K4656P3240
$$ 1027460 1048719 1069697 1098249 1086150 1033604 1088157 1100438 1179119 1203802 1228458 1301698
5107A301698N2001L2647J5444O8742J09157J40233M9526R5421R0857J10222O0492
$$ 1301698 1353699 1386346 1401790 1470532 1579689 1719922 1769448 1864869 1955726 2065948 2126440
5096B126440N0570R7511K03989J03587J79549J68317K23821K37210K16330K17160
$$ 2126440 2177010 2274521 2478510 2582097 2761646 2929963 3153784 3390994 3607324 3824484
5086C824484K42937L10012K96703K27072L66351L93929L41782M61371L99015L53694
$$ 3824484 4067421 4377433 4674136 4901208 5267559 5661488 6003270 6464641 6863656 7217350
5076G217350J34587K11176K84010L09963L42491M36235N19141M97721N10394O58719
$$ 7217350 7351937 7563113 7847123 8157086 8499577 8935812 9454953 9952674 10463068 11121787
5066A1121787P61715Q33506R02797J003956J080371J140566J361294J634659J849673
$$ 11121787 11883502 12717008 13619805 14623761 15704132 16844698 18205992 19840651 21690324
5057B1690324K092788K417453K888171L311670L356478L496568L931816M679063
$$ 21690324 23783112 26200565 29088736 32400406 35756884 39253452 43185268 47864331
5049D7864331O032188P667391N283593m68407o108277r336313q590172o880321
$$ 47864331 53896519 61563910 66847503 66379096 60270819 50934506 42344334 35464013
5041C5464013n310020m256463l840060l097735k495369k016731j749982j397613
$$ 35464013 30153993 25897530 22057470 18959735 16464366 14447635 12697653 11300040
5033A1300040j168964r72204p84526o75168n59007m31460l75167l44080l30034
$$ 11300040 10131076 9158872 8374346 7699178 7140171 6708711 6333544 5989464 5659430
5024E659430k97259k70544k96157k92763j52086l07554k35507q3792j95096j59870
$$ 5659430 5362171 5091627 4795470 4502707 4350621 4043067 3807560 3723768 3528672 3368802
5014C368802k26534j14655j76241k71527o6188n0635q8758j34880o2004j04244
$$ 3368802 3142268 3027613 2851372 2579845 2513657 2463022 2374264 2239384 2177380 2073136
5004B073136o5993j3883j08026m0931m5981j17159l9300K0349n4136m8049j01143
$$ 2073136 2007143 1993260 1885234 1844303 1798322 1681163 1641863 1662212 1608076 1560027 1458884
4993A458884k3980l4768r886l5486M1453q2046m2750l3128j9545n5299k886k7474
$$ 1458884 1434904 1400136 1390250 1354764 1396217 1314171 1271421 1238293 1218748 1163449 1160563 1133089
4981A133089j1872M4023l2361o2236R3697l8067r999j25555m0982j5273K128N4513
$$ 1133089 1121217 1165240 1132879 1070643 1164340 1126273 1116274 990719 949737 934464 936592 991105
4969I91105P680l7263N7498o7106k4646m3876l2437n1287j4683m547r975J0320
$$ 991105 998785 961522 1019020 951914 927268 883392 850955 799668 784985 780438 770463 780783
4957G80783p4957N6517J5546K4940J3817p363M6666j7598J752J9201l415K1318
$$ 780783 705826 762343 777889 802829 816646 809283 855949 838351 840103 859304 855889 877207
4945H77207m1618j0147k183Q153P257K5030k711l3775M9229L5876r832J6333l8457
$$ 877207 835589 825442 823259 831412 838669 863699 860988 827213 876442 912318 902486 918819 880362
4932H80362J2233m3413m3946l9729l292l2506k2552j04734J7492R769N579j0324
$$ 880362 892595 849182 805236 765507 762215 729709 707157 602423 619915 629684 635263 624939
4920F24939J0970p3620K2399m0786n035k0002r627q761o8238k3601N0686k8244
$$ 624939 635909 562289 584688 543902 538867 518865 509238 500477 432239 408638 459324 431080
4908D31080k9566Q466L6696l5101L4233P7746k1619o3428n508j9698J01331M3866
$$ 431080 401514 409980 446676 411575 445808 523554 501935 438507 432999 413301 514632 558498
4896E58498O3796q0140n9652r053K5583q029m230M0400J3776m2733L0850J5163
$$ 558498 622294 542154 482502 473449 499032 491003 486773 527173 540949 498216 529066 544229
4884E44229r3694m9632N5685l1061k979J04839J2596o2815N6133n3622p1097J3979
$$ 544229 450535 400903 456588 425527 422548 527387 539983 477168 533301 479679 408582 422561
4872D22561K3645M2826j1180N4212K975P55j5288M9905L440m0632l2449j8412
$$ 422561 446206 489032 477852 532064 535039 535794 520506 570411 573851 533219 500770 482358
4860D82358J1139P7659m4469n4735l0462J09773p5080l946K8084P4741k992J9292
$$ 482358 493497 571156 526687 471952 441490 551263 476183 472237 500321 575062 572070 591362
4848E91362R962L2348m0826L9956k5880L2693l098P728M0470L2769k1616K3890
$$ 591362 601324 633672 592846 632802 606922 639615 636517 644245 684715 717484 695868 719758
4836G19758m8279M3710L5140j9522M8043Q874j6456N6484k8662K5837O4917k7538
$$ 719758 671479 715189 750329 730807 778850 787724 771268 827752 799090 824927 889844 862306
4824H62306m28K6677J9806k7706L9916J20533R4229K4738M5934l99J6722p713
$$ 862306 861878 888555 908361 880655 920571 1041104 1135333 1160071 1206005 1205606 1222328 1214615
4812A214615k4031k7288Q7910R7658J3293J9555N1512R4616j6502k429Q5404N3190
$$ 1214615 1190584 1163296 1251206 1348864 1362157 1381712 1433224 1527840 1511338 1508909 1594313 1647503
4800A647503J43598P8545N0099j4285R3054Q5597J36427J01565M5651J47565J23994
$$ 1647503 1791101 1869646 1919745 1905460 1998514 2084111 2220538 2322103 2367754 2515319 2639313
4789B639313P9837J58103J73217J55856J31894J34224K12616P7755J80040K38555
$$ 2639313 2719150 2877253 3050470 3206326 3338220 3472444 3685060 3762815 3942855 4181410
4779D181410K45451K31540J47042K78564K70583K53497K94821L16441L22700L78555
$$ 4181410 4426861 4658401 4805443 5084007 5354590 5608087 5902908 6219349 6542049 6920604
4769F920604L79020L83613L17229M77719N27907N95614P15312Q25338P75461Q14048
$$ 6920604 7299624 7683237 8000466 8478185 9006092 9601706 10317018 11142356 11917817 12731865
4759A2731865O94640M79002L19280J99601K30124K32950K27220K04983K00446
$$ 12731865 13426505 13905507 14224787 14424388 14654512 14887462 15114682 15319665 15520111
4750A5520111J48917J89144K33117K91181L99387L89861M09030N95147N64795
$$ 15520111 15669028 15858172 16091289 16382470 16781857 17171718 17580748 18175895 18740690
4741A8740690N48348M84348M43370M61292M46665M82513O11968P46699P45594
$$ 18740690 19289038 19773386 20216756 20678048 21124713 21607226 22219194 22965893 23711487
4732B3711487R37767R25635Q17841M84976K6520m84527p27951q79815q71599p17197
$$ 23711487 24649254 25574889 26392730 26877706 26904226 26419699 25691748 24811933 23940334 23223137
4722B3223137p29551o97728o11973n55403m92806n59569o71905p13232p04454
$$ 23223137 22493586 21795858 21183885 20628482 20135676 19576107 18904202 18190970 17486516
4713A7486516n59334m93648l78415l12415l06553k71617k15082j72268r7709m0009
$$ 17486516 16927182 16433534 16055119 15742704 15436151 15164534 14949452 14777184 14679475 14639466
4703A4639466L9450l2621k11490j97789j36449l19280o21101p82701q78155p90210
$$ 14639466 14678916 14646295 14434805 14237016 14100567 13781287 13160186 12377485 11499330 10709120
4693A0709120o43829n36352l85207l53109k70026l15629l01880k08262j84718
$$ 10709120 10065291 9528939 9143732 8790623 8520597 8204968 7903088 7694826 7510108
4684G510108k41080j96112j58188j70446k03278j93048j57957j03521n4389j32535
$$ 7510108 7269028 7072916 6914728 6744282 6541004 6347956 6189999 6086478 6032089 5899554
4674E899554k00946j43257j17355j11702q6604j02118o2344N8927m3467j09524
$$ 5899554 5698608 5555351 5437996 5326294 5239690 5137572 5075228 5134155 5090688 4981164
4664D981164M2015M5226J4367k2828J01679L8047o0722N5079P7393Q2134K6718
$$ 4981164 5023179 5068405 5082772 5059944 5161623 5199670 5138948 5194027 5271420 5353554 5380272
4653E380272L1742m5521K7564n223M771m7782r4699k6839q4485j20975j36126
$$ 5380272 5412014 5366493 5394057 5388834 5393605 5345823 5251124 5224285 5139800 5018825 4882699
4642D882699m1453r2693j30276r9534j14942j27830j31611k8234p5178q8123j28488
$$ 4882699 4841246 4748553 4618277 4518743 4403801 4275971 4144360 4116126 4040948 3952825 3824337
4631C824337r3669r9508q2050M8488K3928p3734j36605k8810L5473J0818j37447
$$ 3824337 3730668 3631160 3549110 3597598 3621526 3547792 3411187 3382377 3417850 3428668 3291221
4620C291221o7179j1199j5587m4664j45549k3696o5255o3143j50234q3734q9022
$$ 3291221 3224042 3212843 3197256 3152592 3007043 2983347 2918092 2854949 2704715 2620981 2531959
4609B531959q4173o7754j61221j12102n8585j1885j71162j89687q7927j1113o8773
$$ 2531959 2447786 2380032 2218811 2106709 2048124 2036239 1865077 1675390 1587463 1576350 1507577
4598A507577l3811j22033o5963k6405k15l0842k6809n1314m2007R51p4409o8034
$$ 1507577 1473766 1351733 1285770 1259365 1259150 1228308 1201499 1150185 1108178 1109129 1034720 966686
4586I66686k7048M7182o7841M21j3744k7888j5822r6462m5639L0935Q0695K7029
$$ 966686 939638 986820 918979 919400 905656 877768 861946 765484 719845 750780 831475 858504
4574H58504K863j8904j5663j6867m4839m7110O7691J6448k4120J231k3133J4970
$$ 858504 861367 842463 826800 809933 765094 717984 785675 802123 778003 779234 756101 771071
4562G71071j1991l898Q279J0221r0418n448R265L327k2466J8170Q8824m7008n9015
$$ 771071 759080 755182 763461 773682 683264 677816 687081 690408 667942 686112 774936 727928 668913
4549F68913l4176j1016n001P2871J0531r920L234m5269N011m4878p4375P3217
$$ 668913 634737 623721 618720 691591 702122 692202 695436 650167 655178 610300 535925 609142
4537F09142O998j9881K8629J6138O62M4973O976r2211o1059O651L6481O3776k6138
$$ 609142 616140 596259 624888 641026 641688 686661 693637 601426 540367 547018 583499 647275 621137
4524F21137K3106m7250j9633j2042j7592J6869p643n7800M6848L871J8079K4681
$$ 621137 644243 596993 577360 565318 547726 564595 556952 499152 546000 549871 567950 592631
4512E92631J5906r935k1356l9959j5877J3914m7731M7217m606O1521n6015j6194
$$ 592631 608537 598602 577246 537287 521410 535324 487593 534810 530204 591725 535710 519516
4500E19516j0236k0948L4298Q224J8031n0691r038O1996N546M5644m1056j6475
$$ 519516 509280 488332 522630 530854 548885 498194 489156 551152 556698 602342 561286 544811
4488E44811j708J3394l9381k5069J8859K1404k0419L2637O3960J0489r9420l1584
$$ 544811 543103 556497 517116 492047 510906 532310 511891 544528 608488 618977 519557 487973
4476D87973J04327j7043m3272K4460J8855M3568L0623L722k0336R4557N940m8627
$$ 487973 592300 575257 531985 556445 575300 618868 649491 653213 632877 727434 733374 684747
4464F84747k7660J9679k2523K0675M7463L7818o2675k4288M7142K7251n3720K3434
$$ 684747 657087 676766 654243 674918 722381 760199 697524 673236 720378 747629 693909 717343
4452G17343M2579R92J2719P5928K4961J2357N4364r7592l920O1712p3074M0492
$$ 717343 759922 760914 773633 849561 874522 886879 941243 843651 839731 901443 828369 868861
4440H68861L6762J4923K5247j962q756k9296K6100L7904N1759K123Q994L545K0213
$$ 868861 905623 920546 945793 943831 935075 905779 931879 969783 1021542 1023665 1032659 1036204 1056417
4427A056417j23749M1432P3577N0259l7626L8461N2792N6605l1483K606P651J7535
$$ 1056417 932668 974100 1047677 1097936 1060310 1098771 1151563 1208168 1176685 1179291 1186942 1204477
4415A204477J4277Q5264o4578j4704O574K1983N8716L2708K4400j7609L2910n252
$$ 1204477 1218754 1304018 1239440 1224736 1231310 1253293 1312009 1344717 1369117 1351508 1384418 1379166
4403A379166n751K3183m1135Q7500m445j1917j9450M882O0685N1492r29J5775
$$ 1379166 1373415 1396598 1355463 1442963 1438518 1426601 1407151 1412033 1472718 1524210 1523281 1539056
4391A539056L9065M1002J05932k8298K2869J0139M3099K5625L1855L8414K3097
$$ 1539056 1578121 1619123 1725055 1696757 1719626 1729765 1772864 1798489 1830344 1868758 1891855
4380A891855p6292J4710K9484M3395n8615Q5652N7805j1093P0108M346o951P7967
$$ 1891855 1815563 1830273 1859757 1903152 1844537 1930189 1987994 1976901 2047009 2051355 2044404 2122371
4368B122371K0939P4710m4067J7228J20325j7597J07202P5099J1248R3099J78716
$$ 2122371 2143310 2218020 2173953 2191181 2311506 2293909 2401111 2476210 2487458 2580557 2759273
4357B759273P4471K7508m0758o1431o8343o6892m6123K4149n4657J2462N724j7941
$$ 2759273 2833744 2861252 2820494 2759063 2690720 2623828 2577705 2601854 2547197 2559659 2565383 2547442
4345B547442K5712l4842m8049m904J3724N8634o201o2760K9698l0925N3180Q1150
$$ 2547442 2573154 2538312 2490263 2485359 2499083 2557717 2551516 2488756 2518454 2487529 2540709 2621859
4333B621859j0236j7276K0402o514K5225n612J0960j9272k547m544J24470N3353
$$ 2621859 2611623 2594347 2614749 2608235 2633460 2627848 2638808 2619536 2616989 2612445 2736915 2790268
4321B790268o8167k326P1736P5768k4721J1415O450M4571R4388P225L1371Q7272
$$ 2790268 2722101 2719775 2791511 2867279 2842558 2853973 2860423 2904994 2999382 3006607 3037978 3125250
4309C125250j6099N6189Q2091M3054J48898K7713N7067L2918J25915O7937N1754
$$ 3125250 3109151 3165340 3247431 3290485 3439383 3467096 3524163 3557081 3682996 3750933 3802687
4298C802687P3293R6680J25663Q0735J65014J78887P0261M0772K18904J27229
$$ 3802687 3875980 3972660 4098323 4179058 4344072 4522959 4593220 4633992 4852896 4980125
4288D980125J48035J67916J05405J46276K09200K54286K15407K75032K21620J73915
$$ 4980125 5128160 5296076 5401481 5547757 5756957 6011243 6226650 6501682 6723302 6897217
4278F897217K27983J56645J00437L4848J81001K83469K67654L11577L28726L55519
$$ 6897217 7125200 7281845 7382282 7417130 7598131 7881600 8149254 8460831 8789557 9145076
4268I145076L46257K79505J92590J98432K30657J40122Q5474K06977J91221K26308
$$ 9145076 9491333 9770838 9963428 10161860 10392517 10532639 10618113 10825090 11016311 11242619
4258A1242619L13784K76316L98350L14632K73648K21678K02047R4099j713q5375
$$ 11242619 11556403 11832719 12231069 12545701 12819349 13041027 13243074 13337173 13335460 13250085
4248A3250085j4153R5922J26772J21682J46026K21775J59956J94955J43211k1415
$$ 13250085 13235932 13331854 13458626 13580308 13726334 13948109 14108065 14303020 14446231 14424816
4238A4424816j27657k13430k94122l08185l16626j56785j56267j18657j42023
$$ 14424816 14297159 14083729 13789607 13481422 13164796 13008011 12851744 12733087 12591064
4229A2591064m2502k2677j43076j39354l05560l47431l31499m67974m74140l48509
$$ 12591064 12548562 12525885 12382809 12243455 11937895 11590464 11258965 10790991 10316851 9968342
4219I968342l74631k21256j82467k53690k61951k28916j83037j92305k91400l27385
$$ 9968342 9593711 9372455 9189988 8936298 8674347 8445431 8262394 8070089 7778689 7451304
4209G451304l53433l03857l44351k64921k61961k38962j93317j96869k84228k34279
$$ 7451304 7097871 6794014 6449663 6184742 5922781 5683819 5490502 5293633 5009405 4775126
4199D775126j12146r9491k05521k31425j74732r1647j31503j53434r5559p7564
$$ 4775126 4662980 4563489 4357968 4126543 3951811 3860164 3728661 3575227 3479668 3402104
4189C402104j31910j66659k5544j01424q7176o5825j7660j04450n0204o7391p2048
$$ 3402104 3270194 3103535 3077991 2976567 2889391 2823566 2805906 2701456 2651252 2583861 2511813
4178B511813j4647o5805j6355l3130L5697l4379n5291m4353j10165j7681K2190
$$ 2511813 2497166 2431361 2415006 2381876 2417573 2383194 2327903 2283550 2173385 2155704 2177894
4167B177894J5050l7040j00729m0257m7697l5942L7310l6747l2420m0872O2959
$$ 2177894 2192944 2155904 2055175 2014918 1967221 1931279 1968589 1931842 1899422 1858550 1921509
4156A921509j229m5335l8032l3168l1116M5198L4728p2425j7050R4647m0472n8831
$$ 1921509 1920280 1874945 1836913 1803745 1772629 1817827 1852555 1780130 1763080 1857727 1817255 1758424
4144A758424N1629J7648n804J2050L9447k1635J6829J07068k0081r3812N4807
$$ 1758424 1810053 1827701 1821897 1833947 1873394 1851759 1868588 1975656 1955575 1861763 1916570
4133A916570l6007N2879L9025m5954K2465K7532L0311l011j6293L5731M2225j8272
$$ 1916570 1880563 1933442 1972467 1926513 1948978 1976510 2006821 2003810 1987517 2023248 2065473 2047201
4121B047201K2323k721J14030J6627K4237o354R988R3219O0412J0565O3571O4247
$$ 2047201 2069524 2066803 2180833 2197460 2221697 2215343 2225331 2318550 2378962 2389527 2453098 2517345
4109B517345L507L0680Q9110R0520N4567P6268q402R0393J20454N3821M7351O5844
$$ 2517345 2520852 2551532 2640642 2731162 2785729 2861997 2853595 2943988 3064442 3118263 3165614 3231458
4097C231458J13062J53136J05218O1447J56924J43717J52149J88653J43057J87153
$$ 3231458 3344520 3497656 3602874 3664321 3821245 3964962 4117111 4305764 4448821 4635974
4087D635974J98632J53394J82810J99562J43959J29741L8280J48376K26733K50105
$$ 4635974 4834606 4988000 5170810 5370372 5514331 5644072 5682352 5830728 6057461 6307566
4077F307566J44275K08071K27864K04820K44109J23950R2120R5886J03819J37672
$$ 6307566 6451841 6659912 6887776 7092596 7336705 7460655 7552775 7648661 7752480 7890152
4067G890152J35661J95013K02430Q8567J93278K16701K75398L21863L57565L65133
$$ 7890152 8025813 8220826 8423256 8511823 8705101 8921802 9197200 9519063 9876628 10241761
4057A0241761J89533J26299n654k4220j10966j39566J0359R8201R8946J15335
$$ 10241761 10431294 10557593 10551939 10527719 10416753 10277187 10287546 10385747 10484693 10600028
4047A0600028K49157K42622K22911K58459K04847J52935J58534J67694R0726J55031
$$ 10600028 10849185 11091807 11314718 11573177 11778024 11930959 12089493 12257187 12347913 12502944
4037A2502944K56278K92314K34379J62877K23799K29950K16581K58939K96214
$$ 12502944 12759222 13051536 13285915 13448792 13672591 13902541 14119122 14378061 14674275
4028A4674275K75345L51852M33401M89268M70030M63841M12190L52033L49966
$$ 14674275 14949620 15301472 15734873 16224141 16694171 17158012 17570202 17922235 18272201
4019A8272201L84746M89385O19776P54326P72360P85748R80370Q80005R80146
$$ 18272201 18656947 19146332 19766108 20520434 21292794 22078542 23058912 23938917 24919063
4010B4919063J246968J337398J422782J238160Q54383M81001L39104L59387M65811
$$ 24919063 26166031 27503429 28926211 30164371 31018754 31499755 31838859 32198246 32664057
4001C2664057N23555N77149O42625O55660P55970Q56771P97945O43392M66786
$$ 32664057 33187612 33764761 34407386 35063046 35819016 36675787 37473732 38117124 38583910
3992C8583910L09526J70846J05418P2230N3504j35928j32719o7353k8013Q6011
$$ 38583910 38893436 39064282 39169700 39241930 39295434 39159506 39026787 38959434 38931421 39017432
3982C9017432J28389K04593K01581N6280j10099l07758l51240n22459o44251p29579
$$ 39017432 39145821 39350414 39551995 39608275 39498176 39190418 38839178 38316719 37672468 36942889
3972C6942889p43462n40504n04145l74170k10579j72470j18594j07758j01189
$$ 36942889 36199427 35658923 35154778 34780608 34570029 34397559 34278965 34171207 34070018
3963C4070018m9538j29733k16884j32148p4129M415J55872J44221K8418j87763
$$ 34070018 34020480 33890747 33673863 33541715 33467586 33472001 33627873 33772094 33800512 33612749
3953C3612749j92092M0674J66097K38227L62340N01272P26240J004194J274871
$$ 33612749 33420657 33461331 33627428 33865655 34227995 34729267 35455507 36459701 37734572
3944C7734572J479768J492937J506809J422877J168011Q15704N19431N16078N93467
$$ 37734572 39214340 40707277 42214086 43636963 44804974 45620678 46140109 46656187 47249654
3935D7249654N15441O03395Q26593Q92782J279695J561228J565448J511068J189852
$$ 47249654 47765095 48368490 49195083 50087865 51367560 52928788 54494236 56005304 57195156
3926E7195156Q81529O81780M04127J70282K33736M36774P44710J200673J690276
$$ 57195156 58076685 58758465 59162592 59332874 59566610 60003384 60748094 61948767 63639043
3917F3639043K279474K781861L176814L355948K452568O70164j056855k255700
$$ 63639043 65918517 68700378 71877192 75233140 77685708 78355872 77299017 75043317
3909G5043317k257973j714191r78976m44233q9908K58731N27618M77729M59221
$$ 75043317 72785344 71071153 70092177 69647944 69558036 69816767 70344385 70822114 71281335
3900G1281335K53934j62417m29635o76109q80507r53578r47833p52491m67771
$$ 71281335 71535269 71372852 70943217 70267108 69386601 68433023 67485190 66732699 66264928
3891F6264928k25724j62826l93305l63733l71610n99355p91038r50726j431688
$$ 66264928 66039204 65876378 65483073 65119340 64747730 64148375 63357337 62406611 60974923
3882F0974923j650271j632877j450511j110746p06527k60162J35799L74746M99622
$$ 60974923 59324652 57691775 56241264 55130518 54423991 54163829 54299628 54674374 55173996
3873E5173996K50430m15287j022825j390258j697143j489702j241446j116168
$$ 55173996 55424426 55009139 53986314 52596056 50898913 49409211 48167765 47051597
3865D7051597r37467q36688p25753m76498m75610m32082l15849n32126o40486
$$ 47051597 46114130 45277442 44551689 44075191 43599581 43167499 42851650 42319524 41679038
3856D1679038p53816q19875r42402r07711r49966q66422p12617m53316l25769
$$ 41679038 40925222 40105347 39162945 38255234 37305268 36438846 35726229 35272913 34947144
3847C4947144j54175o8194M2822J93794m431j97727m22378n09382n82153n85609
$$ 34947144 34792969 34724775 34767597 34961391 34956960 34759233 34336855 33827473 33245320 32659711
3837C2659711n16508l95295l64244k70358j33727o6126o4534R7662L29941L48137
$$ 32659711 32143203 31747908 31383664 31113306 30979579 30913453 30848919 30946581 31276522 31624659
3827C1624659M63838N56599N43208M25230K88119L05518K04085J13597J1848j80491
$$ 31624659 32088497 32645096 33188304 33613534 33901653 34207171 34411256 34524853 34536701 34356210
3817C4356210k27276l10509l38854l73088m75519p06842q33849q56783q76719
$$ 34356210 34128934 33818425 33479571 33106483 32630964 31924122 31090273 30233490 29356771
3808B9356771r27883r05321q54491q26389p27754o08752n77306m85322l92384
$$ 29356771 28428888 27523567 26669076 25842687 25114933 24506181 23928875 23443553 23051169
3799B3051169m02658k30420k32143m04111m38050m15141m08319l43860k29930
$$ 23051169 22648511 22418091 22185948 21781837 21343787 20928646 20520327 20176467 19946537
3790A9946537j93352q1770q4190r8041l8554j06833j41988k60780k12834k04047
$$ 19946537 19753185 19671415 19587225 19489184 19450630 19343797 19201809 18941029 18728195 18524148
3780A8524148j93819j79299l40966m52892m08345l38743k13423j13006M998k4660
$$ 18524148 18330329 18151030 17810064 17357172 16948827 16610084 16396661 16283655 16288653 16263993
3770A6263993K1339J04088j2765L2480J9840l1317O4772O2930J84120K83706L34715
$$ 16263993 16285332 16389420 16376655 16409135 16428975 16397658 16462430 16525360 16709480 16993186 17327901
3759A7327901M73994N25133N15292N94918N21200L39885M31427L91543M43745
$$ 17327901 17801895 18327028 18842320 19437238 19958438 20298323 20729750 21121293 21565038
3750B1565038L18857J82724K38074K41972K44015L36196M41245M33945N58372
$$ 21565038 21883895 22066619 22304693 22546665 22790680 23126876 23568121 24002066 24560438
3741B4560438N50997O02715P68747R37434J154294J306397J443944J539560J558789
$$ 24560438 25111435 25714150 26482897 27420331 28574625 29881022 31324966 32864526 34423315
3732C4423315J655610J582949J376118J056578P43439L93398O4323k76444o78542
$$ 34423315 36078925 37661874 39037992 40094570 40838009 41231407 41295730 41019286 40340744
3723D0340744q44954r29989j019408q96831q89937q06898p91773q32875r03372
$$ 40340744 39495790 38565801 37546393 36649562 35759625 34952727 34160954 33328079 32424707
3714C2424707r41936j085206j223477j320224j322446j394895j480739j418932
$$ 32424707 31482771 30397565 29174088 27853864 26531418 25136523 23655784 22236852
3706B2236852j388317j310569j132952j104071r98584p82233p45860n91139n70778
$$ 22236852 20848535 19537966 18405014 17300943 16302359 15520126 14774266 14183127 13612349
3697A3612349m68068n05390m15984k90746k29736k29164k11800k16025j28109
$$ 13612349 13144281 12638891 12222907 11932161 11702425 11473261 11261461 11045436 10917327
3688A0917327j52646q2970l5863l3819j01499n4376n885M3087p7740J3582k3773
$$ 10917327 10764681 10681711 10645848 10612029 10510530 10456154 10450269 10493356 10415616 10429198 10405425
3677A0405425o4766l3015j98456r1268j08025j08661q0944p3986K6884j71r6999
$$ 10405425 10340659 10307644 10109188 10017920 9909895 9801234 9720290 9646304 9673188 9673017 9576018
3666I576018o0180r1474L9036N543j05375l7869n894j3464k7545n988P1645J13273
$$ 9576018 9515838 9424364 9463400 9468943 9363568 9325699 9319805 9306341 9278796 9272808 9344453 9457726
3654I457726J02585J99395J69591J38463J37920J32803R4871J46680J82499J45094
$$ 9457726 9560311 9759706 9929297 10067760 10205680 10338483 10433354 10580034 10762533 10907627
3644A0907627J64273K45160K32912J90371K49415K80570L07540L50932L59612
$$ 10907627 11071900 11317060 11549972 11740343 11989758 12270328 12577868 12928800 13288412
3635A3288412L11627L54967L26531K97507L39181L21827J38155J39949J45398
$$ 13288412 13600039 13955006 14281537 14579044 14918225 15240052 15378207 15518156 15663554
3626A5663554O6136M3540J6950k8157j12781p4208p9597q3885P221k7522m7854
$$ 15663554 15729690 15773230 15790180 15762023 15649242 15575034 15495437 15411552 15418773 15391251 15343397
3615A5343397j8042l4242R098j58167k47398k42912k24195k74896l07074k32669
$$ 15343397 15325355 15291113 15300211 15142044 14894646 14651734 14427539 14152643 13845569 13612900
3605A3612900k80596k66808j18317k12199j87205k1705l9881L9862Q7329P2908
$$ 13612900 13332304 13065496 12947179 12734980 12547775 12526070 12486189 12526051 12613380 12686288
3595A2686288J64312J95049J98918K20409J90855J96833L18808L82871K91209
$$ 12686288 12850600 13045649 13244567 13464976 13655831 13852664 14171472 14554343 14845552
3586A4845552K89989K39556K84353K81748K23104J85363J15777J23152J05385
$$ 14845552 15135541 15375097 15659450 15941198 16164302 16349665 16465442 16588594 16693979
3577A6693979j920k6748r773L4353K2152Q4324J59832J50290J86641K63061K02483
$$ 16693979 16692059 16665311 16655538 16689891 16712043 16796367 16956199 17106489 17293130 17556191 17758674
3566A7758674L73826K76230K61925L46542M16843M31062M34260N25705N17305
$$ 17758674 18132500 18408730 18670655 19017197 19434040 19865102 20299362 20825067 21342372
3557B1342372N45004N79587P12868P46072Q56369Q89762R50976J070817J099675
$$ 21342372 21887376 22466963 23179831 23925903 24782272 25672034 26623010 27693827 28793502
3548B8793502J241735J200915J469012J549809J673770J853126K007232K242797
$$ 28793502 30035237 31236152 32705164 34254973 35928743 37781869 39789101 42031898
3540D2031898K507096K643600K932038L080386L328344L562249L753537L794238
$$ 42031898 44538994 47182594 50114632 53195018 56523362 60085611 63839148 67633386
3532F7633386L871411L937886M064931M021902L913118L707659L627755L497345
$$ 67633386 71504797 75442683 79507614 83529516 87442634 91150293 94778048 98275393
3524I8275393K952176K323912K021453J842803J965396K220886K387062K481849
$$ 98275393 101227569 103551481 105572934 107415737 109381133 111602019 113989081 116470930
3516A16470930K710385L034309L335611L931112M437787M960005N525152N974348
$$ 116470930 119181315 122215624 125551235 129482347 133920134 138880139 144405291 150379639
3508A50379639O481900P265735Q131621R198124J0678323J2909536J5639050J8768025
$$ 150379639 156861539 164127274 172258895 181457019 192135342 205044878 220683928 239451953
3500B39451953K2896953K7525942K8280114K5592552K3592094K4018816J6186944
$$ 239451953 262348906 289874848 318154962 343747514 367339608 391358424 407545368
3493D07545368J125397j6531178k9981027l3345340l1311262k5783197k0206878
$$ 407545368 408670765 392139587 362158560 328813220 297501958 271718761 251511883
3486B51511883j5660259j1381134q070784n248346k773237q47920N69743J985622
$$ 251511883 235851624 224470490 216399706 211151360 208378123 207530203 208099946 210085568
3478B10085568L397481M921314O487758Q568425J0999108J3898436J7366177K2262588
$$ 210085568 213483049 218404363 224892121 233460546 244459654 258358090 275724267 297986855
3470B97986855K4624106K2680229J9594571K0007431J6872224L810228j3260907
$$ 297986855 322610961 345291190 364885761 384893192 401765416 405575644 392314737
3463C92314737l0101451l7854024l8268508l4337936k9018323k4781036k0918179
$$ 392314737 362213286 324359262 286090754 251752818 222734495 197953459 177035280
3456A77035280j7638781j5121822j2822566j0987762r358172p985949o739951
$$ 177035280 159396499 144274677 131452111 120464349 111106177 103120228 96380277
3449I6380277n646497m763134m006555l414135k947537k522315k176615j883051
$$ 96380277 90733780 85970646 81964091 78549956 75602419 73080104 70903489 69020438
3441F9020438j748309j590070j464023j342672j232425j177882j179460j072401
$$ 69020438 67272129 65682059 64218036 62875364 61642939 60465057 59285597 58213196
3433E8213196j121317j178112j123915j169737j134388j122712j239957j227310
$$ 58213196 57091879 55913767 54789852 53620115 52485727 51363015 50123058 48895748
3425D8895748j148960j035029r28668r16813q15300p27121p61980p44082n47993
$$ 48895748 47746788 46711759 45783091 44866278 44050978 43323857 42561877 41817795 41269802
3416D1269802n02813l77935k64856j70842r2327Q1533K25835L33162M61938O60122
$$ 41269802 40766989 40389054 40124198 39953356 39861029 39942562 40168397 40501559 40963497 41623619
3406D1623619O95627P16230Q21932J180448J806936K692590L318951M057521M312838
$$ 41623619 42319246 43035476 43857408 45037856 46844792 49537382 52856333 56913854 61226692
3397F1226692K190360r85236l745599m866493m256544l351088k588654j989513
$$ 61226692 63417052 62431816 58686217 53819724 49563180 46212092 43623438 41633925
3389D1633925j578124j061641o71469l32859q5920K18722M48819N18149O97211
$$ 41633925 40055801 38994160 38322691 37989832 37903912 38122634 38571453 39089602 39786813
3380C9786813R39161J258639J421460J444016J505003J681055K204934K964897
$$ 39786813 40725974 41984613 43406073 44850089 46355092 48036147 50241081 53205978
3372E3205978L794380M772096N273562L384139L68267k411304l613502k930084
$$ 53205978 57000358 61772454 67046016 70430155 70798422 68387118 64773616 61843532
3364F1843532j951226j030144l03116M13426J323796K445832L639976M975995
$$ 61843532 59892306 58862162 58559046 58972472 60296268 62742100 66382076 71358071
3356G1358071O048339O686793P155862N214019N64420m156476p309289p400089
$$ 71358071 77406410 84093203 91249065 96463084 97027504 92871028 85561739 78161650
3348G8161650o309992n113764m108660l521103k826678k201588j680870j094057
$$ 78161650 71851658 66737894 62629234 59108131 56281453 54079865 52398995 51304938
3340E1304938q59849n29601k67451K6237K66395M40984P36262J073714J508859
$$ 51304938 50445089 49915488 49648037 49674274 49940669 50381653 51117915 52191629 53700488
3331E3700488K331835L302590M528408N357009N751922O067790L348536j531344
$$ 53700488 56032323 59334913 63863321 69220330 74972252 81040042 84388578 82857234
3323H2857234n880862p903379p024325n561879m115943l141537k514324j814131
$$ 82857234 76976372 69072993 62048668 56486789 52370846 49229309 46714985 44900854
3315D4900854j276966r19710n67199m17139k39040p0940n6454m9796J5066j51639
$$ 44900854 43623888 42704178 42136979 41719840 41480800 41409860 41353406 41303610 41318676 41167037
3305D1167037l75719n34016n49315p20052r43838j103729j158279j298224j512575
$$ 41167037 40791318 40257302 39707987 38987935 38044097 36940368 35782089 34483865 32971290
3296C2971290j568059j625468j613907j482365j546294j532114j441182j386586
$$ 32971290 31403231 29777763 28163856 26681491 25135197 23603083 22161901 20775315
3288B0775315j229321j170324j084913j089232j006705r33147p75459p34250o19231
$$ 20775315 19545994 18375670 17290757 16201525 15194820 14261673 13486214 12751964 12132733
3279A2132733n13243n40798n42734m42368l78592l28574l26997k37195k83642
$$ 12132733 11619490 11078692 10535958 10093590 9714998 9386424 9059427 8822232 8538590
3270H538590k14779k40738j59035j16027j79199j11739p0047q8945m3148p4682
$$ 8538590 8323811 8083073 7924038 7808011 7628812 7517073 7447026 7358081 7314933 7240251
3260G240251j10758j75297j7891o7803j46281j33377m5765l1904j8302j2216n0126
$$ 7240251 7129493 6954196 6936305 6868502 6722221 6588844 6543079 6511175 6492873 6480657 6430531
3249F430531l238r8112n1474r685n0823o1634q8557o0904K3985p0566j06317o8296
$$ 6430531 6427293 6329181 6277707 6268022 6217199 6155565 6067008 6006104 6030089 5959523 5853206 5784910
3237E784910j18598j61690r4469m5337j27587j33677q9592m7093j02836j10008
$$ 5784910 5666312 5504622 5410153 5364816 5237229 5103552 5013960 4966867 4864031 4754023
3227D754023k3192p3726q5243q1520n0075L2403K052m7824o1667P5812O3099l399
$$ 4754023 4730831 4657105 4571862 4490342 4440267 4472670 4474722 4426898 4365231 4441043 4504142 4500743
3215D500743N9369O1899K2565M2321P5223Q0271J54869J70813J55190P8511P0565
$$ 4500743 4560112 4622011 4644576 4686897 4762120 4842391 4997260 5168073 5323263 5401774 5472339
3204E472339K0567r0800j06398p6494j54050j35262j47849j18167j19079L118
$$ 5472339 5492906 5402106 5295708 5219214 5065164 4929902 4782053 4663886 4544807 4547925
3194D547925j9616K4596K442q0716J6598M5142L2176K9379K7357J4021P9937J25767
$$ 4547925 4528309 4552905 4555347 4474631 4491229 4536371 4568547 4597926 4625283 4639304 4719241 4845008
3182D845008J63944R6848M7874J90569J54076J0539m234l8922l6564o2850j79614
$$ 4845008 5008952 5105800 5153674 5344243 5498319 5508858 5504624 5465702 5429138 5366288 5186674
3171E186674j41897j46420j35077r1523L1023q5623k1959K5568p9L8903O9994
$$ 5186674 5044777 4898357 4763280 4671757 4702780 4617157 4595198 4620766 4620687 4659590 4729584
3160D729584j049J5156K1735J01324j548J11046R2850P5416R6976L1612J27075
$$ 4729584 4728535 4743691 4765426 4866750 4865202 4976248 5069098 5144514 5241490 5273102 5400177
3149E400177Q3343Q2508J13420J74934N9404R8885P0270K25867J42520K20788
$$ 5400177 5483520 5566028 5679448 5854382 5913786 6012671 6082941 6308808 6451328 6672116
3139F672116L10840K14094K49655K51432K71603K96516L51024L89332L52677L84246
$$ 6672116 6982956 7197050 7446705 7698137 7969740 8266256 8617280 9006612 9359289 9743535
3129I743535L14351M80961M59602M27325M43680M29079M49316L77756L35348M94883
$$ 9743535 10057886 10538847 10998449 11425774 11869454 12298533 12747849 13125605 13460953 13955836
3119A3955836N73588N83137N98681O97938P79024R14857R60916J033187J099796
$$ 13955836 14529424 15112561 15711242 16409180 17188204 18103061 19063977 20097164 21196960
3110B1196960J278205J377530J525581J763023J957494K007756K054450K081529
$$ 21196960 22475165 23852695 25378276 27141299 29098793 31106549 33160999 35242528
3102C5242528K159100K350425K761855L463165M346527N166773N552192N060495
$$ 35242528 37401628 39752053 42513908 45977073 50323600 55490373 61042565 66103060
3094F6103060K882763j74862k684172l685415l531901k740425j852353j071771
$$ 66103060 68985823 68810961 66126789 62441374 58909473 56169048 54316695 53244924
3086E3244924m05191K96629R02554J436309J934394K249399K590155L042651L534554
$$ 53244924 52839733 53136362 54038916 55475225 57409619 59659018 62249173 65291824 68826378
3077F8826378M228160N019751N767595O574907P194072P727434Q060175Q310078
$$ 68826378 73054538 78074289 83841884 90416791 97610863 105338297 113398472 121708550
3069A21708550Q399620Q573020Q912709P679833L454553k468412p601742r866544
$$ 121708550 130108170 138681190 147593899 155273732 158728285 156259873 148658131 138791587
3061A38791587r390499q058641p398528q029203q951133r565858r337133q575921
$$ 138791587 129401088 121342447 113943919 105914716 96963583 87397725 78060592 69484671
3053F9484671p694744o680741n866125m959490m244974l653215l054398k638591
$$ 69484671 61789927 55109186 49243061 44283571 40038597 36385382 33330984 30692393
3045C0692393k276403j993774j746252j502166j294642j104611j049538j001529
$$ 30692393 28415990 26422216 24675964 23173798 21879156 20774545 19725007 18723478
3037A8723478r20891q30107o52818p05857o11727o55554n74732o12266o66319
$$ 18723478 17802587 16972480 16319662 15613805 15002078 14346524 13771792 13159526 12493207
3028A2493207o06964n12377m40903m36824l95990k75251l16232l01918k94344
$$ 12493207 11886243 11373866 10932963 10496139 10100149 9824898 9508666 9206748 8912404
3019H912404l48709l60033k27077l40777l16033k16583k69804k34175j38422j54860
$$ 8912404 8563695 8203662 7976585 7635808 7319775 7103192 6833388 6599213 6460791 6305931
3009F305931j88073j14762j12956k06358k46962j13968p4652j03792j48058j62992
$$ 6305931 6117858 6003096 5890140 5683782 5436820 5322852 5248200 5144408 4996350 4833358
2999D833358j15951j33396n2981j55475n9340o7493q0123j25867l8278p5640q9518
$$ 4833358 4717407 4584011 4531030 4375555 4316215 4248722 4168599 4042732 4004454 3928814 3839296
2988C839296Q793j37799p2013j63297r8828n3500q7579q1895n0619o6798r0867
$$ 3839296 3848089 3710290 3638277 3474980 3376152 3322652 3235073 3153178 3102559 3035761 2944894
2977B944894p8396N506J5189o3170j23802k7844l9402j4031l0651p4472j07930
$$ 2944894 2866498 2872004 2887193 2824023 2700221 2672377 2632975 2618944 2588293 2513821 2405891
2966B405891o7187o1110L7199n6911k9209m9356m357M0575l5156k0141P5247p3310
$$ 2405891 2338704 2277594 2314793 2257882 2228673 2179317 2174960 2215535 2180379 2160238 2235485 2162175
2954B162175q9046p553N924m7456O512n1485J1425M6419l1997j02617n1468K3061
$$ 2162175 2073129 2065576 2071500 2024044 2030556 1979071 1990496 2036915 2004918 1902301 1850833 1873894
2942A873894j1412o8417M5633j2879p5591Q6358O1758o2025r1014m6351K0822
$$ 1873894 1862482 1794065 1839698 1826819 1751228 1837586 1899344 1837319 1746305 1699954 1720776
2931A720776p693L8313L2120k449j7152m8505L1285N5125n7822N7936k447l3046
$$ 1720776 1713083 1751396 1783516 1781067 1763915 1715410 1746695 1801820 1743998 1801934 1799487 1766441
2919A766441m805j07785j0436l4637K1896J4438l505J2437J6831N271P3695k9821
$$ 1766441 1761636 1653851 1643415 1608778 1630674 1645112 1641607 1654044 1670875 1676146 1749841 1720020
2907A720020m0749K9946n0054l0800Q1371n36n2022m7972J0624K4050L9093n4358
$$ 1720020 1679271 1709217 1659163 1628363 1709734 1709198 1657176 1609204 1619828 1643878 1682971 1628613
2895A628613n5054K6336L6642L3408J6629P992k8871L997n6100p8642K5167N9082
$$ 1628613 1573559 1599895 1636537 1669945 1686574 1694566 1665695 1669692 1613592 1534950 1560117 1619199
2883A619199l33p2027q787l0207M7311j3394n320l4321l965n2760m257P266k4645
$$ 1619199 1618866 1546839 1538052 1507845 1555156 1541762 1536442 1502121 1498156 1445396 1441139 1448405 1423760
2870A423760M2176N8106k2237K2798l9578j7678L9651k1796J1164J9897m3804
$$ 1423760 1465936 1524042 1501805 1524603 1485025 1467347 1506998 1485202 1496366 1516263 1472459
2859A472459K315J4702p9682o020K7258r3716q482J6504K7691o115j6205l2071
$$ 1472459 1474774 1489476 1409794 1403774 1431032 1337316 1328834 1345338 1373029 1366914 1350709 1318638
2847A318638M860j4419m6483K2632j3637N7877J1807O683k8961K959o0182j30681
$$ 1318638 1323498 1309079 1262596 1285228 1271591 1329468 1341275 1347958 1318997 1321956 1261774 1131093
2835A131093K6751M6070j340p0481n6877Q9702L9771J8995m6747j6833k675m4390
$$ 1131093 1157844 1203914 1202574 1132093 1075216 1164918 1204689 1223684 1176937 1160104 1157429 1113039
2823A113039k1351k133Q699J00098J2269P182l578j1428M814R1962k5026r1727
$$ 1113039 1091688 1089555 1098254 1198352 1210621 1217803 1214225 1202797 1207611 1299573 1274547 1182820
2811A182820O6720K7143K3946K6732l5031n3436q6998k899J397J8113q0086n3620
$$ 1182820 1249540 1276683 1300629 1327361 1292330 1238894 1151896 1148997 1150394 1168507 1088421 1034801
2799A034801j626J1369J03363o837n2566J6308P7061j8696n5827M1475P5736M5247
$$ 1034801 1033175 1044544 1147907 1141070 1088504 1104812 1181873 1163177 1107350 1148825 1224561 1269808
2787A269808L16O7075M0554k138Q0087J3210p410n9916n9650l2555K0734o4247
$$ 1269808 1270124 1337199 1377753 1375615 1455702 1468912 1461502 1401586 1341936 1309381 1330115 1265868
2775A265868q3069o4441k0934j38972k5614m621r2689J1664o7869m1177L047J2342
$$ 1265868 1182799 1118358 1097424 958452 932838 928217 835528 847192 779323 738146 741193 753535
2763G53535j0024K0389j9327r6164M568l2030L336M2730o558l0110n0137L1064
$$ 753535 743511 763900 744573 648409 652977 620947 624283 667013 660455 630345 580208 611272
2751F11272m5261J6383j991K5375J1262j4525o9630J663L0204q0604q7526M8821
$$ 611272 566011 582394 580403 605778 617040 602515 532885 534548 564752 484148 396622 445443
2739D45443Q4237k120r679N1868o4512l3982R0457o53r9210k8787O5420N09m1597
$$ 445443 529680 527560 517881 569749 505237 471255 561712 561059 461849 433062 498482 498991 457394
2726D57394k3058P2771J5028m2715k8264m258k1450j0806O9051K3370j04686n9809
$$ 457394 434336 507107 522135 479420 451156 446898 425448 414642 483693 507063 402377 342568
2714C42568M5749M9860r087k6758K4563p946l0584R514K8163P833m9940k3022
$$ 342568 388317 438177 429090 402332 426895 418949 388365 397879 426042 433875 383935 360913
2702C60913n2543m5917J0691M8914Q2809o478o2534M4421k8786m2861k9981Q510
$$ 360913 308370 262453 273144 322058 404867 398389 335855 380276 351490 308629 278648 287158
2690B87158J02562k5668m9159l2960m7558J9584M6852L1166K4139J7894k7623
$$ 287158 389720 364052 314893 281933 234375 253959 300811 331977 356116 374010 346387
2679C46387K3112p8715l6491J1779J3183Q3638j2027k4361M5648L293k6778P89
$$ 346387 369499 290784 254293 266072 279255 362893 350866 326505 372153 375446 348668 349457
2667C49457k8441o6691N3520K0435m2242M0567P193l893j5891k448l3600L7683
$$ 349457 321016 254325 307845 328280 286038 326605 333798 329905 314014 311566 277966 315649
2655C15649R3236n6708L005K7139r3619q08Q38K1465O93J1127l4997n2861J1248
$$ 315649 408885 352177 355182 382321 288702 287894 288732 310197 310890 322017 287020 234159 245407
2642B45407J9690m7725L718O4758O8085p8932n0175R3602j2372o9970n658j7842
$$ 245407 265097 217372 221090 285848 353933 275001 224826 318428 306056 236086 230428 212586
2630B12586n6451M568O1099Q9548P5558k2628j02062o6294k8242L9348l2426K3992
$$ 212586 156135 160703 221802 311350 386908 364280 262218 195924 167682 207030 174604 198596
2618A98596R5052l1944p7298R5969m2765l2249J3881k4361p490P834K0445l7822
$$ 198596 293648 261704 184406 280375 237610 205361 219242 194881 187391 195225 215670 177848
2606A77848L6358k1447J4916k249j5034K9741J6019J9N0470l5033m0610j1181
$$ 177848 214206 192759 207675 205426 190392 220133 236152 236171 286641 251608 210998 199817
2594A99817k0803j7126J09762r623l9221M355k8598P5071N2787k0644r3846n278
$$ 199817 179014 161888 271650 262027 222806 227161 198563 273634 326421 305777 211931 206653
2582B06653K2795K3136k03l5756k2882J7666j1611L4119K2758M9020K697q306
$$ 206653 229448 252584 252381 216625 193743 211409 199798 233917 256675 305695 308392 300086
2570C00086m9394N7713L7074j0958M2855P238j06241L5127n8540p0201L4791M0840
$$ 300086 250692 308405 345479 334521 377376 384614 278373 313500 254960 184759 219550 260390
2558B60390o1291M5838M1269j03887k0240R5326J8392p9300r1866K3023J00796
$$ 260390 199099 244937 286206 182319 162079 257405 275797 196497 104631 127654 228450
2547B28450l4760k4660m221M0718m1261K6573N142j2017l3861r153m7429J4517
$$ 228450 193690 169030 164809 205527 164266 190839 195981 183964 150103 140950 93521 108038
2535A08038J01684j7988j6899J0713m8824L8082M3339l3275m8990N9530j6221
$$ 108038 209722 191734 174835 185548 136724 174806 218145 184870 135880 195410 179189
2524A79189l3860k5106N7437J8767n3771m7550M1745l739j3428m8432J2264O4620
$$ 179189 145329 120223 177660 196427 142656 95106 136851 133112 119684 71252 83516 148136
2512A48136J419M312M060m247j621J084n733l1939l4174N2617l2265j7155J01234
$$ 148136 149555 153867 157927 153680 152059 153143 147410 115471 81297 133914 101649 84494 185728
2499A85728K1786j1244L421k6166L0767j3031J3540J678K926p1034j5640J6125
$$ 185728 207514 196270 199691 173525 204292 191261 204801 206479 209405 138371 122731 138856
2487A38856N704J895J009k9919L1601M1336p1300o0773k415K4018K2158J3959
$$ 138856 144560 146455 147464 117545 149146 190482 119182 58409 55994 80012 102170 116129
2475A16129o9048L900R3430n7819K7025N2422r4178J03679N8434p6692m8324R1460
$$ 116129 47081 50981 144411 86592 113617 166039 71861 175540 233974 157282 108958 200418
2463B00418J1079m0052N474K1236K5627m9773q767J5212m6780J966n789j365o6768
$$ 200418 211497 171445 176919 198155 223782 174009 165242 180454 133674 135640 129851 128486 61718
2450F1718Q7665O7567R975l5450R016J2288o2511J5115N3732Q948J526M7566j7981
$$ 61718 149383 216950 226925 191475 200491 212779 150268 165383 219115 228063 229589 277155 259174
2437B59174K1000l8306l9445R492o8577M1039J02741K6644j05846k8519J4874
$$ 259174 280174 241868 202423 211915 143338 184377 287118 313762 207916 179397 194271
2426A94271j6731L2351p089o086O5294M6430r817j2085n4153j5934m8756K1708
$$ 194271 177540 209891 202802 196716 262010 308440 298623 286538 232385 216451 167695 189403
2414A89403K4418r656O0530j9889l1695J6791l3039R1097m2862J8196R300l931
$$ 189403 213821 204165 264695 244806 213111 229902 196863 287960 245098 263294 272594 268663
2402B68663n1389k230L237N4638m747k3765j4471K7908q930J3620K0087l5465
$$ 268663 217274 215044 218281 272919 268172 244407 229936 257844 248914 262534 282621 247156
2390B47156M8349k8471o2725P415o5345N8255L8481J09054J4341j3711J8829M780
$$ 247156 295505 267034 204309 211724 146379 204634 243115 352169 366510 352799 371628 376408
2378C76408K1518k1293m433n0432j7761J5192O6453K513m5654M3607l586j7799
$$ 376408 397926 376633 372200 321768 304007 319199 385652 388165 342511 386118 382532 364733
2366C64733N6513p890j1037R1543O5360J4109m0405M4042Q7427M626M0259r244
$$ 364733 421246 413356 402319 493862 559222 573331 532926 576968 664395 669021 709280 700036
2354G00036J7678L7133R8748m0945J0941M2091Q6495J05535M1937J04010M5451
$$ 700036 717714 754847 853595 812650 823591 865682 952177 1057712 1099649 1203659 1249110
2343A249110N8557J52474J13911J21698j6544J19643J34975J06193J59011J80798
$$ 1249110 1307667 1460141 1574052 1695750 1679206 1798849 1933824 2040017 2199028 2379826
2333B379826J68027K17609K32577J55641M9438J27988O3865J71503J94561J32317
$$ 2379826 2547853 2765462 2998039 3153680 3203118 3331106 3394971 3566474 3761035 3893352
2323C893352K06893K04045K06097L08753L19474M22941M71774N09503M81227M18877
$$ 3893352 4100245 4304290 4510387 4819140 5138614 5561555 6033329 6542832 7024059 7442936
2313G442936M50786M46407N07384O23301P40903P40481R37775J391385J890981
$$ 7442936 7893722 8340129 8847513 9470814 10211717 10952198 11889973 13281358 15172339
2304A5172339K632387L032044L809643M735785K693869n70064l618715m820340
$$ 15172339 17804726 20836770 24646413 29382198 32076067 31506003 27887288 23066948
2296B3066948l990736l120849k304143j975562j753215j434212j153813p82003
$$ 23066948 19076212 15955363 13651220 11675658 9922443 8488231 7334418 6552415
2288F552415p11524m35077l77589l87814m07473l90151l37544k70447k18890k38369
$$ 6552415 5840891 5405814 5028225 4640411 4232938 3842787 3505243 3234796 3015906 2777537
2278B777537j65600j98060j29902j83265j16442j53818r8206p4387n5826q4677
$$ 2777537 2611937 2413877 2283975 2100710 1984268 1830450 1732244 1657857 1602031 1517354
2268A517354o5634m5814j1818j14024n0434j04712m6681m2160M990l7123j30625
$$ 1517354 1451720 1405906 1394088 1280064 1229630 1124918 1078237 1036077 1041067 1003944 873319
2257H73319P634k6221n343l6641q0796k1490n771J5316n1116k7506k4637N441
$$ 873319 880953 854732 849389 812748 731952 710462 704691 720007 668891 641385 616748 622189
2245F22189O2559m6463k5081n724K2753P959M126l9047r9483l9333L8448L4046
$$ 622189 684748 638285 613204 607480 630233 638192 642318 603271 503788 464455 502903 536949
2233E36949m8024r918L5238p2665o105k544m9245K5878L1737m1914K931k2066
$$ 536949 488925 479007 514245 441580 435475 432931 383686 409564 441301 399387 402318 380252
2221C80252j0746l8396P1640l2982o9685m4065j4398J5857j3399l4287J591N4223
$$ 380252 369506 331110 402750 369768 300083 256018 241620 257477 244078 209791 211382 265605
2209B65605k3871O133O3794q957m0p7730k3114p9545N9192R940m7143M631N6514
$$ 265605 241734 247867 311661 302704 302664 224934 201820 122275 181467 191407 144264 148895 205409
2196B05409m3124m3372J39607n2465M090m015k8685k6458J3829J0871k2771K1862
$$ 205409 162285 118913 258520 206055 210145 206130 177445 150987 164816 175687 152916 174778
2184A74778l0892J4374k9389r338l2236L0603K5120k4644j8610j6503R7508l8047
$$ 174778 143886 158260 128871 119533 87297 117900 143020 118376 99766 83263 180771 142724
2172A42724N230P7903o827p4683K0296m8029j3727K0893j2291p182k8032M4227
$$ 142724 147954 225857 219030 144347 164643 116614 102887 123780 111489 104307 76275 120502
2160A20502l928r462K8620K302j5391l1393m0246J9866N31k0654J6749K2568N2522
$$ 120502 116574 107112 135732 138034 122643 91250 51004 70870 71401 50747 67496 90064 142586
2147A42586J2280M2755n8496k4923j1351o1274L9454K6955M025k2150k018n393
$$ 142586 154866 197621 139125 114202 102851 41577 81031 107986 112011 89861 87843 82450
2135H2450N2834L7406m1707k7068n0278P639M5181n3739J8044M009k9875k704
$$ 82450 135284 172690 130983 103915 53637 61276 106457 52718 70762 74771 44896 42192
2123D2192K0352k9810K9002L278j4952R489P8153j6548l9818L8114q9222K599
$$ 42192 62544 32734 61736 65014 50062 59551 137704 121156 81338 119452 30230 32829
2111C2829N7233M1956k0277p6577m2588O4205j2862M8869l2555M030n3838m3950
$$ 32829 90062 132018 111741 35164 -7424 56781 43919 92788 60233 64263 10425 -33525
2099c3525P9905J7852N702K3185L6215L8675p7697m9065k9815k5903M7606K8485
$$ -33525 46380 64232 69934 93119 129334 168009 90312 41247 11432 -14471 33135 61620
2087F1620K2134J0456p7831J7244M445N709r265j4395N9888o455k0496n6177k399
$$ 61620 83754 94210 16379 33623 38068 43777 34512 20117 80005 73550 53054 -3123 -5522
2074e522N7024n2464O0297M1433n2629j9281L9255L0294l8461q1211J6619O0728
$$ -5522 51502 -962 59335 100768 48139 28858 68113 98407 59946 -21265 -4646 56082
2062E6082K3839M924n307j7837n7195k0790M6448n670m4232K076N5044k1209j2061
$$ 56082 79921 84845 79538 61701 4506 -16284 30164 24494 -19738 -17662 37382 16173 4112
2049D112J15973n2320l8J3801J5233o347l6555j4082M5832J504l371j6091K1073
$$ 4112 120085 67765 67727 81528 96761 90414 53859 39777 85609 87113 83742 67651 88724
2036H8724l4394L3359K3817O904p811J4979N6408K2817J997n1451r518K4579k0893
$$ 88724 54330 87689 111506 118410 110599 125578 181986 204803 206800 155349 145831 170410 149517
2023A49517m7940q5640J2224M6543O6990m0800q919m0308m7916L1431p877j2015
$$ 149517 101577 15937 28161 74704 141694 100894 91975 51667 3751 35182 27305 15290
2011A5290N4963L1244o9935M4983J5127m9494n853n187J399M8551l5909Q722k9274
$$ 15290 70253 101497 31562 76545 91672 42178 36325 31138 32537 81088 45179 53901 24627
1998B4627j840q7195L9306L8935l0126M842K4908J6446R100O2745L9772n4715
$$ 24627 22787 -64408 -25102 13833 -16293 -11451 13457 29903 39003 101748 141520 86805
1986H6805n3368l2334k2206o935l3324j0576R5118O4937k9271q762m8702J1389
$$ 86805 33437 1103 -21103 -28038 -61362 -71938 23180 88117 58846 50084 1382 12771
1974A2771L2444j6515L658p581m5245J0117p1540J09282j0500l1583O7974m9462
$$ 12771 45215 28700 32358 24777 -20468 -10351 -81891 27391 16891 -14692 53282 3820
1962C820k4563m5701L5939R4365m705m3962m2602L9308j7563J7917J7844Q823
$$ 3820 -20743 -66444 -30505 63860 59155 15193 -27409 11899 -5664 12253 30097 38920
1950C8920L73r5076k1259R9859j0192p4791r531L6576O9164m435K2127M799k0870
$$ 38920 39293 -55783 -77042 22817 12625 -62166 -71697 -35121 34043 29608 51735 56534 35664
1937C5664l8175k9045m615M6117M797l6534O3606M5561p8599k0416L3626j1859
$$ 35664 -2511 -31556 -36171 9946 14743 -21791 41815 87376 8777 -11639 21987 10128
1925A0128K6180K2089K1618j6719o6207J0205K9166M035K036J4267R618j3857
$$ 10128 36308 58397 80015 63296 -2911 7294 36460 40495 42531 56798 66416 52559
1913E2559l4263L5260k5935m5688J8379J9587j9788k2378M6609M3832L4520k7435
$$ 52559 18296 53556 27621 -18067 312 19899 111 -22267 24342 68174 102694 75259
1901G5259p6867R345J1350J2758j039o7641k8349M4410j6411N1260M8787j5943
$$ 75259 -1608 7737 19087 31845 30806 -36835 -65184 -20774 -37185 14075 62862 46919
1889D6919n9487J4578N0889m2698o1631N1780L7907p3585q170N8549R355k1992
$$ 46919 -12568 2010 52899 10201 -51430 350 38257 -35328 -43498 15051 24406 2414
1877B414M605p0150L672N4032k627j4230l3093K7695N6835K7801J605O66k8166
$$ 2414 7019 -63131 -59459 -5427 -8054 -22284 -55377 -27682 29153 56954 58559 59225 31059
1864C1059m851Q804m6235M518L1227j9774L5209l3057k6232P6600J5846o6616
$$ 31059 26208 35012 -11223 -6705 24522 4748 39957 6900 -19332 57268 73114 6498
1852F498j1709k0110m8087O014l53k057M2149M0321J2900l8207K106Q8639l8008
$$ 6498 -5211 -25321 -73408 -67394 -67747 -69804 -27655 12666 25566 -12641 -10535 78104 40096
1839D0096N3j2106m8036L1201n691o5006R864k3885J1062L0124N6829m7804j0686
$$ 40096 40149 28043 -19993 11208 5517 -59489 -49625 -73510 -62448 -32324 24505 -23299 -33985
1826c3985K5531m9878P7729k4130k1883P066N6993l4399J9218k4939J4048N0148
$$ -33985 -8454 -58332 19397 -4733 -26616 -19550 37443 3044 22262 -2677 11371 61519
1814F1519l2055K29k1221m8572j1714N4665k8876R2197R783n5225n9643K1933
$$ 61519 29464 29693 8472 -40100 -51814 2851 -26025 66172 75955 20730 -38913 -16980
1802a6980L2506j2494J8213J582j3280M5584n2878l3126j604J2076M1967J4195
$$ -16980 15526 3032 21245 22827 9547 55131 2253 -30873 -32477 -20401 21566 35761
1790C5761j0877p3169M2494L5969o3350J3463O9106P315q7847L198N4715r5045
$$ 35761 24884 -48285 -5791 30178 -33172 -19709 49397 56712 -31135 -27937 26778 -68267
1778f8267M8717K7961M0487j7301K063j6270l3195J3976L4963J9865M5157k9082
$$ -68267 -19550 8411 48898 31597 33660 17390 -15805 -1829 33134 52999 98156 69074
1766F9074o2618l1392J5469k8813k2485K6191J8011O180K7242L4041l4974K1382
$$ 69074 6456 -24936 -9467 -38280 -60765 -34574 -16563 -10383 16859 50900 15926 37308
1754C7308n6256j5663n4894J5707J169N2583q896j8477M4472J6740L394O2050
$$ 37308 -18948 -34611 -89505 -73798 -72629 -20046 -28942 -47419 -2947 13793 17187 79237
1742G9237o9931o9748L110J1649o193q216R032J2783m0426M8491J02880j0691
$$ 79237 9306 -60442 -57332 -45683 -51876 -60092 -51060 -38277 -78703 -30212 72668 61977
1730F1977j8708K2959M2842j0877j02242n0402K0951m0327L5321K9653L4775j1023
$$ 61977 43269 66228 109070 98193 -4049 -54451 -33500 -73827 -38506 -8853 25922 14899
1718A4899m5498l379M7372J1549L7254p3676m4907J6091J4150Q203K7918o8216
$$ 14899 -30599 -33978 13394 24943 62197 -11479 -56386 -40295 -26145 -17942 9976 -58240
1706e8240l0365N4818k2284l1358J1543M956j6481q602K4093P8709q433O0412
$$ -58240 -88605 -33787 -56071 -87429 -75886 -70930 -87411 -96013 -71920 6789 -1644 58768
1694E8768l8425M9888j3321q2537N7261M2658m8986n3135L5972m116j2463N0205
$$ 58768 20343 70231 56910 -25627 31634 74292 25306 -27829 8143 4027 -8436 41769
1682D1769j6301j1463m984J6686L7450j1158n0923k1202j4840k8233k975m963
$$ 41769 25468 14005 9021 25707 63157 51999 1076 -20126 -34966 -63199 -66174 -71137
1670g1137N2974l593Q08L1529N532m8762N4015Q0936n2627l9659J9823q5228O33
$$ -71137 -18163 -21756 -20948 10581 16113 -32649 21366 102302 49675 10016 29839 -55389 -54756
1657e4756O6429K7374j7434l8512J2641j1843j0815J8192J9411k865L938k389
$$ -54756 11673 39047 21613 -16899 -4258 -16101 -26916 -8724 10687 7822 11760 9371
1645I371K2995R683k0058K663k7629L389K6670l041j3181N973k9217j8575Q650
$$ 9371 32366 42049 21991 24654 -2975 414 27084 24043 10862 16835 -12382 -30957 -22307
1632b2307K9762k1271j1235N760N9272p409r1516N995Q1692k6210k630J4260J6089
$$ -22307 7455 -13816 -25051 -19291 39981 32572 -58944 -52949 28743 2533 -97 14163 30252
1619C0252J1843J5076k3824o7243K1176j735K3427P297m0769q647l0986l155q834
$$ 30252 42095 57171 33347 -33896 -12720 -14455 8972 16269 -24500 -33147 -64133 -67288 -76122
1606g6122N2207N1561n2990M1092k6433L6387N1998r589l4203p893k4997j1774
$$ -76122 -23915 27646 -25344 15748 -10685 25702 77700 68111 33908 26015 1018 -10756
1594a0756M791p526L184k3115m110J1428R821m1284Q1065o504l0436p845j2756
$$ -10756 -5965 -13491 -10307 -33422 -37532 -26104 -16283 -57567 23498 16994 -13442 -21287 -34043
1581c4043k3902Q5077Q022r1278n3524M9503O6081q6612L4515J10902K4604n3700
$$ -34043 -57945 27132 35154 -56124 -109648 -60145 5936 -80676 -46161 64741 89345 35645
1569C5645k6336j1948j8301l736M7852k3254l3967P822m4008k216L775k4089Q1197
$$ 35645 9309 -2639 -20940 -24676 23176 -78 -34045 -26223 -70231 -72447 -68672 -92761 -11564
1556a1564M2939J4869j6552j5815m3281j5439N8757M1080j785r5024L0955o768
$$ -11564 31375 46244 29692 13877 -29404 -44843 13914 54994 53209 -41815 -10860 -17628
1544a7628n2761j1926m0712O4619m008M4026M2743L8715o979k5135K8416l9194
$$ -17628 -70389 -82315 -123027 -58408 -62416 -18390 24353 63068 56089 30954 59370 20176
1532B0176n59q6384j2105K8299R641L7450k9813M7912K0980O775r1524K3262j341
$$ 20176 19617 -66767 -78872 -50573 -40932 -3482 -33295 14617 35597 42372 -49152 -25890 -27231
1519b7231o993j5985J4106L9991M472k0643m0189M782J38747l047o9200n1432
$$ -27231 -34224 -50209 -36103 3888 8360 -12283 -52472 -47690 91057 88010 18810 -32622
1507c2622J4754k2020k9136N363R798k662j8792q087R4334m3573p534K2580J8665
$$ -32622 -17868 -39888 -69024 -63661 -53863 -56525 -75317 -83404 10930 -32643 -40177 -17597 1068
1494A068N3943l3310Q416n4157K3427m4738N9459N3783l0386L3640k4303k7660
$$ 1068 55011 21701 30117 -24040 -613 -45351 14108 67891 37505 71145 46842 19182
1482A9182p972o1482J8983K9254O4543N546J4984R82Q88k7453L1360j01093k8934
$$ 19182 11210 -50272 -31289 -2035 62508 68054 83038 84020 84908 57455 88815 -12278 -41212
1469d1212N6993J4537m8291K786Q532K9892k1614n6189j481N6260N5820J7067
$$ -41212 15781 30318 -17973 -15187 -6655 23237 1623 -54566 -56047 213 56033 73100
1457G3100J9446n2507q1836N3447k0006q312L9663L5781n8512k6270p670j832
$$ 73100 92546 40039 -41797 11650 -8356 -16668 22995 58776 264 -26006 -33676 -35508
1445c5508O883l1272M9024L0149K4615J1464j6233k6902l434m1167P154j4922
$$ -35508 -28625 -59897 -10873 19276 43891 55355 39122 12220 8786 -32381 -25227 -40149
1433d0149l0226j5366P0904M6177k7482l5134O1592j0410p1877k3136l943J02033
$$ -40149 -70375 -85741 -14837 31340 3858 -31276 30316 19906 -51971 -75107 -79050 22983
1421B2983J234k7031k5348j9474q5717o3799j4187J24885J06981p797J2603n5702
$$ 22983 24217 -2814 -28162 -47636 -133353 -197152 -211339 -86454 20527 12730 25333 -30369
1409c0369k3736P5833N9544j03877m2571J0676o904k5503N1441Q6324j5898m2673
$$ -30369 -54105 21728 81272 -22605 -65176 -54500 -61404 -86907 -35466 50858 34960 -7713
1397g713o5899l1436K7471j864m79L8354j3281J3148K6693l541J4282k0536L0056
$$ -7713 -73612 -105048 -77577 -79441 -79920 -41566 -54847 -41699 -15006 -18547 -4265 -24801 5255
1384E255J0011Q221J6342m0577n6620K9986l3984K0140K9712J142k5866j7888
$$ 5255 15266 23487 39829 -748 -57368 -27382 -61366 -41226 -11514 -10372 -36238 -54126
1372e4126Q4415l580q316N6067p5726m6706k1431P8295K8610l4344L7696j6032
$$ -54126 30289 26709 18393 74460 -1266 -47972 -69403 8892 37502 3158 40854 24822
1360B4822n598l2303r913J8205m1941M0299j5869j2676L1624J1828K0072n7434
$$ 24822 19224 -13079 -22992 -4787 -46728 -6429 -22298 -34974 -3350 8478 28550 -28884
1348b8884k4090J1386K9470l4256J8734j1296J1494M4909k3188l907J025K4696
$$ -28884 -52974 -41588 -12118 -46374 -27640 -38936 -27442 17467 -5721 -9628 -8603 16093
1336A6093J1122L9698n6730m0196j5557Q216Q408L8263L3228M784J0648k4882
$$ 16093 27215 66913 10183 -30013 -45570 -37354 -28946 9317 42545 47329 57977 33095
1324C3095m7399n4931K8203j0977o135N1752m9581m3695N2773M1030o0290N8045
$$ 33095 -14304 -69235 -41032 -52009 -58144 -6392 -55973 -99668 -46895 -5865 -66155 -8110
1312h110j6738n2234P9893l5916J7373l851m392P976K133o8281O0381k2125l2605
$$ -8110 -24848 -77082 2811 -33105 -15732 -19583 -23975 -15999 -13866 -82147 -21766 -43891 -76496
1299g6496N1872M4596P744m7243L7522m0450p617L9614l3186J9730J9747j9084
$$ -76496 -24624 19972 27716 -19527 17995 -22455 -30072 9542 -23644 -3914 15833 -3251
1287c251K0151K1561r586m045O063j5142k2139m2639k4608L5994l2393l4868O252
$$ -3251 16900 38461 28875 24830 30893 15751 -6388 -49027 -73635 -37641 -70034 -104902 -98650
1274i8650Q5434M4023M9738k2606o7990k728m2463j475K9253P1409n494J5008
$$ -98650 -13216 30807 80545 57939 -10051 -12779 -55242 -56717 -27464 43945 38451 53459
1262E3459n0282J5469o5650m3354L3144l0745P6787j52p011L33O8960k1374n0602
$$ 53459 3177 18646 -47004 -90358 -57214 -87959 -11172 -11324 -18335 -18002 50958 29584 -21018
1249b1018M1153m3615K5019M203J6316j7819N8637J5069r6853p330K5886L0693
$$ -21018 20135 -23480 1539 5742 22058 4239 62876 77945 -18908 -26238 -352 30341
1237C0341j2081J2641R046j9902k5003N350J8740m2761p5146N6462J4698k5549
$$ 30341 18260 30901 39947 20045 -4958 392 19132 -23629 -98775 -42313 -27615 -53164
1225e3164j1753N930j8416K6997k1730M2860K4333J4247Q91M5411J5412o4403
$$ -53164 -64917 -58987 -77403 -50406 -72136 -29276 -4943 9304 10195 55606 71018 6615
1213F615l3144j5693K280J3407l2012N27L2131J4503k731q429M1937j4425K4671
$$ 6615 -26529 -42222 -39942 -26535 -58547 -58020 -25889 -11386 -14117 -22546 19391 4966 29637
1200B9637o13N4856l0157k0100L922j960n0396l03L1782l8273k7890P3809K8512
$$ 29637 29024 83880 53723 33623 37545 35585 -14811 -15114 16668 -21605 -49495 24314 52826
1187E2826p7036l6884L0844j4982N0572N9979l4350n3220O9498l9742K1867L5412
$$ 52826 -24210 -61094 -30250 -45232 5340 65319 30969 -22251 47247 7505 29372 64784
1175F4784r3538l6419K8232J5602M97k7179K0882m9378m0572N5064J0183J6713
$$ 64784 -28754 -65173 -36941 -21339 -20842 -48021 -27139 -76517 -117089 -62025 -51842 -35129
1163c5129n0078K6301p876J3949j7493M152O8907l224P0706m5134k8703L6916
$$ -35129 -85207 -58906 -66782 -52833 -70326 -66174 2733 -491 70215 25081 -3622 33294
1151C3294m8576M8046k4776m1955L1634l905K6745K8858l4848m2904n7520K4707
$$ 33294 -15282 32764 7988 -33967 -2333 -6238 20507 49365 14517 -28387 -85907 -61200
1139f1200J9618Q6893k9304l5533p183n747P3301J6220K3244R562j00344k3031
$$ -61200 -41582 45311 16007 -19526 -26709 -32456 40845 57065 80309 89871 -10473 -33504
1127c3504n16M9828K355J667m086j0954m2255J2698J7982K535J3934m2152K9640
$$ -33504 -34020 15808 18163 19830 15744 4790 -37465 -24767 -6785 -4250 9684 -32468 -2828
1114b828J6995k0897j738j7562K3706L0357J0604M671p638p5385o668L4584M9609
$$ -2828 14167 -6730 -8468 -26030 -2324 28033 38637 43308 35670 -39715 -46383 -11799 37810
1101C7810l2622j0931M9795p8155P023J9234M9500Q855m0568l1296J5663L599
$$ 37810 5188 -5743 44052 -34103 -27080 -7846 41654 50509 9941 -21355 -5692 -2093
1089b093k5120J8512K1100R4267m6574j15265J0656L0824J4877p941L8493j02753
$$ -2093 -27213 -8701 12399 106666 60092 -55173 -44517 -13693 1184 -6757 31736 -71017
1077g1017j3597L8702N6346j2632O1896j8046l306o59J2259O290m2921K4568j7206
$$ -71017 -84614 -45912 10434 -2198 59698 41652 38346 37687 49946 56236 13315 37883 20677
1064B0677m0547j0308O1030J567m8648L2038j5569K1309l0448q99q567k5709j0228
$$ 20677 -19870 -30178 30852 32419 -16229 15809 240 21549 -8899 -9798 -18365 -44074 -54302
1051e4302p38L4913Q3988k976r9104K4334M7347o2727l8033N2752m863J2105r555
$$ -54302 -55040 -20127 63861 60885 -38219 -13885 33462 -29265 -67298 -14546 -19409 -7304 -16859
1038a6859P6758j6344j00219J4562p526q167N2107K7865o9636K6323N4300j3975
$$ -16859 59899 43555 -56664 -42102 -49628 -57795 -5688 22177 -47459 -21136 33164 19189
1026A9189n1327j3756L0365N9314n7473l7254l791r158j122j8109J3193L0022
$$ 19189 -32138 -45894 -15529 43785 -13688 -50942 -54733 -63891 -65013 -83122 -69929 -39907
1014c9907N6952o224M7466k0112p2062j7118j2113n0130K1201l4386O8478K6180
$$ -39907 17045 10821 58287 38175 -33887 -51005 -63118 -113248 -92047 -126433 -57955 -31775
1002c1775K1769M0468P404l8277L9850l4819k7192L3278J2486L2812m9408j4905
$$ -31775 -10006 30462 37866 -411 39439 4620 -22572 10706 23192 56004 6596 -8309
990h309M6791K6391K0594l8459k1537j2513j3335k031J3880J0056K8089l2229
$$ -8309 38482 64873 85467 47008 25471 12958 -377 -2408 11472 21528 49617 17388
978A7388o796j6634m2995J1481Q9298J3921k0566K5913l9508n7677k2341Q23J3378
$$ 17388 10592 -6042 -49037 -37556 51742 65663 45097 71010 31502 -26175 -48516 -47693 -34315
965c4315K6649N9228N809k8909q2762m2661K5684n0137j2316N6951j2979J0865
$$ -34315 -7666 51562 57371 28462 -54300 -96961 -71277 -121414 -133730 -76779 -89758 -78893
953g8893O2447K3124j5684m3857P5288O4372q2124m4828K9822l8401N6790n239
$$ -78893 -16446 6678 -9006 -52863 22425 86797 4673 -40155 -10333 -48734 8056 2817
941B817j0188L5562j5268j21730k5570Q925L3678N0560m7300M4812k7581k779
$$ 2817 -7371 28191 12923 -108807 -134377 -125452 -91774 -41214 -88514 -43702 -71283 -74062
929g4062M1913j0091K8860K1034m2537j9346q654K761M0895r731J6542J2774J6432
$$ -74062 -32149 -42240 -13380 7654 -34883 -54229 -62883 -60122 -19227 -28958 -12416 358 16790
916A6790j9879k8194q387L3996K8793j5474K113l8198k5551P1451j2090l2189
$$ 16790 -3089 -31283 -39670 -5674 23119 7645 9758 -28440 -53991 17460 5370 -26819
904b6819J2583Q4480m5360k9337J1303K4453k5775o5357J8296m844K5683N9J1066
$$ -26819 -14236 70244 24884 -4453 6850 31303 5528 -59829 -41533 -46377 -20694 -20635 -9569
891i569J5558K435q374o2148M0675M72K135R446M0027O473o9054j6047J02638
$$ -9569 5989 8424 50 -62098 -21423 -20951 -18816 -9370 30657 37130 -31924 -47971 54667
878E4667J7034m2756O8962q922J5931L7673o0706l3398p291m6064k6539O3498
$$ 54667 71701 28945 97907 88985 104916 142589 81883 48485 41194 -4870 -31409 32089
866C2089L2240j054n6933m0634L2596j6341K1685p0876m2918P3372J0453J5060
$$ 32089 64329 63275 6342 -34292 -1696 -18037 3648 -67228 -110146 -36774 -26321 -11261
854a1261l3568L9547N8615m6229K3109K0249l0341r603L7540n8946R547J3794
$$ -11261 -44829 -5282 53333 7104 30213 50462 20121 10518 48058 -10888 -1341 12453
842A2453J4088n523o9183N6329p875L7437j0332p1665J9267K711j2890k0146R5492
$$ 12453 26541 21018 -48165 8164 289 37726 27394 -44271 -25004 -22293 -35183 -55329 40163
829D0163k6541J474l679m633J5649k0344O3161K3885M4106j08750q5735L5836
$$ 40163 13622 15096 11417 6784 22433 2089 65250 89135 133241 24491 -61244 -25408
817b5408k4469M9615r798J033m9629O6323k4143L3547J5722o4447M9237K1500
$$ -25408 -49877 -262 -10060 -9027 -58656 7667 -16476 17071 32793 -31654 17583 39083
805C9083R393J4366K387l2064O2147J4666m3001m152q0355K90l1581K7403K3702
$$ 39083 48476 62842 65229 33165 95312 109978 66977 62825 -17530 -17240 -48821 -21418 2284
792B284M4007k5600p5873P9977M4350J1768j1836k4560n985n349Q20K833L6536
$$ 2284 46291 20691 -55182 24795 69145 80913 69077 44517 38532 33183 34003 36836 73372
779G3372k8402p4873J9521l3189M931M1635J0969l7191M0608M045K330m4456q0320
$$ 73372 44970 -29903 -10382 -43571 -38640 2995 13964 -23227 17381 21426 23756 -20700 -101020
766a01020J1429J25682O2145n6452j8858J1286K6813j3338l3550L8889M9209o3539
$$ -101020 -89591 36091 98236 41784 22926 34212 61025 47687 14137 53026 102235 38696
754C8696l8927j0889m4343P8298J723l4463L236l7401J7303Q5953o545m0455j9303
$$ 38696 -231 -11120 -55463 22835 24558 -9905 -6669 -44070 -26767 59186 52641 12186 -7117
741g117J9796P823m2792m8058O1266P8043q520n2596l7171J4944J5050p2635L6821
$$ -7117 12679 20502 -22290 -70348 -9082 68961 60441 7845 -29326 -14382 668 -71967 -35146
728c5146L7743j5477L9676J5383j1039L5183j3151j0002p397k6570l4253l0710
$$ -35146 2597 -12880 26796 42179 31140 66323 53172 43170 35773 9203 -25050 -55760
716e5760P1931m0862K9257N3302m5083j629J1636K8059J0958q1441n2356N6798
$$ -55760 16171 -24691 4566 57868 12785 11156 22792 50851 61809 -19632 -71988 -15190
704a5190O9108k5881O993n596p0922l872r91P8109J981l8015M4514o034J0774
$$ -15190 53918 28037 35030 29434 -41488 -45360 -46351 31758 33739 -4276 40238 34204 44978
691D4978N9485j8829l7617o917K5430L7186k1874p0591O4694L1407o1363k9504
$$ 44978 104463 85634 48017 41100 66530 103716 81842 11251 75945 107352 45989 16485
679A6485J2433K4206O711k85N146m394n8234o481L3175k1632j1844P121l9378
$$ 16485 28918 53124 59835 59550 64696 60302 2068 -4413 28762 7130 -4714 2407 -36971
666c6971M951k6846L5452N7716J7570L3427m5789m2824j3803m3102L2635J7679
$$ -36971 -32020 -58866 -23414 34302 51872 85299 39510 -3314 -17117 -60219 -27584 -9905
654i905J7164m7537Q8260k4036o3192M0691J1630j3478k0732L6399K1168j06609
$$ -9905 7259 -40278 47982 23946 -39246 1445 13075 -403 -21135 15264 36432 -70177
642g0177m573m4037L3558M3024M0255M5050k7323J578J01210o8420j11541L7805
$$ -70177 -74750 -118787 -85229 -42205 -1950 43100 15777 17355 118565 50145 -61396 -23591
630b3591L2668K6279J1320M4806m9417o7124p8604j7896Q3168P9734M6995l5105
$$ -23591 9077 35356 46676 91482 42065 -25059 -103663 -121559 -38391 41343 88338 53233
618E3233o0653K5796j1934o1238k0876k5219r330N8787m7444M8096M8920O297
$$ 53233 -7420 18376 6442 -54796 -75672 -100891 -110221 -51434 -98878 -50782 -1862 4435
606D435K7336m9280P58k5427N0065n346n8762j7366M1627J11185n0062m1767o0604
$$ 4435 31771 -17509 -16751 -42178 7887 2541 -56221 -73587 -31960 79225 29163 -12604 -73208
593g3208m1433N4211R6554P9627M810p4391k6202n4790R381j4260M2397k4924
$$ -73208 -114641 -60430 36124 115751 120561 46170 19968 -34822 -25441 -39701 2696 -22228
581b2228k73L8305j8762j075l9539j7598L1272K3604M6159r3212l8185L2641J289
$$ -22228 -22501 15804 -2958 -4033 -43572 -61170 -29898 -6294 39865 -53347 -91532 -58891 -57602
568e7602J1652M3915l8202k3378m169j3698k7322N2296K5075n783K1974N4435
$$ -57602 -45950 -2035 -40237 -63615 -67784 -81482 -108804 -56508 -31433 -37216 -15242 39193
556C9193p2123L2280R729K2656L0112n7245Q276J6608J9655r6798J7982P2197
$$ 39193 -32930 -650 9079 31735 61847 4602 12878 29486 49141 -47657 -29675 42522
544D2522K6494m4487N219M7241n4209j4097N9264j05125P9339J9019j8639n4440
$$ 42522 69016 24529 29748 76989 22780 8683 67947 -37178 42161 61180 42541 -11899
532a1899J402K7356J7021J7975m3216k09L334m3719N4429P200l2304o6537N2913
$$ -11899 -10497 16859 33880 51855 8639 8430 11764 -31955 22474 29674 -2630 -69167 -16254
519a6254M0508n4199K1876m99K33K7323q129K4602j6031j5035j5829j5831J1826
$$ -16254 24254 -29945 -8069 -8568 -8335 18988 10859 35461 19430 4395 -11434 -27265 -15439
506a5439K7154m142M2740R646M2844n0496j03958O3389l3166K6607K3361J7546
$$ -15439 11715 7573 50313 59959 102803 52307 -51651 11738 -21428 5179 28540 46086
494D6086k9081j3968K6776N252k0723l1219L0695M2061n4773j872q428L2456P999
$$ 46086 17005 3037 29813 35065 14342 -16877 13818 55879 1106 -766 -9194 23262 31261
481C1261o6655O8963M3188m6381L3793M5973m6906p0134n7506L9332k2906K2832
$$ 31261 -35394 33569 76757 30376 64169 110142 63236 -6898 -64404 -25072 -47978 -25146
469b5146N8023L5597j8715J0888q6406m7335J0292m4923K6057N7664j743j8702
$$ -25146 32877 68474 49759 60647 -25759 -73094 -62802 -107725 -81668 -24004 -25747 -44449
457d4449J6075j5846K3107J998n1115M8110L6778o447J1376N9461n8773q582Q020
$$ -44449 -28374 -44220 -21113 -19115 -70230 -22120 14658 8211 19587 79048 20275 11693 19713
444A9713n8201J2728j8211P5672j14k4971L5355j9819j03272J9153K398M4577
$$ 19713 -38488 -25760 -43971 31701 31587 6616 41971 22152 -81120 -61967 -59569 -14992
432a4992l1664P689K5067k9195K959J1990r509N5502J7627m9193N1171l178J8742
$$ -14992 -46656 -38967 -13900 -43095 -40136 -28146 -37655 17847 35474 -13719 37452 34274 53016
419E3016R694o8778j0277l8948j340K1288k4289J4369P6696K0827j9240o8008
$$ 53016 62710 -6068 -16345 -55293 -56633 -35345 -59634 -45265 31431 52258 33018 -34990
407c4990o537N0760N2405p446N4392k4451j6838r527o0359M3533K9172m6096M957
$$ -34990 -41527 9233 61638 54192 108584 84133 67295 57768 -2591 40942 70114 24018 28975
394B8975m7275J447M4238p553J8244l4510L7895p4948m6598k7236O9489R1328
$$ 28975 -18300 -16853 27385 19832 38076 3566 41461 -33487 -80085 -107321 -37832 53496
382E3496k8238o1927J383k8633M0811K8611K2262L1695o8351K3101l905K0173
$$ 53496 25258 -36669 -35286 -63919 -23108 5503 27765 59460 -8891 14210 10305 30478
370C0478m793l9116j3734K9507O4612o1616j0955M1706J0381l7544o682O163k4430
$$ 30478 25685 -13431 -27165 2342 66954 5338 -5617 36089 46470 8926 2244 8407 -16023
357a6023K9836j1560L9884M1327j2700j0988k8486j3333J3545L0206k4591m6582
$$ -16023 13813 2253 42137 83464 70764 59776 31290 17957 31502 61708 37117 -9465
345i465J5080n826J1969l4728J2284R3453M3931n7523p0296o0054p832J09946
$$ -9465 5615 -211 11758 -22970 -10686 82767 126698 69175 -1121 -61175 -69007 40939
333D0939L4191P035p7007R001k0157k0723m885m77K5237K2912O485l5750o276
$$ 40939 75130 82165 5158 14159 -5998 -26721 -31606 -32083 -6846 16066 22551 -13199 -19475
320a9475n769O210R429M989K7170q016L3867j7128n644L4550j07465L0907L5309
$$ -19475 -25244 -19034 -9605 -4616 22554 14538 48405 31277 25633 60183 -47282 -16375 18934
307A8934k0091J839N2896o690l892k2166J2409l5541j5476J0747L4648R491M28
$$ 18934 -1157 682 53578 46888 42996 20830 33239 -2302 -17778 -7031 27617 37108 37536
294C7536L7266l3216L5112l9302k2650n101o5036k0738N1422K8783o0203N9070
$$ 37536 74802 41586 76698 37396 14746 9645 -55391 -76129 -24707 4076 -56127 2943
282B943M6848o5882J02780j4106k1985o7652J357L1863M0602k8112n5958K4032
$$ 2943 49791 -16091 86689 72583 50598 -17054 -15697 16166 56768 28656 -27302 -3270
270c270K4617L598l751l8698k2300j1778M1083M8355j7937J2220n1941J8949K8304
$$ -3270 21347 24945 21194 -17504 -39804 -51582 -10499 37856 19919 32139 -19802 -853 27451
257B7451o402J1230P9671k7143k7706J88o4807m8800P0494k1718n673k3339L228
$$ 27451 21049 32279 111950 84807 57101 57289 -7518 -56318 14176 -7542 -13215 -36554 -33326
244c3326j0206j9695M0390o747L6346K0100K2968l964J6770n1270j1402k032J8614
$$ -33326 -43532 -63227 -22837 -29584 6762 26862 49830 45866 62636 11366 -36 -2068 16546
231A6546o8933J3264J5453K4930K6372K9040j3459l4942j2198L2838K3364j6064
$$ 16546 -52387 -39123 -23670 1260 27632 56672 43213 8271 -3927 28911 52275 36211
219C6211R541j6154l0448Q0246K9988q8574K8932J07038l5122j38721M5048k070
$$ 36211 45752 29598 -850 79396 109384 20810 49742 156780 121658 -17063 27985 25915
207B5915j6074l0185M0062l5389K775L389j4737n2617P4803L969l6651R8946r939
$$ 25915 9841 -20344 19718 -15671 -12896 -9507 -24244 -76861 -2058 1911 -34740 64206 54267
194E4267l4597j9019L1421l0354K3328Q320k1537j0369j2636M709J608m4041j3883
$$ 54267 19670 651 32072 1718 25046 33366 11829 1460 -11176 -6467 -4859 -48900 -62783
$$ [...]
##END NTUPLES=NMR SPECTRUM
##END=
