##TITLE=1H_DE-80H_X3
 200.13MHz, d2o
 8 sc
 
 19ns.26.2.2025
##JCAMPDX= 6.0         $$ Bruker NMR JCAMP-DX V2.0
##DATA TYPE= NMR SPECTRUM
##DATA CLASS= NTUPLES
##ORIGIN= UXNMR, Bruker Analytische Messtechnik GmbH
##OWNER= pz
$$ XWIN-NMR		Version 3.5
$$ Wed Jun  4 10:26:51 2025 Russian Standard Time (UT+4h)  Yarkov@DPX200
##.OBSERVE FREQUENCY= 200.1313
##.OBSERVE NUCLEUS= ^1H
##.ACQUISITION MODE= SIMULTANEOUS
##.ACQUISITION SCHEME= undefined
##.AVERAGES= 8
##.DIGITISER RES= 18
##SPECTROMETER/DATA SYSTEM= spect
##.PULSE SEQUENCE= zg30
##.SOLVENT NAME= CDCl3
##.SHIFT REFERENCE= (INTERNAL, CDCl3, 0, 15.5188)
##AUDIT TRAIL= $$ (NUMBER, WHEN, WHO, WHERE, WHAT)
$$ ##TITLE= Audit trail, XWIN-NMR		Version 3.5
$$ ##JCAMPDX= 5.01
$$ ##ORIGIN= Bruker BioSpin GmbH
$$ ##OWNER= Yarkov
$$ C:/Bruker/XWIN-NMR/data/yarkov2/nmr/H-C/1/pdata/1/auditp.txt
$$ ##AUDIT TRAIL=  $$ (NUMBER, WHEN, WHO, WHERE, WHAT)
(   1,<2025-06-04 10:25:44.12 +0400>,<Yarkov>,<DPX200>,
      <created by zg, POWCHK disabled, PULCHK disabled
       configuration hash MD5:
       00 E9 B6 7A A2 85 ED C7 34 08 36 98 17 FE 4E 26
       data hash MD5: 16K
       8D 83 7B AB 5D E9 BA CE B8 D8 B5 C9 16 57 B7 70>)
(   2,<2025-06-04 10:25:50.04 +0400>,<Yarkov>,<DPX200>,
      <Start of raw data processing
       efp BC_mod = 2 LB = 0.25 FT_mod = 6 PKNL = 1 PHC0 = -1711.075 PHC1 = 11.76656 SI = 16K 
       data hash MD5: 16K
       6D B0 EF 42 31 DC 21 7D 32 F5 9C 4A 46 44 87 54>)
(   3,<2025-06-04 10:25:54.79 +0400>,<Yarkov>,<DPX200>,
      <abs ABSG = 5 
       data hash MD5: 16K
       B7 5F EC A1 60 09 93 6F 2C 4B EE 10 1F 9D 0B 4D>)
(   4,<2025-06-04 10:26:11.59 +0400>,<Yarkov>,<DPX200>,
      <pk PHC0 = 0.5734865 PHC1 = -2 
       data hash MD5: 16K
       9E EB 20 78 9D 63 EC 08 E8 11 05 D4 53 B6 31 D7>)
$$ ##END=
$$ 
$$ hash MD5
$$ 55 18 E0 D0 4A F4 AD D0 E2 D4 3E B9 06 2F EE 39
##$RELAX= 
##$RELAX= 
##$RELAX= 
##$RELAX= 
##$RELAX= 
##$RELAX= 
$$ Bruker specific parameters
$$ --------------------------
##$DU= <C:/Bruker/XWIN-NMR>
##$EXPNO= 1
##$NAME= <H-C>
##$PROCNO= 1
##$TYPE= <nmr>
##$USER= <yarkov2>
##$AMP= (0..31)
100 100 100 100 100 100 100 100 100 100 100 100 100 100 100 100 100 100 
100 100 100 100 100 100 100 100 100 100 100 100 100 100 
##$AQSEQ= 0
##$AQ_mod= 1
##$AUNM= <au_zg>
##$AUTOPOS= <>
##$BF1= 200.13
##$BF2= 200.13
##$BF3= 200.13
##$BF4= 200.13
##$BF5= 200.13
##$BF6= 200.13
##$BF7= 200.13
##$BF8= 200.13
##$BYTORDA= 1
##$CFDGTYP= 0
##$CFRGTYP= 5
##$CHEMSTR= <none>
##$CNST= (0..31)
1 1 145 1 1 1 1 1 1 1 1 1 1 1 1 1 1 1 1 1 1 1 1 1 1 1 1 1 1 1 1 1 
##$CPDPRG= <>
##$CPDPRG1= <>
##$CPDPRG2= <>
##$CPDPRG3= <>
##$CPDPRG4= <mlev>
##$CPDPRG5= <mlev>
##$CPDPRG6= <mlev>
##$CPDPRG7= <mlev>
##$CPDPRG8= <mlev>
##$CPDPRGB= <>
##$CPDPRGT= <>
##$D= (0..31)
0 0.7 0 0 0 0 0 0 0 0 0 0.03 0 0 0 0 0 0 0 0 0 0 0 0 0 0 0 0 0 0 0 0 
##$DATE= 1749018343
##$DBL= (0..7)
120 120 120 120 120 120 120 120 
##$DBP= (0..7)
150 150 150 150 150 150 150 150 
##$DBP07= 0
##$DBPNAM0= <>
##$DBPNAM1= <>
$$ [...]
##$SUBNAM3= <"">
##$SUBNAM4= <"">
##$SUBNAM5= <"">
##$SUBNAM6= <"">
##$SUBNAM7= <"">
##$SUBNAM8= <"">
##$SUBNAM9= <"">
##$SW= 18.0517328524113
##$SWIBOX= (0..15)
0 0 2 0 0 0 0 0 0 0 0 0 0 0 0 0 
##$SW_h= 3612.71676300578
##$TD= 16384
##$TD0= 1
##$TE= 0
##$TE2= 300
##$TE3= 300
##$TEG= 300
##$TL= (0..7)
0 120 120 120 120 120 120 120 
##$TP= (0..7)
150 150 150 150 150 150 150 150 
##$TP07= 0
##$TPNAME0= <>
##$TPNAME1= <>
##$TPNAME2= <>
##$TPNAME3= <>
##$TPNAME4= <>
##$TPNAME5= <>
##$TPNAME6= <>
##$TPNAME7= <>
##$TPOAL= (0..7)
0.5 0.5 0.5 0.5 0.5 0.5 0.5 0.5 
##$TPOFFS= (0..7)
0 0 0 0 0 0 0 0 
##$TUNHIN= 0
##$TUNHOUT= 0
##$TUNXOUT= 0
##$USERA1= <user>
##$USERA2= <user>
##$USERA3= <user>
##$USERA4= <user>
##$USERA5= <user>
##$V9= 5
##$VALIST= <valist>
##$VCLIST= <CCCCCCCCCCCCCCC>
##$VD= 0
##$VDLIST= <DDDDDDDDDDDDDDD>
##$VPLIST= <PPPPPPPPPPPPPPP>
##$VTLIST= <TTTTTTTTTTTTTTT>
##$WBST= 1024
##$WBSW= 4
##$XGAIN= (0..3)
0 0 0 0 
##$XL= 0
##$YL= 0
##$YMAX_a= 488387
##$YMIN_a= -440599
##$ZGOPTNS= <>
##$ZL1= 120
##$ZL2= 120
##$ZL3= 120
##$ZL4= 120
##$ABSF1= 15.49127
##$ABSF2= -2.560579
##$ABSG= 5
##$ABSL= 3
##$ALPHA= 0
##$AQORDER= 0
##$ASSFAC= 0
##$ASSFACI= 0
##$ASSFACX= 0
##$ASSWID= 0
##$AUNMP= <proc_1d>
##$AZFE= 0.1
##$AZFW= 0.1
##$BCFW= 0
##$BC_mod= 2
##$BYTORDP= 0
##$COROFFS= 0
##$CY= -3
##$DATMOD= 1
##$DC= 0
##$DFILT= <>
##$DTYPP= 0
##$F1P= 0
##$F2P= 0
##$FCOR= 1
##$FTSIZE= 16384
##$FT_mod= 6
##$GAMMA= 0
##$GB= 0
##$INTBC= 1
##$INTSCL= 3.241238e-09
##$ISEN= 128
##$LB= 0.25
##$LEV0= 0
##$LPBIN= 0
##$MAXI= 10000
##$MC2= 0
##$MEAN= 0
##$ME_mod= 0
##$MI= 1.114404
##$NCOEF= 0
##$NC_proc= -5
##$NLEV= 6
##$NOISF1= 3.799351
##$NOISF2= 2.8
##$NSP= 0
##$NTH_PI= 0
##$NZP= 0
##$OFFSET= 15.51882
##$PC= 1
##$PHC0= -1710.501
##$PHC1= 9.76656
##$PH_mod= 1
##$PKNL= yes
##$PPARMOD= 0
##$PSCAL= 0
##$PSIGN= 0
##$REVERSE= no
##$SF= 200.130000577794
##$SI= 16384
##$SIGF1= 3
##$SIGF2= 2
##$SINO= 0.751879
##$SIOLD= 32768
##$SREGLST= <19F.Aceton>
##$SSB= 0
##$STSI= 16384
##$STSR= 0
##$SW_p= 3612.71676300578
##$SYMM= 0
##$S_DEV= 0
##$TDeff= 16384
##$TDoff= 0
##$TI= <>
##$TILT= no
##$TM1= 0
##$TM2= 0
##$TOPLEV= 0
##$USERP1= <user>
##$USERP2= <user>
##$USERP3= <user>
##$USERP4= <user>
##$USERP5= <user>
##$WDW= 1
##$XDIM= 16384
##$YMAX_p= 274365190
##$YMIN_p= -185816
$$ End of Bruker specific parameters
$$ ---------------------------------
##NTUPLES= NMR SPECTRUM
##VAR_NAME=  FREQUENCY,     SPECTRUM/REAL,   SPECTRUM/IMAG
##SYMBOL=    X,             R,               I
##VAR_TYPE=  INDEPENDENT,   DEPENDENT,       DEPENDENT
##VAR_FORM=  AFFN,          ASDF,            ASDF
##VAR_DIM=   16384,         16384,           16384
##UNITS=     HZ,            ARBITRARY UNITS, ARBITRARY UNITS
##FACTOR=    0.220516191357247, 1,           1
##FIRST=     3105.78141733384, 0,            0
##LAST=      -506.935345671942, 0,           0
##MIN=       -506.935345671942, -185816,     0
##MAX=       3105.78141733384, 274365190,    0
$$ Real data points
##PAGE= N=1
##DATA TABLE= (X++(R..R)), XYDATA
$$ [...]
6668G346458K55282K30594L32599K83545p901l94070p08185q43542p65474o24754
6658E104552n17922m23531l72294l22835k59164k27508j96075j54398j02041j17445
6648B411339p8255l4718p2307j7994j2425K0982q9K4099J7625N662k8061M3718
6636B279576k5195m4796r3669j70590j70931j54562p5308j21804j14147o6118
6626A242456p4469q4675p4111P976k2856n8295j6061n8262l0313k7419l1077P980
6614G80874j8645M572k5879j870j9273j6702m2259m2413J571J5264k6912j9855
6602E88473j7531N68k2050p05k5405k9204j2120k0759L513J6497k2156l1389Q732
6589D36464L1385O759j8808Q221l837k0530l6230J7104j8194K9465p069k7607
$$ y = [7346458, 7601740, 7832334, 8164933, 8448478, 8440577, 8046507, 7338322, 6494780, 5729306, 5104552, 4586630, 4163099, 3790805, 3467970, 3208806, 2981298, 2785223, 2630825, 2528784, 2411339, 2333084, 2298366, 2226059, 2208065, 2195640, 2216622, 2216533, 2240632, 2258257, 2263919, 2235858, 2279576, 2254381, 2209585, 2115916, 1945326, 1774395, 1619833, 1544525, 1422721, 1308574, 1242456, 1167987, 1083312, 1009201, 1017177, 994321, 936026, 919965, 861703, 831390, 803971, 772894, 780874, 762229, 766801, 740922, 739052, 719779, 703077, 660818, 618405, 619976, 635240, 608328, 588473, 570942, 571510, 549460, 548755, 523350, 494146, 482026, 461267, 464780, 481277, 459121, 427732, 436464, 467849, 474608, 455800, 464021, 460184, 439654, 403424, 420528, 402334, 431799, 424730, 397123]
6577C97123j3859N908Q121k9454k698L554l3092J0834m3684K5097K1132m234j621
6564C43127k201J1945p849k1119J021L0469k7268l63J0681l2701k4358M223r162
6551B76445P04l25M440J8433j7760o020L0774k7209o149m984L053J0739L9494
6538C21635j2457R97Q264l3832o679m6261J7425J0292J5121K9510l7228k3308
6526B43479J1575R243P444K3567J3327k1583j1773J7884J4910l698J2238J6698
6514C33311O84J4188K3214k5234J0155J384p574K5950J9080K184L0410L341k410
6501D28683K3444r616k9928L5682N822Q319l5987J547O1683J9142j739L3455J2970
6488E53477N80K1332K6996K3544O491Q00M5483P4319k3220p463M2926M1462J3959
$$ y = [397123, 383264, 389172, 397293, 367839, 365141, 368695, 335603, 346437, 302753, 327850, 348982, 344748, 343127, 340926, 352871, 345022, 323903, 324924, 355393, 328125, 327762, 338443, 305742, 281384, 285607, 276445, 277149, 276824, 281264, 299697, 281937, 275917, 306691, 279482, 273333, 268349, 271402, 282141, 321635, 309178, 310175, 318439, 284607, 277928, 231667, 249092, 259384, 274505, 304015, 266787, 243479, 255054, 264297, 271741, 295308, 308635, 287052, 275279, 293163, 308073, 304375, 316613, 333311, 333995, 348183, 371397, 346163, 356318, 357702, 350128, 376078, 395158, 397342, 427752, 431093, 428683, 452127, 442511, 412583, 448265, 454087, 462406, 426419, 427966, 489649, 508791, 507052, 540507, 553477, 554057, 575389, 602385, 625929, 632420, 633220, 678703, 753022, 729802, 722339, 765265, 806727, 820686]
6475H20686n478N0368K1750j1511M5677L3436P655J4167M2695L3097L3771m273
6463A082040l591K2364j906l0168k6980K5303P782k8740j5781j8451l1989L039
6451I82922k2295m0011j0339k5107J4274k8461l7082k1596k8200m4224k1760k151
6439G15970L5146M763j1920j8095j1910l94j9552j6301P345n618R62j1676j6709
6426F52011K542p566n836k596j6381J6690q41J15j7715L2464p159J0402M8762
6413G04892j6640l2285M144L9799K0160J1789j2213l6623P857J6327l0780M1840
6401G18267m924K063K1132j9890l9830O191j0686P243k786l4346n940N083j6022
6388F25555j525j5135p664J662K156r043K2927l59j2726K5624l2918n3297m4104
$$ y = [820686, 815208, 865576, 887326, 875815, 921492, 954928, 962583, 976750, 1019445, 1052542, 1086313, 1082040, 1078449, 1100813, 1098907, 1068739, 1041759, 1067062, 1074844, 1046104, 1030323, 1011872, 979883, 982922, 960627, 920616, 910277, 885170, 899444, 870983, 833901, 812305, 784105, 739881, 718121, 715970, 751116, 755879, 743959, 725864, 713954, 713560, 694008, 677707, 685052, 679434, 680396, 668720, 652011, 654553, 646987, 641151, 638555, 622174, 638864, 638023, 638138, 620423, 652887, 645728, 656130, 704892, 688252, 655967, 660111, 699910, 720070, 731859, 719646, 683023, 690880, 707207, 676427, 718267, 713343, 715406, 736538, 716648, 676818, 683009, 672323, 679566, 676780, 642434, 636494, 641577, 625555, 624030, 608895, 601231, 602893, 605049, 596006, 618933, 618574, 605848, 631472, 598554, 545257, 501153]
6375E01153j5340j0248k5852J492J8073l7762j5924r043j2445P332K097l427m24
6362C99682k4007N250m249J3540k3867K6128Q231l9064J3031J849j5439K6380
6350C87465k4834m5896j2355j5040Q696k9524K945J7697j8906l2961j105K465
6338B38647N0685M933K685m041m4727j8825K8395J3081K7114k3823o161r899k6360
6325B31704J9451L5396J5134l4974k867N211L6372j0323k0694k4832r641r046
6313B30891j4049K2624j883J0164K7278L327k0933k1144J601J9124K0244k432
6301B74812K9694k492l4462J3581L0808l7533k3061J7218J3539K1166k1426J5044
6289B96888k282k542m867Q04R923l2033J0698K3180J8623J8961l146n2850L7858
$$ y = [501153, 485813, 475565, 449713, 451205, 469278, 431516, 415592, 406549, 394104, 401436, 403533, 400106, 399682, 375675, 380925, 376676, 390216, 366349, 392477, 400708, 361644, 374675, 376524, 361085, 387465, 362631, 316735, 304380, 289340, 298036, 268512, 271457, 289154, 270248, 237287, 236182, 238647, 289332, 294265, 296950, 292909, 248182, 229357, 257752, 270833, 297947, 274124, 267963, 258064, 231704, 251155, 286551, 301685, 266711, 263844, 269055, 305427, 295104, 274410, 249578, 239937, 230891, 216842, 239466, 237583, 247747, 275025, 278352, 257419, 236275, 237876, 257000, 277244, 274812, 304506, 302014, 267552, 281133, 311941, 274408, 251347, 268565, 282104, 303270, 281844, 296888, 294606, 292064, 287197, 288001, 297924, 265891, 276589, 299769, 318392, 337353, 334207, 281357, 319215]
6276C19215M3907k847J6262l2450j8624L927J7826l623J5081K0416j096j5057
6264C62937K0731o529n360R245L1359L053J3532P150N1576k2300j9195k1902J7280
6251D41577j1881l6015L0704K9411J0168o798N24J6431J8552q853j0924j5320
6239D57576j1761K8955K4800r202K9264k2402J5482K5112J7794M790K5860l9940
6227E46328r929J3352k0453j1309N326R032K8620J4583O6306J7334P941k8555
6215F38576n667j0672M621K3863L6296J3490r391J1866r796J0193j6077J6298
6203G03600K5510J3727r455k3972N746O0344L6709k4247j2702M5897M1191J1223
6191H73571J4430J6081J7268N515l121L8536L8091J6899K1092J7002J4182J8431
$$ y = [319215, 363122, 360275, 376537, 344087, 325463, 329390, 347216, 343593, 358674, 379090, 377994, 362937, 383668, 377139, 371779, 381024, 412383, 415436, 428968, 436118, 487694, 465394, 446199, 424297, 441577, 429696, 393681, 424385, 453796, 463964, 457166, 457690, 474121, 492673, 483820, 472896, 457576, 445815, 474770, 499570, 490368, 519632, 497230, 512712, 537824, 555618, 560408, 586268, 546328, 536399, 549751, 529298, 517989, 523315, 532347, 560967, 575550, 641856, 659190, 667131, 638576, 632909, 622237, 626858, 650721, 687017, 700507, 691116, 702982, 693186, 703379, 687302, 703600, 729110, 742837, 733382, 709410, 715156, 775500, 812209, 787962, 775260, 821157, 862348, 873571, 888001, 904082, 921350, 926865, 923744, 962280, 1000371, 1017270, 1038362, 1055364, 1069546, 1087977]
6179A087977K1513j6070O4307K5761j4906K8046L1060M6819L9156J8223J3968
6168A345854K5621K5165M7906O4444K6385O1517J9385K9522N8013P2043R4338
6157A870193L1390P2566R3275O2678M9402M9533P1437P9325L9512M7555P3001
6146B539867R4494R9573J32780J17730J26089J19739J31702Q7863J44337J51223
6136C745397J46732J56253J55155J96490J93732J77467K27088K38315K01240K09466
6126E647335K45987K62846L12949K38807K92826L55840L51414L93946M42769M46472
6116H991191N04899N66529N53997O12675O48302O31398P66976P75601Q44391R11823
6106A5807782R81313J179674J214799J137566R80414P64569P38896Q33795J002957
$$ y = [1087977, 1109490, 1093420, 1157727, 1183488, 1168582, 1196628, 1227688, 1274507, 1313663, 1331886, 1345854, 1371475, 1396640, 1444546, 1508990, 1535375, 1596892, 1616277, 1645799, 1703812, 1775855, 1870193, 1901583, 1974149, 2067424, 2130102, 2179504, 2229037, 2300474, 2379799, 2419311, 2466866, 2539867, 2634361, 2733934, 2866714, 2984444, 3110533, 3230272, 3361974, 3449837, 3594174, 3745397, 3892129, 4048382, 4203537, 4400027, 4593759, 4771226, 4998314, 5236629, 5437869, 5647335, 5893322, 6156168, 6469117, 6707924, 7000750, 7356590, 7708004, 8101950, 8544719, 8991191, 9496090, 10062619, 10616616, 11229291, 11877593, 12508991, 13275967, 14051568, 14895959, 15807782, 16789095, 17968769, 19183568, 20321134, 21301548, 22066117, 22805013, 23638808, 24641765]
6097B4641765J249251J468091J643648J525388J308830J064852R46664R31256
6089C4779745Q86192P51181N17794L50035M33755N25797O95816Q61741J090037
6080D0892093J285661J550439J707567J806284J604122J104369M72360P2777J37002
6071E0632674M50834P83521J157978J602107J958065J739323O71350p78771j633019
6062E6584062j421102r83384j120524j713349k289797k407477k136730j812581
6054D2699118j579764j503968j351235j180717j017115r85983j034227j202538
6046C2843571j281599j183333r96658q27155p72093p95774o84012n74151o23515
6037B5105281q06028j087510j193882j042248q66835p46106p85399r95499j217457
$$ y = [24641765, 25891016, 27359107, 29002755, 30528143, 31836973, 32901825, 33848489, 34779745, 35665937, 36417118, 36934912, 37284947, 37718702, 38244499, 38940315, 39802056, 40892093, 42177754, 43728193, 45435760, 47242044, 48846166, 49950535, 50422895, 50495672, 50632674, 51083508, 51867029, 53025007, 54627114, 56585179, 58324502, 58995852, 58217081, 56584062, 55162960, 54179576, 53059052, 51345703, 49055906, 46648429, 44511699, 42699118, 41119354, 39615386, 38264151, 37083434, 36066319, 35080336, 34046109, 32843571, 31561972, 30378639, 29381981, 28554826, 27782733, 26986959, 26302947, 25728796, 25105281, 24299253, 23211743, 22017861, 20975613, 20108778, 19362672, 18577273, 17581774, 16364317]
6028A6364317j299768j124077r36941p97985o95144n80172n92967o37013m97081
6019I203169n16836m27361l93074l92083l67984l09871l10315k35937k29882k82311
6009E737515j87930j69002j33318j56901j11625j25566j58039j13347j20603j38821
5999D322363o6320o5926m5146q9641m6545J2405j6059l6163k4081k80P770K0160
5987C972537L3549P9488O5829N9954M3315j967n9781o1963p1645r2764l5408o333
5975C924811n1144j8479k7214p671L4752N202K5068O8434O0473J5277l153O2682
5963D089038O5361P4531J20443J39157J70784K12478K79573K48075K06956P0208
5953E676604j31889k02186k15198j33646j30931j18305r6010o9319k8217n2852
$$ y = [16364317, 15064549, 13940472, 13003531, 12205546, 11510402, 10930230, 10337263, 9700250, 9203169, 8686333, 8258972, 7865898, 7473815, 7105831, 6795960, 6485645, 6249708, 6019826, 5737515, 5549585, 5380583, 5247265, 5090364, 4978739, 4853173, 4695134, 4581787, 4461184, 4322363, 4256043, 4190117, 4144971, 4055330, 4008785, 4021190, 4005131, 3968968, 3944887, 3944607, 3952377, 3972537, 4006086, 4085574, 4151403, 4211357, 4254672, 4252705, 4192924, 4130961, 4059316, 3966552, 3931144, 3924811, 3873667, 3855188, 3827974, 3820303, 3855055, 3860257, 3885325, 3953759, 4014232, 4029509, 4026356, 4089038, 4154399, 4228930, 4349373, 4488530, 4659314, 4871792, 5151365, 5399440, 5606396, 5676604, 5544715, 5342529, 5127331, 4993685, 4862754, 4744449, 4648439, 4579120, 4550903, 4498051]
5943D498051j4411j1176l7344m6554m0527n1099l8691k0697m611Q672L6341Q6520
5931D364474J53244J60269K29955K90780J87424l018k22690l57833l43619l15601
5921D143385k48671j83372j69771j30530p6517n3372m3914k1075N23p2509l8556
5910C105621j10575j08873j2565o9038j3729L1374M6030R3643J29525J75903J34679
5899C401995J10957J2696j55198k51703k68398k29777j65122j46716j28654j00244
5889B079836p5667l4212j1245L6137k289k5001o1715p3692o7832m9455r2663n1309
5877A570893n932J7039K3233O2989L4457K6856L6340o541o9693j05494q7988j06992
5865A389167p8504p1149l9502o1402j9236J8177j2048j3156j1008n9821m4960
$$ y = [4498051, 4483640, 4472464, 4435120, 4388566, 4348039, 4296940, 4258249, 4237552, 4232941, 4241613, 4277954, 4364474, 4517718, 4677987, 4907942, 5198722, 5386146, 5383128, 5160438, 4802605, 4458986, 4143385, 3894714, 3711342, 3541571, 3411041, 3334524, 3281152, 3237238, 3216163, 3216686, 3144177, 3105621, 2995046, 2886173, 2873608, 2804570, 2790841, 2822215, 2868245, 2961888, 3091413, 3267316, 3401995, 3512952, 3525648, 3370450, 3118747, 2850349, 2620572, 2455450, 2308734, 2180080, 2079836, 2004169, 1969957, 1958712, 1994849, 1992560, 1967559, 1905844, 1832152, 1764320, 1714865, 1622202, 1570893, 1564961, 1582000, 1605233, 1668222, 1702679, 1729535, 1765875, 1759334, 1689641, 1584147, 1496159, 1389167, 1310663, 1239514, 1200012, 1138610, 1119374, 1137551, 1125503, 1112347, 1101339, 1041518, 996558]
5854I96558n7741l6054K655k7295k2526k7633k6881l5008J3278j878L6472J0397
5842H24344k0246p9041m6033J0863o610k8481J6197j1582o8408N493K4578l3433
5830E87641j2740K5980k1849l9954j7743m552Q753k1222l7060L059K7494k5057
5818D72750l5527M606r402k4179p575J350K5112j1925J3522K3748j8677j119k2010
5805D10674J6385j0026l2258J0062K1001j8552J1838J263j5679l9866M099J0761
5793C69702P825R018q986k0479k2380J2188K2216n998j2335J0967L0371k8357
5781C63752L7424L383k8789J3314J6175j4874l435l2996j1919J5460j6114J5772
5769C57153K2906j0836J06N6640K2648k5516k0078K2921L896L914K7415j6345
$$ y = [996558, 938817, 902763, 905418, 878123, 855597, 827964, 801083, 766075, 779353, 777475, 813947, 824344, 804098, 725057, 679024, 689887, 683277, 654796, 670993, 659411, 591003, 596496, 621074, 587641, 574901, 600881, 579032, 539078, 521335, 516783, 525536, 504314, 467254, 470313, 497807, 472750, 437223, 441829, 432427, 408248, 400673, 402023, 427135, 415210, 428732, 452480, 433803, 432684, 410674, 427059, 417033, 384775, 394837, 415838, 397286, 409124, 410387, 394708, 354842, 358941, 369702, 377527, 386545, 377559, 357080, 334700, 346888, 369104, 363106, 350771, 361738, 392109, 363752, 401176, 404559, 375770, 389084, 405259, 390385, 386950, 353954, 342035, 357495, 341381, 357153, 380059, 369223, 369329, 425969, 448617, 423101, 403023, 425944, 429840, 433754, 461169, 444824]
5757D44824J963L4278o221L6134j3902K3671q45l3137o660J9836N3919j0873j5069
5744E27918k498J8898k950N859J049l5306J6956N4226j4165O679p790k595J2359
5731E78640J9347K5702j4990M3400L0912k1316K1248L699n3378m2033m5335j6842
5719E29054j442j077j6481l0151k9376o46l46K6044r887m2117j5359L6611L3180
5706D78007o764l789l8977p874j146m287P654j2828K3035l2562K8484L4104l9965
5693D23092j1802J1656k5101j9546M821j4148k7312l14J1112L787M054j5512j9169
5680C25618j4053K0193n170j3298L1336J3828K1869J0456k0163J1306R496J1454
5668D02872J3725j6188k7797K0280P677K928J8043J239M652L6716K5000j2043
$$ y = [444824, 446787, 481065, 474844, 510978, 497076, 520747, 519902, 486765, 480105, 499941, 553860, 542987, 527918, 525420, 544318, 541368, 547227, 548276, 512970, 529926, 584152, 569987, 576666, 568876, 566281, 578640, 597987, 623689, 608699, 652099, 683011, 661695, 682943, 686642, 633264, 591231, 545896, 529054, 527612, 526535, 510054, 479903, 450527, 449881, 449535, 475579, 465692, 423575, 408216, 444827, 478007, 471243, 467454, 428477, 420603, 419457, 415170, 422824, 409996, 433031, 400469, 428953, 463057, 423092, 411290, 422946, 397845, 378299, 383120, 368972, 341660, 341346, 352458, 356245, 360299, 344787, 325618, 311565, 331758, 326588, 313290, 344626, 358454, 380323, 390779, 370616, 381922, 391418, 402872, 416597, 400409, 372612, 392892, 400569, 403497, 421540, 422779, 427431, 464147, 489147, 477104]
5656D77104K654j6505k9833J9650J9706l2199L4086J4448J2613L062L6658J1451
5644E52895K7259L4955K5585P774N101K1990L3390M9655K283N48J1537L3868J5948
5631H22788O0208N3306J4687L1672R8196O2545N493o767L2965r477k6423Q771
5619A147964M6601L9825K6182L0213M887L6075M7995K8649R3234N5261P2330N0130
5607A679346M7985O3114J19159Q4263J13045J16261R5882J40070J24395J37454
5597B720974J48952J34263J68728J97846J85581J30408N5599J15816J22401J17134
5587D097702J63286K16686K00467J89080K56179L16679L76744M87694N82256O68477
5577G555250P42186O25796L85820K37709L7867p0524j31146j24740n6069N653
$$ y = [477104, 479758, 463253, 433420, 453070, 472776, 440577, 474663, 489111, 501724, 504786, 541444, 552895, 580154, 615109, 640694, 648468, 653569, 675559, 708949, 758604, 760887, 761435, 772972, 806840, 822788, 882996, 936302, 950989, 982661, 1080857, 1143402, 1148895, 1142128, 1175093, 1165616, 1139193, 1147964, 1194565, 1234390, 1260572, 1290785, 1295672, 1331747, 1379742, 1408391, 1501625, 1556886, 1629216, 1679346, 1727331, 1790445, 1909604, 1993867, 2106912, 2223173, 2319055, 2459125, 2583520, 2720974, 2869926, 3004189, 3172917, 3370763, 3556344, 3686752, 3742351, 3858167, 3980568, 4097702, 4260988, 4477674, 4678141, 4867221, 5123400, 5440079, 5816823, 6304517, 6886773, 7555250, 8297436, 8923232, 9309052, 9546761, 9584628, 9514104, 9382958, 9258218, 9202149, 9207802]
5567I207802N9961O9488Q6006J55841J96556L20784L58246M09899L85176L63367
5557A1613126L55312K73169K46141L14384M74290O53394Q69707R97386J094399
5548A6891308Q95280K82435m76283r51137j127020j164687j144059r50429p97658
5539A1457750o69847n63135n29039l85806l54685k25353j00498k6839M0742J44782
5529H788072J46789J31003J36095J14276J99096L14642M57637M68462M73847K53023
5519A1482942L6664k47852o15393q79096r38736q67720p41724o15749n66896m99090
5509E547350l98346l35084k73121k77663k50093j49239j67406q7382q8567k2552
5499C497897L5008L869j827J12059R8063J28924K03013K50958K79287J56322m114
$$ y = [9207802, 9267763, 9337251, 9423257, 9579098, 9775654, 10096438, 10454684, 10864583, 11249759, 11613126, 11968438, 12241607, 12487748, 12802132, 13276422, 13929816, 14799523, 15796909, 16891308, 17786588, 18069023, 17592740, 16641603, 15514583, 14349896, 13205837, 12255408, 11457750, 10787903, 10224768, 9695729, 9309923, 8955238, 8729885, 8629387, 8602548, 8643290, 8788072, 8934861, 9065864, 9201959, 9316235, 9515331, 9829973, 10287610, 10756072, 11229919, 11482942, 11519606, 11271754, 10656361, 9777265, 8838529, 7970809, 7229085, 6613336, 6046440, 5547350, 5149004, 4813920, 4540799, 4263136, 4013043, 3863804, 3696398, 3609016, 3520449, 3497897, 3532905, 3536774, 3534947, 3647006, 3745069, 3873993, 4077006, 4327964, 4607251, 4763573, 4759459]
5488D759459k54330l83781m05962l36629k46659j90924j09576j29256j14867r7642
5478B489833q8843k0373q533k2827k5188n3091j6119L8826O1750O1507O6595O0642
5466B544179J16360J32255J32604J69367J17978k60l6977o0593o7777j6491J8391
5455C049036K5095O2844R4650J53526J84212J72675J90311K23593K03341K26176
5445D585459L14975L95368M62447N79966O02567L67625N2942k62319m30319m47657
5435F221054l61027l04585k08308k31132j39711j58640p0741j494Q823Q7975J68713
5424E010927K13864K80961L31981L71848L22896K96310M31730N33195P00915Q77925
5414I372552R91296R71545P62536K29143n13244r69453j112176r82663p73747
$$ y = [4759459, 4505129, 4121348, 3715386, 3378757, 3132098, 2941174, 2831598, 2702342, 2587475, 2489833, 2400990, 2380617, 2372084, 2349257, 2324069, 2270978, 2254859, 2293685, 2355435, 2416942, 2483537, 2544179, 2660539, 2792794, 2925398, 3094765, 3212743, 3212483, 3175506, 3114913, 3047136, 3030645, 3049036, 3074131, 3136975, 3231625, 3385151, 3569363, 3742038, 3932349, 4155942, 4359283, 4585459, 4900434, 5295802, 5758249, 6338215, 6940782, 7308407, 7361349, 7099030, 6668711, 6221054, 5860027, 5555442, 5347134, 5116002, 4976291, 4817651, 4746910, 4745416, 4754239, 4842214, 5010927, 5224791, 5505752, 5837733, 6209581, 6532477, 6828787, 7260517, 7793712, 8494627, 9372552, 10363848, 11335393, 12097929, 12327072, 11813828, 10844375, 9732199, 8749536, 7975789]
5405G975789o88192n61286n31248m27339l37174k47335j94705j35230q4523m3288
5395D725469L26n452M6000J33791J35583J94937K46286K68514K56464J88578J28085
5384F318581m7482k66346m78508n94240n53633n05488m17095l22113l15429k67379
5374B550868k22644j96420j68263j43126j59401j31586n1752q0876p8835p3735
5364A244230m8982p3910m2016l8783n1158m1693m5542l1596l2055m1266K1447
5353H18676l2756n9790q890l7238k0468Q641k6159k248k0740k8642j9358n670
5341E65358j056l1120l6700k0858L6855j0011r987k6447k7822j96k6244k678K9012
5328D38106N938J7219m249q250k3444J9044k1783k9394K2144m476j2633l0280
$$ y = [7975789, 7287597, 6726311, 6195063, 5767724, 5430550, 5183215, 4988510, 4853280, 4768757, 4725469, 4725795, 4720343, 4766343, 4900134, 5035717, 5230654, 5476940, 5745454, 6001918, 6190496, 6318581, 6271099, 6004753, 5526245, 4932005, 4378372, 3872884, 3455789, 3133676, 2818247, 2550868, 2328224, 2131804, 1963541, 1820415, 1661014, 1529428, 1477676, 1396800, 1317965, 1244230, 1195248, 1121338, 1079322, 1040539, 989381, 947688, 902146, 870550, 838495, 797229, 818676, 785920, 726130, 717240, 680002, 659534, 668175, 642016, 639768, 619028, 590386, 571028, 565358, 564302, 533182, 496482, 475624, 512479, 502468, 492481, 466034, 438212, 438016, 411772, 409094, 438106, 444044, 461263, 457014, 448764, 425320, 444364, 422581, 393187, 415331, 410855, 398222, 367942]
5316C67942j2154J1940j8917J8942k5911j1352K0476m252k1432n109l2530q427
5304B79216J4463j6852M188p735k3111N279P946j1691k3910m111j3159L5912j4491
5291B31944J4833j5198m0280K6129R51J517K2500q365j4254L659k9386Q898J5375
5278B18323K589j0241l0439k3243M3881L451O554k441l0965j9917J0450K8468
5266A96470m129k7000O418j2988p756J8769m29j8920M4300j0483k0134J179J4673
5253A79970K2250k1666N97m3909o465M6513P553J175l1381j1232k7746r977K1588
5240A27270K4376K2148l298M675R765k5061j3599J0866K7628l453j2853j8919
5228A49545L391J6852r654K0176L31j0211q004K2169p080m2108J2797L375J767
$$ y = [367942, 355788, 367728, 348811, 367753, 341842, 330490, 350966, 346714, 325282, 320173, 287643, 279216, 293679, 276827, 281015, 273280, 250169, 255448, 263394, 251703, 227793, 223682, 210523, 246435, 231944, 246777, 231579, 191299, 217428, 218379, 219896, 242396, 234031, 219777, 223436, 194050, 202948, 218323, 220912, 210671, 180232, 156989, 200870, 204321, 210875, 208434, 177469, 157552, 168002, 196470, 192341, 165341, 171759, 158771, 151015, 169784, 169355, 150435, 194735, 184252, 164118, 165297, 179970, 202220, 180554, 181151, 137242, 130777, 177290, 184843, 186018, 154637, 143405, 115659, 105682, 127270, 151646, 173794, 170496, 175171, 184936, 159875, 146276, 157142, 184770, 181317, 168464, 149545, 152936, 169788, 160134, 180310, 180641, 170430, 162426, 184595, 177515, 135407, 148204, 151579, 153346]
5215A53346K8366m8116K534M5355P462J4437j9277r901L560J1618K627Q850J8796
5202B19657j1619m3855K0222k110j3958k2241j1007P973K2576J41m5350l29k114
5189A17986J5433K7520m2354k0585K6083j5084J009J8688k711K0221P594p392
5177A46408j1150k6567J0091K6388j4222N401r859l4604J7443M909K9324j8735
5165A24827j2885k4066J0731l1389j188J0680l28k1316J487J9752P346m84L037
5152H6204m1840l66J1721M552L2844j2198L1342m1825k3317j1426J132K39M4525
5139H1587O1101j2491j9568l1740K13J4476k3427r433l4388n646J7227K723K687
5126D3321k5450K8102L1966K4646K7979j8945O324L7423m2590p259J2087k1462
$$ y = [153346, 181712, 133596, 136130, 181485, 188947, 203384, 184107, 174206, 177766, 189384, 192011, 200861, 219657, 208038, 164183, 184405, 182295, 168337, 146096, 135089, 143062, 165638, 165779, 120429, 120100, 117986, 133419, 160939, 118585, 98000, 124083, 108999, 110008, 128696, 125985, 146206, 153800, 146408, 135258, 108691, 118782, 145170, 130948, 136349, 126490, 91886, 109329, 114238, 143562, 124827, 111942, 87876, 98607, 67218, 66030, 76710, 76382, 55066, 56553, 76305, 83651, 83167, 86204, 44364, 43998, 55719, 60271, 93115, 80917, 112259, 70434, 47117, 35691, 36823, 37062, 81587, 142688, 130197, 110629, 78889, 79102, 93578, 70151, 60718, 26330, 20684, 37911, 40634, 43321, 17871, 45973, 77939, 102585, 130564, 111619, 117943, 155366, 112776, 105517, 117604, 96142]
5114I6142p783Q828j4268r835j8489k4211K5530K1727j7548K1223L4249l1103
5102H4462n302L306J0783m012J7830J13k1818L8182n339k1147P434Q04m005J9008
5088A20299k6440l4556p971j8335l292L7990J7128k2967L1695M0939j6755m4259
5076G3476L6508j4699J464j461k6740J6292K9425M387K9505p264m4814L4939O764
5063A37782J2430j205J6340j7381J451M3433L5789k936L369K6311N4084K8124
5051C37591L3240k1402k7917K7277K3255M1955n4424r0043l5400j7318k5558K2521
5039B13777m5733j6631j3749n0594k2351k1296K3009M1812p866k1725k6213q111
5027D4329J2153j1574k8518q95J5163o318j4095J1405J9129L0158l7844L0118
$$ y = [96142, 88359, 97187, 82919, 73084, 54595, 30384, 55914, 77641, 60093, 81316, 115565, 84462, 79160, 82466, 93249, 89237, 107067, 107180, 85362, 123544, 118205, 97058, 104492, 105296, 101291, 120299, 93859, 59303, 51332, 32997, 29705, 67695, 84823, 61856, 93551, 134490, 117735, 73476, 109984, 95285, 96749, 95288, 68548, 84840, 114265, 118652, 148157, 140893, 96079, 131018, 137782, 150212, 149007, 165347, 147966, 149417, 192850, 228639, 225703, 229072, 255383, 309467, 337591, 370831, 349429, 321512, 348789, 372044, 413999, 359575, 269532, 234132, 216814, 191256, 213777, 168044, 151413, 137664, 87070, 64719, 43423, 66432, 108244, 100378, 78653, 52440, 44329, 56482, 44908, 16390, 15495, 30658, 24340, 10245, 21650, 40779, 70937, 33093, 63211]
5015F3211M78k1766N526O489K4744k0567k2382j8890J7069L5744N667k7284o314
5002D1725J2570j6092R688k2089M828p952J912J8677n260K5002K982p820j0357
4989D7814M770O71L566o137K0524k3827l8708j903J75k904J7952N741k0941m382
4975B411L4600k2952q771L7785k4061K69M341L189j490k176L57j9203n596J5475
4961A4178j0173o557K7735J2915o228q323J349K8401r230m4942p024J976L3635
4948B7712J3782k9654J0673L7014r219k3292j0202J0855J201j7823J374L6964
4936D9385k0346m967o529J9646Q180M159o859J1636m683J7458m909j7700n178
4923C9293J0298J5280k5780K5557k807m107l3793n352J2732k589l720j6250R509
$$ y = [63211, 63689, 41923, 47449, 53938, 78682, 58115, 35733, 16843, 33912, 69656, 75323, 48039, 41725, 54295, 38203, 47891, 25802, 30630, 22678, 24590, 43267, 38007, 63009, 65991, 58171, 47814, 52584, 53255, 56821, 50684, 71208, 47381, 8673, 6770, 6945, 4041, 21993, 27734, 6793, 2411, 37011, 14059, 5288, 43073, 19012, 19281, 23622, 26811, 25321, 23145, 23502, 4299, -1297, 14178, 4005, -2552, 25183, 38098, 31870, 23547, 24896, 53297, 44067, -875, -7899, -5923, 27712, 41494, 11840, 22513, 59527, 50308, 27016, 16814, 27669, 28870, 11047, 12421, 49385, 29039, 24072, 17543, 37189, 45369, 49528, 42669, 54305, 49622, 67080, 62171, 44471, 39293, 49591, 64871, 39091, 64648, 61841, 57734, 23941, 18589, 31321, 28732, 25012, 8762, 18271]
4910A8271L4234R975k2613j1460l3402J0850o277m38K6231p031k1140j2411K396
4897a2815L945n881K1898J4667k2098L6989k29k9467Q881L515l212J4558k6368
4884D383k1053K1605K7385j2517o199J4575k4531q454p211j8904K4436l312N893
4871c904L990J3576K009q147j3942j8740M3799R084o721m0115r254J5369L1585
4858A8589l7004J3953J4910O5562k1023l9255J1939k5498K859r364k0622k6650
4846e1604J7113K5363J9056j2361J4684j3720n135K2272K5416k4435m2569k092
4834b8012M7609q406J5681J1474l9271k2272K8671j3313K8356j841L5649q262
4822D6063k6116k5369j718J7331L531p501M4876n359l2613r448q932K0165k2455
$$ y = [18271, 52505, 62480, 39867, 28407, -4995, 5855, -422, -860, 25371, 18340, -2800, -15211, -12815, -8870, -14751, 7147, 21814, -284, 36705, 36476, 7009, 15890, 19405, 16193, 30751, 4383, -16670, 4935, 32320, 19803, 13604, 28179, 3648, -4806, -12017, -30921, -6485, -9797, -3904, 86, 13662, 15671, 7524, -6418, -25158, 18641, 27725, 21004, -19111, -28365, -12996, 18589, -18415, -4462, 10448, 76010, 54987, 15732, 27671, 2173, 5032, -4332, -24954, -51604, -34491, -9128, 9928, -2433, 12251, -1469, -6604, 15668, 41084, 16649, -25920, -28012, 19597, 11191, 26872, 38346, -925, -23197, 5474, -7839, 20517, 18676, 54325, 46063, 19947, -5422, -7140, 10191, 13722, 6221, 51097, 45738, 13125, 3677, -5255, 14910, -7545]
4809g545J7030J3r909j5732K2362M6366j48k6500k5344J0J0194l205l3773J2495
4795a3686J4285j7870O772J837L1110K6894q934Q061k2102m915P366M07p631j3111
4781H483j9650k5315K5235J8855J1187j886j42N547j7586J6444k0717K1407L0842
4768E2704k9141k3610m4084J0893j669J2033J3014j8754r427K521j3849J9584
4756b9785L509K3137J739K9720r591q368k1025j7261J1534K1758m191J6597j7928
4743a55J52L2670J202m1525J1021P32m0428L854q590J6694L4490l914L2000K2235
4729F0438l4201j1827K3722p2435l723N5613n668k5157k0162K1299N301j681j3537
4716b2018j1644J4352J4100k5856O749J345L1661j1412J3500k4474j0812L4598
$$ y = [-7545, 9485, 9498, -411, -16143, 6219, 52585, 52437, 25937, 593, 603, 10797, 7592, -26181, -13686, 599, -17271, -10499, -8662, 22448, 49342, 40408, 48469, 26367, 21452, 28818, 29225, 21594, 8483, -11167, -36482, -11247, 7608, 18795, 16909, 16767, 22314, 4728, 21172, 455, 21862, 52704, 23563, -47, -44131, -33238, -34907, -22874, -9860, -28614, -38041, -35520, -49369, -29785, -26276, -3139, -1400, 28320, 18729, 10361, -10664, -27925, -16391, 5367, 1176, 17773, -155, -3, 32667, 33869, -7656, 3365, 4097, -36331, -32477, -41067, -24373, 10117, 6203, 38203, 60438, 26237, 14410, 38132, -34303, -38026, 17587, 11919, -13238, -33400, -12101, -6800, -8481, -22018, -33662, -19310, -5210, -31066, -24317, -22972, 8689, -2723, 10777, -13697, -24509, 10089]
4704A0089o546j6454K8691K2553k374J2259O937J5561n0553j6650K2481M635k4997
4691E632k2222J9071o650M370k569J3916k6741K0894J4744j1221r505K900O31
4678C250K2409p920J3809K3073l3896o438k232q636K8815Q312n988K229l2310
4665D477L255L3219j2123j2792O758o926Q203l5445K2263J0286L394L2762O494
4652F3825m6525J4031N959o614r556P777m606Q235K8118j1168r67k3703K9699
4639E4505k6242m0428J2804K3311J6923j3496K128J35K3409l022J9330r353m0501
4626A9503J7118O099j7091j4818j9943J7513M3587j3881r555j808N109J1029J710
4613D4572k3320Q262K4063j6663k6982J1844J8622J3890R456L397m4015l5188
$$ y = [10089, 3543, -12911, 15780, 38333, 35959, 48218, 55155, 70716, 20163, 3513, 25994, 30629, 5632, -16590, 2481, -4169, 201, -2368, 11548, -15193, 5701, 20445, 9224, -281, 2619, 3250, 25659, 17739, 31548, 54621, 20725, 14287, 12055, 3419, 32234, 40546, 34558, 36787, 4477, 7732, 40951, 28828, 16036, 22794, 15868, 24071, -11374, 10889, 21175, 24569, 57331, 63825, 17300, 31331, 37290, 30676, 21120, 28897, 24291, 32526, 60644, 49476, 48509, 24806, 54505, 28263, -12165, 639, 23950, 40873, 27377, 29505, 29640, 53049, 50027, 69357, 60004, 19503, 36621, 42720, 25629, 10811, -9132, 8381, 51968, 38087, 28532, 26724, 31833, 42862, 44572, 21252, 29514, 53577, 36914, 9932, 21776, 40398, 54288, 63744, 67141, 23126, -12062]
4601a2062o633K6337P463J7996K3685k3999O84J7069j7149m3855J835J9386K1135
4588C1892L519P411K5798q640o254n140p788j4407K4673n507n3574J1224J0453
4575A3660K2768J2746J0029j1391q986jJ5578K2943Q833J965j6956j5359m0341
4562A5488K0783N891k6493K1791K8089k0496K3297k9596q648K4134l257K0048
4550G1031j0550k4178L8211j5861k4148K4268P606l8850O162J7551k6197J7584
4538D2629j4459q67Q25J7094O761J8007j2557j3593j1179m9949N566M7818R938
4525D6034l7835L0184N2565l8200j783j9843J2782Q903r809j5709n616P3O777
4512B8523L0320N543K3577j2328l5865m84n57m675l693J9303K870J6687k6908
$$ y = [-12062, -18695, 7642, 15105, 33101, 56786, 32787, 33471, 50540, 33391, -10464, -8629, 10757, 31892, 35411, 42822, 68620, 59980, 53726, 48586, 40798, 26391, 51064, 45557, -8017, 3207, 13660, 36428, 49174, 59203, 47812, 38826, 38825, 54403, 77346, 86179, 88144, 71188, 55829, 15488, 36271, 42162, 15669, 37460, 65549, 45053, 68350, 38754, 30106, 54240, 50983, 71031, 60481, 36303, 74514, 58653, 34505, 58773, 66379, 27529, 33691, 51242, 25045, 42629, 28170, 27303, 28128, 45222, 51983, 69990, 57433, 43840, 32661, -17288, -11722, 36096, 46034, 8199, 38383, 90948, 52748, 50965, 31122, 43904, 52807, 42998, 27289, 21673, 21746, 28523, 58843, 64386, 87963, 75635, 39770, 39286, 38729, 34054, 30361, 49664, 52534, 69221, 42313]
4499D2313P96K1529K349o653N605Q51k0203O041P119j1200O738M050R940K9863
4485I9138p082n205l6503l7001L002K4152K5619j5528j0378M3928Q401k5732k668
4472F4143J7184j94j7622k1292Q91j028K6928j2344o53p436k3881L6488K6277
4459H7461J5100j5649m990J4691j9114L676Q682P780O638K6997k5963j4152P350
4446I8507O684k1323j2092N1271r84M087m757j3067J0199p358j9457r473J6909
4433I9146J1159L1772j3990l6781K0665J2802L21j5748K2137K8898J1923j7515
4421A54789J4684K4565p776J2978K8207j6848K503k7122k4836p64J4152L8442
4409B12974J5129J2485O73J51q042l3665K036P659Q560L9113J6394l0613J643
$$ y = [42313, 43109, 64638, 66987, 60334, 65939, 66790, 46587, 52628, 59747, 48547, 55285, 59335, 69275, 99138, 92056, 86851, 50348, 13347, 16349, 40501, 66120, 50592, 40214, 84142, 92543, 66811, 64143, 81327, 81133, 63511, 42219, 43110, 42082, 69010, 56666, 56013, 48577, 24696, 61184, 87461, 102561, 86912, 81922, 96613, 77499, 81175, 89857, 97637, 104275, 131272, 105309, 91157, 98507, 105191, 83868, 71776, 123047, 122063, 126150, 121393, 108326, 118525, 111167, 91710, 82237, 99146, 110305, 142077, 128087, 91306, 111971, 124773, 125094, 109346, 131483, 160381, 172304, 154789, 169473, 194038, 186262, 199240, 227447, 210599, 213102, 185980, 161144, 160380, 174532, 212974, 228103, 240588, 241261, 241412, 233370, 199705, 201741, 209400, 217960, 257073, 273467, 242854, 244497]
4396B44497J5253M074L0269n646J5770J9729J6651l6368L4488j0522k5464M4777
4384C47508l5884k1750L943K1699M6689O698K4609L5214J4852Q11K084N3066K2148
4371E21687j1766L2732O6206K0692N439N2493M3925K9336O0668J01840Q0811O7668
4359A071731R6790J87259K00312J50082Q114j68765j83674j77913j52766o4794
4349I66376n5603q4218o9736m3323j1909k0510k1539k0290J3187L32j1610j6080
4337F25077r677J2331j2354R588l419K3483J7454K9154Q551M6340L2984J0017
4325G89529O198N849K9190M392K2624N9886N8272m564O6584L6968O2567O4014
4313A201509O5354J5018N0148R2782R6175P3630O4840Q3472O0891Q1478R5472
$$ y = [244497, 259750, 263824, 294093, 288447, 304217, 323946, 340597, 304229, 338717, 328195, 302731, 347508, 311624, 289874, 293817, 315516, 362205, 368903, 393512, 428726, 443578, 444389, 446473, 499539, 521687, 509921, 542653, 608859, 629551, 634990, 687483, 731408, 760744, 821412, 923252, 1004063, 1071731, 1168521, 1355780, 1556092, 1706174, 1714288, 1545523, 1361849, 1183936, 1031170, 966376, 910773, 826555, 756819, 713496, 701587, 681077, 659538, 639248, 652435, 652767, 641157, 625077, 615400, 627731, 615377, 624965, 621546, 645029, 662483, 691637, 700188, 746528, 779512, 789529, 795727, 801576, 830766, 835158, 857782, 917668, 975940, 971376, 1037960, 1074928, 1137495, 1201509, 1266863, 1281881, 1332029, 1424811, 1520986, 1594616, 1659456, 1742928, 1803819, 1885297, 1980769]
4302A980769Q8131J04247J05068J31343J49173J66405J61996J46570J40039Q8316
4292C262057N3946P7362Q4438M9010N0899J63356J51098J69331K76396L06035
4282D643928L40240K82548K45111P7229m5097p8119o8273l5418q725O10Q1720
4271E435754J46671K14280K66108K99453K93116K33514P7303n0194j88621k60259
4261F467125k76763k37432j46898r3726k6277O859Q8029J59488J81559J23104
4251F245068N981j03398j87008k88178l05474k62690k17450j55404j78268j42058
4241D411121q3305l7914q988l2931m5481q1829j52053j16694j67143k00268j36652
4230C347863j44813j10397r1950j35229j15187q9391o8384j13298j15478n4488
$$ y = [1980769, 2068900, 2173147, 2278215, 2409558, 2558731, 2725136, 2887132, 3033702, 3173741, 3262057, 3316003, 3393365, 3477803, 3526813, 3577712, 3741068, 3892166, 4061497, 4337893, 4643928, 4984168, 5266716, 5511827, 5589056, 5543959, 5465840, 5397567, 5362149, 5353424, 5354034, 5435754, 5582425, 5796705, 6062813, 6362266, 6655382, 6888896, 6966199, 6916005, 6727384, 6467125, 6190362, 5952930, 5806032, 5712306, 5686029, 5692888, 5780917, 5940405, 6121964, 6245068, 6251049, 6147651, 5960643, 5672465, 5366991, 5104301, 4886851, 4731447, 4553179, 4411121, 4327816, 4289902, 4280914, 4247983, 4202502, 4120673, 3968620, 3851926, 3684783, 3484515, 3347863, 3203050, 3092653, 3000703, 2865474, 2750287, 2660896, 2592512, 2479214, 2363736, 2309248]
4220B309248j03688n7272n8310n9173o0527k8526o3611p6361k1617m3423l7870
4209A698870n8497q3625j7319o5839n2371l952r507l2545j6787l6595R37k0856
4197A301914n1298j0516L82j5190p1619Q16j4494l6036q803K718k5124j6764l4339
4184A021647k3963l213j7440J2351m548k3898Q335o427l7782l155n109J828M3238
4171I61864r355j0606p76J0478K4248l4388k8126j2678j6173j1027J8230o3143
4159H28548p062M6616j1411j3571m3111K6939K3818m1714j585P598L1914J0168
4147H57147j0980O09L075J3223L3977l0074Q928J7892L9143Q400j8794J0332j2874
4134I20004j3480Q432N3772r564m401J2749J0671J2477O1864O657n231J4995K4271
$$ y = [2309248, 2205560, 2148288, 2089978, 2030805, 1970278, 1941752, 1878141, 1801780, 1780163, 1736740, 1698870, 1640373, 1556748, 1539429, 1473590, 1421219, 1417267, 1407760, 1375215, 1358428, 1321833, 1322770, 1301914, 1250616, 1240100, 1240482, 1225292, 1153673, 1154489, 1139995, 1103959, 1095156, 1097874, 1072750, 1055986, 1021647, 997684, 994471, 977031, 989382, 984834, 960936, 969271, 962844, 925062, 921907, 916798, 918626, 961864, 952509, 941903, 941127, 951605, 975853, 941465, 913339, 900661, 884488, 873461, 891691, 828548, 821486, 868102, 856691, 843120, 800009, 826948, 850766, 809052, 807467, 815065, 846979, 857147, 846167, 846776, 849851, 863074, 897051, 866977, 875905, 893797, 932940, 941340, 922546, 932878, 920004, 906524, 914956, 968728, 959164, 954763, 967512, 978183, 990660, 1052524, 1059181, 1053950, 1068945, 1093216]
4121A093216L1679M992r888J5022O4300r858K2419J8825L0974O0482j4285K7879
4109A335757L4772L1405N988P0114K1170K2677M8682J1273K2287M4099L8736N3279
4097A740239N9049O9089K7944K2981P7178R5284Q7632N5293J1468K2283L3786
4086B302226J2208M7072Q3060N1057K5438P1277R3939R6311J20614R6916Q0853
4075C080971O1130M4576M5988O4510P9836L2407P1758Q5537N3411P7833J02212
4064C800169Q6635O7963Q6581Q6940P8821J27821J45345J74698K31920K00665
4054E087558J53699J11235J31940J27072J36776K18703K45186K56098K64116K31372
4044F963755J42550J86561J48185J31025J96652K04441K94065L45334L73519L62217
$$ y = [1093216, 1124895, 1129887, 1119999, 1135021, 1199321, 1189463, 1211882, 1230707, 1261681, 1322163, 1307878, 1335757, 1370529, 1401934, 1407922, 1478036, 1499206, 1521883, 1570565, 1581838, 1604125, 1648224, 1686960, 1740239, 1799288, 1868377, 1896321, 1919302, 1996480, 2091764, 2179396, 2234689, 2246157, 2268440, 2302226, 2314434, 2361506, 2444566, 2495623, 2521061, 2592338, 2686277, 2782588, 2903202, 3000118, 3080971, 3142101, 3186677, 3232665, 3297175, 3377011, 3409418, 3481176, 3566713, 3620124, 3697957, 3800169, 3886804, 3954767, 4041348, 4128288, 4207109, 4334930, 4480275, 4654973, 4886893, 5087558, 5241257, 5352492, 5484432, 5611504, 5748280, 5966983, 6212169, 6468267, 6732383, 6963755, 7106305, 7292866, 7441051, 7572076, 7768728, 7973169, 8267234, 8612568, 8986087, 9348304]
4034I348304K87553K21966J89601K74064L52503M48088M98984O40045O78526O00153
4024A3539787N76953N21514N21785N19319N41237O00773P56259P92861P75586
4015A9146074P65333P54177Q92483J110861J308233J581000J817026J943893J847581
4006C1166661J345799P17851K21649J18971K40553L89349M87258M86910M55926
3997C5630927M19501L77135L77141K31233P9700n0080k34303l96757m93981o14394
3987C5326122o24781o60732p65585o77833n15448k87552m6265M9261k41392p37553
3977C0818242j189965j509504j424056j132343r49241o71434m74504l24917k19854
3968B2922424k01034r7670j900J39633L06512L91017M81696N83030N77435L70223
$$ y = [9348304, 9635857, 9857823, 10047424, 10321488, 10673991, 11122079, 11621063, 12261108, 12939634, 13539787, 14116740, 14638254, 15160039, 15679358, 16220595, 16821368, 17577627, 18370488, 19146074, 19911407, 20665584, 21558067, 22668928, 23977161, 25558161, 27375187, 29319080, 31166661, 32512460, 33230311, 33451960, 33570931, 33811484, 34200833, 34688091, 35175001, 35630927, 36050428, 36427563, 36804704, 37035937, 37115637, 37065557, 36831254, 36434497, 35940516, 35326122, 34701341, 34040609, 33275024, 32597191, 32081743, 31794191, 31747926, 31797187, 31555795, 30818242, 29628277, 28118773, 26694717, 25562374, 24613133, 23941699, 23467195, 23142278, 22922424, 22721390, 22623720, 22621820, 22761453, 23067965, 23458982, 23940678, 24523708, 25101143, 25471366]
3958B5471366L4808k46176m94474n79991n10256l90105l11873j89169j85585j44086
3948B2454459Q2927K82844N13093P27692R16748J101007J166446J114866Q90268
3939B9250350N88925L68632L52038N09495N49537N15745N83375O68848Q64310
3930C4251255R84797J041603J008236Q37498O61292M43566K55609Q6666J9266
3921C9589788P6915L48622O72236J014587J405161J762630K157851K402000J934444
3912E1364234N45095j176910k289640k335949j893731j415845j032719p94602
3904D0969933n80061k89797J0950R3703O1317k09175n18734p20151q75201j069281
3894C6873503j101698j023064q92979o53733n47924n71781n67753m86512m12852
$$ y = [25471366, 25506174, 25259998, 24765524, 24185533, 23675277, 23285172, 22973299, 22784130, 22598545, 22454459, 22537386, 22820230, 23333323, 24061015, 24977763, 26078770, 27245216, 28360082, 29250350, 29839275, 30207907, 30559945, 31069440, 31618977, 32134722, 32718097, 33386945, 34251255, 35236052, 36277655, 37285891, 38123389, 38784681, 39228247, 39483856, 39570522, 39589788, 39666703, 40015325, 40687561, 41702148, 43107309, 44869939, 47027790, 49429790, 51364234, 51909329, 50732419, 48442779, 46106830, 44213099, 42797254, 41764535, 40969933, 40389872, 40100075, 40111025, 40204728, 40266045, 40056870, 39538136, 38817985, 37942784, 36873503, 35771805, 34748741, 33855762, 33202029, 32654105, 32082324, 31514571, 31028059, 30615207]
3885C0615207m45667o85269r47629j241554j370860j299009j177009j042894r00729
3876B1504587p45826n76513m00306l33644k26816q3829q2293r6140j57700j94238
3866A8607282j84703k53176k10259k41143j43342j09268j43708k28776k26159
3857A6866748k34019k30470j80998n5506M0021L2565J3848K9306M4376P4321J70045
3846A6570237K25309K74748L78297L75821L82109L99350M27727M38891M45310
3837A9917799M89894N52345O41118P12457P97288R42018J050556J175467J347689
3828B7626631J384514J456802J479426J359456J162552J023605Q34189O53143
3820C6980318M39249J74909k6201j99351l03174l96999n16653n90586o80240q57227
$$ y = [30615207, 30169540, 29484271, 28536642, 27295088, 25924228, 24625219, 23448210, 22405316, 21504587, 20758761, 20182248, 19781942, 19448298, 19221482, 19137653, 19055360, 18959220, 18801520, 18607282, 18422579, 18169403, 17959144, 17718001, 17574659, 17465391, 17321683, 17092907, 16866748, 16632729, 16402259, 16221261, 16165755, 16205776, 16238341, 16252189, 16281495, 16325871, 16400192, 16570237, 16795546, 17070294, 17448591, 17824412, 18206521, 18605871, 19033598, 19472489, 19917799, 20407693, 20960038, 21601156, 22313613, 23110901, 24052919, 25103475, 26278942, 27626631, 29011145, 30467947, 31947373, 33306829, 34469381, 35492986, 36327175, 36980318, 37419567, 37594476, 37568275, 37368924, 37065750, 36668751, 36152098, 35561512, 34881272, 34024045]
3810C4024045r16731r15691r86182j012220j139908j170875j152650j196463j171141
3801B4362184j092455j035805r88851r14536r21347r19057q72264q38833p45040
3792A6033996o70274n17165m59878l83420k78641k05081k02927k69533l41926
3783A2705151k46551k21130k26215j65070j81526k93250l71995l41513k78093
3774A0379808k03790j73871j02672k9477m7005k2702Q49K965o2735m3055k6451
3763I671864O8316J25561J63280K28338K63466L38122L51883L48954L10487K93520
3753A2163791J84720J69769J67566K7524o4570j68573j75212j63595k07225k31523
3743A1702672k71564k46326k19683k40286j62411j08882l4111K8815P0063J33900
$$ y = [34024045, 33107314, 32191623, 31205441, 30193221, 29053313, 27882438, 26729788, 25533325, 24362184, 23269729, 22233924, 21245073, 20330537, 19409190, 18490133, 17617869, 16779036, 16033996, 15363722, 14846557, 14386679, 14003259, 13724618, 13519537, 13316610, 13047077, 12705151, 12458600, 12237470, 12011255, 11846185, 11664659, 11371409, 10999414, 10657901, 10379808, 10176018, 10002147, 9899475, 9869998, 9822993, 9800291, 9801140, 9804105, 9741370, 9698315, 9671864, 9740180, 9865741, 10029021, 10257359, 10520825, 10858947, 11210830, 11559784, 11870271, 12163791, 12348511, 12518280, 12685846, 12713370, 12648800, 12480227, 12305015, 12141420, 11934195, 11702672, 11431108, 11184782, 10965099, 10724813, 10562402, 10453520, 10419409, 10448224, 10518287, 10652187]
3733A0652187J33150J54691J53322J60198J03395J1415l5689j48238k22453k86015
3723A0675963l82587m63452m41457m07668m27286m62575m38710l95710l53533
3714F902985l82439l74439l14027l27299k24352k34745k18018j67080j61777j51531
3704D347278j18177j31557j07462o6511j16913n8237o7328m8766l3768q1698k1195
3693C495666l0492l8797j8823m1780m3136n9446p328m0771m5498n194j9353j6602
3681C128446j8050k3742l7951m7840l1040j0536m8521m044k0570L4797K236j9445
3669B903740j9823K7503J9625N2691K2454L779J3734J1473J8463j0984j7358K3479
3657C048776m9250k6513K5071L5501k8883m6720j4390K2670r876P880K9073J9710
$$ y = [10652187, 10785337, 10940028, 11093350, 11253548, 11356943, 11368358, 11332669, 11184431, 10961978, 10675963, 10293376, 9829924, 9388467, 8980799, 8553513, 8090938, 7652228, 7256518, 6902985, 6520546, 6146107, 5832080, 5504781, 5280429, 5045684, 4827666, 4660586, 4498809, 4347278, 4229101, 4097544, 3990082, 3923571, 3806658, 3748421, 3681093, 3632327, 3598559, 3516861, 3495666, 3465174, 3426377, 3407554, 3365774, 3322638, 3263192, 3255864, 3215093, 3169595, 3164401, 3145048, 3128446, 3110396, 3086654, 3048703, 3000863, 2969823, 2959287, 2910766, 2906722, 2886152, 2920949, 2923185, 2903740, 2883917, 2911420, 2931045, 2983736, 3006190, 3009969, 3023703, 3035176, 3053639, 3042655, 3025297, 3048776, 2999526, 2973013, 2998084, 3033585, 3004702, 2957982, 2943592, 2966262, 2956386, 2964266, 2993339, 3013049]
3645C013049L9573R223J8294O2980M2776K0012O2965N4977M1333N6718N395k3707
3633C403588L0686L2074Q513n4867n005L8846J2895K3132K3773L4378K5586L0307
3621C603906O0668M7004j181M4942L9484M6148O5732N6421M0240J3979N5184L5997
3609D108524O7787Q7131P4606K4253j2168O7535O7754P1572R3873R9973R6596
3598D847436J56523J62220J16197J60247J77293K25874K23626K34732J99362K37198
3588F740708K39159K31428K35691J61793J65466J86123J23969J33459R6623J24350
3578H438769R6756J04976J40477R0278J24687J93589K00693J86051J89455J96754
3568I962485J55650J41306J44677J73395J64996J62563J75649J60902J15316J26097
$$ y = [3013049, 3052622, 3061845, 3080139, 3143119, 3185895, 3205907, 3268872, 3323849, 3365182, 3421900, 3427295, 3403588, 3434274, 3466348, 3474861, 3419994, 3414989, 3453835, 3466730, 3489862, 3513635, 3548013, 3573599, 3603906, 3664574, 3711578, 3710397, 3755339, 3794823, 3840971, 3906703, 3963124, 4003364, 4017343, 4072527, 4108524, 4176311, 4263442, 4338048, 4362301, 4350133, 4417668, 4485422, 4556994, 4650867, 4750840, 4847436, 5003959, 5166179, 5282376, 5442623, 5619916, 5845790, 6069416, 6304148, 6503510, 6740708, 6979867, 7211295, 7446986, 7608779, 7774245, 7960368, 8084337, 8217796, 8314419, 8438769, 8535525, 8640501, 8780978, 8871256, 8995943, 9189532, 9390225, 9576276, 9765731, 9962485, 10118135, 10259441, 10404118, 10577513, 10742509, 10905072, 11080721, 11241623, 11356939, 11483036]
3558A1483036K11955J80722K00326K78539K59522K97088L22032M04034M33615
3549A4070869M82507N63681N97687O46624O80864P63885Q79784R07106J011473
3540B0604480J119450J257376J429573J608354J742736J890491K059825K137760
3532C3850045K009225J881223J658728J478686J425332J459548J450387J455816
3524D6668990J450808J503631J563167J665265J850299K057631K340478K674251
3516F1774520K871646L154902L391120L593698L684822L949048M255671M638970
3508I1314397N024784N492338N875852O552591P412055Q343929R328440J0764903
3500A50109289J2928587J6436511J9707272K0043187J8068967J7195121J4692789
$$ y = [11483036, 11694991, 11875713, 12076039, 12354578, 12614100, 12911188, 13233220, 13637254, 14070869, 14553376, 15117057, 15714744, 16361368, 17042232, 17806117, 18685901, 19593007, 20604480, 21723930, 22981306, 24410879, 26019233, 27761969, 29652460, 31712285, 33850045, 35859270, 37740493, 39399221, 40877907, 42303239, 43762787, 45213174, 46668990, 48119798, 49623429, 51186596, 52851861, 54702160, 56759791, 59100269, 61774520, 64646166, 67801068, 71192188, 74785886, 78470708, 82419756, 86675427, 91314397, 96339181, 101831519, 107707371, 114259962, 121672017, 130015946, 139344386, 150109289, 163037876, 179474387, 199181659, 219224846, 237293813, 254488934, 269181723]
3493B69181723N183467r894463k3118864k6445985k4092652j9486564j4924553
3486A56402109j2285624j0040549p933657o107473m318273k941850j712931m82916
3478A10578836P70754J928717L317511M910776O382290P928997J0073514J3144244
3470A59035639J6833256J8520921J7196618J5648735J4751408Q422198m714764
3463B45694011j9880517k7427854k6715282k3076251j8147594j4943614j2841960
3456A02660939j0715494q918364p377889o153954n263818m517887l913357l373292
3448E2426884k934121k467198k202555j892980j657683j488037j348263j199259
3440C7236788j128402j028205j036536j042410j052747r84402r52185r26335r01233
$$ y = [269181723, 274365190, 264470727, 241351863, 214905878, 190813226, 171326662, 156402109, 144116485, 134075936, 126142279, 120034806, 115716533, 112774683, 111061752, 110578836, 111349590, 113278307, 116595818, 121506594, 127888884, 135817881, 145891395, 159035639, 175868895, 194389816, 211586434, 227235169, 241986577, 250408775, 245694011, 225813494, 198385640, 171670358, 148594107, 130446513, 115502899, 102660939, 91945445, 83027081, 75649192, 69495238, 64231420, 59713533, 55800176, 52426884, 49492763, 47025565, 44823010, 42930030, 41272347, 39784310, 38436047, 37236788, 36108386, 35080181, 34043645, 33001235, 31948488, 30964086, 30011901, 29085566, 28184333]
3431B8184333q21979p79603p17999p79141o59351o17606m89303l94408l26050
3422B2598893k28424j32526j16414j9218R0647J94356K59581L54417M69381O09698
3412B4080391P37048Q30576R47430R95826J046611J218129J239839J110739R20901
3403C3127490Q53188J127874J750277K495991L179838L572132K449644k91326
3395D8265108l177443m432325l635457k573455j789448j382206j202824r10218
3387B9161732n05635j95344J4764K54949M22028N45365O94420Q94954J112097
3378C2399330J355243J326400J131348J058832J236900J841423K598192L308646
3370D6256314M028608L275566Q49642k029546l386278k670490j451423m85398
$$ y = [28184333, 27362354, 26582751, 25864752, 25085611, 24426260, 23808654, 23319351, 22924943, 22598893, 22370469, 22237943, 22121529, 22102311, 22192958, 22387314, 22646895, 23001312, 23470693, 24080391, 24817439, 25648015, 26595445, 27591271, 28637882, 29856011, 31095850, 32206589, 33127490, 33980678, 35108552, 36858829, 39354820, 42534658, 46106790, 48556434, 48265108, 45087665, 40655340, 37019883, 34446428, 32656980, 31274774, 30071950, 29161732, 28656097, 28460753, 28475517, 28730466, 29152494, 29697859, 30392279, 31287233, 32399330, 33754573, 35080973, 36212321, 37271153, 38508053, 40349476, 42947668, 46256314, 50284922, 53560488, 54410130, 52380584, 48994306, 46323816, 44872393, 44386995]
3362D4386995J24590M87734R63090J706019K532497L306522L961155M431365N004625
3353F6904592M656395K114782j728087m973812n465827m567897l799412l202819
3345D9937915l077919k956751k661721k287549j963802j639540j367178j089471
3337C2893984p29491m95202k15927N5375J75799M43582Q94252J498726K036361
3328C6557459K584630L086248L673831K941272R2664l531102n839733n485034
3320C4080235m215401l117768k476668k210857j865790j536406j279594j132876
3312A6244875j088367r76779q80063p91040o87323o20337n63492m52140m62025
3303I723309m22995l36226l57615l28213k81344k61090k72443k33289j89814k03254
$$ y = [44386995, 44511585, 44999319, 45962409, 47668428, 50200925, 53507447, 57468602, 61899967, 66904592, 71560987, 73675769, 71947682, 66973870, 61508043, 56940146, 53140734, 49937915, 46859996, 43903245, 41241524, 38953975, 36990173, 35350633, 33983455, 32893984, 32164493, 31669291, 31453364, 31508739, 31684538, 32128120, 33022372, 34521098, 36557459, 39142089, 42228337, 45902168, 48843440, 48936104, 45405002, 39565269, 34080235, 29864834, 26747066, 24270398, 22059541, 20193751, 18657345, 17377751, 16244875, 15156508, 14179729, 13299666, 12508626, 11821303, 11200966, 10637474, 10185334, 9723309, 9300314, 8964088, 8606473, 8278260, 7996916, 7735826, 7463383, 7230094, 7040280, 6837026]
3293F837026j44147j26632j17496p7378r5120q709j7827n2184r2582j92947k51439
3282E660565j81981k13169j88975j53822j58787j61799j24479j07466j10112p7687
3272D182288j10704q7383l7093n9876n6441p1658m7756l0434m4369o8221m4205
3261C524148l3479l5607n6635n7024o4558l8720o0080k8647k9333j6714l2791
3250C070560j1612r211l8310j1209p126o3188r439K508m760j7724j322R73o1301
3237B838839n4422k7854m65j847j720j3131J01k287m6484k3444R826M182N0958
3224B732252L3100K881J6566J3251M9373J1794O2671N2723l2358K7060M3730O7767
3212C080810K9287O0188Q5976J17230J38238J02936K1207R4102N4746l3570n9996
$$ y = [6837026, 6692879, 6566247, 6448751, 6371373, 6276253, 6267544, 6249717, 6197533, 6104951, 5912004, 5660565, 5478584, 5265415, 5076440, 4922618, 4763831, 4602032, 4477553, 4370087, 4259975, 4182288, 4071584, 3984201, 3947108, 3887232, 3830791, 3759133, 3711377, 3680943, 3636574, 3568353, 3524148, 3490669, 3455062, 3398427, 3341403, 3276845, 3238125, 3178045, 3149398, 3120065, 3103351, 3070560, 3058948, 3049737, 3011427, 3000218, 2993092, 2929904, 2920465, 2922973, 2918213, 2900489, 2899167, 2900140, 2838839, 2784417, 2756563, 2756098, 2754251, 2752531, 2739400, 2739501, 2737214, 2690730, 2667286, 2677112, 2681294, 2732252, 2765352, 2768233, 2784799, 2798050, 2847423, 2859217, 2921888, 2974611, 2942253, 2969313, 3013043, 3080810, 3110097, 3170285, 3256261, 3373491, 3511729, 3614665, 3635872, 3729974, 3784720, 3751150, 3691154]
3201C691154r4318n2149n8843l3507k4647R533m518n5926j1173l1858j1351k0075
3189C302322J5708j6025K4443M5896K730K2474L6710P4478J08051Q9518R1658
3178C797963Q0444J22737P3966R385J4047m0720j03616k0036k491l8568N172J5747
3166C914030J1419O4027N6460M5905R1120O3513Q9353O2939K0058K0841K9528
3155D469193L6639L5507J04922O6359J04736J6993M9199O1646P7333J48880J19377
3144E290784J64595J49367K07988J86763K92869K60573L30406M21115M59208N30919
3134H294587N89021M74180M33335L10901J95176J46384J72714J97038K10476L06819
3124A1330631L20411L29287L82470M25591M93930N88979O82155P64040Q89302
$$ y = [3691154, 3596836, 3544687, 3485844, 3452337, 3427690, 3437223, 3432705, 3376779, 3365606, 3333748, 3322397, 3302322, 3318030, 3302005, 3326448, 3372344, 3375074, 3397548, 3434258, 3508736, 3616787, 3706305, 3797963, 3878407, 4001144, 4075110, 4084495, 4098542, 4057822, 3954206, 3934170, 3931679, 3893111, 3898283, 3914030, 3925449, 3989476, 4045936, 4091841, 4182961, 4246474, 4335827, 4398766, 4418824, 4439665, 4469193, 4505832, 4541339, 4646261, 4712620, 4817356, 4834349, 4883548, 4945194, 5022527, 5171407, 5290784, 5455379, 5604746, 5812734, 5999497, 6292366, 6552939, 6883345, 7304460, 7763668, 8294587, 8883608, 9357788, 9791123, 10102024, 10297200, 10443584, 10616298, 10813336, 11023812, 11330631, 11651042, 11980329, 12362799, 12788390, 13282320, 13871299, 14553454, 15317494, 16206796]
3115A6206796R23774R52779J072233J081840J265377J350675J486306J741330
3107B6081110K015177K306659K606483K765943K877604L166153L789104M950748
3099E0558981O495386Q170878R865838J0847647R624923M708825k734678r253825
3091H8283975j1775420j0738603q488930o561997n330430m494782l624795k781673
3083C4487345k108104j668095j358914j075347q33599o31577l73858p2636K99673
3074B6664888O41347Q20265Q00305L80886l12667j085035j725938j977235j924309
3065B2282507j759003j492174j222978j073147r17828o67343n10152l25309k10934
3056A4103639j58864k67024m68354p26499q48552q60559p79755p25102o44859
$$ y = [16206796, 17130570, 18083349, 19155582, 20237422, 21502799, 22853474, 24339780, 26081110, 28096287, 30402946, 33009429, 35775372, 38652976, 41819129, 45608233, 50558981, 57054367, 65225245, 75091083, 85938730, 95563653, 100272478, 97537800, 88283975, 76508555, 65769952, 57281022, 50719025, 45388595, 40893813, 37269018, 34487345, 32379241, 30711146, 29352232, 28276885, 27443286, 26811709, 26437851, 26365215, 26664888, 27306235, 28126500, 28926805, 29307691, 28995024, 27909989, 26184051, 24206816, 22282507, 20523504, 19031330, 17808352, 16735205, 15817377, 15150034, 14639882, 14314573, 14103639, 13944775, 13677751, 13209397, 12482898, 11634346, 10773787, 9994032, 9268930, 8624071]
3047H624071n58537n00008m26121l65881l67276l28001k94092k13172k17501k11862
3037E141620k08036k21148k30419j94589j75330j26948j57428j46844j05348j10858
3027C464672p8006j17205q9096j16310j01873p5077j00120m3320j20396n1325
3017B571944n6224p6765k7177q3454p0148m3307l2565o2916n1751l8746m3102
3006A985789n8944m984m5658q2228m7161J025k0391n4403j2907l3889m6158M337
2994A584428l547j3032k892k2717l7733k3348j3846j4541m1081N426q566k7324
2982A381227m3087k284m3021Q44l8153l3194j8703k2640k0172m8764K2159k3869
2970A110343q984k9456j7637K3049r390k3466k5135K762J8057j7330n347o1348
$$ y = [8624071, 8065534, 7565526, 7139405, 6773524, 6406248, 6078247, 5784155, 5570983, 5353482, 5141620, 4933584, 4712436, 4482017, 4287428, 4112098, 3985150, 3827722, 3680878, 3575530, 3464672, 3386666, 3269461, 3180365, 3064055, 2962182, 2887105, 2786985, 2743665, 2623269, 2571944, 2515720, 2438955, 2411778, 2328324, 2258176, 2214869, 2182304, 2119388, 2067637, 2028891, 1985789, 1926845, 1921861, 1876203, 1793975, 1746814, 1747839, 1727448, 1673045, 1660138, 1626249, 1580091, 1584428, 1580881, 1567849, 1564957, 1542240, 1504507, 1481159, 1467313, 1452772, 1411691, 1417117, 1408551, 1381227, 1338140, 1335856, 1292835, 1293679, 1255526, 1222332, 1203629, 1180989, 1160817, 1112053, 1134212, 1110343, 1101359, 1071903, 1054266, 1077315, 1067925, 1044459, 1019324, 1022086, 1040143, 1022813, 1017466, 956118]
2958I56118o802j809j075k589l945j0473k3397l365j8993j7671m0140p50m6250
2945G78859q049O644l8076n0514n529L4165J9492k6287r848N462j2827J808n768
2932F89532J6421j2458k4118l0241k5390l2873P234J5531k8946J0477j8299J7461
2920E84331o994k1618J4129L02J4662j3953J166J1480R028k7372q098j6621j7153
2907E23289L2437l5243j8349l4167k0266J2614k111L4800k7810k9128K2665K2324
2895D81055k5084J8298K8844q763l9293K4736l76j8661K5875r2J586l6575l0682
2882D20868N93M8085j4253K2587l339r482K667m792J0997n227N2r509j2469L0264
2868D77042j291j0864j9530K5436K367k2600K5099N985j8839J695J3555L2988
$$ y = [956118, 949316, 947507, 946432, 943843, 939898, 929425, 906028, 902663, 883670, 865999, 825859, 825109, 778859, 770810, 777454, 739378, 688864, 683335, 717500, 736992, 710705, 700857, 706319, 693492, 695300, 689532, 705953, 693495, 669377, 639136, 613746, 580873, 588107, 603638, 574692, 585169, 566870, 584331, 577337, 555719, 569848, 570150, 584812, 570859, 572025, 583505, 592533, 565161, 557063, 540442, 523289, 555726, 520483, 502134, 467967, 447701, 460315, 458204, 493004, 465194, 436066, 458731, 481055, 455971, 474269, 503113, 494350, 455057, 479793, 479417, 460756, 486631, 486539, 488125, 451550, 420868, 421461, 469546, 455293, 477880, 474541, 465059, 467726, 462934, 473931, 468704, 468756, 459247, 446778, 477042, 475751, 464887, 445357, 470793, 473160, 450560, 475659, 481644, 462805, 464500, 478055, 511043]
2856E11043k3930O57l224j8779J3153L0897K6179l2410m344N127J501J5570K3465
2843E44905R849J8353k479J949k1589J035K3624M666K0974n544K2379j1994m932
2830F01196K8654k1775M4300J409J2158K02l2826Q005N3392M2990M781L3524K7923
2817H03933J4625K8428P686M3380Q4966P4544M4436O5215l59j6297n1675r2554
2805A006328l5955k9646l0234r980l9736r704k7107M303K1322k1951j3265m1789
2793G72586j7711K1174J9946k1719k279M1878R994J121L6151K3239j6242m3591
2781H24547k79R74k0513K1206q495k2285j9574q366r456l7030n252j5407m1716
2768F58354o031j5404q48j977m168j1856m916J9594j1829m3716m394j3877l0008
$$ y = [511043, 487113, 487770, 484546, 465767, 478920, 509817, 535996, 503586, 499242, 504369, 505870, 521440, 544905, 554754, 573107, 570628, 572577, 550988, 552023, 575647, 580313, 601287, 595743, 618122, 606128, 601196, 629850, 608075, 652375, 653784, 665942, 666144, 633318, 641323, 694715, 737705, 742486, 776010, 803933, 818558, 846986, 854672, 898052, 983018, 1057562, 1101998, 1167213, 1166854, 1150557, 1098882, 1006328, 970373, 940727, 910493, 900513, 860777, 851073, 823966, 828269, 849591, 827640, 814375, 772586, 754875, 776049, 795995, 774276, 771997, 813875, 823869, 824990, 861141, 884380, 868138, 824547, 824268, 825242, 804729, 825935, 817440, 795155, 775581, 767215, 757759, 720729, 715477, 700070, 658354, 652323, 636919, 636071, 634094, 629926, 618070, 613154, 632748, 620919, 577203, 572809, 558932, 528924]
2755E28924J1723q175o798K0840J9726O0843j872O668k9595l6457r405P365k8897
2742E34890o856j2527l1781k2245k1758j4216m5775J5271r130j6429j6241l0818
2730C22385L4349K1628l4437K2989l527j4860j3625k913m6916n263J2801Q974
2718C01585J6359K2132l3650k1258J2508J610k779j477j6022k667k1972j2754
2706B41615J1839K4910j354n1857J504j6272L1960k2048k8745j865j0021N179
2694A84845j5049J4736J8385J5626l0632l1261K1559O524k6560r120J087N4071
2682B04211k0781k2715k0143J0156N448o091j2512l2177J0959r90O108N397j7807
2669A09063J3878j2804J0929l715J7946J4861k2860k2656K3724K9577J9081l2713
$$ y = [528924, 540647, 532472, 525674, 546514, 566240, 627083, 625211, 631879, 602284, 565827, 556422, 563787, 534890, 528034, 515507, 483726, 461481, 439723, 425507, 379732, 395003, 385873, 369444, 353203, 322385, 356734, 378362, 343925, 366914, 363387, 348527, 334902, 331989, 285073, 279810, 292611, 301585, 317944, 340076, 306426, 285168, 297676, 299286, 296507, 295030, 279008, 276341, 254369, 241615, 253454, 278364, 277010, 225153, 226657, 210385, 242345, 220297, 191552, 189687, 179666, 184845, 169796, 184532, 202917, 218543, 187911, 156650, 178209, 184733, 158173, 149053, 150140, 204211, 183430, 160715, 140572, 150728, 156176, 150085, 137573, 105396, 116355, 115365, 121473, 126870, 109063, 122941, 110137, 121066, 117351, 135297, 150158, 127298, 104642, 128366, 157943, 177024, 144311]
2657A44311j2479k992l534J5495k6689j7968N756r711J2490J7683J0278r255p255
2644A16130p350J7263j0912O472j2297O891J0972l8791K2900L201K9504l3692
2632A10291J1200J2019O564O507j2495j1566m8572q250K0770J474q505L2657M2950
2619A55044l8555O42j3233K4123k3880l5103J7459R804n967L3239o893j6454j0517
2606H9709Q133J3705j9970j6797K4842K8203P150m9013k8090J9485O358J4679
2594I8394L5467k8246k246J9165k3921K4705J0925j9330q730l3007K0838J5582
2582A09596K271j1039K2835j6169j9881O71K7834O360Q850N152J3583k8310l8900
2569H2853M406K9281K6331P684r842J3147O383j3552k2022j9456j4829j6788K9414
$$ y = [144311, 131832, 128840, 125306, 140801, 114112, 96144, 101900, 92189, 104679, 122362, 132640, 123385, 116130, 108780, 126043, 115131, 121603, 109306, 116197, 127169, 88378, 111278, 114479, 143983, 110291, 121491, 133510, 140074, 146581, 134086, 122520, 73948, 65698, 86468, 87942, 79437, 112094, 155044, 116489, 117131, 103898, 128021, 104141, 69038, 86497, 96301, 90334, 123573, 116680, 100226, 89709, 97842, 111547, 91577, 74780, 99622, 127825, 134975, 85962, 57872, 77357, 83715, 98394, 133861, 105615, 103369, 122534, 98613, 123318, 134243, 114913, 106183, 73176, 94014, 109596, 111867, 100828, 123663, 107494, 87613, 88284, 116118, 122478, 131328, 136480, 150063, 121753, 82853, 87259, 116540, 142871, 150555, 140713, 153860, 160243, 146691, 124669, 105213, 90384, 73596, 103010]
2556A03010L0775r78n5037m521j7410K6747L0375K3951k2051p337j1387l0450
2544F5687K465J9789K02j1519j059l4858j8608N774L410M7487J1186j2794k4933
2531E2229Q469j8043m315J156N186N9417K4341m5435j7565R038J8392R056N491
2518A07417m142q592j8959J665k7685j8048P647K6181r540J0687N065j664n195
2505F4837J4808J1632Q402j3875J699J3003k1415k0981K5861l111p690m459l1842
2492C6869P841J3677k8168M705M894J8911K2611j6909l1062J3306J5884l0292
2480C2267J2868L899M124J2144J2045k724k3460j4103L9742k7427L5865j179j0164
2467G3897j3212K877k5317j2358N1653j7802J6019j161k5968J4452M444J4298
$$ y = [103010, 133785, 132807, 77770, 73249, 55839, 82586, 112961, 136912, 114861, 107524, 96137, 65687, 68152, 87941, 88143, 76624, 75565, 40707, 22099, 27873, 31283, 78770, 89956, 77162, 52229, 60698, 42655, 38340, 39496, 44682, 104099, 128440, 83005, 65440, 74478, 92870, 101926, 107417, 103275, 94683, 75724, 77389, 49704, 31656, 39303, 65484, 55944, 66631, 71696, 70032, 64837, 79645, 91277, 99679, 85804, 87503, 100506, 79091, 58110, 83971, 80860, 73170, 68711, 36869, 44710, 58387, 30219, 34924, 39818, 58729, 81340, 64431, 33369, 46675, 62559, 32267, 45135, 49034, 53158, 65302, 77347, 74623, 51163, 37060, 76802, 49375, 85240, 84061, 73897, 60685, 63562, 38245, 25887, 77540, 59738, 75757, 74596, 48628, 63080, 67524, 81822]
2455H1822J9213k2432o466p644J5773j2391J302J1120k4263J2095j7846J5652
2443F5935l5346L6711L5914k3009J5098J454j973p535K215P386r385o1614j0508
2430A5343J3318N376R650Q32K7722p004j0505J3046r485J3381j230j5026J6260
2417G1678j7281J4119K5127N160n23J2890j4889l252K196l53l105j3626N498P0
2403H3709l270K708L27K7334K6355L7691n63l7474J3269p709n8671n938j2893
2390F4875K4426J5256J3260L1416j0489R443J021P302j9457L703O706J8200L6731
2377B02393K333j8099J2969M219R439j0677K631J3104n712j2799n324M4921J2261
2364B51659L305L2776k0093J0558L1333m216J2724k9776L780J4108L7888K0960
$$ y = [81822, 101035, 78603, 72137, 64493, 80266, 67875, 69177, 80297, 56034, 68129, 50283, 65935, 30589, 67300, 103214, 80205, 95303, 96757, 94784, 87249, 89464, 96850, 87465, 25851, 15343, 28661, 34037, 43687, 44519, 72241, 65237, 54732, 67778, 58293, 71674, 70444, 55418, 71678, 54397, 68516, 93643, 98803, 98280, 111170, 96281, 93029, 95225, 94872, 91767, 78141, 83639, 83709, 80439, 83147, 83474, 110808, 137163, 174854, 174291, 136817, 150086, 142377, 83706, 77768, 64875, 89301, 104557, 117817, 149233, 138744, 148187, 149208, 156510, 137053, 140756, 147462, 165662, 202393, 204726, 186627, 199596, 203815, 213254, 202577, 205208, 218312, 212600, 199801, 194477, 239398, 251659, 254964, 287740, 267647, 278205, 309538, 305322, 318046, 288270, 292050, 306158, 344046, 365006]
2352C65006J6642K6424N0913L9130J5748N0648J2905N440K8646P6822N9646O2889
2340H10859P1098O8512L7532P3447J6216J3180L1029L1314M9668J5649K1718P3378
2328A313600P2156O8872M4717Q2636R3443J11788J11571J13843J72737J73846
2318B359209J49586K06807K26749K18616K26929K08025J97000K38538L87472M21271
2308D840202M20957M62377O53940Q72333J180474J470706J712557K268806J980415
2299A5862767N08683j586421k745644k260755j606144j094908r16301q71406p29450
2290D560421n65517m16256m01600k83622j80887j83108j79132j98419k29304j85274
2280A737302j35972j34511q9731j09024r3574n7661k3131n4315p4028q8933q3983
$$ y = [365006, 381648, 408072, 458985, 498115, 513863, 564511, 577416, 582856, 611502, 688324, 747970, 810859, 881957, 950469, 988001, 1061448, 1077664, 1090844, 1121873, 1153187, 1202855, 1218504, 1240222, 1313600, 1385756, 1454628, 1499345, 1581981, 1675424, 1787212, 1898783, 2012626, 2185363, 2359209, 2508795, 2715602, 2942351, 3160967, 3387896, 3595921, 3792921, 4031459, 4418931, 4840202, 5261159, 5723536, 6377476, 7249809, 8430283, 9900989, 11613546, 13882352, 15862767, 16371450, 14785029, 12039385, 9778630, 8172486, 7077578, 6161277, 5289871, 4560421, 3994904, 3578648, 3177048, 2893426, 2712539, 2529431, 2350299, 2151880, 1922576, 1737302, 1601330, 1466819, 1377088, 1268064, 1174490, 1116829, 1093698, 1039383, 965355, 876422, 792439]
2269G92439n3934r376j2132l1041j9177m1969p9357l3259p190K6738l5917m2914
2257D52911k700k4350l7761K921j2241j6960j5245M813L678l7023k0437q427N529
2244B94708k5930Q248L7335j7450m5911k857j3896m0008J3619K8450k2839j8325
2232A95144p028J2284J3196K4624j6401j6438k7525j4635P655N736k1316j5982
2220A39314K97J3116l477p538j4940K4748k660k0878j5517R144j9095j89J362
2207A03687l6015M803K1333R622j3460j6047k960K2745k2258j3991j481J9216
2195G5194K2907p891k921k051k1804K5529k3061q147q261L0585R377k693N582
2182I2345m3945r096K7120J9955J0407l7053o649K4308M849k5684l6177J2910
$$ y = [792439, 738505, 729129, 716997, 685956, 666779, 624810, 545453, 512194, 505004, 531742, 495825, 452911, 450211, 425861, 388100, 391021, 378780, 361820, 346575, 351388, 355066, 318043, 297606, 289179, 294708, 268778, 277026, 314361, 296911, 251000, 248143, 234247, 194239, 207858, 236308, 213469, 195144, 188116, 200400, 213596, 238220, 221819, 205381, 177856, 163221, 170876, 176612, 155296, 139314, 139611, 152727, 149250, 141712, 126772, 151520, 148860, 127982, 112465, 121609, 102514, 102325, 103687, 67672, 72475, 93808, 103430, 89970, 73923, 70963, 93708, 71450, 57459, 55978, 75194, 98101, 90210, 87289, 85238, 63434, 88963, 65902, 57755, 49494, 80079, 89456, 86763, 92345, 48400, 39304, 66424, 86379, 96786, 59733, 53084, 77392, 82241, 56557, 20380, 33290]
2170C3290j4613k0792J2747J2160J106K9864n528o674j387k271p657l856J0121
2157C6510j2262J553k532K4007k556m765n939J2285j3961q842L0149p348L660
2144D9959j3156m808r892n86J4531l3j0600J5492j5696M161j8474o809K1744L9353
2130F5186o314n4465J0848N604p767Q038j9603J0225J2574K7526l2088j5078j2519
2117g833m660K6238n440k3007O933J2086O087j0366J1757M38k7321l060q937L543
2103b3542L6574m416k2054n940j4562L7464j83j2803N680j8168q259L1652j2371
2090a0928K5288N704j7916j4472o551K6580L0827j824l013j4832J3832j8774o392
2077G529k0848P335k477k4003J4697L1806k0569k340m340R463O584o132j135O538
$$ y = [33290, 18677, -2115, 10632, 22792, 23898, 53762, 48234, 41560, 40173, 37902, 30245, 26389, 36510, 24248, 25801, 23269, 47276, 44720, 39955, 34016, 46301, 32340, 23498, 53647, 46299, 49959, 36803, 31995, 22103, 21517, 36048, 36015, 25415, 40907, 25211, 29372, 10898, 4089, 25833, 65186, 58872, 4407, 15255, 20859, 13092, 21130, 1527, 11752, 24326, 51852, 19764, 4686, -7833, -12493, 13745, 8305, -14702, -7769, 4317, 10404, 38, 11795, 12233, -15088, -18148, -27085, -23542, 13032, 8616, -13438, -19378, -33940, 3524, 3341, -9462, -3782, -21950, -30209, 1443, -10928, 14360, 20064, 2148, -12324, -18875, 7705, 38532, 36708, 33695, 18863, 32695, 13921, 7529, -13319, -5984, -8461, -32464, -17767, 14039, -6530, -8870, -13210, -3747, 2837, -3295, -4430, 2108]
2063B108k0639J5303q939l1677M3040k073J5531j7236j1567M10O721K822J6414
2050A0218j0143K23k2111j2063J9239K5447J9566j7852o0127N780K4246N371M5252
2037C3046L9372n7320m0145m097K3760M7694J8639o311n944J3059k7741j3996
2025B0016j5572M76K828j7331J6780L6746m3323j7224J9224M112J4700J1854R996
2012D3282l7961k6930j053j8411j0457n133J8427N555o684j6636L4783L7893j2052
1999D623k3440j29l864k9003P750j3017L3990J2613k2580M650L0806m208o587
1986h396N324k1723P438J4838n379k1019K2701j9610R907p049l7707K9855O093
1973b4727k742Q33p788P799l0O724j0119K9079j5409j2361K0809R397J544j9180
$$ y = [2108, -18531, -3228, -12167, -43844, -804, -2877, 12654, -4582, -16149, -15739, -9018, -6196, 10218, 75, 298, -21813, -33876, -14637, 10810, 30376, 12524, -47603, -41823, -17577, -12206, 33046, 72418, 15098, -25047, -29144, -5384, 42310, 60949, 54638, 48694, 61753, 34012, 20016, 4444, 4920, 7748, -9583, 7197, 43943, 620, -16604, 2620, 6732, 21432, 33286, 43282, 5321, -21609, -22662, -41073, -51530, -56663, -38236, -32681, -39365, -56001, -21218, 16675, 4623, -18817, -18946, -22810, -51813, -44063, -57080, -23090, -10477, -33057, -28407, 2399, -1809, -8396, -3072, -24795, -17357, -2519, -7898, -28917, -6216, -25826, -15919, -22968, -60675, -30820, -24727, -27469, -26636, -34424, -26625, -26655, -19931, -30050, -971, -16380, -28741, -7932, 1465, 3009, -16171]
1959a6171j0395k522M447n464m203p357L0356k7936k749J8242l589J157K9931
1946C747L1093j2063l8426l1676K4992M7076l4080j0149r197M321m4549L0628
1934c8283J4261j4444J1533l0463J3042K5965r009k3801k4819J7572J1793L1273
1922a5380j4508k7608K6600N293J8801q702J1994j6840J88j7110l1794Q671K2944
1909c7451J7401J0104o846k9201J0239m454R603k857J1592l391L25M5764m6534
1896b5706q224J8992O210m2690l5299K511L8281K3309J722l5325P595K1325N008
1883b2291k3009k7942j1774N2074P806m4559p40K8997K9117k6656j6613J5705
1871c9885j0195m720L0621l704j4355J0635J7581k9788K339K6705j3705j3179
$$ y = [-16171, -26566, -29088, -24641, -30105, -34308, -41665, -11309, -39245, -41994, -23752, -27341, -26184, 3747, 34840, 22777, -15649, -47325, -22333, 24743, -9337, -19486, -28683, -24362, -68911, -38283, -24022, -38466, -26933, -57396, -44354, -18389, -27398, -51199, -76018, -58446, -46653, -15380, -29888, -57496, -30896, -25603, -6802, -15504, -3510, -20350, -20162, -37272, -69066, -60395, -37451, -20050, -9946, -16792, -45993, -35754, -40208, -30605, -33462, -21870, -25261, -24936, 20828, -25706, -33930, -14938, -8728, -51418, -86717, -84206, -45925, -22616, -20894, -56219, -48624, -27299, -22291, -45300, -73242, -85016, -32942, -25136, -69695, -70435, -41438, -12321, -38977, -55590, -39885, -50080, -54800, -24179, -27883, -42238, -31603, -14022, -43810, -41471, -14766, -28471, -41650]
1859d1650o377K1991K2097k8594j10J6010k5683R044k5171O988L1879R400O594
1846c582m3006n7691K3210J1973J0486L8911P704j440k1328o859Q537J6855j0565
1833b6795j1781R70Q70K0524P801l2164P700o432q559P796J03M346k1333k0520
1819g7474K6437K8762n3720j0740K9998L2673q573L771K0161l3536j4300J1667
1807d4874N254j6555o553j9316J5314J3962P827k1893j5261Q397J4726M399M685
1794d9888o496q51K690R371R288J260l2460q703n79K9264K9434l1174j537P484
1780d2897J7424m314o67k0178L90j1461j7973K4978j0717n398K0510J1474J0502
1767b8327k8206j7597K8919K8408k2934k2550J0502j6654K157k2549j2036L6025
$$ y = [-41650, -48027, -26036, -3939, -32533, -32643, -16633, -42316, -33272, -58443, -51455, -19576, -10176, -3582, -46588, -104279, -81069, -69096, -58610, -19699, -11995, -13435, -34763, -41622, -33085, -16230, -26795, -38576, -37606, -36736, -16212, -8411, -40575, -32875, -39307, -47866, -40070, -39967, -35621, -56954, -77474, -51037, -22275, -75995, -86735, -56737, -24064, -32637, -28866, -8705, -42241, -56541, -44874, -39620, -56175, -62728, -82044, -66730, -52768, -44941, -66834, -82095, -73698, -58972, -54573, -49888, -56384, -57235, -54545, -45174, -35886, -34626, -67086, -75789, -76368, -47104, -17670, -48844, -50381, -42897, -25473, -29787, -30454, -50632, -50242, -61703, -79676, -54698, -65415, -70813, -50303, -38829, -28327, -56533, -74130, -45211, -16803, -39737, -62287, -51785, -68439, -66282, -88831, -100867, -64842]
1755f4842J1912o637L2588k4337p487L9883l153k839k91n1819J6882J2928q899
1742e6111L83l8612L7045K9352k6818l590J0055P054M772o200j1500M485N374
1729d4311l1585m209J8187J1671J1105j6311o632n055J0965q022k663j1626j3236
1716i1722N012R251J0067Q847k4887J52K5034k1458k7003L6294L1715J2531k3735
1703d9902n4864L7014N806K3562l9065j695M5396k88j2663o374J4620K2538j6591
1690c2506o419k5636Q4r971K5118K5946l1203j8089m76K2156R89n758l514j3642
1676g2921k306K0497J4815n050Q972J6333p080l360m6015j592J746j8756K8777
1663f5940M935J7922K623N468K5296k5139J6047J4115N44j7456l6487j8635L169
$$ y = [-64842, -52930, -59567, -26979, -51316, -58803, -18920, -22073, -24912, -25203, -77022, -60140, -47212, -56111, -55728, -94340, -57295, -27943, -54761, -58351, -48296, -41242, -36470, -42670, -54170, -49685, -44311, -75896, -80105, -61918, -50247, -39142, -55453, -62085, -67140, -56175, -64197, -66860, -78486, -91722, -86710, -77459, -67392, -58545, -83432, -83280, -58246, -79704, -106707, -70413, -38698, -26167, -49902, -104766, -67752, -61946, -38384, -77449, -79144, -33748, -34036, -46699, -53073, -38453, -15915, -32506, -38925, -64561, -64477, -74448, -49330, -23384, -54587, -72676, -73152, -50996, -50007, -55765, -59279, -72921, -75227, -54730, -39915, -44965, -35993, -19660, -26740, -30100, -76115, -77707, -75961, -94717, -65940, -61005, -43083, -40460, -34992, -9696, -34835, -18788, -4673, -4129, -21585, -58072, -76707, -73538]
1650g3538L1851q321J7017K74l3380l962M164r329K2508m165j3865o43r708J732
1636g9365r156K8841K8978j5886k3875K566K4313j9325o739L898j7853J3757K0308
1623d9538m1833j7708L4292l8867R965K0156q795l537M9303j6157m8408R935k589
1610a03781K4390J7891R18j8517J458j2538O382J6051J023J6921K0731n558k5172
1597e9801m6992P714M2477l840n814M4643j455l7930j4774j7619K4577L142j9155
1584h4827m5511M6312J5986J5731j3156m490M592L0197r906K9322m1577O5j1332
1571f8594p744J6366L33J7854k7750J7695q334Q110l1354N84J5023O571Q961L2853
1557a9426k7428k3392J5245J6299k537l6086r775K4797j4113J8386m008j3212
$$ y = [-73538, -41687, -50008, -32991, -32717, -66097, -70059, -65895, -75224, -52716, -56881, -70746, -71389, -81097, -79365, -88521, -59680, -30702, -46588, -70463, -67897, -43584, -62909, -69648, -65750, -83603, -69846, -49538, -91371, -109079, -74787, -113654, -103689, -83533, -92328, -95865, -46562, -62719, -111127, -101192, -103781, -79391, -61500, -60582, -79099, -77641, -90179, -83797, -67746, -66723, -49802, -29071, -34629, -59801, -106793, -99079, -56602, -60442, -66256, -21613, -23068, -60998, -75772, -93391, -68814, -65672, -84827, -130338, -84026, -68040, -52309, -65465, -69955, -65363, -35166, -45072, -15750, -57327, -57262, -68594, -76338, -59972, -59639, -41785, -69535, -51840, -60174, -52064, -83418, -82834, -67811, -61240, -52279, -19426, -46854, -70246, -55001, -38702, -41239, -77325, -87100, -62303, -76416, -58030, -62038, -75250]
1545g5250P690J453j2330R502k7546J3471k895K0204R876L477o62k3032k3237
1532i9279K9705K2309P366j766O164j4744n687J6171l418k1619j9045K0392N534
1519e7917P805j7936K4143k3243k0340O877k5644l9324L8489L6384P497N677K565
1506e4967K47j5687J4999n352p679L092j6930j0772O521J2753R177J814K3144
1493c9640l6629q831J6633l2164K807K6546J4306p175P412j121J4412m646J6602
1480c1488j0553j7160o014j009J6210j2818l8224k113J1060K1209l6731L29L9713
1467f7589r561k1479K1724j0746K202j760l2608J2774K6822M864k972J7103l5843
1454i7069k788L0721k1796j0679K0572O755K2115N107Q414J7135n075k4054J5296
$$ y = [-75250, -67560, -66107, -78437, -68935, -96481, -83010, -85905, -65701, -55825, -52348, -53010, -76042, -99279, -69574, -47265, -39899, -41665, -35501, -50245, -55932, -39761, -43179, -64798, -83843, -63451, -57917, -50112, -68048, -43905, -67148, -87488, -80611, -106255, -145579, -107090, -70706, -63209, -57532, -54967, -54720, -70407, -55408, -60760, -68439, -65347, -82277, -93049, -86528, -73775, -64598, -62784, -39640, -76269, -85100, -68467, -100631, -97824, -71278, -56972, -64147, -56735, -57856, -43444, -48090, -31488, -42041, -59201, -65215, -66224, -50014, -62832, -101056, -103169, -92109, -70900, -107631, -107302, -67589, -77150, -98629, -76905, -87651, -85449, -87209, -119817, -107043, -80221, -75357, -78329, -61226, -97069, -99857, -69136, -90932, -101611, -81039, -74284, -52169, -47062, -38648, -21513, -26588, -50642, -35346]
1441c5346o647K727k1640K1102n495j6699o484P207J2500k5639j5750l0708N6148
1428f4724J0806k8908j975j9750o937Q159K2296K6722j418n214j1543j2241J4577
1415g0150J5205m989p81j1313o687J7173J0239m0469o241O700K4856L5960n2188
1402h2685k5574L2580l3776J9904J4910k037L6848j4429j3529J1101J9977j1324
1390d8034k8052K8034j8573P073K0724l2817j7803j8414J7118J6215r421j1608
1378i5558j4490K3535j7259n976K7531k673l6957j2958N7382j4734J478l0535
1366a21214K4586K0969J0895j0280j2723J79q13j5439k708K0643K0861p681O643
1353f6082l0569j6912K7813J1791l7485J0574J933n176K3365l4827M098K2457
$$ y = [-35346, -41993, -39266, -60906, -39804, -45299, -61998, -68482, -61275, -48775, -74414, -90164, -120872, -64724, -53918, -82826, -84801, -104551, -111488, -103329, -81033, -54311, -55729, -60943, -72486, -84727, -70150, -54945, -59934, -60715, -72028, -78715, -61542, -51303, -91772, -98013, -91313, -66457, -30497, -82685, -108259, -75679, -109455, -89551, -74641, -76678, -39830, -54259, -67788, -56687, -36710, -48034, -76086, -48052, -66625, -59552, -38828, -71645, -89448, -107862, -90744, -74529, -83950, -95558, -110048, -86513, -103772, -109748, -82217, -84890, -121847, -134805, -77423, -92157, -90679, -121214, -96628, -75659, -64764, -75044, -87767, -87588, -88401, -103840, -106548, -85905, -65044, -72725, -66082, -96651, -113563, -85750, -73959, -111444, -100870, -98937, -104113, -80748, -115575, -111477, -89020]
1341h9020M874k2239p81K4060k0436o19M8955J0545q984j8319l0204N522J2352
1328h4294J7533K5798l7195k8536K3003J8298l9313K8083J7431m6347o413M4955
1316f6997k3971j1204L698K9285J2051k5217P763o702m2817k329J1149L1608J0414
1303g3269m4J0695J8852l3622N274p745J0222m631q814J4127J0477O348o1633
1290a13763J9969J8573n7403n555L0804j3045J1354J4262Q073K1045O197k8457
1278h7946J3049l684j3932l527K9233J6771J009k4256j8620J5062J696k886R123
1265f8908j7924M0431k8310k098K2049n6843R672L7501J1936j5728j7241p081
1253i2544J6777k0843j0734O523J9859k7855J9389J3368Q451l121m1410k7878
$$ y = [-89020, -84146, -106385, -107166, -83106, -103542, -104161, -55206, -44661, -53645, -71964, -102168, -96646, -84294, -66761, -40963, -78158, -106694, -83691, -65393, -104706, -76623, -59192, -105539, -111952, -66997, -90968, -102172, -98474, -69189, -57138, -82355, -74592, -81294, -124111, -126440, -115291, -83683, -73269, -73313, -62618, -43766, -77388, -72114, -79859, -69637, -74268, -83082, -68955, -58478, -52130, -113763, -93794, -75221, -132624, -138179, -107375, -120420, -109066, -94804, -86731, -65686, -59489, -87946, -74897, -78581, -92513, -96040, -66807, -50036, -49027, -73283, -91903, -76841, -75145, -78031, -68908, -86832, -46401, -74711, -76809, -54760, -111603, -101931, -64430, -52494, -68222, -85463, -92544, -75767, -96610, -107344, -100821, -80962, -108817, -89428, -76060, -67609, -70730, -112140, -140018]
1241a40018K0386K9923j1437R888N383j8103N261R837k289Q143l7040L0487J4151
1228g5428q532J2616J1259m8940M1723m617K880J3826j6695J7601J5008L279R52
1215c5068k3854O691J0962l290M500k0272R197j7236q168K0949k0539m244K6657
1202e3715l0967q282k1222L2348L345o311L419R409k5601N156Q389k409J2565
1189g3876K1675l2745j1187M3115M67j4129j6353j1263J4196J1522K5191l5300
1177g8687k5408K712J6281J8235M319J7199N275k9278L557J0005p20j1616l579
1164g1705j3092j7569j8394P81M6077L2449Q016j8469k1803k2336L4646k0356
1152h1755k5936O974J1416j6506P381J222r085j7172R83K9459r702Q074K5749
$$ y = [-140018, -119632, -89709, -101146, -91258, -85875, -103978, -98717, -88880, -91169, -83026, -120066, -89579, -75428, -83960, -71344, -60085, -109025, -67302, -71919, -69039, -55213, -71908, -54307, -39299, -36020, -35068, -58922, -52231, -41269, -44559, -40059, -60331, -51134, -68370, -76538, -55589, -76128, -80372, -53715, -84682, -92964, -114186, -81838, -78493, -84804, -81385, -71976, -97577, -92421, -84032, -86441, -73876, -52201, -84946, -96133, -53018, -52551, -66680, -83033, -94296, -80100, -68578, -43387, -78687, -104095, -101383, -85102, -66867, -62548, -45349, -40074, -69352, -65795, -55790, -56510, -68126, -71705, -84797, -102366, -120760, -119979, -73902, -41453, -33437, -51906, -73709, -96045, -61399, -81755, -107691, -100717, -89301, -105807, -98426, -97204, -106289, -123461, -122478, -93019, -102721, -94647, -68898]
1139f8898k9285K005K68K616n497J924L875r252K280K4424j4776k905K2677p346
1125g7890l7232j2577R524R649K1520j300k2706J8278O275l755j2692j2317K7804
1112h7419Q317K882o72l6334n252L2929k284o850J8492j6045J4215j6527L347
1099i1201M5210m2000j5417Q517K822K8132l6917J838L7572j4456N0480j6205
1087d1625l9737j7203O871r872J957M4735j0424j5285Q482J0664j1976j8601j0413
1074a02427K3900K1844k2492k2779J2597K4288j9073K8749k7150P248l9781P575
1062a07501J0310j769J1208J666l18J5053P843j4459o248j8888J8087K5619n066
1049f4463o4243J3864m798j1928M6395K584o424N328M27J7754k7008L527k2999
$$ y = [-68898, -98183, -96178, -95910, -93294, -98791, -96867, -92992, -102244, -99964, -75540, -90316, -93221, -70544, -77890, -115122, -127699, -118175, -108526, -87006, -88306, -111012, -92734, -86459, -90214, -102906, -115223, -87419, -79102, -76220, -76892, -113226, -118478, -85549, -87833, -94683, -76191, -92236, -78021, -94548, -91201, -45991, -87991, -103408, -94891, -92069, -63937, -100854, -99016, -61444, -75900, -25420, -41625, -81362, -98565, -91694, -101566, -99609, -54874, -65298, -80583, -72101, -61437, -73413, -92014, -102427, -78527, -56683, -79175, -101954, -89357, -65069, -84142, -55393, -82543, -75295, -115076, -107501, -97191, -98960, -87752, -86086, -86404, -71351, -63508, -77967, -84215, -103103, -85016, -59397, -64463, -128706, -114842, -119640, -131568, -85173, -82589, -89013, -83685, -83258, -65504, -92512, -88985, -111984]
1036a11984N652q495J306j5647j1090J3132J6999K3083o839k7865m628K2690j8824
1023a22510M3393Q427k4540L5723k4892j3753J8710o632k0084K1883K1906k0873
1011h3242k3849J7912J2267l104j0420k3976j863m981Q383r295o371M8754k1182
998a00967o799K6976k085J5810j0091J6806o062k6032k6891J1288j1609M3994
986g5662o525L7708l115k1307q327j3089j6731J5J6345j0308m0584r711M2791
973a08500o159R843j048N963j5397K2588o367M960k1934p510M5245L888l6071
960a10499L6037k9551k5603R745J3541K9745k4268m920J8650K3263k748l1083
948i7691k9257K424Q785q457J9589L0151l0479l468K277J7868k218k7551K714
$$ y = [-111984, -106332, -114827, -113521, -129168, -140258, -127126, -110127, -87044, -93883, -121748, -126376, -103686, -122510, -79117, -70690, -95230, -59507, -84399, -98152, -79442, -86074, -106158, -84275, -62369, -83242, -107091, -89179, -76912, -80016, -90436, -114412, -116275, -121256, -112873, -122168, -128539, -79785, -100967, -107766, -80790, -82875, -67065, -77156, -60350, -66412, -92444, -119335, -108047, -119656, -75662, -82187, -44479, -47594, -68901, -77228, -90317, -107048, -107033, -90688, -100996, -141580, -151291, -108500, -114659, -104816, -105864, -99901, -115298, -92710, -99077, -94117, -116051, -123561, -78316, -74428, -110499, -74462, -104013, -129616, -119871, -106330, -76585, -100853, -105773, -87123, -63860, -66608, -97691, -126948, -124524, -115739, -124196, -104607, -74456, -104935, -108403, -106126, -88258, -90476, -118027, -115313]
935a15313O777J3355j8900K8360j6174j1167o55m3159j768L6813K7376J3401J4646
922f6408j9489J5875j3846k3722j5496J5042k603J2844k0818j4416K5285o120
910a13872k3632K9665K4967l7944P247R144N892R473r990J1388K6434K2545j8368
897e7051j6404P025O996j8707j5619M749n608m944J8816N745j7947k362k1926
884a17237L461j0742K6681J952o4K5149k1962M886k4971j7854O6802J8798l1926
871g7027n6724J4794j5323k3852L9995L8043j5736k4553J831o60L529K0906j2022
858a06799L694k1702k6016J7390K9452J1553j5911J5127K8378o296p250L213j9523
845i4690q42J779L7272l4133m0088K833j0315L2856k141Q196j14r891j9723j086
$$ y = [-115313, -108536, -95181, -114081, -85721, -101895, -113062, -113717, -156876, -158644, -121831, -94455, -81054, -66408, -85897, -70022, -83868, -107590, -123086, -108044, -110647, -97803, -118621, -133037, -107752, -113872, -137504, -107839, -82872, -120816, -113569, -104425, -98533, -89060, -99050, -87662, -61228, -38683, -57051, -73455, -66430, -59434, -78141, -93760, -89011, -94619, -99563, -80747, -75002, -92949, -95311, -117237, -113776, -124518, -97837, -95885, -95949, -70800, -92762, -87876, -112847, -130701, -63899, -45101, -77027, -133751, -118957, -134280, -158132, -118137, -80094, -95830, -120383, -118552, -119212, -115683, -94777, -106799, -103105, -124807, -150823, -133433, -103981, -92428, -108339, -93212, -64834, -71130, -78380, -75167, -94690, -95532, -93753, -56481, -90614, -130702, -127869, -138184, -105328, -107469, -99273, -99387, -109278, -129001, -130087]
831a30087R274K6623L1837l1062m609n514l548Q097p944J1910Q271m188K1094
818f9846j0992K7366L3628l6120m2457l4704K8927N198N51J4883k0308j271m492
805a09637k249q718J7850n908J0360m05R263j7624n877L0240N320m5703j3763
792a36851J3251k0634O422J6382j2770J8164k490l645M943J7495M9942j3826m6601
779a10218j1429j3461P730k3802R331R484N320M759K4633p252j1992K3739R917
766h3241P677l7864q607K1473l176k4878J2174K4226J2676k2058l0647j2358L7794
753a06809M593r032L033J0489j0457j1079J0139J965l5491J2618K3738l694j6039
740a26026L6647j3661j7347J1326o499l4087L1222M3094j7515l3591n504N2949
$$ y = [-130087, -120813, -94190, -62353, -93415, -98024, -103538, -107086, -98989, -106933, -95023, -86752, -90940, -69846, -80838, -53472, -19844, -55964, -98421, -133125, -104198, -99000, -98449, -83566, -103874, -105145, -109637, -111886, -120604, -102754, -108662, -98302, -98707, -89444, -107068, -112945, -82705, -77385, -123088, -136851, -123600, -144234, -137812, -121430, -134200, -116036, -118526, -122171, -117228, -99733, -49791, -63617, -110218, -121647, -135108, -127378, -151180, -141849, -132365, -127045, -122286, -97653, -104905, -116897, -93158, -83241, -75564, -113428, -122035, -100562, -103738, -128616, -116442, -92216, -79540, -101598, -132245, -144603, -106809, -102216, -111248, -108215, -97726, -108183, -119262, -109123, -107158, -142649, -130031, -106293, -109987, -126026, -89379, -103040, -120387, -109061, -115560, -149647, -118425, -75331, -92846, -126437, -131941, -78992]
728g8992Q263l1989k147K2275P880p969j3876j8785k4074L7194L1143k3683k7326
715a22086q527J5265Q724l3669L7986j2164j5181o333J580m135j1198K0948N211
702a23579J1169J1521j3248N467J912J4917n773K0423m2949k9041J2478K1340
690a15363k2751K4715j4373j0329N16L404K8916J5048j3463l4313K7426k9344
678a39911J3812J4091N317p308j0018M8481O891j5641K544j5630k3543K0721L9310
665f0884j3636N126k2838J541r234j0982j2247J0902j2197K8285r533N698j3220
652a13219J0893r612m455M314K2884J3019N071l3256k2729l1774q220M066J7565
639a45453K4508n296j6656J9139L2374j0282j2710j4634K98K8104p22j8343k1023
$$ y = [-78992, -70729, -102718, -104865, -82590, -74710, -82679, -96555, -115340, -139414, -102220, -71077, -94760, -122086, -130613, -115348, -106624, -140293, -102307, -114471, -129652, -135985, -134405, -138540, -149738, -128790, -123579, -112410, -100889, -114137, -108670, -106758, -91841, -97614, -77191, -120140, -149181, -136703, -115363, -138114, -113399, -127772, -138101, -137585, -134181, -105265, -90217, -103680, -137993, -110567, -139911, -126099, -112008, -106691, -113999, -124017, -75536, -68645, -84286, -81742, -97372, -120915, -100194, -60884, -74520, -69394, -92232, -90691, -99925, -110907, -123154, -112252, -124449, -96164, -105697, -99999, -113219, -102326, -111938, -116393, -112079, -89195, -76176, -71105, -104361, -127090, -158864, -167084, -163018, -145453, -120945, -126241, -142897, -123758, -91384, -101666, -114376, -129010, -128712, -100608, -101330, -119673, -140696]
626a40696M3913M1938o4948m966J8155k5385J1407J5544j749j9643k499J1944
614a16985J1303j974l2534L6189J2461M628O821j4022j9224J6321n667j6444j4055
601a33182L7265j1662m1472K5135J8375J7916O45j3455Q063L914k8985Q426J5312
588i3705n4551L8622J6054m3127L0029K4032j4781j5772j2923L0688M136M448
576h6850r634j7919M924J5686L434J5388k34j2841l8741J2860L677m312j7842
563a32404J0613k6212N352j603J7512m528k1868K2667J0714L2790J1231j1707
551h7443k2508j0396r121L0588k1874l6866M4756j1400j3408J2939l7338J6448
539a45623K0338p345m810L615P080j1441P344J1214j6954K9720K8979k5955l8201
$$ y = [-140696, -96783, -54845, -119793, -124759, -106604, -131989, -120582, -105038, -106787, -126430, -128929, -116985, -105682, -107656, -140190, -104001, -91540, -86912, -80091, -94113, -113337, -97016, -102683, -119127, -133182, -95917, -107579, -149051, -123916, -105541, -87625, -86980, -100435, -92372, -88458, -117443, -109017, -93705, -148256, -109634, -93580, -136707, -106678, -82646, -97427, -113199, -126122, -95434, -91298, -86850, -96484, -114403, -109479, -93793, -90359, -74971, -75205, -88046, -126787, -113927, -110250, -114562, -132404, -121791, -148003, -142651, -144254, -126742, -131270, -153138, -130471, -119757, -86967, -75736, -87443, -109951, -120347, -129468, -98880, -120754, -157620, -112864, -124264, -137672, -124733, -162071, -145623, -125285, -132630, -137440, -133825, -126745, -138186, -130842, -119628, -136582, -106862, -77883, -103838, -142039]
526a42039J9686L4253j9106Q197P770K254l684j2792m657J1135j0574J0868M676
513i4013k7639j2973Q990j2673J9742J1427j8356J0241K1620J3160m7073o605
501a34152L5025K624o262J2894J4257m902l6539M740J3868j030j6705n825N100
488a16907L6639J448o436k1118j6209j6598O83J1549k1579l7288J6136R691L95
475a59594M4107J0738p062k685j3209p84l3265K2866L1790k3759j14J1405j1596
462a31162n035l559J6701o639l664k5350J249m915L8702K4827J0207k2857p384
449a18879j2369q965M0912K1645j3987Q276j9467l5512J6923l7920k992K7526
437a34809J5595K2560m1546j5083J7186m191J1089n572k9535J7128M6543N654
$$ y = [-142039, -122353, -88100, -107206, -99009, -91239, -88985, -92669, -105461, -110118, -98983, -109557, -98689, -94013, -121652, -134625, -125635, -138308, -118566, -107139, -125495, -115254, -93634, -80474, -127547, -134152, -99127, -96503, -102765, -89871, -75614, -80516, -117055, -112315, -98447, -99477, -116182, -122007, -116907, -80268, -78820, -85256, -106374, -122583, -139181, -138498, -126949, -148528, -185816, -169680, -159989, -159594, -115487, -104749, -111811, -114496, -127705, -128489, -161754, -138888, -107098, -130857, -130971, -119566, -131162, -136197, -139756, -123055, -129694, -133358, -158708, -157459, -162374, -123672, -98845, -88638, -111495, -118879, -131248, -140213, -99301, -77656, -91643, -83367, -102834, -138346, -121423, -159343, -162335, -134809, -119214, -96654, -138200, -153283, -136097, -140288, -129199, -134771, -164306, -147178, -100635, -94981]
425i4981q698l0040J4402R212l0095J420R086J4804j1710N835o642o256K9910
412a03753j8054k6378L718R247P279J2170J552n133j1974L4095j768j0894k01
399a10094o882j1458K6186O512r796k8238j6069N1013O489q116M2988k5559j4899
386i7923k6179l7287K6427K4066m0962N3383p491J5603j4817k6376Q079J4029
374a09448n377L713K2678k4273l0694J7152M0446j4470K0652j2580k4625k5583
362a42409L6576Q978k0076j6879k6213K3590M8238n616k9155M16m2j4057m361
349a41010J8007K615k087M028K6118j580j4385N534P451k5400L2280o021l5551
336a30001l15K480J7162J6232j9052j6539J434J1960K1856M13J5068q667l6782
$$ y = [-94981, -103679, -133719, -119317, -110105, -140200, -138780, -129694, -114890, -126600, -120765, -127407, -133663, -103753, -121807, -148185, -144467, -135220, -127941, -115771, -114219, -119352, -131326, -97231, -98999, -109893, -110094, -116976, -128434, -102248, -95736, -105532, -133770, -149839, -98826, -92337, -100453, -57465, -83024, -97923, -124102, -161389, -134962, -110896, -151858, -98475, -105966, -90363, -105180, -131556, -123477, -109448, -114825, -111112, -88434, -112707, -143401, -126249, -85803, -100273, -79621, -92201, -116826, -142409, -105833, -96855, -116931, -133810, -160023, -136433, -88195, -93811, -122966, -122550, -122592, -136649, -141010, -123003, -120388, -122475, -118447, -92329, -93909, -108294, -102760, -95309, -120709, -88429, -94450, -130001, -130316, -127836, -110674, -94442, -113494, -130033, -128599, -116639, -94783, -94370, -79302, -87969, -124751]
323a24751k5207l222K2376J6249K498j2479j1569K1763k3663K2863K7121J9493
311f8528j960n0742N10J2156l7233q108L9669O754k7446k0640J4417L5211O237
298i9703q108L707O87L4428l1999q842l2029J9777j976k1010N7436k9451N681
285a11402m500K0130k6197j9934J6589j8215q597K1650Q897l973k5577K0215N317
272a25597J9423l2111q935L3686J9479j0919p328k957n702L1587k3505j1623J4068
259a10434p227J3914J6707m8437J4838l7056M109M6561r998k3166r03O119r71
246a35944L5177Q623L834j7331L847K7640j0170j4502J9446j0951l3439m3450
234a67220L6133J0989j984k9251k67J2182L2304j8158j392J7060r643j6567j9257
$$ y = [-124751, -149958, -153180, -130804, -114555, -112057, -124536, -136105, -114342, -138005, -115142, -88021, -68528, -70488, -121230, -120720, -108564, -145797, -153905, -114236, -107482, -134928, -155568, -141151, -105940, -99703, -107811, -104104, -103417, -68989, -100988, -109830, -141859, -122082, -124058, -145068, -87632, -117083, -111402, -115902, -95772, -121969, -141903, -125314, -143529, -152126, -130476, -121579, -125552, -151129, -130914, -125597, -106174, -138285, -147220, -113534, -94055, -104974, -112302, -115259, -120961, -89374, -112879, -124502, -110434, -117661, -103747, -87040, -135477, -120639, -157695, -153586, -107025, -117023, -140189, -141092, -134973, -135944, -100767, -92144, -88310, -105641, -101794, -74154, -84324, -98826, -79380, -90331, -123770, -167220, -131087, -120098, -122082, -151333, -151600, -139418, -107114, -125272, -126664, -109604, -119247, -135814, -155071]
221a55071L7574n04k1951l4080N7408K9952l854M835m6040N464J6289j5392R297
208a16073K3786m134j7654m688j6530j6330r38L9309K3665j7449j5821M2389J9938
195f0530l8504j3736j5607K8421K679k3031j0073N679L8262k9721j5810n171J9202
182a17940J8218k9552j1235K0411N493J6975j9568r735k4525K3751R169l522K9074
169i2986p368k27K0697l273k3944j577j0455j0046N518J0809p648m1n311p165
155a33017L0049n789r67r947o113r118L671J2385M987J1776J1353j7836n103j0018
141a23687J6782O371q60k4496k6389M1769J2201p226K693Q939m696j8368l1195
128a48162J3408L2253J7756j1095R720p527j6507K5259j7937R250j0197l0430
$$ y = [-155071, -117497, -118001, -139952, -174032, -116624, -86672, -90526, -85691, -131731, -126267, -109978, -125370, -116073, -92287, -96421, -114075, -118763, -135293, -151623, -152561, -113252, -89587, -107036, -122857, -80468, -60530, -99034, -112770, -128377, -99956, -97277, -120308, -130381, -124702, -86440, -116161, -131971, -137142, -117940, -99722, -129274, -140509, -120098, -114605, -97630, -117198, -126933, -151458, -127707, -118538, -122060, -92986, -100354, -100581, -79884, -83157, -107101, -108678, -119133, -129179, -123661, -112852, -120500, -120541, -125852, -133017, -102968, -108757, -109724, -119671, -125784, -134902, -131231, -118846, -113859, -102083, -90730, -108566, -113669, -123687, -106905, -100534, -101394, -125890, -152279, -110510, -98309, -105535, -102842, -93903, -98599, -116967, -148162, -134754, -102501, -84745, -95840, -86120, -93647, -110154, -84895, -102832, -93582, -103779, -134209]
116a34209J4338J538O971O866Q780j5608O731l464n356J380O127N161j4625N425
$$ y = [-134209, -119871, -118333, -111362, -104496, -95716, -111324, -104593, -108057, -113413, -112033, -105906, -100745, -115370, -109945]
$$ [...]
##END NTUPLES=NMR SPECTRUM
##END=
