##TITLE=1H_DE-80H_X3
 200.13MHz, d2o
 8 sc
 
 19ns.26.2.2025
##JCAMPDX= 6.0         $$ Bruker NMR JCAMP-DX V2.0
##DATA TYPE= NMR SPECTRUM
##DATA CLASS= NTUPLES
##ORIGIN= UXNMR, Bruker Analytische Messtechnik GmbH
##OWNER= pz
$$ XWIN-NMR		Version 3.5
$$ Thu Jul  3 11:20:14 2025 Russian Standard Time (UT+4h)  Yarkov@DPX200
##.OBSERVE FREQUENCY= 200.1313
##.OBSERVE NUCLEUS= ^1H
##.ACQUISITION MODE= SIMULTANEOUS
##.ACQUISITION SCHEME= undefined
##.AVERAGES= 8
##.DIGITISER RES= 18
##SPECTROMETER/DATA SYSTEM= spect
##.PULSE SEQUENCE= zg30
##.SOLVENT NAME= CDCl3
##.SHIFT REFERENCE= (INTERNAL, CDCl3, 0, 15.5574)
##AUDIT TRAIL= $$ (NUMBER, WHEN, WHO, WHERE, WHAT)
$$ ##TITLE= Audit trail, XWIN-NMR		Version 3.5
$$ ##JCAMPDX= 5.01
$$ ##ORIGIN= Bruker BioSpin GmbH
$$ ##OWNER= Yarkov
$$ C:/Bruker/XWIN-NMR/data/yarkov2/nmr/H-C/1/pdata/1/auditp.txt
$$ ##AUDIT TRAIL=  $$ (NUMBER, WHEN, WHO, WHERE, WHAT)
(   1,<2025-07-03 11:17:54.51 +0400>,<Yarkov>,<DPX200>,
      <created by zg, POWCHK disabled, PULCHK disabled
       configuration hash MD5:
       00 E9 B6 7A A2 85 ED C7 34 08 36 98 17 FE 4E 26
       data hash MD5: 16K
       14 D1 92 12 9A 23 C1 37 0E B9 4A FD 1A FC EB 64>)
(   2,<2025-07-03 11:18:25.96 +0400>,<Yarkov>,<DPX200>,
      <Start of raw data processing
       efp BC_mod = 2 LB = 0.25 FT_mod = 6 PKNL = 1 PHC0 = -1353.293 PHC1 = -4.750521 SI = 16K 
       data hash MD5: 16K
       AC 21 3F CF D1 11 58 1F 66 6A A6 4F CE 9F FD C5>)
(   3,<2025-07-03 11:18:47.26 +0400>,<Yarkov>,<DPX200>,
      <pk PHC0 = 6.972803 PHC1 = -1.2 
       data hash MD5: 16K
       4F 4C CF A1 35 1E 54 18 65 39 D6 E9 4A 8C 08 3C>)
(   4,<2025-07-03 11:19:39.53 +0400>,<Yarkov>,<DPX200>,
      <pk PHC0 = -14.57071 PHC1 = 15.99999 
       data hash MD5: 16K
       3C 62 9B FC 52 3E A3 85 70 6F 70 0D 61 B8 7D 40>)
$$ ##END=
$$ 
$$ hash MD5
$$ 70 16 50 9F 9E D1 01 2F F1 18 9C F6 81 9E 48 65
##$RELAX= 
##$RELAX= 
##$RELAX= 
##$RELAX= 
##$RELAX= 
##$RELAX= 
$$ Bruker specific parameters
$$ --------------------------
##$DU= <C:/Bruker/XWIN-NMR>
##$EXPNO= 1
##$NAME= <H-C>
##$PROCNO= 1
##$TYPE= <nmr>
##$USER= <yarkov2>
##$AMP= (0..31)
100 100 100 100 100 100 100 100 100 100 100 100 100 100 100 100 100 100 
100 100 100 100 100 100 100 100 100 100 100 100 100 100 
##$AQSEQ= 0
##$AQ_mod= 1
##$AUNM= <au_zg>
##$AUTOPOS= <>
##$BF1= 200.13
##$BF2= 200.13
##$BF3= 200.13
##$BF4= 200.13
##$BF5= 200.13
##$BF6= 200.13
##$BF7= 200.13
##$BF8= 200.13
##$BYTORDA= 1
##$CFDGTYP= 0
##$CFRGTYP= 5
##$CHEMSTR= <none>
##$CNST= (0..31)
1 1 145 1 1 1 1 1 1 1 1 1 1 1 1 1 1 1 1 1 1 1 1 1 1 1 1 1 1 1 1 1 
##$CPDPRG= <>
##$CPDPRG1= <>
##$CPDPRG2= <>
##$CPDPRG3= <>
##$CPDPRG4= <mlev>
##$CPDPRG5= <mlev>
##$CPDPRG6= <mlev>
##$CPDPRG7= <mlev>
##$CPDPRG8= <mlev>
##$CPDPRGB= <>
##$CPDPRGT= <>
##$D= (0..31)
0 0.7 0 0 0 0 0 0 0 0 0 0.03 0 0 0 0 0 0 0 0 0 0 0 0 0 0 0 0 0 0 0 0 
##$DATE= 1751527073
##$DBL= (0..7)
120 120 120 120 120 120 120 120 
##$DBP= (0..7)
150 150 150 150 150 150 150 150 
##$DBP07= 0
##$DBPNAM0= <>
$$ [...]
##$SUBNAM2= <"">
##$SUBNAM3= <"">
##$SUBNAM4= <"">
##$SUBNAM5= <"">
##$SUBNAM6= <"">
##$SUBNAM7= <"">
##$SUBNAM8= <"">
##$SUBNAM9= <"">
##$SW= 18.0517328524113
##$SWIBOX= (0..15)
0 0 2 0 0 0 0 0 0 0 0 0 0 0 0 0 
##$SW_h= 3612.71676300578
##$TD= 16384
##$TD0= 1
##$TE= 0
##$TE2= 300
##$TE3= 300
##$TEG= 300
##$TL= (0..7)
0 120 120 120 120 120 120 120 
##$TP= (0..7)
150 150 150 150 150 150 150 150 
##$TP07= 0
##$TPNAME0= <>
##$TPNAME1= <>
##$TPNAME2= <>
##$TPNAME3= <>
##$TPNAME4= <>
##$TPNAME5= <>
##$TPNAME6= <>
##$TPNAME7= <>
##$TPOAL= (0..7)
0.5 0.5 0.5 0.5 0.5 0.5 0.5 0.5 
##$TPOFFS= (0..7)
0 0 0 0 0 0 0 0 
##$TUNHIN= 0
##$TUNHOUT= 0
##$TUNXOUT= 0
##$USERA1= <user>
##$USERA2= <user>
##$USERA3= <user>
##$USERA4= <user>
##$USERA5= <user>
##$V9= 5
##$VALIST= <valist>
##$VCLIST= <CCCCCCCCCCCCCCC>
##$VD= 0
##$VDLIST= <DDDDDDDDDDDDDDD>
##$VPLIST= <PPPPPPPPPPPPPPP>
##$VTLIST= <TTTTTTTTTTTTTTT>
##$WBST= 1024
##$WBSW= 4
##$XGAIN= (0..3)
0 0 0 0 
##$XL= 0
##$YL= 0
##$YMAX_a= 562727
##$YMIN_a= -571148
##$ZGOPTNS= <>
##$ZL1= 120
##$ZL2= 120
##$ZL3= 120
##$ZL4= 120
##$ABSF1= 0
##$ABSF2= 0
##$ABSG= 0
##$ABSL= 0
##$ALPHA= 0
##$AQORDER= 0
##$ASSFAC= 0
##$ASSFACI= 0
##$ASSFACX= 0
##$ASSWID= 0
##$AUNMP= <proc_1d>
##$AZFE= 0.1
##$AZFW= 0.1
##$BCFW= 0
##$BC_mod= 2
##$BYTORDP= 0
##$COROFFS= 0
##$CY= -3
##$DATMOD= 1
##$DC= 0
##$DFILT= <>
##$DTYPP= 0
##$F1P= 0
##$F2P= 0
##$FCOR= 1
##$FTSIZE= 16384
##$FT_mod= 6
##$GAMMA= 0
##$GB= 0
##$INTBC= 1
##$INTSCL= 3.241238e-09
##$ISEN= 128
##$LB= 0.25
##$LEV0= 0
##$LPBIN= 0
##$MAXI= 10000
##$MC2= 0
##$MEAN= 0
##$ME_mod= 0
##$MI= 1.114404
##$NCOEF= 0
##$NC_proc= -5
##$NLEV= 6
##$NOISF1= 3.799351
##$NOISF2= 2.8
##$NSP= 0
##$NTH_PI= 0
##$NZP= 0
##$OFFSET= 15.55738
##$PC= 1
##$PHC0= -1360.891
##$PHC1= 10.04947
##$PH_mod= 1
##$PKNL= yes
##$PPARMOD= 0
##$PSCAL= 0
##$PSIGN= 0
##$REVERSE= no
##$SF= 200.129992859084
##$SI= 16384
##$SIGF1= 3
##$SIGF2= 2
##$SINO= 0.751879
##$SIOLD= 32768
##$SREGLST= <19F.Aceton>
##$SSB= 0
##$STSI= 16384
##$STSR= 0
##$SW_p= 3612.71676300578
##$SYMM= 0
##$S_DEV= 0
##$TDeff= 16384
##$TDoff= 0
##$TI= <>
##$TILT= no
##$TM1= 0
##$TM2= 0
##$TOPLEV= 0
##$USERP1= <user>
##$USERP2= <user>
##$USERP3= <user>
##$USERP4= <user>
##$USERP5= <user>
##$WDW= 1
##$XDIM= 16384
##$YMAX_p= 287666875
##$YMIN_p= -632379
$$ End of Bruker specific parameters
$$ ---------------------------------
##NTUPLES= NMR SPECTRUM
##VAR_NAME=  FREQUENCY,     SPECTRUM/REAL,   SPECTRUM/IMAG
##SYMBOL=    X,             R,               I
##VAR_TYPE=  INDEPENDENT,   DEPENDENT,       DEPENDENT
##VAR_FORM=  AFFN,          ASDF,            ASDF
##VAR_DIM=   16384,         16384,           16384
##UNITS=     HZ,            ARBITRARY UNITS, ARBITRARY UNITS
##FACTOR=    0.220516191357247, 1,           1
##FIRST=     3113.49829278904, 0,            0
##LAST=      -499.218470216741, 0,           0
##MIN=       -499.218470216741, -632379,     0
##MAX=       3113.49829278904, 287666875,    0
$$ Real data points
##PAGE= N=1
##DATA TABLE= (X++(R..R)), XYDATA
$$ [...]
$$ plain form
5966 239754 228371 246405 263770 227409 238848 233836 252359 256134 214921 216356 241761 239491
5954 239491 225286 266901 249757 269839 253452 218628 256436 278373 263707 259876 236765 243074
5942 243074 242937 224236 240159 251138 277667 292311 278507 288691 270693 281989 301166 267575
5930 267575 242320 311113 296484 321429 330820 370029 375671 351760 372415 371891 345540 336657 373035
5917 373035 375456 379944 391653 405566 425918 412817 426490 467779 451656 421428 426064 413917
5905 413917 437801 425726 415811 462685 476108 486547 475619 472890 437341 423528 455086 474885
5893 474885 473983 498340 512592 506642 505750 522098 534929 563970 573180 575631 552773 563547 562817
5880 562817 542622 518034 514129 483210 489965 515339 523389 498592 500885 516157 506434 506070 506401
$$ packed form
5966B39754j1383J8034J7365l6361J1439n012J8523L775m1213J435K5405k270
5954B39491j4205M1615j7144K0082j6387l4824L7808K1937j4666l831k3111O309
5942B43074j37j8701J5923J0979K6529J4644j3804J0184j7998J1296J9177l3591
5930B67575k5255O8793j4629K4945R391L9209N642k3911K0655n24k6351q883L6378
5917C73035K421M488J1709J3913K0352j3101J3673M1289j6123l0228M636j2147
5905D13917K3884j2075r915M6874J3423J0439j0928k729l5549j3813L1558J9799
5893D74885r02K4357J4252n950q92J6348J2831K9041R210K451k2858J0774p30
5880E62817k0195k4588l905l0919O755K5374Q050k4797K293J5272r723l64L31
$$ plain form
5867 506401 488089 495475 521169 482403 472053 491303 495341 489715 516299 482765 497665 510915
5855 510915 519650 552831 522033 520196 533299 555864 542783 514948 499206 518395 508634 517338
5843 517338 516112 488557 473089 505201 509068 495367 483181 484926 495639 485697 480906 476121 432291
5830 432291 442172 466337 495460 466528 464427 473736 450175 425697 408859 441135 443296 449903 440192
5817 440192 464845 448578 430152 437893 422583 430659 419878 428860 443102 448565 436147 433641 430050
5804 430050 411287 410471 405525 396208 386874 393799 404160 413054 396084 408498 399191 426107 412035
5791 412035 414911 391447 369672 386663 380403 373290 367721 362797 371272 382903 399003 404938 411138
5778 411138 425167 391147 364840 393042 399846 394563 418591 429798 439136 415536 427747 445916
$$ packed form
5867E06401j8312P386K5694l8766j0350J9250M038n626K6584l3534J4900J3250
5855E10915Q735L3181l0798j837J3103K2565j3081k7835j5742J9189r761Q704
5843E17338j226k7555j5468L2112L867j3701j2186J745J0713r942m791m785m3830
5830D32291R881K4165K9123k8932k101R309k3561k4478j6838L2276K161O607r711
5817D40192K4653j6267j8426P741j5310Q076j0781Q982J4242N463j2418k506l591
5804D30050j8763q16m946r317r334O925J0361Q894j6970J2414r307K6916j4072
5791D12035K876k3464k1775J6991o260p113n569m924Q475J1631J6100N935O200
5778D11138J4029l4020k6307K8202O804n283K4028J1207R338k3600J2211J8169
$$ plain form
5766 445916 456931 449054 448506 451209 426943 446434 415199 447609 466301 475615 490718 493632 508410
5753 508410 557557 542214 551856 564920 561926 534581 508387 478005 473155 482437 490193 481881 465821
5740 465821 479202 481585 488166 485796 522200 517219 494042 496566 491391 467501 500125 524907 511641
5727 511641 534091 550483 553024 571632 615038 686926 693001 749378 805335 837859 802727 731269
5715 731269 697957 657382 638647 638914 627109 580752 547874 556278 544768 532714 550338 516078
5703 516078 493301 540046 536745 555238 556069 571383 594841 601863 591718 607211 647367 672327
5691 672327 703231 736065 754631 822855 886841 893111 815990 770019 728589 690630 687014 648430
5679 648430 627222 646223 617346 605163 593880 581314 606603 592493 576112 603488 611083 600271
$$ packed form
5766D45916J1015p877n48K703k4266J9491l1235L2410J8692R314J5103K914J4778
5753E08410M9147j5343R642J3064k994k7345k6194l0382m850R282P756q312j6060
5740D65821J3381K383O581k370L6404m981k3177K524n175k3890L2624K4782j3266
5727E11641K2450J6392K541J8608M3406P1888O075N6377N5957L2524l5132p1458
5715G31269l3312m0575j8735K67j1805m6357l2878Q404j1510j2054J7624l4260
5703E16078k2777M6745l301J8493Q31J5314K3458P022j0145J5493M0156K4960
5691F72327L0904L2834J8566O8224O3986O270p7121m5971m1430l7959l616l8584
5679F48430k1208J9001k8877j2183j1283j2566K5289j4110j6381K7376P595j0812
$$ plain form
5667 600271 616421 645449 642802 645995 646194 666468 704503 740296 772470 749324 773907 768731 763404
5654 763404 753005 767989 731255 721718 713881 719283 687015 692088 707657 675250 663072 673242
5642 673242 695754 692588 667917 688704 718398 734698 748523 727027 742411 751188 765289 779918
5630 779918 779552 799733 798670 785671 784777 789910 826269 797085 808756 844039 835493 897530 883391
5617 883391 898364 878268 857174 881275 888494 906544 900019 879346 878908 915179 948734 914394
5605 914394 925386 955618 990831 1002024 984260 981338 985003 1014060 976022 1022984 1040574 1074133
5593 1074133 1091788 1104203 1127957 1155070 1155405 1138980 1154527 1186809 1182122 1192334 1209384 1195997
5581 1195997 1188281 1164621 1177346 1188245 1209317 1203799 1178820 1194516 1226892 1245680 1254448 1277550
$$ packed form
5667F00271J6150K9028k647L193J99K0274L8035L5793L2174k3146K4583n176n327
5654G63404j0399J4984l6734r537p837N402l2268N073J5569l2407j2178J0170
5642F73242K2512l166k4671K0787K9694J6300J3825k1496J5384Q777J4101J4629
5630G79918l66K0181j063j2999q94N133L6359k9184J1671L5283q546O2037j4139
5617H83391J4973k0096k1094K4101P219J8050o525k0673m38L6271L3555l4340
5605I14394J0992L0232L5213J1193j7764k922L665K9057l8038M6962J7590L3559
5593A074133J7655J2415K3754K7113L35j6425J5547L2282m687J0212J7050j3387
5581A195997p716k3660J2725J0899K1072n518k4979J5696L2376J8788Q768K3102
$$ plain form
5569 1277550 1291910 1330707 1344949 1324773 1339930 1349762 1360171 1388593 1409221 1462228 1492203 1475283
5557 1475283 1510825 1545715 1558657 1552910 1539156 1605297 1648871 1636184 1641764 1678738 1704209 1769883
5545 1769883 1811640 1780457 1799355 1839218 1875093 1942882 2006978 2033857 2090639 2128028 2201240
5534 2201240 2273511 2336435 2412014 2506794 2542680 2566709 2643434 2746846 2799125 2879868 2996698
5523 2996698 3058116 3184901 3310923 3433251 3543594 3673017 3845452 4023156 4203713 4372557
5513 4372557 4586217 4826631 5007435 5236764 5449907 5659108 5897920 6143385 6341962 6568502
5503 6568502 6821918 7040158 7263828 7468145 7691190 7944358 8177230 8391455 8593926 8858168
5493 8858168 9142110 9383161 9654654 9960166 10258956 10538086 10832765 11127247 11426881 11788185
$$ packed form
5569A277550J4360L8797J4242k0176J5157R832J0409K8422K0628N3007K9975j6920
5557A475283L5542L4890J2942n747j3754O6141M3574j2687N580L6974K5471O5674
5545A769883M1757l1183J8898L9863L5875O7789O4096K6879N6782L7389P3212
5534B201240P2271O2924P5579R4780L5886K4029P6725J03412N2279Q0743J16830
5523B996698O1418J26785J26022J22328J10343J29423J72435J77704J80557J68844
5513D372557K13660K40414J80804K29329K13143K09201K38812K45465J98577K26540
5503F568502K53416K18240K23670K04317K23045K53168K32872K14225K02471K64242
5493H858168K83942K41051K71493L05512K98790K79130K94679K94482K99634L61304
$$ plain form
5483 11788185 12121844 12454010 12753689 13015587 13308910 13628322 13903052 14162127 14424777
5474 14424777 14645219 14873953 15107421 15333679 15547923 15806031 16064661 16315928 16567059
5465 16567059 16843317 17168135 17514360 17832937 18182776 18528021 18862104 19159863 19503988
5456 19503988 19792332 19999751 20264631 20471977 20614802 20717212 20816857 20908218 20973326 21000318
5446 21000318 21058295 21122142 21175774 21254326 21298149 21392289 21464875 21555107 21699684 21830366 21982309
5435 21982309 22175699 22296371 22388836 22460193 22535864 22593788 22624356 22615787 22575929 22520681 22443572
5424 22443572 22323602 22215076 22091813 21904696 21730082 21558827 21367765 21228660 21087187
5415 21087187 20939908 20815773 20662133 20526763 20376667 20240427 20096390 19940437 19801730
$$ packed form
5483A1788185L33659L32166K99679K61898K93323L19412K74730K59075K62650
5474A4424777K20442K28734K33468K26258K14244K58108K58630K51267K51131
5465A6567059K76258L24818L46225L18577L49839L45245L34083K97759L44125
5456A9503988K88344K07419K64880K07346J42825J02410R9645R1361O5108K6992
5446B1000318N7977O3847N3632P8552M3823R4140P2586R0232J44577J30682J51943
5435B1982309J93390J20672R2465P1357P5671N7924L0568q569l9858n5248p7109
5424B2443572j19970j08526j23263j87117j74614j71255j91062j39105j41473
5415B1087187j47279j24135j53640j35370j50096j36240j44037j55953j38707
$$ plain form
5406 19801730 19638509 19405093 19128077 18832629 18492088 18134281 17783352 17402322 16971074
5397 16971074 16578759 16198433 15807165 15427034 15051926 14670806 14300918 13987433 13692358
5388 13692358 13361806 13063653 12810591 12523173 12258731 12012591 11751009 11486419 11226445
5379 11226445 10943708 10689060 10431517 10171712 9877135 9567556 9298766 8990709 8640036
5370 8640036 8311577 8017600 7701852 7398802 7090449 6826492 6558908 6288575 6020299 5804334
5360 5804334 5596019 5387680 5195795 4999690 4858759 4682081 4504287 4356736 4240201 4076094
5350 4076094 3931102 3820969 3693987 3571878 3454708 3378775 3288290 3174327 3124487 3033043
5340 3033043 2973572 2885137 2787870 2736481 2689403 2602242 2570938 2538899 2435921 2381635 2379364
$$ packed form
5406A9801730j63221k33416k77016k95448l40541l57807l50929l81030m31248
5397A6971074l92315l80326l91268l80131l75108l81120l69888l13485k95075
5388A3692358l30552k98153k53062k87418k64442k46140k61582k64590k59974
5379A1226445k82737k54648k57543k59805k94577l09579k68790l08057l50673
5370H640036l28459k93977l15748l03050l08353k63957k67584k70333k68276k15965
5360E804334k08315k08339j91885j96105j40931j76678j77794j47551j16535j64107
5350D076094j44992j10133j26982j22109j17170p5933r0485j13963m9840r1444
5340C033043n9471q8435r7267n1389m7078q7161l1304l2039j02978n4286k271
$$ plain form
5329 2379364 2321015 2266544 2179393 2128349 2073090 2067877 2039577 2043061 1996507 1948285 1957867 1923438
5317 1923438 1856966 1841925 1822443 1780576 1751733 1729019 1696914 1689566 1674446 1641792 1592713 1577267
5305 1577267 1608791 1588863 1558080 1515128 1513928 1500842 1532279 1497371 1465155 1426607 1414102 1435535
5293 1435535 1406835 1414087 1420792 1399590 1357249 1359294 1357144 1339190 1308187 1303911 1333758 1318447
5281 1318447 1307203 1297456 1291050 1299232 1311543 1283822 1238205 1196995 1219488 1231173 1245932 1206535
5269 1206535 1212959 1210393 1226938 1239186 1205304 1195212 1231176 1182825 1168091 1187859 1215911 1177705
5257 1177705 1166731 1184749 1199681 1191154 1188091 1193717 1229475 1185234 1182977 1226269 1201138 1200023
5245 1200023 1234211 1264159 1246937 1241737 1265607 1253354 1260149 1238475 1275843 1286255 1269751 1298163
$$ packed form
5329B379364n8349n4471q7151n1044n5259n213k8300L484m6554m8222R582l4429
5317A923438o6472j5041j9482m1867k8843k2714l2105p348j5120l2654m9079j5446
5305A577267L1524j9928l0783m2952j200j3086L1437l4908l2216l8548j2505K1433
5293A435535k8700P252O705k1202m2341K045k150j7954l1003m276K9847j5311
5281A318447j1244r747o406Q182J2311k7721m5617m1210K2493J1685J4759l9397
5269A206535O424k566J6545J2248l3882j0092L5964m8351j4734J9768K8052l8206
5257A177705j0974J8018J4932q527l063N626L5758m4241k257M3292k5131j115
5245A200023L4188K9948j7222n200K3870j2253O795k1674L7368J0412j6504K8412
$$ plain form
5233 1298163 1290857 1334965 1333670 1327520 1304320 1310143 1308320 1321566 1330186 1352079 1365578 1392079 1419404
5220 1419404 1433616 1461354 1449999 1457488 1513989 1543185 1556782 1560781 1570735 1578708 1594159 1616297
5208 1616297 1649304 1690154 1751415 1789185 1834008 1838836 1854049 1927388 1929425 1980030 2005757 2053879
5196 2053879 2086220 2128458 2177191 2205937 2252196 2329317 2438887 2476820 2517779 2528591 2611695
5185 2611695 2736426 2783446 2834877 2903116 3024660 3176583 3232818 3345697 3476476 3630633
5175 3630633 3770954 3917836 4042317 4200840 4376240 4545640 4692782 4857858 5025053 5233855
5165 5233855 5476324 5705258 5909170 6074455 6262756 6445769 6652826 6873054 7064596 7278776
5155 7278776 7445031 7593544 7792264 7953440 8104435 8309332 8500154 8656526 8809419 9008830
$$ packed form
5233A298163p306M4108j295o150k3200N823j823J3246Q620K1893J3499K6501K7325
5220A419404J4212K7738j1355P489N6501K9196J3597L999R954P973J5451K2138
5208A616297L3007M0850O1261L7770M4823M828J5213P3339K037N0605K5727M8122
5196B053879L2341M2238M8733K8746M6259P7121J09570L7933M0959J0812Q3104
5185B611695J24731M7020N1431O8239J21544J51923N6235J12879J30779J54157
5175C630633J40321J46882J24481J58523J75400J69400J47142J65076J67195K08802
5165E233855K42469K28934K03912J65285J88301J83013K07057K20228J91542K14180
5155G278776J66255J48513J98720J61176J50995K04897J90822J56372J52893J99411
$$ plain form
5145 9008830 9216961 9424310 9645059 9873252 10127033 10409180 10703401 11042261 11359249 11633276
5135 11633276 11918212 12261462 12619041 12950205 13298372 13610274 13965103 14261322 14543852
5126 14543852 14824312 15052848 15282081 15525741 15699934 15882083 16092737 16207133 16314467
5117 16314467 16404588 16501788 16625442 16751147 16898350 17054072 17191688 17348616 17463054 17596096
5107 17596096 17738699 17915085 18062972 18204595 18398030 18573381 18720603 18894814 19081426
5098 19081426 19215850 19367340 19510222 19599548 19707023 19823027 19908804 19903816 19925273 19952195
5088 19952195 19951311 19912054 19860143 19858445 19794766 19768071 19738916 19720892 19680781 19623092 19535447 19478120
5076 19478120 19366501 19287564 19219774 19100035 18972271 18857296 18706665 18541324 18382168 18244739
$$ packed form
5145I008830K08131K07349K20749K28193K53781K82147K94221L38860L16988K74027
5135A1633276K84936L43250L57579L31164L48167L11902L54829K96219K82530
5126A4543852K80460K28536K29233K43660J74193J82149K10654J14396J07334
5117A6314467R0121R7200J23654J25705J47203J55722J37616J56928J14438J33042
5107A7596096J42603J76386J47887J41623J93435J75351J47222J74211J86612
5098A9081426J34424J51490J42882Q9326J07475J16004Q5777m988K1457K6922
5088A9952195q84l9257n1911j698o3679k6695k9155j8024m0111n7689q7645n7327
5076A9478120j11619p8937o7790j19739j27764j14975j50631j65341j59156j37429
$$ plain form
5066 18244739 18093237 17914379 17742510 17628444 17477357 17311102 17104012 16929221 16788471
5057 16788471 16652224 16507878 16374915 16254842 16077173 15912499 15758235 15610724 15462783
5048 15462783 15318316 15159872 14936770 14718865 14542514 14388635 14165173 13871422 13612284
5039 13612284 13335797 13056905 12798713 12509568 12187760 11904027 11594556 11299432 11047788
5030 11047788 10781696 10510492 10284440 10032976 9794253 9596060 9422221 9216157 8999637
5021 8999637 8825930 8668406 8531254 8355837 8184026 8053125 7913377 7758780 7593989 7423576
5011 7423576 7266944 7107878 6971906 6778653 6563579 6391395 6190013 6014710 5822405 5619760
5001 5619760 5446311 5279342 5153396 5027541 4877336 4730485 4554778 4390329 4301523 4150648
$$ packed form
5066A8244739j51502j78858j71869j14066j51087j66255k07090j74791j40750
5057A6788471j36247j44346j32963j20073j77669j64674j54264j47511j47941
5048A5462783j44467j58444k23102k17905j76351j53879k23462k93751k59138
5039A3612284k76487k78892k58192k89145l21808k83733l09471k95124k51644
5030A1047788k66092k71204k26052k51464k38723j98193j73839k06064k16520
5021H999637j73707j57524j37152j75417j71811j30901j39748j54597j64791j70413
5011G423576j56632j59066j35972j93253k15074j72184k01382j75303j92305k02645
5001E619760j73449j66969j25946j25855j50205j46851j75707j64449q8806j50875
$$ plain form
4991 4150648 4025671 3943442 3820207 3732122 3639919 3532371 3452811 3358359 3289605 3215562 3129994
4980 3129994 3049587 3009066 2928848 2867379 2854880 2827669 2746235 2656563 2623713 2567721 2516407
4969 2516407 2485545 2405734 2360126 2346457 2302514 2274784 2256575 2223447 2173970 2132105 2094617
4958 2094617 2079174 2040922 2041393 1980451 1971223 1989123 1947649 1872627 1878764 1850434 1816225 1775215
4946 1775215 1748534 1707322 1669401 1642556 1639642 1606501 1593929 1575797 1540762 1533008 1504664 1499765
4934 1499765 1461017 1421870 1419346 1413572 1432743 1404935 1395664 1380571 1372067 1372891 1376369 1350251 1314336
4921 1314336 1320536 1309328 1344680 1353745 1321980 1334683 1372404 1382170 1418714 1444280 1448407 1421557
4909 1421557 1370792 1340382 1249999 1194864 1192172 1130377 1106446 1104682 1063554 1017131 1002040 983628
$$ packed form
4991D150648j24977q2229j23235q8085r2203j07548p9560r4452o8754p4043q5568
4980C129994q0407m0521q0218o1469j2499k7211q1434q9672l2850n5992n1314
4969B516407l0862p9811m5608j3669m3943k7730j8209l3128m9477m1865l7488
4958B094617j5443l8252M71o0942r228J7900m1474p5022O137k8330l4209m1010
4946A775215k6681m1212l7921k6845k914l3141j2572j8132l5035p754k8344m899
4934A499765l8748l9147k524n774J9171k7808r271j5093q504Q24L478k6118l5915
4921A314336O200j1208L5352R065l1765J2703L7721R766L6544K5566M127k6850
4909A421557n0765l0410r0383n5135k692o1795k3931j764m1128m6423j5091j8412
$$ plain form
4897 983628 994808 973254 960043 919178 899463 904981 900888 880904 856561 823301 857679 844428
4885 844428 822366 824013 809901 793914 770848 792147 806723 779694 751708 752027 724991 710882
4873 710882 724160 694573 675765 668719 681139 685520 666565 663882 660106 665937 663170 629358 628379
4860 628379 654095 651846 678198 673878 636772 622517 637163 632477 623806 622214 599617 618985 600604
4847 600604 593728 612508 593543 578710 561151 556867 559437 559546 556909 555609 566156 546442 549415
4834 549415 554532 543224 528468 538628 556711 545477 543437 539489 544234 523803 535392 533911 530237
4821 530237 512840 497486 528499 540770 532757 535451 516251 505473 549490 552565 556180 557705 542080
4808 542080 517289 537392 535420 497467 475884 435537 475284 502004 490444 537026 528135 522611
$$ packed form
4897I83628J1180k1554j3211m0865j9715N518m093j9984k4343l3260L4378j3251
4885H44428k2062J647j4112j5987k3066K1299J4576k7029k7986L19k7036j4109
4873G10882J3278k9587j8808p046J2420M381j8955k683l776N831k767l3812r79
4860F28379K5716k249K6352m320l7106j4255J4646m686q671j592k2597J9368j8381
4847F00604o876J8780j8965j4833j7559m284K570J09k637j300J0547j9714K973
4834E49415N117j1308j4756J0160J8083j1234k040l948M745k0431J1589j481l674
4821E30237j7397j5354L1013J2271q013K694j9200j0778M4017L075L615J525j5625
4808E42080k4791K0103j972l7953k1583m0347L9747K6720j1560M6582q891n524
$$ plain form
4796 522611 506333 506751 517172 522718 496981 502964 519609 506796 484809 493594 515184 494322 471741
4783 471741 479273 496417 525377 525063 519232 512949 491334 496575 494301 532623 525721 501024 517442
4770 517442 487432 484304 510712 485735 496564 533967 546814 505318 511175 499151 502291 469611
4758 469611 481299 485555 464891 471318 484082 477448 438576 462120 461535 469341 475953 462577 469377
4745 469377 469156 473611 485285 473543 473058 500703 492367 506178 490282 510983 490400 469409 463871
4732 463871 477211 487023 488133 498755 489353 490921 461808 485750 489881 477499 482157 510204 477986
4719 477986 487882 467093 466464 491725 473003 486319 441646 464605 452966 437679 453255 434815
4707 434815 451875 470480 489344 517634 506652 463055 431029 472354 458517 451988 473095 470168
$$ packed form
4796E22611j6278M18J0421N546k5737N983J6645j2813k1987Q785K1590k0862k2581
4783D71741P532J7144K8960l14n831o283k1615N241k274L8322o902k4697J6418
4770E17442l0010l128K6408k4977J0829L7403J2847m1496N857j2024L140l2680
4758D69611J1688M256k0664O427J2764o634l8872K3544n85P806O612j3376O800
4745D69377k21M455J1674j1742m85K7645q336J3811j5896K0701k0583k0991n538
4732D63871J3340R812J110J0622r402J568k9113K3942M131j2382M658K8047l2218
4719D77986R896k0789o29K5261j8722J3316m4673K2959j1639j5287J5576j8440
4707D34815J7060J8605J8864K8290j0982m3597l2026M1325j3837o529K1107k927
$$ plain form
4695 470168 472507 502060 477529 500997 489081 490834 508847 483129 481178 458488 478525 484804
4683 484804 491236 503498 506486 498832 533883 520020 508630 482507 492307 493515 535718 533523 519216
4670 519216 515855 519047 515318 535267 538294 533796 521416 521792 500317 515856 527998 537196 544238
4657 544238 520682 545188 513534 511525 550722 536051 517499 530325 549945 549433 501164 513216
4645 513216 520120 529636 541386 493020 506654 526346 514009 527656 542672 526113 500492 507478
4633 507478 517914 505985 491449 512848 488079 463130 469466 496281 496893 510931 497588 476684
4621 476684 436303 480582 498275 490806 507833 522804 507607 498798 492584 508731 495257 494029
4609 494029 529638 532383 537985 522475 491832 495772 512612 533441 556765 542937 539970 510812
$$ packed form
4695D70168K339K9553k4531K3468j1916J753J8013k5718j951k2690K0037O279
4683D84804O432J2262K988p654L5051j3863j1390k6123R800J208M2203k195j4307
4670E19216l361L192l729J9949L027m498j2380L76k1475J5539J2142R198P042
4657E44238k3556K4506l1654k009L9197j4671j8552J2826J9620n12m8269J2052
4645E13216O904R516J1750m8366J3634J9692j2337J3647J5016j6559k5621O986
4633E07478J0436j1929j4536K1399k4769k4949O336K6815O12J4038j3343k0904
4621D76684m0381M4279J7693p469J7027J4971j5197q809o214J6147j3474j228
4609D94029L5609K745N602j5510l0643L940J6840K0829K3324j3828k967k9158
$$ plain form
4597 510812 544377 560656 573773 566172 560852 555358 566034 573264 588861 599930 607829 573422 602649
4584 602649 635515 594832 563752 543703 529450 543921 578872 618996 616785 598784 602292 663653
4572 663653 634799 612703 617937 627648 634408 659820 627183 596581 631913 640515 641801 625675 645832
4559 645832 662757 673216 683627 678273 683437 686735 658443 669349 665832 683183 692560 733995 721808
4546 721808 730994 749234 740628 731654 743436 754711 750102 769006 787728 781018 802866 830040 823734
4533 823734 825521 843940 841062 843143 864665 888146 892584 932291 927372 914557 882474 903806 942246
4520 942246 926228 900485 940128 951554 949923 962111 1002666 1011815 995884 1002159 1020086 1019347 1002480
4507 1002480 1005577 1030457 1059671 1056701 1107479 1130666 1124578 1092909 1065803 1093346 1125448 1123417
$$ packed form
4597E10812L3565J6279J3117p601n320n494J0676P230J5597J1069P899l4407K9227
4584F02649L2866m0683l1080k0049j4253J4471L4951M0124k211j8001L508O1361
4572F63653k8854k2096N234R711O760K5412l2637l0602L5332Q602J286j6126K0157
4559F45832J6925J0459J0411n354N164L298k8292J0906l517J7351R377M1435j2187
4546G21808R186J8240q606q974J1782J1275m609J8904J8722o710K1848K7174o306
4533H23734J787J8419k878K081K1522K3481M438L9707m919j2815l2083K1332L8440
4520I42246j6018k5743L9643J1426j631J2188M0555R149j5931O275J7927p39j6867
4507A002480L097K4880K9214k970N0778K3187o088l1669k7106K7543L2102k031
$$ plain form
4495 1123417 1142517 1144085 1157217 1119953 1136625 1158987 1161468 1148314 1163430 1148008 1172449 1208390
4483 1208390 1203382 1217567 1246172 1242713 1272502 1260036 1267993 1296983 1279586 1314709 1281645 1279530
4471 1279530 1315741 1330860 1339721 1349279 1351495 1340497 1342589 1417902 1428044 1414957 1433722 1440889
4459 1440889 1449039 1467643 1502904 1490237 1498184 1503969 1507949 1528091 1543873 1547887 1615276 1624208 1618097
4446 1618097 1645892 1687624 1711967 1702404 1730087 1753090 1763000 1797202 1858832 1863188 1844347 1827187
4434 1827187 1859108 1860926 1905880 1951697 1980299 2009542 2050108 2077619 2099236 2138274 2152094 2246572
4422 2246572 2288054 2276823 2319540 2359368 2430922 2478646 2540555 2584018 2684284 2774027 2841208
4411 2841208 2927818 3019419 3138669 3261954 3349619 3476274 3597995 3740021 3922501 4088547
$$ packed form
4495A123417J9100J568J3132l7264J6672K2362K481j3154J5116j5422K4441L5941
4483A208390n008J4185K8605l459K9789j2466P957K8990j7397L5123l3064k115
4471A279530L6211J5119Q861R558K216j0998K092P5313J0142j3087J8765P167
4459A440889Q150J8604L5261j2667P947N785L980K0142J5782M014O7389Q932o111
4446A618097K7795M1732K4343r563K7683K3003R910L4202O1630M356j8841j7160
4434A827187L1921J818M4954M5817K8602K9243M0566K7511K1617L9038J3820R4478
4422B246572M1482j1231M2717L9828P1554M7724O1909M3463J00266Q9743O7181
4411B841208Q6610R1601J19250J23285Q7665J26655J21721J42026J82480J66046
$$ plain form
4401 4088547 4256659 4448045 4660517 4883348 5144674 5400508 5658992 5921479 6219882 6548100
4391 6548100 6905875 7295228 7709440 8094928 8559913 9005060 9403095 9857762 10275478 10674984
4381 10674984 11102550 11558275 12057959 12552793 13102319 13670171 14269098 14903547 15479754
4372 15479754 16048293 16561938 17023511 17443955 17764685 18090325 18410712 18713617 19030552
4363 19030552 19399001 19772581 20156915 20547893 20916624 21203396 21457283 21567698 21598774 21480150
4353 21480150 21322550 21105344 20837189 20639822 20421168 20244926 20100091 20006017 19851938 19642830
4343 19642830 19409097 19157713 18776006 18316707 17800745 17290772 16790580 16299111 15838643
4334 15838643 15405645 15003347 14647654 14344319 14008253 13656946 13388804 13109596 12797707
$$ packed form
4401D088547J68112J91386K12472K22831K61326K55834K58484K62487K98403L28218
4391F548100L57775L89353M14212L85488M64985M45147L98035M54667M17716L99506
4381A0674984M27566M55725M99684M94834N49526N67852N98927O34449N76207
4372A5479754N68539N13645M61573M20444L20730L25640L20387L02905L16935
4363A9030552L68449L73580L84334L90978L68731K86772K53887J10415L1076j18624
4353B1480150j57600k17206k68155j97367k18654j76242j44835r4074j54079k09108
4343A9642830k33733k51384l81707m59299n15962n09973n00192m91469m60468
4334A5838643m32998m02298l55693l03335l36066l51307k68142k79208l11889
$$ plain form
4325 12797707 12554537 12317042 12143387 11984200 11719462 11326566 10919687 10582214 10282386
4316 10282386 10038883 9874778 9711475 9581135 9454705 9329708 9266998 9213038 9170833 9132529
4306 9132529 9076098 9046212 9033866 9034751 9083937 9119391 9162460 9234923 9335026 9402712 9501622 9601158
4294 9601158 9741267 9869542 9975407 10118521 10242273 10365185 10484611 10599141 10737980 10883665
4284 10883665 11066250 11215853 11383776 11586600 11805190 12001921 12247149 12452367 12675617
4275 12675617 12940887 13169144 13375579 13575610 13758590 13913420 14098332 14297250 14479059
4266 14479059 14706149 14921757 15106884 15359250 15600679 15832174 16050940 16314621 16512133
4257 16512133 16718853 16894016 17044673 17216637 17427792 17640401 17859331 18027389 18241610
$$ packed form
4325A2797707k43170k37495j73655j59187k64738l92896m06879l37473k99828
4316A0282386k43503j64105j63303j30340j26430j24997o2710n3960m2205l8304
4306I132529n6431k9886j2346Q85M9186L5454M3069P2463J00103O7686R8910R9536
4294I601158J40109J28275J05865J43114J23752J22912J19426J14530J38839J45685
4284A0883665J82585J49603J67923K02824K18590J96731K45228K05218K23250
4275A2675617K65270K28257K06435K00031J82980J54830J84912J98918J81809
4266A4479059K27090K15608J85127K52366K41429K31495K18766K63681J97512
4257A6512133K06720J75163J50657J71964K11155K12609K18930J68058K14221
$$ plain form
4248 18241610 18430975 18590581 18728717 18907061 19073875 19241230 19400531 19531033 19710323
4239 19710323 19887914 20058581 20242749 20387523 20538607 20702292 20840640 21007986 21133849
4230 21133849 21320467 21442539 21564832 21709350 21867719 21973703 22119746 22253237 22313905 22360576
4220 22360576 22457893 22490141 22529101 22519426 22490153 22479224 22394238 22274412 22177316 22039825 21895749
4209 21895749 21795473 21650188 21523964 21403838 21300220 21224141 21155935 21081490 21034653 20996314
4199 20996314 20994358 20932057 20900327 20823605 20823756 20874430 20850387 20857154 20884520 20875440 20840746 20800882
4187 20800882 20786096 20708729 20609180 20471823 20299137 20139420 19876665 19590839 19320256 19045173
4177 19045173 18729030 18409477 18089318 17772165 17432476 17111178 16840475 16599645 16322905
$$ packed form
4248A8241610J89365J59606J38136J78344J66814J67355J59301J30502J79290
4239A9710323J77591J70667J84168J44774J51084J63685J38348J67346J25863
4230B1133849J86618J22072J22293J44518J58369J05984J46043J33491O0668M6671
4220B2360576R7317L2248L8960r675k9273j0929q4986j19826r7096j37491j44076
4209B1895749j00276j45285j26224j20126j03618p6079o8206p4445m6837l8339
4199B0996314j956o2301l1730p6722J51N0674k4043O767K7366r080l4694l9864
4187B0800882j4786p7367r9549j37357j72686j59717k62755k85826k70583k75083
4177A9045173l16143l19553l20159l17153l39689l21298k70703k40830k76740
$$ plain form
4168 16322905 16043411 15815524 15597666 15416059 15252733 15113914 15015811 14877944 14773865 14677862
4158 14677862 14588721 14550111 14512470 14525352 14535296 14544446 14582086 14614947 14651208 14753311 14832710
4147 14832710 14870845 14878296 14924618 14929919 14887546 14855168 14821319 14792619 14747771 14757120 14733190 14653418
4135 14653418 14642771 14662848 14663085 14678037 14677652 14759939 14800773 14842579 14930118 15030403 15088379 15159121
4123 15159121 15239974 15301499 15363028 15435871 15493273 15573278 15694361 15730626 15795030 15875025 15926884
4112 15926884 16039522 16176415 16291331 16469063 16638495 16797611 16974977 17157003 17369731
4103 17369731 17638316 17878654 18165325 18429258 18725443 18977045 19234382 19544706 19803221
4094 19803221 20069641 20339862 20600664 20835591 21050000 21246736 21413291 21599593 21781588
$$ packed form
4168A6322905k79494k27887k17858j81607j63326j38819r8103j37867j04079r6003
4158A4677862q9141l8610l7641J2882R944R150L7640L2861L6261J02103P9399
4147A4832710L8135P451M6322N301m2373l2378l3849k8700m4848R349k3930p9772
4135A4653418j0647K0077K37J4952l85Q2287M0834M1806Q7539J00285N7976P0742
4123A5159121Q0853O1525O1529P2843N7402Q0005J21083L6265O4404P9995N1859
4112A5926884J12638J36893J14916J77732J69432J59116J77366J82026K12728
4103A7369731K68585K40338K86671K63933K96185K51602K57337L10324K58515
4094A9803221K66420K70221K60802K34927K14409J96736J66555J86302J81995
$$ plain form
4085 21781588 21915319 22017630 22121004 22200010 22261711 22306619 22302815 22314163 22323984 22334456 22354245
4074 22354245 22407721 22409150 22438877 22499103 22585930 22644198 22754584 22854933 22952766 23087663 23175190
4063 23175190 23307067 23431679 23574402 23704361 23845984 23973958 24063572 24121766 24149972 24174007
4053 24174007 24129150 24048469 23959860 23790758 23669238 23482692 23287210 23105213 22862436 22687492
4043 22687492 22462038 22278676 22102824 21905687 21688379 21512752 21336196 21152331 20986551
4034 20986551 20839540 20693052 20507613 20301569 20106526 19922046 19754506 19558824 19372484
4025 19372484 19163176 18936039 18729892 18507351 18270285 18039390 17825823 17602039 17376915
4016 17376915 17141860 16932627 16673789 16447466 16229415 16025485 15826817 15642693 15515188
$$ packed form
4085B1781588J33731J02311J03374P9006O1701M4908l804J1348R821J0472J9789
4074B2354245N3476J429K9727O0226Q6827N8268J10386J00349R7833J34897Q7527
4063B3175190J31877J24612J42723J29959J41623J27974Q9614N8194K8206K4035
4053B4174007m4857q0681q8609j69102j21520j86546j95482j81997k42777j74944
4043B2687492k25454j83362j75852j97137k17308j75627j76556j83865j65780
4034B0986551j47011j46488j85439k06044j95043j84480j67540j95682j86340
4025A9372484k09308k27137k06147k22541k37066k30895k13567k23784k25124
4016A7376915k35055k09233k58838k26323k18051k03930j98668j84124j27505
$$ plain form
4007 15515188 15342200 15197078 15072355 14977351 14891645 14849688 14778317 14705691 14703154 14727836 14750462
3996 14750462 14809280 14907653 15043322 15172791 15311772 15539979 15774082 16015087 16323684 16658896
3986 16658896 16948186 17343673 17755183 18184754 18581589 18945017 19345060 19750313 20151272
3977 20151272 20471837 20759527 21110191 21431749 21773234 22142100 22497771 22896047 23320776
3968 23320776 23793407 24375048 24970167 25633051 26359799 27116144 27967066 28912465 29975309
3959 29975309 31151510 32502271 33979125 35564619 37300154 39183231 41135980 43097497
3951 43097497 45040872 46892837 48579609 50036911 51231569 52115063 52724632 53118625 53272170
3942 53272170 53286335 53224031 53130982 53049098 52954397 52862191 52737946 52486331 52042051 51397437
$$ packed form
4007A5515188j72988j45122j24723r5004q5706m1957p1371p2626k537K4682K2626
3996A4750462N8818R8373J35669J29469J38981K28207K34103K41005L08597L35212
3986A6658896K89290L95487M11510M29571L96835L63428M00043M05253M00959
3977B0151272L20565K87690L50664L21558L41485L68866L55671L98276M24729
3968B3320776M72631N81641N95119O62884P26748P56345Q50922R45399J062844
3959B9975309J176201J350761J476854J585494J735535J883077J952749J961517
3951D3097497J943375J851965J686772J457302J194658Q83494O09569L93993J53545
3942E3272170J4165o2304r3049q1884r4701r2206j24245k51615m44280o44614
$$ plain form
3932 51397437 50514993 49305854 47839735 46107289 44140321 42038815 39865613 37669144
3924 37669144 35517249 33482508 31497878 29674624 27929402 26278835 24822705 23499664
3916 23499664 22246515 21125253 20084739 19058203 18177802 17364021 16573709 15852544 15201183
3907 15201183 14592104 14065844 13586139 13158366 12772259 12369497 12004832 11638972 11339676
3898 11339676 11067887 10762174 10517122 10305899 10127705 9919450 9752380 9612312 9422080
3889 9422080 9299712 9189923 9058016 8959979 8840617 8737120 8657876 8589571 8500615 8441222
3879 8441222 8384384 8313741 8263434 8202480 8138756 8064191 7982011 7920929 7878677 7829854 7793037
3868 7793037 7736162 7730375 7704097 7697704 7694581 7658770 7642604 7618526 7618251 7623271 7630407 7684972 7744311
$$ packed form
3932E1397437q82444j209139j466119j732446j966968k101506k173202k196469
3924C7669144k151895k034741j984630j823254j745222j650567j456130j323041
3916B3499664j253149j121262j040514j026536q80401q13781p90312p21165o51361
3907A5201183o09079n26260m79705m27773l86107m02762l64665l65860k99296
3898A1339676k71789l05713k45052k11223j78194k08255j67070j40068j90232
3889I422080j22368j09789j31907r8037j19362j03497p9244o8305q8956n9393
3879H441222n6838p0643n0307o0954o3724p4565q2180o1082m2252m8823l6817
3868G793037n6875n787k6278o393l123l5811j6166k4078k75N020P136N4565N9339
$$ plain form
3855 7744311 7799179 7823113 7864356 7889358 7891994 7940825 7966528 7990619 7993174 7982980 7952034 7978581
3843 7978581 7945736 7846866 7797131 7760939 7723118 7695803 7694640 7708954 7744215 7747470 7742666 7804272
3831 7804272 7852569 7937089 8039492 8139543 8239159 8351197 8472415 8638960 8835851 9044766
3821 9044766 9264427 9521643 9805579 10084249 10407999 10720038 11101222 11445585 11837618 12314321
3811 12314321 12800687 13351440 13964340 14607505 15247752 16015627 16839334 17724689 18670563
3802 18670563 19655431 20719148 21785292 22852880 23898240 24963256 25903891 26749608 27522586
3793 27522586 28113306 28531463 28832903 28962206 28937776 28871405 28750397 28518214 28293970 28071641
3783 28071641 27801180 27556992 27329067 27151652 26921709 26685806 26482259 26268701 26069824
$$ packed form
3855G744311N4868K3934M1243K5002K636M8831K5703K4091K555j0194l0946K6547
3843G978581l2845r8870m9735l6192l7821k7315j163J4314L5261L255m804O1606
3831G804272M8297Q4520J02403J00051R9616J12038J21218J66545J96891K08915
3821I044766K19661K57216K83936K78670L23750L12039L81184L44363L92033M76703
3811A2314321M86366N50753O12900O43165O40247P67875Q23707Q85355R45874
3802A8670563R84868J063717J066144J067588J045360J065016R40635Q45717P72978
3793B7522586N90720M18157L01440J29303k4430o6371j21008k32183k24244k22329
3783B8071641k70461k44188k27925j77415k29943k35903k03547k13558j98877
$$ plain form
3774 26069824 25902270 25740916 25548453 25403889 25311492 25259654 25322140 25415907 25601257 25873273
3764 25873273 26269483 26757476 27382541 28124219 29012071 30042124 31226858 32604218 34170650
3755 34170650 35933385 37913117 40174196 42656239 45433521 48493460 51804663 55363600
3747 55363600 59213122 63237352 67332826 71479629 75542100 79471011 83252290 86731114
3739 86731114 89825735 92504219 94753108 96483619 97721392 98464450 98694871 98444063 97771454
3730 97771454 96677464 95229267 93457587 91368262 89016105 86394357 83535227 80498228
3722 80498228 77258661 73837645 70314049 66803275 63281640 59791734 56409508 53129320
3714 53129320 50017944 47057007 44303527 41713953 39343772 37173541 35091946 33183681
$$ packed form
3774B6069824j67554j61354j92463j44564r2397n1838O2486R3767J85350K72016
3764B5873273L96210M87993O25065P41678Q87852J030053J184734J377360J566432
3755C4170650J762735J979732K261079K482043K777282L059939L311203L558937
3747E5363600L849522M024230M095474M146803M062471L928911L781279L478824
3739H6731114L094621K678484K248889J730511J237773P43058K30421k50808o72609
3730I7771454j093990j448197j771680k089325k352157k621748k859130l036999
3722H0498228l239567l421016l523596l510774l521635l489906l382226l280188
3714E3129320l111376k960937k753480k589574k370181k170231k081595j908265
$$ plain form
3706 33183681 31462788 29851758 28394232 27060973 25838031 24720267 23669924 22736880
3698 22736880 21819876 21022617 20320539 19675789 19088930 18568165 18091842 17665362 17299252
3689 17299252 16986613 16685540 16494036 16338108 16186970 16117414 16063246 16044901 16106770 16213581
3679 16213581 16253772 16349840 16459325 16523232 16528302 16500222 16439262 16297084 16094499 15860975 15552979
3668 15552979 15174865 14749452 14332019 13899261 13460523 12996615 12581801 12193128 11809247
3659 11809247 11453192 11099330 10780281 10482910 10209624 9943274 9686361 9486500 9267148
3650 9267148 9065877 8858136 8681383 8490547 8313797 8177740 8041956 7882020 7714498 7627064
3640 7627064 7489106 7371713 7289091 7197831 7109955 7023150 6949820 6891380 6840488 6763283 6686407
$$ packed form
3706C3183681j720893j611030j457526j333259j222942j117764j050343r33044
3698B2736880r17004p97259p02078o44750n86859n20765m76323m26480l66110
3689A7299252l12639l01073j91504j55928j51138o9556n4168j8345O1869J06811
3679A6213581M0191R6068J09485O3907N070k8080o0960j42178k02585k33524l07996
3668A5552979l78114m25413m17433m32758m38738m63908m14814l88673l83881
3659A1809247l56055l53862l19049k97371k73286k66350k56913j99861k19352
3650I267148k01271k07741j76753j90836j76750j36057j35784j59936j67522q7434
3640G627064j37958j17393q2622r1260q7876q6805p3330n8440n0892p7205p6876
$$ plain form
3629 6686407 6638363 6558261 6498832 6453288 6427673 6387832 6356916 6334173 6326515 6315477 6273470 6268311
3617 6268311 6256289 6284153 6286388 6319936 6373471 6365456 6388286 6425515 6463129 6523936 6552835 6620402
3605 6620402 6726789 6818449 6914226 6998639 7091230 7222981 7343126 7479493 7585550 7741655
3595 7741655 7921068 8112272 8274513 8460894 8691099 8905908 9092599 9269309 9488446 9672117
3585 9672117 9843708 10033582 10184577 10387594 10604644 10789637 11010215 11245422 11496537 11698263
3575 11698263 11900277 12107726 12306878 12497375 12677469 12838803 13025491 13178220 13418275
3566 13418275 13680430 13920683 14229709 14570407 14877296 15275759 15679361 16132013 16648826
3557 16648826 17253257 17854353 18509041 19253560 20088537 21046012 22061892 23197479 24521830
$$ packed form
3629F686407m8044q0102n9429m5544k5615l9841l0916k2743p658j1038m2007n159
3617F268311j2022K7864K235L3548N3535q015K2830L7229L7614O0807K8899O7567
3605F620402J06387R1660R5777Q4413R2591J31751J20145J36367J06057J56105
3595G741655J79413J91204J62241J86381K30205K14809J86691J76710K19137J83671
3585I672117J71591J89874J50995K03017K17050J84993K20578K35207K51115K01726
3575A1698263K02014K07449J99152J90497J80094J61334J86688J52729K40055
3566A3418275K62155K40253L09026L40698L06889L98463M03602M52652N16813
3557A6648826O04431O01096O54688P44519Q34977R57475J015880J135587J324351
$$ plain form
3548 24521830 25960318 27533748 29347196 31344944 33605049 36077734 38922144 42073606
3540 42073606 45563114 49450704 53723743 58388149 63460982 68907517 74572613 80435815
3532 80435815 86247451 91858854 97058104 101710489 105615594 108645787 110807381 112278965
3524 112278965 113217557 113798904 114234030 114662018 115085569 115553007 115968025 116086294 115798660
3515 115798660 114912798 113262868 110725923 107322265 103121540 98363765 93207939 87910002
3507 87910002 82576604 77464768 72587520 68072730 63942515 60102870 56593976 53437738
3499 53437738 50575408 47982369 45620858 43451590 41531764 39829186 38250465 36825514
3491 36825514 35525884 34331624 33214704 32203467 31319610 30432932 29621387 28828152 28127216
$$ packed form
3548B4521830J438488J573430J813448J997748K260105K472685K844410L151462
3540D2073606L489508L887590M273039M664406N072833N446535N665096N863202
3532H0435815N811636N611403N199250M652385L905105L030193K161594J471584
3524A12278965R38592N81347M35126M27988M23551M67438M15018J18269k87634
3515A15798660q85862j649930k536945l403658m200725m757775n155826n297937
3507H7910002n333398n111836m877248m514790m130215l839645l508894l156238
3499E3437738k862330k593039k361511k169268j919826j702578j578721j424951
3491C6825514j299630j194260j116920j011237q83857q86678q11545p93235p00936
$$ plain form
3482 28127216 27467641 26847752 26242302 25700286 25203911 24736564 24300995 23921381 23497202
3473 23497202 23070189 22642907 22263184 21864713 21442540 21081857 20656757 20266607 19828289
3464 19828289 19437038 19040036 18671923 18370554 18079158 17824513 17640053 17464045 17326760
3455 17326760 17203276 17085325 16910324 16729345 16528435 16322535 16137419 16022116 15974943 15962493
3445 15962493 15980323 15985002 15989043 16030986 16102798 16262003 16489872 16672801 16924399 17215681 17529455
3434 17529455 17824312 18173090 18509693 18786753 19097748 19455512 19801634 20143746 20564961
3425 20564961 21003257 21413089 21836994 22280755 22676730 23105555 23559639 23980251 24350213
3416 24350213 24622157 24787050 24860268 24729024 24431485 24023068 23539380 23109646 22763234 22509611
$$ packed form
3482B8127216o59575o19889o05450n42016m96375m67347m35569l79614m24179
3473B3497202m27013m27282l79723l98471m22173l60683m25100l90150m38318
3464A9828289l91251l97002l68113l01369k91396k54645j84460j76008j37285
3455A7326760j23484j17951j75001j80979k00910k05900j85116j15303m7173j2450
3445A5962493J7830M679M041M1943P1812J59205K27869J82929K51598K91282L13774
3434A7529455K94857L48778L36603K77060L10995L57764L46122L42112M21215
3425B0564961M38296M09832M23905M43761L95975M28825M54084M20612L69962
3416B4350213K71944J64893P3218j31244k97539m08417m83688m29734l46412k53623
$$ plain form
3406 22509611 22227298 21978233 21746760 21507644 21285224 21108765 20946280 20850573 20789305 20814696
3396 20814696 20885369 21061808 21357379 21730480 22218053 22810138 23540457 24398265 25415493
3387 25415493 26588267 27935839 29480339 31189937 33051857 35121864 37428040 39943131
3379 39943131 42677819 45640260 48838426 52163298 55480670 58766934 61884528 64645318
3371 64645318 67032905 68975076 70294472 70947071 71010031 70499172 69419045 67873654 65878654
3362 65878654 63544979 60909477 58091990 55213555 52269866 49349004 46652740 44135583
3354 44135583 41832569 39761990 37940249 36325149 34857628 33476671 32164711 30953381
3346 30953381 29855065 28835799 27903315 27073950 26261131 25522553 24791316 24096663 23405052
$$ packed form
3406B2509611k82313k49065k31473k39116k22420j76459j62485r5707o1268K5391
3396B0814696P0673J76439K95571L73101M87573N92085P30319Q57808J017228
3387B5415493J172774J347572J544500J709598J861920K070007K306176K515091
3379C9943131K734688K962441L198166L324872L317372L286264L117594K760790
3371F4645318K387587J942171J319396O52599O2960n10859j080127j545391j995000
3362F5878654k333675k635502k817487k878435k943689k920862k696264k517157
3354D4135583k303014k070579j821741j615100j467521j380957j311960j211330
3346C0953381j098316j019266r32484q29365q12819p38578p31237o94653o91611
$$ plain form
3337 23405052 22703037 21984465 21267612 20543402 19802783 19051568 18294072 17582337 16956777
3328 16956777 16332952 15710507 15179113 14690347 14253807 13848253 13474990 13060634 12597314
3319 12597314 12097334 11628345 11247800 10923211 10638156 10404333 10174211 10002523 9874794
3310 9874794 9730110 9617602 9460185 9283709 9164240 9000970 8803270 8612838 8382497 8121171
3300 8121171 7855878 7643976 7410448 7228175 6997145 6780047 6566057 6407109 6241015 6080703
3290 6080703 5938068 5808763 5719784 5608884 5517140 5438445 5388033 5325954 5256674 5170018 5097116
3279 5097116 5069553 5027443 4963439 4889956 4795334 4720070 4676872 4614262 4548350 4502962 4452258
3268 4452258 4379232 4292499 4276047 4233099 4187817 4133911 4112407 4073972 4041632 4013334 3992685
$$ packed form
3337B3405052p02015p18572p16853p24210p40619p51215p57496p11735o25560
3328A6956777o23825o22445n31394m88766m36540m05554l73263m14356m63320
3319A2597314m99980m68989l80545l24589k85055k33823k30122j71688j27729
3310I874794j44684j12508j57417j76476j19469j63270j97700j90432k30341k61326
3300H121171k65293k11902k33528j82273k31030k17098k13990j58948j66094j60312
3290F080703j42635j29305q8979j10900r1744p8695n0412o2079o9280q6656p2902
3279E097116k7563m2110o4004p3483r4622p5264m3198o2610o5912m5388n0704
3268D452258p3026q6733j6452m2948m5282n3906k1504l8435l2340k8298k0649
$$ plain form
3257 3992685 3978595 3961136 3996628 3999659 3989848 3987841 3983002 4033903 4051805 4059221 4070128 4067431 4069722
3244 4069722 4070583 4062397 4070413 4098925 4121331 4152096 4152791 4167999 4147982 4138988 4157831 4126995 4127889
3231 4127889 4118081 4093287 4062802 4033238 3998891 3990302 3992723 3999688 4037194 3955104 3958235 3988202
3219 3988202 3957361 3962626 3917642 3907447 3927982 3941601 3934376 3966121 3988029 3977468 4010813 4027421
3207 4027421 4055045 4100723 4108073 4119198 4123939 4147069 4170994 4181256 4166702 4166064 4189695 4226736
3195 4226736 4247604 4253015 4279716 4313329 4326646 4389134 4442473 4541167 4639830 4703815 4813398
3184 4813398 4947216 5052306 5178135 5308354 5428031 5555719 5692456 5846760 6002765 6143895
3174 6143895 6278067 6399860 6532041 6702216 6814858 6968317 7128216 7302004 7464838 7670906
$$ packed form
3257C992685j4090j7459L5492L031r811k007m839N0901J7902P416J0907k697K291
3244D069722Q61q186Q016K8512K2406L0765O95J5208k0017q994J8843l0836Q94
3231D127889r808k4794l0485k9564l4347q589K421O965L7506q2090L131K9967
3219C988202l0841N265m4984j0195K0535J3619p225L1745K1908j0561L3345J6608
3207D027421K7624M5678P350J1125M741K3130K3925J0262j4554o38K3631L7041
3195D226736K0868N411K6701L3613J3317O2488N3339R8694R8663O3985J09583
3184D813398J33818J05090J25829J30219J19677J27688J36737J54304J56005J41130
3174F143895J34172J21793J32181J70175J12642J53459J59899J73788J62834K06068
$$ plain form
3164 7670906 7881449 8088651 8327425 8563840 8804486 9041786 9313822 9595336 9873362 10225925
3154 10225925 10587993 10984701 11414845 11874890 12357903 12911056 13493257 14141547 14809039
3145 14809039 15533915 16302965 17095407 17901346 18767617 19771106 20843260 21969787 23141217
3136 23141217 24302331 25440060 26564700 27671718 28775607 29988739 31309803 32779031
3128 32779031 34437967 36280416 38346924 40622880 43122694 45905637 49049024 52599225
3120 52599225 56694156 61373332 66698011 72802711 79747667 87482774 96169428 105957863
3112 105957863 117059170 129776395 144425225 161380460 180998293 203291923 227539789
3105 227539789 251913914 273173106 286529973 287666875 276028830 255428217 231246593
$$ packed form
3164G670906K10543K07202K38774K36415K40646K37300K72036K81514K78026L52563
3154A0225925L62068L96708M30144M60045M83013N53153N82201O48290O67492
3145A4809039P24876P69050P92442Q05939Q66271J003489J072154J126527J171430
3136B3141217J161114J137729J124640J107018J103889J213132J321064J469228
3128C2779031J658936J842449K066508K275956K499814K782943L143387L550201
3120E2599225M094931M679176N324679O104700O944956P735107Q686654R788435
3112A05957863J1101307J2717225J4648830J6955235J9617833K2293630K4247866
3105B27539789K4374125K1259192J3356867J136902j1638045k0600613k4181624
$$ plain form
3098 231246593 207602321 186447422 168342250 153168761 140391097 129532402 120155729
3091 120155729 111903151 104651842 98171871 92369368 87247842 82604684 78409017 74642360
3083 74642360 71225267 68177100 65571181 63289754 61386880 59761654 58413664 57347505
3075 57347505 56461075 55800294 55326255 55048867 55045208 55376079 56079087 57170227 58560405
3066 58560405 59912879 60965748 61906553 62777555 63521630 63847274 63413903 61984309 59607963
3057 59607963 56533419 53152220 49781254 46555049 43577306 40915992 38513523 36418471
3049 36418471 34483700 32737894 31195566 29707916 28397381 27216379 26114156 25102108
3041 25102108 24209537 23393713 22608675 21869161 21199460 20552807 19895986 19183502 18463637
$$ packed form
3098B31246593k3644272k1154899j8105172j5173489j2777664j0858695r376673
3091A20155729q252578p251309o479971n802503n121526m643158m195667l766657
3083G4642360l417093l048167k605919k281427j902874j625226j347990j066159
3075E7347505q86430o60781m74039k77388l659L30871P03008J091140J390178
3066E8560405J352474J052869R40805Q71002P44075L25644m33371j429594k376346
3057E9607963l074544l381199l370966l226205k977743k661314k402469k095052
3049C6418471j934771j745806j542328j487650j310535j181002j102223j012048
3041B5102108q92571q15824p85038p39514o69701o46653o56821p12484p19865
$$ plain form
3032 18463637 17735985 17023618 16300635 15664006 15081571 14528227 13998516 13517474 13102973
3023 13102973 12707870 12322564 11949292 11628290 11289593 10990617 10682459 10355360 10057789
3014 10057789 9771684 9454406 9193222 8912372 8651838 8408929 8125928 7867214 7672494
3005 7672494 7505026 7288932 7086563 6901352 6723298 6596644 6442545 6269245 6144963 6023554
2995 6023554 5933105 5851830 5766072 5667301 5569655 5458484 5363857 5241592 5118765 5018279 4907561
2984 4907561 4823626 4769742 4693627 4630988 4510821 4400940 4355445 4247673 4167009 4091538 4017055
2973 4017055 3926092 3846085 3762016 3685012 3574870 3485359 3430332 3359077 3306739 3237025 3142411
2962 3142411 3078994 3019034 2981054 2902814 2842629 2806376 2748346 2689280 2665235 2664710 2622116 2579023
$$ packed form
3032A8463637p27652p12367p22983o36629n82435n53344n29711m81042m14501
3023A3102973l95103l85306l73272l21002l38697k98976l08158l27099k97571
3014A0057789k86105l17278k61184k80850k60534k42909k83001k58714j94720
3005G672494j67468k16094k02369j85211j78054j26654j54099j73300j24282j21409
2995F023554r0449q1275q5758r8771r7646j11171r4627j22265j22827j00486j10718
2984D907561q3935n3884p6115o2639j20167j09881m5495j07772q0664p5471p4483
2973D017055r0963q0007q4069p7004j10142q9511n5027p1255n2338o9714r4614
2962C142411o3417n9960l7980p8240o0185l6253n8030n9066k4045n25m2594m3093
$$ plain form
2950 2579023 2583195 2572302 2523059 2486202 2419951 2355785 2319422 2300877 2264191 2261147 2229582 2187427
2938 2187427 2152094 2104493 2056119 2047838 2035732 2007239 1976828 1908512 1866555 1844311 1825520 1802562
2926 1802562 1777585 1755891 1786357 1784068 1730929 1743758 1710472 1705233 1648855 1652247 1637167 1617010
2914 1617010 1594770 1612763 1600218 1603838 1575201 1546389 1543844 1501590 1511219 1482371 1454610 1443498
2902 1443498 1440930 1398599 1382725 1336581 1310807 1271425 1258483 1230039 1200837 1180965 1167555 1137637
2890 1137637 1101548 1111089 1101999 1075458 1065902 1080381 1048102 1038850 1048290 1038166 1025808 1031261 980963
2877 980963 991410 994396 928962 965576 938153 908071 915270 916565 893148 879780 889160 883623 860971
2864 860971 852132 842260 833418 840945 829795 824475 797512 798437 806203 829532 776089 753559 779017
$$ packed form
2950B579023M172j0893m9243l6857o6251o4166l6363j8545l6686l044l1565m2155
2938B187427l5333m7601m8374q281j2106k8493l0411o8316m1957k2244j8791k2958
2926A802562k4977k1694L0466k289n3139J2829l3286n239n6378L392j5080k0157
2914A617010k2240J7993j2545L620k8637k8812k545m2254R629k8848k7761j1112
2902A443498k568m2331j5874m6144k5774l9382j2942k8444k9202j9872j3410k9918
2890A137637l6089R541r090k6541r556J4479l2279r252R440j0124j2358N453n0298
2877I80963J0447K986o5434L6614k7423l0082P199J295k3417j3368R380n537k2652
2864H60971q839r872q842P527j1150n320k6963R25P766K3329n3443k2530K5458
$$ plain form
2851 779017 759242 765830 774728 778363 738327 761479 771408 745270 745023 756340 745416 728581 732332
2838 732332 739507 792419 808517 798600 822510 845182 864519 899996 938646 972000 1030657 1063743
2826 1063743 1144206 1189875 1269239 1348593 1446782 1560767 1666603 1742745 1797323 1817492 1787310
2815 1787310 1708474 1593038 1462492 1350865 1241550 1182114 1078276 1014362 997372 952741
2805 952741 904243 882114 842025 791554 779735 732137 726565 686008 667360 640951 650396 662150
2793 662150 643407 617725 620938 601146 585599 571461 587911 566530 551394 549473 551181 556395
2781 556395 559867 577108 550918 506668 468856 477215 479855 436064 400698 386111 387085 362866 381892
2768 381892 385135 360635 355558 376872 307106 292749 331907 308856 305422 292309 310030 266624
$$ packed form
2851G79017j9775O588Q898L635m0036K3152R929k6138k47J1317j0924j6835L751
2838G32332P175N2912J6098r917K3910K2672J9337L5477L8650L3354N8657L3086
2826A063743Q0463M5669P9364P9354R8189J13985J05836P6142N4578K0169l0182
2815A787310p8836j15436j30546j11627j09315n9436j03838o3914j6990m4631
2805I52741m8498k2129m0089n0471j1819m7598n572m0557j8648k6409R445J1754
2793F62150j8743k5682L213j9792j5547j4138J6450k1381j5136j921J708N214
2781E56395L472J7241k6190m4250l7812Q359K640m3791l5366j4587R74k4219J9026
2768C81892L243k4500n077K1314o9766j4357L9158k3051l434j3113J7721m3406
$$ plain form
2756 266624 262069 295896 304235 301759 294192 265878 254235 214143 192447 212556 214345 209777 186438
2743 186438 151618 138405 135853 119887 137885 158161 133961 138970 140306 108611 104103 97482 92715
2730 92715 78057 59228 30297 60108 64004 46508 53918 27318 -25957 -19928 -2688 40815
2718 40815 71891 50973 35471 16 -1450 -13968 -9085 -325 -5179 7226 7849 -9147 -15880
2705 -15880 -10873 -20486 -45886 -42412 -12963 21541 -14951 -27472 -13864 -42693 -25813 -12235
2693 -12235 -26741 -5932 -30234 -22558 8980 912 -4955 17383 56465 70187 43169 14213
2681 14213 29136 28537 8104 12813 14852 25161 9942 -4893 -7642 -44457 -53991 -40434 -49759
2668 -49759 -39825 -17940 -44913 -78047 -36302 -24111 -35402 -17731 -11292 -56615 -42364 -57287
$$ packed form
2756B66624m555L3827Q339k476p567k8314j1643m0092k1696K0109J789m568k3339
2743A86438l4820j3213k552j5966J7998K0276k4200N009J336l1695m508o621m767
2730I2715j4658j8829k8931K9811L896j7496P410k6600n3275O029J7240M3503
2718D0815L1076k0918j5502l5455j466j2518M883Q760m854J2405O23j6996o733
2705a5880N007r613k5400L474K9449L4504l6492j2521J3608k8829J6880J3578
2693a2235j4506K0809k4302P676L1538q068n867K2338L9082J3722k7018k8956
2681A4213J4923n99k0433M709K039J0309j5219j4835k749l6815r534J3557r325
2668d9759R934K1885k6973l3134M1745J2191j1291J7671O439m5323J4251j4923
$$ plain form
2656 -57287 -84033 -48884 -46054 -71584 -75918 -78108 -104625 -118406 -88647 -72847 -74098 -40148 -49030
2643 -49030 -66884 -97614 -94453 -63317 -54222 -77775 -99506 -105671 -99761 -90280 -66670 -93858 -59590
2630 -59590 -103929 -103566 -87573 -77333 -94611 -105435 -105274 -88574 -76365 -100163 -97365 -98131 -99469
2617 -99469 -102940 -106766 -84242 -84881 -107980 -107586 -86661 -65051 -47767 -80758 -88238 -76002 -76124 -79652
2603 -79652 -98039 -88255 -81394 -93830 -82357 -67988 -126026 -94182 -66935 -58461 -58128 -95265 -121974
2590 -121974 -98238 -105779 -65788 -56760 -81830 -115069 -107560 -95514 -127067 -127317 -83519 -102118 -117979
2577 -117979 -102881 -97301 -102271 -106266 -109631 -91095 -98576 -122282 -131837 -116979 -89380 -71550 -79276
2564 -79276 -101468 -70799 -42468 -60448 -88189 -97689 -88277 -92877 -93427 -135645 -159618 -133310 -94915
$$ packed form
2656e7287k6746L5149K830k5530m334k190k6517j3781K9759J5800j251L3950q882
2643d9030j7854l0730L161L1136R095k3553k1731o165N910R481K3610k7188L4268
2630e9590m4339L63J5993J0240j7278j0824J61J6700J2209k3798K798p66j338
2617i9469l471l826K2524o39k3099L94K0925K1610J7284l2991p480J2236j22l528
2603g9652j8387R784O861j2436J1473J4369n8038L1844K7247Q474L33l7137k6709
2590a21974K3736p541L9991R028k5070l3239P509J2046l1553k50M3798j8599j5861
2577a17979J5098N580m970l995l365J8536p481k3706r555J4858K7599J7830p726
2564g9276k2192L0669K8331j7980k7741r500R412m600n50m2218k3973K6308L8395
$$ plain form
2551 -94915 -107087 -135067 -130519 -101865 -114898 -93786 -87339 -109850 -85624 -124716 -128495 -85498
2539 -85498 -67429 -77163 -69516 -59539 -64015 -65638 -32975 -34599 -67164 -82952 -90539 -94256 -122338
2526 -122338 -111287 -80168 -99896 -91636 -81345 -115970 -115324 -106175 -109090 -69300 -97545 -117009 -102698
2513 -102698 -82978 -105356 -173323 -163071 -146783 -142906 -123835 -131605 -108304 -99920 -90014 -119708
2501 -119708 -126163 -118463 -109509 -112673 -114001 -112124 -138309 -139296 -140683 -123711 -113206 -103871 -77845 -141029
2487 -141029 -152909 -153785 -139237 -140254 -134692 -127730 -124301 -120374 -125183 -106915 -83155 -65656 -113976
2474 -113976 -98077 -127587 -127967 -99280 -119957 -123997 -89599 -131232 -143433 -123788 -126390 -129288 -130667
2461 -130667 -152879 -172307 -185489 -156805 -148211 -175253 -172584 -172420 -168155 -149056 -157100 -166575 -151400
$$ packed form
2551i4915j2172k7980M548K8654j3033K1112O447k2511K4226l9092l779M2997
2539h5498J8069r734P647R977m476j623L2663j624l2565j5788p587l717k8082
2526a22338J1051L1119j9728Q260J0291l4625O46R149k915L9790k8245j9464J4311
2513a02698J9720k2378o7967J0252J6288L877J9071p770K3301Q384R906k9694
2501a19708o455P700Q954l164j328J877k6185r87j387J6972J0505R335K6026o3184
2487a41029j1880q76J4548j017N562O962L429L927m809J8268K3760J7499m8320
2474a13976J5899k9510l80K8687k0677m040L4398m1633j2201J9645k602k898j379
2461a30667k2212j9428j3182K8684Q594k7042K669J64M265J9099q044r475J5175
$$ plain form
2448 -151400 -138211 -148805 -171985 -153354 -155294 -158701 -167752 -156138 -173349 -182372 -155598 -122256
2436 -122256 -104732 -120840 -166561 -170500 -160710 -148209 -139842 -163382 -169736 -145597 -122011 -116875 -130490
2423 -130490 -134385 -99067 -104603 -114122 -97832 -89782 -66915 -96645 -126799 -118455 -115941 -97210 -65777
2410 -65777 -95466 -97264 -137111 -97734 -102675 -142103 -111082 -105473 -105952 -104727 -87920 -80511 -92856
2397 -92856 -99838 -81330 -72954 -106933 -94135 -65845 -94663 -109316 -107480 -64741 -81747 -78866 -66654
2384 -66654 -113442 -125484 -128369 -112233 -114478 -113724 -100929 -139850 -122990 -107074 -124801 -120829 -108374
2371 -108374 -109536 -122656 -145015 -117915 -95730 -92327 -105540 -94001 -72466 -82786 -107640 -107614 -78341
2358 -78341 -81753 -96257 -92100 -72469 -17288 -35573 -83462 -131293 -111106 -107542 -103352 -92170 -90888
$$ packed form
2448a51400J3189j0594k3180J8631j940l407r051J1614j7211r023K6774L3342
2436a22256J7524j6108m5721l939R790J2501Q367k3540o354K4139K3586N136j3615
2423a30490l895L5318n536r519J6290Q050K2867k9730l0154Q344K514J8731L1433
2410f5777k9689j798l9847L9377m941l9428L1021N609m79J225J6807P409j2345
2397i2856o982J8508Q376l3979J2798K8290k8818j4653J836M2739j7006K881J2212
2384f6654m6788j2042k885J6136k245P54J2795l8921J6860J5916j7727L972J2455
2371a08374j162j3120k2359K7100K2185L403j3213J1539K1535j0320k4854K6K9273
2358g8341l412j4504M157J9631N5181j8285m7889m7831K0187L564M190J1182J282
$$ plain form
2345 -90888 -101431 -95310 -91110 -69563 -53874 -35734 -44160 -18896 -18725 -21903 -18978 -6219 15131
2332 15131 18245 2357 -6700 -26040 -29353 -8863 -14774 -7595 -12761 9736 18112 -12621 -15808
2319 -15808 1350 -16144 -15325 -20044 -33498 26948 76114 87450 55152 47077 81276 104951 106973
2306 106973 121666 110493 118522 173113 206584 186462 170285 231918 266737 267619 301402 332122
2294 332122 360021 384619 395794 477098 491616 559754 606833 701527 739899 809635 878534 947254
2282 947254 1067233 1196705 1331511 1495949 1622914 1770023 1917340 2136439 2403585 2766598
2272 2766598 3179640 3705765 4361199 5251525 6363187 7711241 9364621 11225187 11522476
2263 11522476 9875131 7907098 6294364 5261550 4427768 3807616 3320523 2967481 2674236
$$ packed form
2345i0888j0543O121M200K1547J5689J8140q426K5264J71l178K925J2759K1350
2332A5131L114j5888r057j9340l313K0490n911P179n166K2497Q376l0733l187
2319a5808J7158j7494Q19m719j3454O0446M9166J1336l2298q075L4199K3675K022
2306A06973J4693j1173Q029N4591L3471k0122j6177O1633L4819Q82L3783L0720
2294C32122K7899K4598J1175Q1304J4518O8138M7079R4694L8372O9736O8899O8720
2282I47254J19979J29472J34806J64438J26965J47109J47317K19099K67146L63013
2272B766598M13042N26125O55434Q90326J111662J348054J653380J860566K97289
2263A1522476j647345j968033j612734j032814q33782o20152m87093l53042k93245
$$ plain form
2254 2674236 2452814 2276231 2125663 1961231 1904595 1837229 1684567 1507632 1340891 1234556
2244 1234556 1070203 958916 873187 799057 769130 744360 691056 629471 583203 564945 527260
2233 527260 508206 457772 439921 431174 392161 359125 333478 326967 320913 305434 256785 235893
2221 235893 200824 170752 140692 158632 155821 146227 171349 164250 110190 118069 135659 114952
2209 114952 105373 124236 114925 103510 88227 60315 38171 48950 49891 48998 12899 11685 -4967
2196 -4967 16987 -6746 -16797 -30296 6932 43505 35066 -11577 -32031 -28624 -19198 -50761 -51155
2183 -51155 -43468 -28446 -25677 -14024 28017 -24725 -38541 -10111 -28062 -42328 -37144 -58812
2171 -58812 -45604 -66172 -67038 -62909 -58199 -66558 -44668 -39495 -37594 -29650 -11020 -32152 -62249
$$ packed form
2254B674236k21422j76583j50568j64432n6636o7366j52662j76935j66741j06335
2244A234556j64353j11287q5729p4130k9927k4770n3304o1585m6268j8258l7685
2233E27260j9054n0434j7851q747l9013l3036k5647o511o054j5479m8649k0892
2221B35893l5069l0072l0060J7940k811r594K5122p099n4060P879J7590k0707
2209A14952r579J8863r311j1415j5283k7912k2144J0779R41q93l6099j214j6652
2196d967K1954k3733j0051j3499L7228L6573q439m6643k0454L407R426l1563l94
2183e1155P687J5022K769J1653M2041n2742j3816K8430j7951j4266N184k1668
2171e8812J3208k0568q66M129M710q359K1890N173J901P944J8630k1132l0097
$$ plain form
2158 -62249 -82566 -53267 -78450 -85197 -92178 -82667 -73402 -120130 -104060 -80065 -100753 -105645 -103471
2145 -103471 -68316 -102721 -129904 -101275 -79560 -92521 -80127 -83959 -95857 -94565 -110663 -137880
2133 -137880 -140794 -108518 -132129 -164515 -141189 -112780 -142575 -170380 -136185 -124338 -125310 -156707
2121 -156707 -177871 -166603 -159349 -158064 -181710 -171546 -132822 -121650 -125624 -94557 -103908 -138452
2109 -138452 -134079 -132180 -122368 -143115 -154762 -134517 -120870 -128480 -153091 -142972 -150648 -153603 -136455
2096 -136455 -154385 -174790 -139546 -137685 -114203 -107008 -122390 -167087 -166289 -138899 -133423 -149598 -124054
2083 -124054 -128102 -155844 -164407 -150064 -144848 -124448 -128535 -133292 -141874 -151085 -132871 -117007 -123112
2070 -123112 -156867 -155757 -116392 -113092 -121013 -125921 -115445 -116683 -150314 -134041 -127501 -119516 -141702
$$ packed form
2158f2249k0317K9299k5183o747o981R511R265m6728J6070K3995k0688m892K174
2145a03471L5155l4405k7183K8629K1715j2961J2394l832j1898J292j6098k7217
2133a37880k914L2276k3611l2386K3326K8409k9795k7805L4195J1847r72l1397
2121a56707k1164J1268P254J285k3646J0164L8724J1172l974L1067r351l4544
2109a38452M373J899R812k0747j1647K0245J3647p610k4611J0119p676k955J7148
2096a36455j7930k0405L5244J861K3482P195j5382m4697P98K7390N476j6175K5544
2083a24054m048k7742q563J4343N216K0400m087m757q582r211J8214J5864o105
2070a23112l3755J110L9365L300p921m908J0476j238l3631J6273O540P985k2186
$$ plain form
2057 -141702 -131370 -114681 -122302 -124421 -137293 -120833 -139188 -154149 -168171 -139188 -126260 -140138
2045 -140138 -130257 -120357 -129056 -151058 -135143 -125375 -159139 -195868 -134783 -112198 -119804 -142054 -144843
2032 -144843 -133435 -138466 -125383 -114995 -134685 -154888 -148722 -141929 -143525 -138780 -158855 -153068 -146722
2019 -146722 -122884 -115697 -108848 -111945 -105430 -134186 -126928 -123935 -123547 -139153 -175474 -165486 -126998
2006 -126998 -147390 -184376 -163790 -117544 -140931 -134658 -110041 -129129 -115464 -114308 -107196 -108188 -82542
1993 -82542 -100895 -95429 -96371 -137611 -116022 -106991 -130355 -149356 -160855 -176413 -158063 -141642 -147044
1980 -147044 -121805 -117166 -152246 -178462 -159228 -160509 -160983 -140952 -126559 -164271 -150842 -150040 -129640
1967 -129640 -99803 -105715 -130334 -177598 -175556 -150626 -161383 -162103 -173819 -158691 -157235 -156573 -168479
$$ packed form
2057a41702J0332J6689p621k119j2872J6460j8355j4961j4022K8983J2928j3878
2045a40138R881R900q699k2002J5915R768l3764l6729O1085K2585p606k2250k789
2032a44843J1408n031J3083J0388j9690k0203O166O793j596M745k0075N787O346
2019a46722K3838P187O849l097O515k8756P258K993L88j5606l6321R988L8488
2006a26998k0392l6986K0586M6246k3387O273K4617j9088J3665J156P112r92K5646
1993h2542j8353N466r42m1240K1589R031k3364j9001j1499j5558J8350J6421n402
1980a47044K5239M639l5080k6216J9234j281m74K0031J4393l7712J3429Q02K0400
1967a29640K9837n912k4619m7264K042K4930j0757p20j1716J5128J456O62j1906
$$ plain form
1954 -168479 -155445 -162669 -160584 -161917 -170645 -151617 -155550 -163322 -178981 -158762 -147220 -172675 -187267
1941 -187267 -151471 -141404 -149390 -185428 -200549 -181445 -174385 -149074 -113164 -123612 -146988 -135165
1929 -135165 -153320 -179051 -150221 -145761 -180698 -173721 -171288 -180902 -199021 -192059 -172858 -153897 -150851
1916 -150851 -170208 -174194 -183765 -170439 -170239 -170458 -175040 -173513 -178658 -171260 -149025 -125175 -167605 -173804
1902 -173804 -181277 -183451 -185759 -199717 -155149 -144941 -155789 -158956 -139582 -145529 -167802 -182326 -157096
1889 -157096 -145525 -151013 -157379 -132798 -130752 -137726 -163057 -157008 -147043 -155107 -152560 -129585 -116103
1876 -116103 -114000 -144780 -156108 -121472 -102466 -111746 -143762 -183710 -218384 -215594 -201846 -183079
1864 -183079 -174563 -171850 -202741 -170307 -146098 -156452 -184710 -162909 -157119 -158827 -168747 -179657 -170918
$$ packed form
1954a68479J3034p224K085j333q728J9028l933p772j5659K0219J1542k5455j4592
1941a87267L5796J0067p986l6038j5121J9104P060K5311L5910j0448k3376J1823
1929a35165j8155k5731K8830M460l4937O977K433r614j8119O962J9201J8961L046
1916a50851j9357l986r571J3326K00k19m582J527n145P398K2235K3850m2430o199
1902a73804p473k174k308j3958M4568J0208j0848l167J9374n947k2273j4524K5230
1889a57096J1571n488o366K4581K046o974k5331O049R965q064K547K2975J3482
1876a16103K103l0780j1328L4636J9006r280l2016l9948l4674K790J3748J8767
1864a83079Q516K713l0891L2434K4209j0354k8258K1801N790j708r920j0910Q739
$$ plain form
1851 -170918 -197463 -207217 -178060 -167122 -132559 -149974 -168261 -155151 -201221 -206025 -165000 -139678
1839 -139678 -142320 -160485 -188918 -169634 -135960 -160856 -161187 -188660 -204081 -184299 -164833 -130553
1827 -130553 -125982 -144971 -140226 -125715 -167329 -197129 -193074 -173147 -166269 -185080 -179027 -187729 -196722
1814 -196722 -188169 -177630 -155627 -159542 -156112 -188098 -184531 -148515 -171642 -168668 -153280 -188929 -162624
1801 -162624 -133884 -128538 -143375 -116016 -126579 -152779 -152544 -156408 -130272 -103962 -125564 -184226
1789 -184226 -157592 -146504 -165890 -139201 -133913 -157773 -172592 -155206 -171562 -171173 -136297 -118544
1777 -118544 -135393 -147156 -157182 -169774 -132789 -148956 -156617 -124486 -140921 -158882 -153284 -169984
1765 -169984 -155572 -151309 -143594 -142339 -155123 -161091 -184792 -156965 -184513 -161576 -137544 -165397
$$ packed form
1851a70918k6545r754K9157J0938L4563j7415j8287J3110m6070m804M1025K5322
1839a39678k642j8165k8433J9284L3674k4896l31k7473j5421J9782J9466L4280
1827a30553M571j8989M745J4511m1614k9800M055J9927O878j8811O053q702q993
1814a96722Q553J0539K2003l915L430l1986L567L6016k3127K974J5388l5649K6305
1801a62624K8740N346j4837K7359j0563k6200K35l864K6136K6310k1602n8662
1789a84226K6634J1088j9386K6689N288k3860j4819J7386j6356L89L4876J7753
1777a18544j6849j1763j0026j2592L6985j6167p661L2131j6435j7961N598j6700
1765a69984J4412M263P715J255j2784n968k3701K7827k7548K2937K4032k7853
$$ plain form
1753 -165397 -176313 -147238 -152600 -164438 -183434 -192494 -160554 -156501 -150962 -153434 -165993 -176108 -149474
1740 -149474 -160190 -128506 -142188 -166982 -161881 -148662 -145965 -140059 -147625 -167638 -159937 -162924 -160462
1727 -160462 -166184 -164961 -135282 -146886 -194358 -161788 -127730 -181241 -172002 -169894 -184613 -177759 -169628
1714 -169628 -148452 -184500 -202861 -178561 -187255 -188504 -202447 -153869 -141340 -147606 -196779 -209288
1702 -209288 -187941 -193461 -180348 -162076 -133875 -130745 -153533 -167942 -149828 -146772 -178477 -168550
1690 -168550 -139740 -152357 -174603 -189902 -193847 -183268 -176805 -172702 -164853 -166170 -154681 -141776 -143144
1677 -143144 -160131 -140518 -118688 -109147 -162715 -152685 -165424 -142114 -122501 -143360 -157880 -182943
1665 -182943 -218674 -177866 -161499 -149160 -145260 -135910 -102033 -126777 -131159 -139460 -133526 -144384 -154253
$$ packed form
1753a65397j0916K9075n362j1838j8996r060L1940M053N539k472j2559j0115K6634
1740a49474j0716L1684j3682k4794N101J3219K697N906p566k0013P701k987K462
1727a60462n722J223K9679j1604m7472L2570L4058n3511R239K108j4719O854Q131
1714a69628K1176l6048j8361K4300q694j249j3943M8578J2529o266m9173j2509
1702b09288K1347n520J3113J8272K8201L130k2788j4409J8114L056l1705R927
1690a68550K8810j2617k2246j5299l945J0579O463M103P849j317J1489J2905j368
1677a43144j6987J9613K1830R541n3568J0030j2739K3310J9613k0859j4520k5063
1665a82943l5731M0808J6367J2339L900R350L3877k4744m382q301N934j0858r869
$$ plain form
1652 -154253 -159587 -142957 -139019 -143329 -130278 -128232 -98281 -114685 -140191 -143490 -122612 -103278 -155972
1639 -155972 -168458 -152327 -138910 -146450 -132366 -127796 -128104 -125265 -154638 -149417 -133541 -131400 -118923
1626 -118923 -121964 -127262 -114518 -138029 -154405 -155504 -147892 -161252 -169605 -182469 -179195 -191551 -174533
1613 -174533 -160317 -156218 -132805 -124439 -135243 -145294 -138679 -134643 -116454 -95931 -117297 -142119
1601 -142119 -150287 -162195 -169222 -178626 -185279 -174068 -151848 -175962 -148871 -120857 -152016 -147506 -144921
1588 -144921 -148401 -132822 -132595 -157666 -157209 -167649 -167994 -177194 -155555 -127755 -120001 -129731 -170974 -172303
1574 -172303 -154996 -125597 -153938 -156358 -135181 -101894 -120608 -147566 -163721 -136126 -140488 -128001
1562 -128001 -142286 -141911 -112227 -155173 -189915 -172110 -168823 -156726 -154976 -162695 -157411 -133471 -150000
$$ packed form
1652a54253n334J6630L938m310J3051K046K9951j6404k5506l299K0878J9334n2694
1639a55972j2486J6131J3417p540J4084M570l08K839k9373N221J5876K141J2477
1626a18923l041n298J2744k3511j6376j099P612j3360q353j2864L274j2356J7018
1613a74533J4216M099K3413Q366j0804j0051O615M036J8189K0523k1366k4822
1601a42119q168j1908p027r404o653J1211K2220k4114K7091K8014l1159M510K585
1588a44921l480J5579K27k5071M57j0440l45r200K1639K7800P754r730m1243j329
1574a72303J7307K9399k8341k420K1177L3287j8714k6958j6155K7595m362J2487
1562a28001j4285L75K9684m2946l4742J7805L287J2097J750p719N284K3940j6529
$$ plain form
1549 -150000 -129083 -132248 -104471 -107892 -128965 -162049 -133978 -98757 -133065 -140593 -144242 -145280 -142806
1536 -142806 -128092 -151142 -162399 -163891 -150627 -156097 -140859 -161987 -139929 -116632 -113378 -129411
1524 -129411 -115915 -120568 -109155 -133472 -124941 -113425 -116597 -141502 -116386 -117213 -129267 -133421 -149311
1511 -149311 -163962 -161016 -118309 -146870 -158501 -127494 -134924 -105606 -130061 -152701 -146192 -146353 -134411
1498 -134411 -139845 -126374 -152961 -143079 -137478 -138173 -151897 -172946 -182014 -172501 -173910 -152845 -145317
1485 -145317 -151685 -156956 -133200 -133498 -169756 -171418 -156602 -111659 -103330 -113040 -105043 -140889 -157713
1472 -157713 -164575 -156746 -147341 -154594 -162048 -137860 -146791 -180388 -161163 -146404 -149923 -123681 -175140
1459 -175140 -155810 -147539 -144243 -159305 -180943 -158583 -145750 -124548 -156484 -161845 -164717 -172620 -194950
$$ packed form
1549a50000K0917l165K7777l421k1073l3084K8071L5221l4308p528l649j038K474
1536a42806J4714k3050j1257j492J3264n470J5238k1128K2058K3297L254j6033
1524a29411J3496m653J1413k4317Q531J1516l172k4905K5116q27j2054m154j5890
1511a49311j4651K946M2707k8561j1631L1007p430K9318k4455k2640O509j61J1942
1498a34411n434J3471k6587R882N601o95j3724k1049r068R513j409K1065P528
1485a45317o368n271K3756k98l6258j662J4816M4943Q329r710P997l5846j6824
1472a57713o862P829R405p253p454K4188q931l3597J9225J4759l519K6242n1459
1459a75140J9330Q271L296j5062k1638K2360J2833K1202l1936n361k872p903k2330
$$ plain form
1446 -194950 -175920 -157494 -165480 -133860 -109598 -143639 -190455 -176725 -140238 -122603 -136306 -150659
1434 -150659 -122085 -101856 -96516 -112343 -135832 -140491 -141417 -168898 -193396 -169445 -122816 -121901 -121646
1421 -121646 -104369 -105208 -146990 -146314 -174348 -178419 -171158 -155402 -137397 -142370 -151434 -154947 -141156
1408 -141156 -109145 -169716 -143734 -121803 -130183 -134711 -143860 -156776 -170190 -153485 -151615 -122142
1396 -122142 -114482 -137541 -158697 -161184 -146700 -171899 -142815 -151336 -141957 -120251 -162206 -135277
1384 -135277 -139489 -169442 -124629 -119343 -141501 -121978 -98824 -101702 -127622 -130851 -127263 -147910 -160770
1371 -160770 -150135 -160020 -145572 -118293 -132820 -114506 -99720 -122951 -121371 -165279 -161692 -168093
1359 -168093 -148317 -148295 -168041 -173442 -166745 -183159 -156310 -152879 -177209 -176858 -150519 -129517 -158314
$$ packed form
1446a94950J9030J8426p986L1620K4262l4041m6816J3730L6487J7635j3703j4353
1434a50659K8574K0229N340j5827k3489m659r26k7481k4498K3951M6629R15K55
1421a21646J7277q39m1782O76k8034m071P261J5756J8005m973r064l513J3791
1408a41156L2011o0571K5982K1931q380m528r149j2916j3414J6705J870K9473
1396a22142P660k3059k1156k487J4484k5199K9084q521R379K1706m1955K6929
1384a35277m212k9953M4813N286k2158J9523K3154k878k5920l229L588k0647j2860
1371a60770J0635r885J4448K7279j4527J8314J4786k3231J580m3908L587o401
1359a68093J9776K2j9746n401O697j6414K6849L431k4330L51K6339K1002k8797
$$ plain form
1346 -158314 -149771 -143343 -142280 -127342 -137272 -140422 -161902 -151305 -147654 -128074 -96191 -89748 -132259
1333 -132259 -163988 -185849 -153949 -147423 -134948 -169326 -144709 -125970 -122451 -143099 -157739 -135127
1321 -135127 -124054 -106705 -121260 -128502 -116681 -124483 -136646 -125462 -111616 -109599 -104927 -123307
1309 -123307 -145806 -118108 -87953 -97184 -108735 -108366 -133043 -138252 -174163 -157518 -144312 -112960
1297 -112960 -125468 -128249 -122861 -137996 -132017 -134798 -134342 -144940 -169516 -170753 -171972 -171058 -149431 -122330
1283 -122330 -115214 -146448 -168244 -147249 -136775 -121928 -126323 -155641 -158615 -128332 -94882 -113759
1271 -113759 -126567 -129106 -155279 -135284 -127069 -166875 -195330 -174021 -152221 -170792 -170709 -142953 -138223
1258 -138223 -163279 -163885 -169363 -134284 -116333 -139043 -130503 -161220 -162710 -154897 -136947 -151439 -159546
$$ packed form
1346a58314Q543O428J063J4938r930l150k1480J0597L651J9580L1883O443m2511
1333a32259l1729k1861L1900O526J2475l4378K4617J8739L519k0648j4640K2612
1321a35127J1073J7349j4555p242J1821p802j2163J1184J3846K017M672j8380
1309a23307k2499K7698L0155r231j1551L69k4677n209l5911J6645J3206L1352
1297a12960j2508k781N388j5135N979k781M56j0598k4576j237j219R14K1627K7101
1283a22330P116l1234k1796K0995J0474J4847m395k9318k974L0283L3450j8877
1271a13759j2808k539k6173J9995Q215l9806k8455K1309K1800j8571Q3K7756M730
1258a38223k5056o06n478L5079J7951k2710Q540l0717j490P813J7950j4492q107
$$ plain form
1245 -159546 -183778 -179131 -161961 -173151 -135066 -100863 -125044 -137315 -163126 -161208 -161765 -153912 -124544
1232 -124544 -142981 -141312 -136271 -131210 -139295 -148330 -93437 -118328 -132260 -152041 -129802 -135711 -149025
1219 -149025 -136020 -148044 -122157 -111686 -114383 -116985 -98940 -121381 -131308 -148302 -158824 -132951
1207 -132951 -147272 -124172 -125497 -126976 -134252 -93443 -105395 -136361 -132592 -155072 -142767 -116665
1195 -116665 -116350 -146607 -143198 -134399 -108396 -135571 -131422 -122335 -155234 -171622 -164200 -161993 -128328
1182 -128328 -128413 -133693 -150255 -155336 -159944 -111749 -122760 -142013 -138136 -159324 -158781 -169195 -152418
1169 -152418 -138705 -136344 -141510 -126998 -116677 -118854 -110941 -155137 -137619 -168848 -164827 -154965 -147663
1156 -147663 -143848 -144620 -140838 -159807 -120597 -148458 -118820 -106806 -124057 -130768 -162827 -136234 -117276
$$ packed form
1245a59546k4232M647J7170j1190L8085L4203k4181j2271k5811J918n57P853K9368
1232a24544j8437J669N041N061q085r035N4893k4891j3932j9781K2239n909j3314
1219a49025J3005j2024K5887J0471k697k602J8045k2441r927j6994j0522K5873
1207a32951j4321K3100j325j479p276M0809j1952l0966L769k2480J2305K6102
1195a16665L15l0257L409Q799K6003k7175M149R087l2899j6388P422K207L3665
1182a28328q5n280j6562n081m608M8195j1011j9253L877k1188N43j0414J6777
1169a52418J3713K361n166J4512J0321k177P913m4196J7518l1229M021R862P302
1156a47663L815p72L782j8969L9210k7861K9638J2014j7251o711l2059K6593J8958
$$ plain form
1143 -117276 -120340 -84021 -88142 -84626 -94956 -114499 -120822 -132556 -130902 -124863 -144070 -135695 -94765
1130 -94765 -126848 -157457 -151681 -112341 -127759 -120503 -126962 -157104 -148695 -126022 -131954 -143929 -148467
1117 -148467 -137141 -116032 -127199 -146466 -152901 -148033 -112258 -158525 -177243 -134358 -157014 -169708
1105 -169708 -154985 -123592 -128180 -143984 -167978 -148051 -129075 -131375 -113442 -93721 -88613 -100058
1093 -100058 -95080 -151172 -179078 -181922 -176705 -166742 -167939 -146963 -133517 -128523 -108599 -106180 -149674
1080 -149674 -162560 -146024 -157020 -153451 -152211 -153762 -148063 -157955 -139501 -143276 -162853 -134586 -138035
1067 -138035 -152847 -120121 -105116 -84827 -104624 -120783 -123524 -121489 -140420 -161835 -180948 -168470
1055 -168470 -118455 -104656 -110319 -126324 -109824 -121967 -100241 -70357 -109813 -120105 -116515 -133741
$$ packed form
1143a17276l064L6319m121L516j0330j9543o323j1734J654O039j9207Q375M0930
1130i4765l2083l0609N776L9340j5418P256o459l0142Q409K2673n932j1975m538
1117a48467J1326K1109j1167j9267o435M868L5775m6267j8718M2885k2656j2694
1105a69708J4723L1393m588j5804k3994J9927J8976k300J7933J9721N108j1445
1093a00058M978n6092k7906k844N217R963j197K0976J3446M994J9924K419m3494
1080a49674j2886J6536j0996L569J240j551N699r892J8454l775j9577K8267l449
1067a38035j4812L2726J5005K0289j9797j6159k741K035j8931k1415j9113J2478
1055a68470N0015J3799n663j6005J6500j2143K1726K9884l9456j0292L590j7226
$$ plain form
1043 -133741 -123795 -93150 -107323 -142411 -140313 -119643 -114826 -147963 -172918 -127791 -126900 -157543 -185631
1030 -185631 -160298 -160921 -129926 -119967 -129612 -134977 -122280 -138994 -178283 -170219 -164728 -125160 -92277
1017 -92277 -119211 -101009 -110431 -110822 -128454 -124908 -133310 -147534 -146092 -142702 -147344 -144523 -146484 -151923
1003 -151923 -143715 -120658 -134608 -134999 -145664 -158294 -141500 -159171 -154080 -138601 -110988 -116799 -157037
990 -157037 -147844 -122950 -142002 -144621 -136104 -119675 -132655 -155065 -161353 -146631 -155728 -139624 -137549
977 -137549 -170705 -139808 -98545 -108431 -126706 -131005 -129798 -124624 -96745 -127682 -153705 -171923 -169100
964 -169100 -133596 -151005 -163134 -150918 -155942 -158514 -128830 -148738 -166383 -146464 -141809 -103641
952 -103641 -116763 -119762 -134423 -135325 -143213 -143589 -138299 -116058 -131991 -91239 -86988 -95530 -74805 -99910
$$ packed form
1043a33741R946L0645j4173l5088K098K0670M817l3137k4955M5127Q91l0643k8088
1030a85631K5333o23L0995R959r645n365J2697j6714l9289Q064N491L9568L2883
1017i2277k6934J8202r422l91j7632L546q402j4224J442L390m642K821j961n439
1003a51923Q208K3057j3950l91j0665j2630J6794j7671N091J5479K7613n811m0238
990a57037R193K4894j9052k619Q517J6429j2980k2410o288J4722r097J6104K075
977a37549l3156L0897M1263r886j8275m299J207N174K7879l0937k6023j8218K823
964a69100L5504j7409j2129J2216n024k572K9684j9908j7645J9919M655L8168
952a03641j3122k999j4661r02p888l76N290K2241j5933M0752M251q542K0725k5105
$$ plain form
938 -99910 -149807 -122479 -127828 -99779 -119049 -128704 -91771 -108604 -141778 -119302 -105314 -92544
926 -92544 -104183 -143946 -124811 -119677 -122967 -129698 -136464 -134806 -120172 -126218 -94044 -78770 -71909
913 -71909 -95269 -132213 -116239 -134463 -141067 -110170 -122809 -107444 -137080 -147086 -160775 -160863 -113550
900 -113550 -96554 -115077 -98360 -91041 -115660 -120780 -121697 -129598 -114953 -135662 -138411 -136747 -128648
887 -128648 -158296 -154542 -125838 -134925 -156625 -136346 -121468 -132690 -150559 -153802 -131479 -117557
875 -117557 -125357 -127080 -157430 -172315 -143258 -139997 -133267 -155123 -128351 -126374 -152815 -127932 -120548
862 -120548 -157834 -177330 -146252 -131624 -147469 -162547 -146244 -143340 -151708 -131096 -112401 -126100
850 -126100 -146156 -132803 -111453 -129211 -113203 -99869 -96692 -104641 -129577 -124211 -101131 -99363 -103262
$$ packed form
938i9910m9897K7328n349K8049j9270r655L6933j6833l3174K2476J3988J2770
926i2544j1639l9763J9135N134l290o731o766J658J4634o046L2174J5274O861
913g1909k3360l6944J5974j8224o604L0897j2639J5365k9636j0006j3689q8M7313
900a13550J6996j8523J6717P319k4619n120r17p901J4645k0709k749J664Q099
887a28648k9648L754K8704r087k1700K0279J4878j1222j7869l243K2323J3922
875a17557p800j723l0350j4885K9057L261O730k1856K6772J977k6441K4883P384
862a20548l7286j9496L1078J4628j5845j5078J6303K904q368K0612J8695j3699
850a26100k0056J3353K1350j7758J6008J3334L177p949k4936N366K3080J768l899
$$ plain form
837 -103262 -66029 -70529 -84690 -105375 -112230 -138371 -149090 -144543 -124273 -131286 -123563 -109655 -151718
824 -151718 -122971 -131971 -144357 -148109 -133307 -141117 -180688 -183467 -152833 -132365 -133291 -137978 -156709
811 -156709 -144369 -125662 -136141 -176589 -174635 -139275 -98953 -114589 -154995 -162881 -141252 -128179
799 -128179 -130115 -114409 -120069 -127649 -105332 -97801 -143424 -152538 -139923 -135315 -153726 -165164 -152053
786 -152053 -154685 -138906 -115409 -126895 -117181 -116064 -118620 -148076 -119834 -139207 -151766 -133880 -100261
773 -100261 -117012 -142930 -112238 -134284 -152392 -135128 -105995 -105614 -138050 -150108 -127544 -131721
761 -131721 -127515 -120770 -90708 -98485 -132902 -146385 -109760 -105544 -104102 -110851 -144815 -166565 -171785
748 -171785 -176891 -143412 -110190 -118215 -132369 -114085 -126096 -119556 -133103 -132517 -131287 -115445 -130034
$$ packed form
837a03262L7233m500j4161k0685o855k6141j0719M547K0270p013P723J3908m2063
824a51718K8747r000j2386l752J4802p810l9571k779L0634K0468r26m687j8731
811a56709J2340J8707j0479m0448J954L5360M0322j5636m0406p886K1629J3073
799a28179j936J5706n660p580K2317P531m5623r114J2615M608j8411j1438J3111
786a52053k632J5779K3497j1486R714J117k556k9456K8242j9373j2559J7886L3619
773a00261j6751k5918L0692k2046j8108J7264K9133L81l2436j2058K2564m177
761a31721M206O745L0062p777l4417j3483L6625M216J442o749l3964k1750n220
748a71785n106L3479L3222q025j4154J8284j2011O540j3547N86J230J5842j4589
$$ plain form
735 -130034 -134178 -140187 -125533 -117937 -97295 -93075 -133765 -131451 -132578 -114983 -109277 -119416 -129481
722 -129481 -123471 -160313 -154072 -146074 -116846 -120068 -146983 -121696 -111895 -104198 -109802 -127516 -89346
709 -89346 -113107 -129657 -106615 -134432 -119588 -113112 -136282 -149680 -158256 -119014 -112350 -121292 -132426
696 -132426 -142973 -140494 -144530 -108920 -93865 -118538 -142623 -141076 -115921 -118444 -103273 -89818 -110396
683 -110396 -101025 -146375 -149974 -151970 -134870 -148415 -148071 -126301 -138223 -118394 -111450 -108136 -94525
670 -94525 -110815 -116341 -105578 -105088 -108767 -113756 -146054 -171874 -177377 -159786 -145305 -132579 -126860
657 -126860 -129905 -112060 -105676 -111605 -112421 -138781 -150346 -111285 -105691 -111768 -130570 -151701 -182495
644 -182495 -161011 -122852 -134159 -124707 -106473 -121116 -127400 -130080 -132670 -157986 -135942 -90544 -114227
$$ packed form
735a30034m144o009J4654P596K0642M220m0690K314j127J7595N706j0139j0065
722a29481O010l6842O241P998K9228l222k6915K5287R801P697n604j7714L8170
709h9346k3761j6550K3042k7817J4844O476k3170j3398q576L9242O664q942j1134
696a32426j0547K479m036L5610J5055k4673k4085J547K5155k523J5171J3455k0578
683a10396R371m5350l599j996J7100j3545L44K1770j1922J9829O944L314J3611
670i4525j6290n526J0763M90l679m989l2298k5820n503J7591J4481J2726N719
657a26860l045J7845O384n929q16k6360j1565L9061N594o077j8802k1131l0794
644a82495K1484L8159j1307R452J8234j4643o284k680k590k5316K2044M5398k3683
$$ plain form
631 -114227 -114419 -86308 -83779 -87585 -78115 -71153 -104081 -110371 -143834 -161269 -161548 -173991 -160065 -155513
617 -155513 -173498 -113280 -123296 -150228 -165234 -133238 -84433 -44267 -112769 -131779 -107839 -122620
605 -122620 -97718 -114004 -138196 -124854 -136458 -110030 -130253 -137505 -131352 -149211 -138343 -130737
593 -130737 -122515 -110260 -121661 -131821 -98419 -148626 -146377 -154866 -136086 -117065 -130882 -101468
581 -101468 -96850 -89162 -107696 -108250 -115031 -133377 -130938 -126871 -139687 -163488 -133774 -135861 -127946 -105368
567 -105368 -107477 -167296 -156092 -132012 -158977 -192453 -150382 -143657 -132477 -113467 -110127 -146015
555 -146015 -115782 -101832 -125084 -152498 -156432 -155549 -151573 -111485 -94395 -92469 -115281 -155977 -138031
542 -138031 -139560 -122531 -144879 -139726 -114900 -139249 -104744 -144968 -118996 -128468 -167785 -148441
$$ packed form
631a14227j92K8111K529l806R470O962l2928o290l3463j7435k79j2443J3926M552
617a55513j7985O0218j0016k6932j5006L1996M8805M0166o8502j9010K3940j4781
605a22620K4902j6286k4192J3342j1604K6428k0223p252O153j7859J0868P606
593a30737Q222J2255j1401j0160L3402n0207K249q489J8780J9021j3817K9414
581a01468M618P688j8534n54o781j8346K439M067j2816k3801K9714k087P915K2578
567a05368k109n9819J1204K4080k6965l3476M2071O725J1180J9010L340l5888
555a46015L0233J3950k3252k7414l934Q83L976M0088J7090J926k2812m0696J7946
542a38031j529J7029k2348N153K4826k4349L4505m0224K5972r472l9317J9344
$$ plain form
530 -148441 -132201 -122839 -111514 -154876 -169463 -121008 -103009 -96343 -105311 -108581 -130152 -127987 -118258
517 -118258 -110541 -105938 -78209 -71672 -83996 -92183 -125556 -116951 -125662 -128297 -106758 -130707 -159778
504 -159778 -128735 -135285 -141101 -150966 -137653 -144373 -145433 -130213 -126678 -108764 -111656 -95437 -101559
491 -101559 -108105 -133933 -157916 -161872 -134833 -109612 -148826 -122509 -79462 -100980 -137051 -133795
479 -133795 -105202 -103130 -98065 -110055 -138736 -111757 -84480 -85308 -100714 -96504 -107475 -149124 -141886
466 -141886 -123412 -126632 -96194 -102014 -106171 -137400 -112367 -102899 -116992 -129649 -145123 -122845 -150625
453 -150625 -104109 -93737 -120543 -127502 -117231 -119131 -134005 -119234 -129511 -137114 -148255 -143929 -126702
440 -126702 -123646 -93195 -101470 -128440 -128009 -129069 -88001 -85953 -115511 -130195 -131668 -159797 -136031
$$ packed form
530a48441J6240R362J1325m3362j4587M8455J7999O666q968l270k1571K165R729
517a18258P717M603K7729O537j2324q187l3373Q605q711k635K1539k3949k9071
504a59778L1043o550n816r865J3313o720j060J5220L535J7914k892J6219o122
491a01559o546k5828k3983l956K7039K5221l9214K6317M3047k1518l6071L256
479a33795K8593K072N065j1990k8681K6979K7277q28j5406M210j0971m1649P238
466a41886J8474l220L0438n820m157l1229K5033R468j4093j2657j5474K2278k7780
453a50625M6516J0372k6806o959J0271j900j4874J4771j0277p603j1141M326J7227
440a26702L056L0451q275k6970M31j060M1068K048k9558j4684j473k8129K3766
$$ plain form
427 -136031 -143490 -162957 -124656 -123373 -126664 -120119 -106792 -124639 -135568 -145574 -150171 -154259 -139303
414 -139303 -126825 -103569 -117467 -144545 -106444 -96530 -118855 -111622 -140431 -134084 -147864 -120549
402 -120549 -99522 -125730 -147762 -149776 -133000 -157244 -120453 -110018 -109922 -125229 -104534 -92488 -134265
389 -134265 -131605 -97295 -103738 -103916 -130156 -127198 -107674 -134724 -129072 -135402 -131891 -120938 -88276
376 -88276 -118449 -117294 -131244 -143589 -124805 -110870 -142013 -141646 -87576 -114107 -121314 -142168 -159254
363 -159254 -137420 -119744 -97910 -108967 -115641 -89497 -101978 -130167 -135368 -141479 -136139 -90811 -130417
350 -130417 -139555 -98082 -85930 -115058 -140654 -99711 -97544 -97970 -118735 -154208 -141622 -151829 -130342
337 -130342 -143096 -132659 -121212 -138611 -105814 -103302 -110430 -115855 -112231 -126922 -124843 -145779 -156665
$$ packed form
427a36031p459j9467L8301J283l291O545J3327j7847j0929j0006m597m088J4956
414a39303J2478K3256j3898k7078L8101R914k2325P233k8809O347j3780K7315
402a20549K1027k6208k2032k014J6776k4244L6791J0435R6j5307K0695J2046m1777
389a34265K660L4310o443j78k6240K958J9524k7050N652o330L511J0953L2662
376h8276l0173J155j3950j2345J8784J3935l1143L67N4070k6531p207k0854j7086
363a59254K1834J7676K1834j1057o674K6144j2481k8189n201o111N340M5328l9606
350a30417r138M1473J2152k9128k5596M0943K167m26k0765l5473J2586j0207K1487
337a30342j2754J0437J1447j7399L2797K512p128n425L624j4691K079k0936j0886
$$ plain form
324 -156665 -137988 -122383 -124426 -145720 -117363 -128128 -149723 -109951 -69925 -80865 -87247 -141223
312 -141223 -147030 -144666 -152570 -104719 -91379 -115595 -124591 -126551 -144268 -133193 -107076 -109702 -116291
299 -116291 -96359 -102540 -102844 -110217 -120568 -136957 -118783 -79150 -83632 -132215 -106771 -109645 -140973
286 -140973 -135452 -122028 -131571 -132867 -121648 -135728 -162949 -133592 -142721 -163760 -142429 -120312 -107259
273 -107259 -145848 -151177 -155303 -153223 -129474 -135126 -159091 -179325 -163224 -133793 -101934 -99978 -135682
260 -135682 -132564 -128596 -116123 -136453 -136423 -116505 -128001 -142717 -151044 -152006 -130089 -125397 -131418 -136672
246 -136672 -153355 -145383 -114012 -134820 -122582 -110931 -133188 -153174 -146056 -126357 -158055 -148067
234 -148067 -137363 -153590 -139225 -139545 -92536 -93133 -112147 -108110 -135952 -156156 -135395 -120929 -109605
$$ packed form
324a56665J8677J5605k043k1294K8357j0765k1595L9772M0026j0940o382n3976
312a41223n807K364p904M7851J3340k4216q996j960j7717J1075K6117k626o589
299a16291J9932o181l04p373j0351j6389J8174L9633m482m8583K5444k874l1328
286a40973N521J3424r543j296J1219j4080k7221K9357r129k1039K1331K2117J3053
273a07259l8589n329m126K080K3749n652k3965k0234J6101K9431L1859J956l5704
260a35682L118L968J2473k0330L0J9918j1496j4716q327r62K1917M692o021n254
246a36672j6683P972L1371k0808J2238J1651k2257j9986P118J9699l1698R988
234a48067J0704j6227J4365l20M7009n97j9014M037k7842k0204K0761J4466J1324
$$ plain form
221 -109605 -106785 -130722 -107366 -110577 -113898 -129291 -129323 -135223 -143227 -146244 -154656 -146240 -115606 -113582
207 -113582 -121730 -151310 -148499 -167357 -182103 -189928 -183093 -166182 -150482 -135743 -120841 -98714 -112301
194 -112301 -133919 -123842 -127179 -180229 -179408 -134875 -140132 -140685 -151133 -164856 -149778 -150475 -165962
181 -165962 -158365 -117973 -132609 -142393 -121889 -106985 -132413 -107368 -102981 -94087 -104413 -118310 -114296
168 -114296 -157595 -180699 -160791 -156765 -158502 -134969 -157941 -133998 -140686 -147471 -116954 -107317 -114566
155 -114566 -130715 -134117 -137679 -116994 -112845 -105634 -156182 -152961 -131533 -160867 -170535 -153647 -165905
142 -165905 -157016 -174079 -178752 -174472 -168628 -192505 -155210 -139377 -168562 -158166 -154322 -184225 -173229
129 -173229 -147910 -156456 -109045 -126887 -151287 -196083 -192461 -178754 -156403 -160300 -150601 -154257 -193675
$$ packed form
221a09605K820k3937K3356l211l321j5393l2n900q004l017q412Q416L0634K024
207a13582q148k9580K811j8858j4746p825O835J6911J5700J4739J4902K2127j3587
194a12301k1618J0077l337n3050Q21M4533n257n53j0448j3723J5078o97j5487
181a65962P597M0392j4636r784K0504J4904k5428K5045M387Q894j0326j3897M014
168a14296m3299k3104J9908M026j737K3533k2972K3943o688o785L0517R637p249
155a14566j6149l402l562K0685M149P211n0548L221K1428k9334r668J6888j2258
142a65905Q889j7063m673M280N844k3877L7295J5833k9185J0396L844k9903J0996
129a73229K5319q546M7411j7842k4400m4796L622J3707K2351l897R699l656l9418
$$ plain form
116 -193675 -193646 -188160 -177306 -156663 -153006 -167181 -181381 -175292 -182881 -178896 -179277 -183745 -167991 -165649
102 -165649 -195064 -209135 -195385 -191519 -185722 -182523 -173475 -173710 -191702 -197742 -167627 -166505 -188437
89 -188437 -184722 -187063 -191900 -173921 -168697 -183556 -185695 -195001 -215909 -230327 -231610 -212613 -201010
76 -201010 -196014 -202709 -204556 -191600 -202944 -192421 -186576 -182267 -207492 -219260 -224143 -220685 -234204
63 -234204 -265189 -246675 -205612 -208027 -237618 -230358 -229351 -241264 -245359 -233570 -229935 -255051 -271649
50 -271649 -272824 -257560 -230667 -247756 -237485 -249131 -245112 -233114 -232469 -244588 -256991 -256464 -246414
37 -246414 -259283 -261990 -240186 -256496 -246079 -237023 -237548 -244217 -256046 -267196 -257284 -265572 -280134
24 -280134 -258468 -254854 -269820 -263987 -287830 -292684 -271686 -260568 -276929 -284672 -270907 -254533 -273483
$$ packed form
116a93675K9N486J0854K0643L657j4175j4200O089p589L985l81m468J5754K342
102a65649k9415j4071J3750L866N797L199R048k35j7992o040L0115J122k1932
89a88437L715k341m837J7979N224j4859k139r306k0908j4418j283J8997J1603
76b01010M996o695j847J2956j1344J0523N845M309k5225j1768m883L458j3519
63b34204l0985J8514M1063k415k9591P260J007j1913m095J1789L635k5116j6598
50b71649j175J5264K6893j7089J0271j1646M019J1998O45j2119j2403N27J0050
37b46414j2869k707K1804j6310J0417R056n25o669j1829j1150R912q288j4562
24b80134K1666L614j4966N833k3843m854K0998J1118j6361p743J3765J6374j8950
$$ plain form
11 -273483 -285683 -284091 -277296 -277480 -282880 -297623 -332410 -321408 -287921 -292423 -308689
0 -308689
$$ packed form
11b73483j2200J592O795j84n400j4743l4787J1002L3487m502j6266
0c08689
$$ Imaginary data points
##PAGE= N=2
##DATA TABLE= (X++(I..I)), XYDATA
$$ plain form
16383 -1122471 -1127031 -1113210 -1101998 -1090310 -1079435 -1064356 -1023978 -984452 -997574 -979970 -959909
16372 -959909 -934043 -900373 -884834 -877301 -865477 -850914 -848162 -814445 -769882 -768872 -778694 -763283
16360 -763283 -751254 -754057 -725857 -695381 -667460 -638505 -622500 -619070 -608811 -583969 -529004 -529337
16348 -529337 -534699 -531630 -504832 -487530 -473976 -452347 -465179 -452206 -430661 -413157 -413045 -388874
16336 -388874 -365114 -351162 -348160 -297461 -298106 -278826 -248270 -254171 -239772 -220925 -206075 -181753
16324 -181753 -139917 -103515 -97907 -116788 -129251 -115170 -86800 -72391 -65804 -30393 -14979 3687
16312 3687 20001 29335 45274 67718 82475 83448 98030 116113 131942 144096 157267 174933
16300 174933 197978 212742 236757 239217 241809 233563 226538 234665 257163 290548 299192 326945 346893
$$ packed form
16383a122471m560J3821J1212J1688J0875J5079M0378L9526j3122J7604K0061
16372i59909K5866L3670J5539P533J1824J4563K752L3717M4563J010r822J5411
16360g63283J2029k803K8200L0476K7921K8955J6005L430J0259K4842N4965l33
16348e29337n362L069K6798J7302J3554K1629j2832J2973K1545J7504J12K4171
16336c88874K3760J3952L002N0699o45J9280L0556n901J4399J8847J4850K4322
16324a81753M1836L6402N608j8881j2463J4081K8370J4409O587L5411J5414J8666
16312C687J6314R334J5939K2444J4757R73J4582J8083J5829J2154J3171J7666
16300A74933K3045J4764K4015K460K592q246p025Q127K2498L3385Q644K7753J9948
$$ plain form
16287 346893 367203 369558 377119 378914 391198 422623 428508 479592 486519 488379 476493 476286 501805
16274 501805 504337 499514 513626 531983 543705 572386 595508 586810 601944 627766 638128 641501
16262 641501 644558 639265 661155 680069 705592 687627 675324 685976 694668 717656 751314 786694
16250 786694 782149 782026 781888 808248 857717 834916 834042 851955 853852 844601 838238 849985 884119
16237 884119 924257 925891 932277 925304 928888 969794 952730 945448 949649 953506 958776 991930 980594
16224 980594 1005557 1009586 1015337 1003449 967749 1031223 1041764 1042770 1068977 1093719 1112950 1121959
16212 1121959 1113263 1113582 1098236 1084625 1079787 1105130 1114043 1101110 1114510 1142175 1164955 1180514
16200 1180514 1180311 1152253 1156312 1175740 1179003 1197787 1191481 1184372 1206965 1209617 1221055 1220418 1201452
$$ packed form
16287C46893K0310K355P561J795J2284L1425N885N1084O927J860j1886k07K5519
16274E01805K532m823J4112J8357J1722K8681K3122q698J5134K5822J0362L373
16262F41501L057n293K1890J8914K5523j7965j2303J0652Q692K2988L3658L5380
16250G86694m545j23j38K6360M9469k2801q74J7913J897r251o363J1747L4134
16237H84119M0138J634O386o973L584M0906j7064p282M201L857N270L3154j1336
16224I80594K4963M029N751j1888l5700O3474J0541J006K6207K4742J9231R009
16212A121959q696L19j5346j3611m838K5343Q913j2933J3400K7665K2780J5559
16200A180514k03k8058M059J9428L263J8784o306p109K2593K652J1438o37j8966
$$ plain form
16187 1201452 1218481 1238772 1235704 1224216 1255967 1263134 1288673 1250847 1268131 1298545 1294962 1309743
16175 1309743 1327776 1333790 1324418 1298634 1304106 1315102 1303840 1319705 1316222 1312564 1331235 1326710
16163 1326710 1330825 1321511 1333684 1371976 1385987 1393239 1412073 1405687 1393078 1377816 1397086 1395299
16151 1395299 1414259 1392379 1408098 1412174 1403577 1420637 1405041 1393815 1396083 1407369 1434642 1416923
16139 1416923 1412116 1434572 1433598 1429770 1419264 1436467 1481905 1465984 1429709 1396756 1391505 1422012
$$ packed form
16187A201452J7029K0291l068j1488L1751P167K5539l7826J7284L0414l583J4781
16175A309743J8033O014r372k5784N472J0996j1262J5865l483l658J8671m525
16163A326710M115r314J2173L8292J4011P252J8834o386j2609j5262J9270j787
16151A395299J8960k1880J5719M076q597J7060j5596j1226K268J1286K7273j7719
16139A416923m807K2456r74l828j0506J7203M5438j5921l6275l2953n251L0507
$$ [...]
##END NTUPLES=NMR SPECTRUM
##END=
