##TITLE=1H_DE-80H_X3
 200.13MHz, d2o
 8 sc
 
 19ns.26.2.2025
##JCAMPDX= 6.0         $$ Bruker NMR JCAMP-DX V2.0
##DATA TYPE= NMR SPECTRUM
##DATA CLASS= NTUPLES
##ORIGIN= UXNMR, Bruker Analytische Messtechnik GmbH
##OWNER= pz
$$ XWIN-NMR		Version 3.5
$$ Wed Jul  2 10:38:52 2025 Russian Standard Time (UT+4h)  Yarkov@DPX200
##.OBSERVE FREQUENCY= 200.1313
##.OBSERVE NUCLEUS= ^1H
##.ACQUISITION MODE= SIMULTANEOUS
##.ACQUISITION SCHEME= undefined
##.AVERAGES= 8
##.DIGITISER RES= 18
##SPECTROMETER/DATA SYSTEM= spect
##.PULSE SEQUENCE= zg30
##.SOLVENT NAME= CDCl3
##.SHIFT REFERENCE= (INTERNAL, CDCl3, 0, 15.6158)
##AUDIT TRAIL= $$ (NUMBER, WHEN, WHO, WHERE, WHAT)
$$ ##TITLE= Audit trail, XWIN-NMR		Version 3.5
$$ ##JCAMPDX= 5.01
$$ ##ORIGIN= Bruker BioSpin GmbH
$$ ##OWNER= Yarkov
$$ C:/Bruker/XWIN-NMR/data/yarkov2/nmr/H-C/1/pdata/1/auditp.txt
$$ ##AUDIT TRAIL=  $$ (NUMBER, WHEN, WHO, WHERE, WHAT)
(   1,<2025-07-02 10:36:41.73 +0400>,<Yarkov>,<DPX200>,
      <created by zg, POWCHK disabled, PULCHK disabled
       configuration hash MD5:
       00 E9 B6 7A A2 85 ED C7 34 08 36 98 17 FE 4E 26
       data hash MD5: 16K
       21 C3 9C 7C 4D 3D 8C 6E 15 A2 EE 27 23 CD 18 37>)
(   2,<2025-07-02 10:37:15.03 +0400>,<Yarkov>,<DPX200>,
      <Start of raw data processing
       efp BC_mod = 2 LB = 0.25 FT_mod = 6 PKNL = 1 PHC0 = -1358.546 PHC1 = 12.3666 SI = 16K 
       data hash MD5: 16K
       28 E9 8B FF CD 3A 5A 3E 6A 14 30 C8 16 54 9F C0>)
(   3,<2025-07-02 10:37:31.21 +0400>,<Yarkov>,<DPX200>,
      <abs ABSG = 5 
       data hash MD5: 16K
       F1 FE A4 74 FB 01 10 7D 13 FB 92 6B 6B AE 55 04>)
(   4,<2025-07-02 10:37:37.07 +0400>,<Yarkov>,<DPX200>,
      <pk PHC0 = 2.019162 PHC1 = -4.200002 
       data hash MD5: 16K
       F1 22 A5 9C 7B 2C 64 E1 F0 C4 77 FE 1C EE D6 A1>)
(   5,<2025-07-02 10:37:42.42 +0400>,<Yarkov>,<DPX200>,
      <abs ABSG = 5 
       data hash MD5: 16K
       51 E9 8B CA 54 3D 5C D6 31 2B D1 E1 9A 5D 93 63>)
$$ ##END=
$$ 
$$ hash MD5
$$ AB DB F7 29 1D F5 29 44 7A 68 D7 E3 65 46 6C 7F
##$RELAX= 
##$RELAX= 
##$RELAX= 
##$RELAX= 
##$RELAX= 
##$RELAX= 
$$ Bruker specific parameters
$$ --------------------------
##$DU= <C:/Bruker/XWIN-NMR>
##$EXPNO= 1
##$NAME= <H-C>
##$PROCNO= 1
##$TYPE= <nmr>
##$USER= <yarkov2>
##$AMP= (0..31)
100 100 100 100 100 100 100 100 100 100 100 100 100 100 100 100 100 100 
100 100 100 100 100 100 100 100 100 100 100 100 100 100 
##$AQSEQ= 0
##$AQ_mod= 1
##$AUNM= <au_zg>
##$AUTOPOS= <>
##$BF1= 200.13
##$BF2= 200.13
##$BF3= 200.13
##$BF4= 200.13
##$BF5= 200.13
##$BF6= 200.13
##$BF7= 200.13
##$BF8= 200.13
##$BYTORDA= 1
##$CFDGTYP= 0
##$CFRGTYP= 5
##$CHEMSTR= <none>
##$CNST= (0..31)
1 1 145 1 1 1 1 1 1 1 1 1 1 1 1 1 1 1 1 1 1 1 1 1 1 1 1 1 1 1 1 1 
##$CPDPRG= <>
##$CPDPRG1= <>
##$CPDPRG2= <>
##$CPDPRG3= <>
##$CPDPRG4= <mlev>
##$CPDPRG5= <mlev>
##$CPDPRG6= <mlev>
##$CPDPRG7= <mlev>
##$CPDPRG8= <mlev>
##$CPDPRGB= <>
##$CPDPRGT= <>
##$D= (0..31)
0 0.7 0 0 0 0 0 0 0 0 0 0.03 0 0 0 0 0 0 0 0 0 0 0 0 0 0 0 0 0 0 0 0 
$$ [...]
##$SUBNAM3= <"">
##$SUBNAM4= <"">
##$SUBNAM5= <"">
##$SUBNAM6= <"">
##$SUBNAM7= <"">
##$SUBNAM8= <"">
##$SUBNAM9= <"">
##$SW= 18.0517328524113
##$SWIBOX= (0..15)
0 0 2 0 0 0 0 0 0 0 0 0 0 0 0 0 
##$SW_h= 3612.71676300578
##$TD= 16384
##$TD0= 1
##$TE= 0
##$TE2= 300
##$TE3= 300
##$TEG= 300
##$TL= (0..7)
0 120 120 120 120 120 120 120 
##$TP= (0..7)
150 150 150 150 150 150 150 150 
##$TP07= 0
##$TPNAME0= <>
##$TPNAME1= <>
##$TPNAME2= <>
##$TPNAME3= <>
##$TPNAME4= <>
##$TPNAME5= <>
##$TPNAME6= <>
##$TPNAME7= <>
##$TPOAL= (0..7)
0.5 0.5 0.5 0.5 0.5 0.5 0.5 0.5 
##$TPOFFS= (0..7)
0 0 0 0 0 0 0 0 
##$TUNHIN= 0
##$TUNHOUT= 0
##$TUNXOUT= 0
##$USERA1= <user>
##$USERA2= <user>
##$USERA3= <user>
##$USERA4= <user>
##$USERA5= <user>
##$V9= 5
##$VALIST= <valist>
##$VCLIST= <CCCCCCCCCCCCCCC>
##$VD= 0
##$VDLIST= <DDDDDDDDDDDDDDD>
##$VPLIST= <PPPPPPPPPPPPPPP>
##$VTLIST= <TTTTTTTTTTTTTTT>
##$WBST= 1024
##$WBSW= 4
##$XGAIN= (0..3)
0 0 0 0 
##$XL= 0
##$YL= 0
##$YMAX_a= 600084
##$YMIN_a= -606850
##$ZGOPTNS= <>
##$ZL1= 120
##$ZL2= 120
##$ZL3= 120
##$ZL4= 120
##$ABSF1= 15.52432
##$ABSF2= -2.52753
##$ABSG= 5
##$ABSL= 3
##$ALPHA= 0
##$AQORDER= 0
##$ASSFAC= 0
##$ASSFACI= 0
##$ASSFACX= 0
##$ASSWID= 0
##$AUNMP= <proc_1d>
##$AZFE= 0.1
##$AZFW= 0.1
##$BCFW= 0
##$BC_mod= 2
##$BYTORDP= 0
##$COROFFS= 0
##$CY= -3
##$DATMOD= 1
##$DC= 0
##$DFILT= <>
##$DTYPP= 0
##$F1P= 0
##$F2P= 0
##$FCOR= 1
##$FTSIZE= 16384
##$FT_mod= 6
##$GAMMA= 0
##$GB= 0
##$INTBC= 1
##$INTSCL= 3.241238e-09
##$ISEN= 128
##$LB= 0.25
##$LEV0= 0
##$LPBIN= 0
##$MAXI= 10000
##$MC2= 0
##$MEAN= 0
##$ME_mod= 0
##$MI= 1.114404
##$NCOEF= 0
##$NC_proc= -5
##$NLEV= 6
##$NOISF1= 3.799351
##$NOISF2= 2.8
##$NSP= 0
##$NTH_PI= 0
##$NZP= 0
##$OFFSET= 15.61578
##$PC= 1
##$PHC0= -1356.527
##$PHC1= 8.166597
##$PH_mod= 1
##$PKNL= yes
##$PPARMOD= 0
##$PSCAL= 0
##$PSIGN= 0
##$REVERSE= no
##$SF= 200.129981172488
##$SI= 16384
##$SIGF1= 3
##$SIGF2= 2
##$SINO= 0.751879
##$SIOLD= 32768
##$SREGLST= <19F.Aceton>
##$SSB= 0
##$STSI= 16384
##$STSR= 0
##$SW_p= 3612.71676300578
##$SYMM= 0
##$S_DEV= 0
##$TDeff= 16384
##$TDoff= 0
##$TI= <>
##$TILT= no
##$TM1= 0
##$TM2= 0
##$TOPLEV= 0
##$USERP1= <user>
##$USERP2= <user>
##$USERP3= <user>
##$USERP4= <user>
##$USERP5= <user>
##$WDW= 1
##$XDIM= 16384
##$YMAX_p= 330306844
##$YMIN_p= -145562
$$ End of Bruker specific parameters
$$ ---------------------------------
##NTUPLES= NMR SPECTRUM
##VAR_NAME=  FREQUENCY,     SPECTRUM/REAL,   SPECTRUM/IMAG
##SYMBOL=    X,             R,               I
##VAR_TYPE=  INDEPENDENT,   DEPENDENT,       DEPENDENT
##VAR_FORM=  AFFN,          ASDF,            ASDF
##VAR_DIM=   16384,         16384,           16384
##UNITS=     HZ,            ARBITRARY UNITS, ARBITRARY UNITS
##FACTOR=    0.220516191357247, 1,           1
##FIRST=     3125.18573271949, 0,            0
##LAST=      -487.531030286294, 0,           0
##MIN=       -487.531030286294, -145562,     0
##MAX=       3125.18573271949, 330306844,    0
$$ Real data points
##PAGE= N=1
##DATA TABLE= (X++(R..R)), XYDATA
$$ [...]
6139b051J1621j2775l7650K4933L6129p038k8445J54Q875M382K4052q023j6922
6126b758j0077R613J8198r039j091j6118J3262J7722J0220P58k4486k362K8622
6113C2464P23j0630K240J6602p379j3136K9093j1653J470P928l7573j2400K6792
6100B4541k060P204l0700O130L6720k4676m673k47J556K2544K488k2592J747J1345
6086B9327J9081k1258p30k2610j8646J038K2106j981J11K2333R62k9560J8509
6073A8682K0464J6268n940n071J951j4436J1091q246j398k6949J2350J0127P016
6060C5909k9436q13J9362J1765j9911n761J8429o078r982j8497J8082J5419P269
6047C5757n680j3671J357J7257J7676k5230J240O009J6831J8758j0848j7184l0358
$$ y = [-2051, 9570, -3205, -40855, -15922, 20207, 13169, -15276, -15122, -6247, -1865, 22187, 14164, -2758, -12835, -3222, 14976, 5937, 4846, -11272, 1990, 19712, 29932, 30690, 6204, 3842, 32464, 33187, 22557, 24797, 41399, 34020, 20884, 49977, 38324, 39794, 47722, 10149, -2251, 24541, 22481, 29685, -1015, 5115, 41835, 17159, 12486, 12239, 13795, 36339, 38827, 16235, 17982, 29327, 48408, 27150, 26420, 3810, -14836, -13798, 8308, 6327, 6438, 28771, 29733, 173, 18682, 39146, 55414, 49474, 44403, 46354, 31918, 43009, 34763, 33365, 6416, 18766, 28893, 35909, 6473, 5660, 25022, 36787, 16876, 11115, 29544, 23466, 13484, -5013, 13069, 28488, 35757, 30077, 16406, 17763, 35020, 52696, 27466, 28706, 34715, 51546, 70304, 59456, 42272, 11914]
6034A1914J0422K3024j0108l7299K0626J1083K0064K5556m6598l475k2101k269
6022H39K583J2014P53j347K137L7264L3895N044l2912m3964K1464m5727L6229
6009B8272K7004j9713K354J2752J2777N41j4568J1341J6626k4660n231L5563j5578
5996F7480J0211J6627J0625J9285j2218Q532k1663j5726K0915P073q474K1528
5984A24195j0401j1451N738R599R822m8992K6709j1369k0033K4014K6457K2809
5972A47097j0510J2525K0061j0972q722O461j3286K5203J0454j7917K1453N702
5960A87549j0975k9269M109R204k4122m424K5807j3758J3729k4877j3951o207
5948A12815j5390J7848R975N781r599j682j1326Q113j5911j0350j2225L9537J2435
$$ y = [11914, 22336, 45360, 35252, -2047, 18579, 29662, 49726, 75282, 28684, 25209, 3108, 839, 3422, 15436, 16189, 14842, 16979, 54243, 88138, 93182, 60270, 16306, 37770, -7957, 28272, 55276, 35563, 37917, 50669, 63446, 63987, 49419, 60760, 77386, 52726, 47495, 83058, 67480, 77691, 94318, 104943, 124228, 112010, 120542, 98879, 83153, 104068, 111141, 102667, 124195, 113794, 102343, 108081, 117680, 127502, 78510, 105219, 93850, 73817, 97831, 124288, 147097, 136587, 149112, 169173, 158201, 149479, 155940, 142654, 167857, 178311, 160394, 181847, 187549, 176574, 147305, 151414, 160618, 136496, 132072, 157879, 144121, 157850, 132973, 119022, 112815, 97425, 115273, 125248, 131029, 121430, 119748, 108422, 116535, 100624, 90274, 78049, 117586, 130021]
5935A30021j1510R360J9456L4612M395m0538j7940j2218J7939j1694J7383j0869
5923A28397l8556K5160R239k7527k5579J7174p394j8050O362k337K9157k0587
5911G5459j8423M0227J3858l7858K0923k5564k3363J7569J3638J2762n9383J38
5899B9983L8223N654J0157l9363M618L667o135l729K434k642q767N085p422j0361
5885B1402k5018L1975l707k6833J6568J5765J7400P918k7954J2K3676k1776J0517
5872C9945K3399l8642l277P844K4298J3041j792J7395n290j1705K0204r764r748
5859F5908j8145J0802J2521k180n1368L69J1934K6891l629j0615l748J6221K3553
5846G8514j9734Q220m875J0759o170n355q65m440J9224P8J7117O303j7206m0807
$$ y = [130021, 118511, 127871, 147327, 181939, 186334, 145796, 127856, 115638, 133577, 121883, 139266, 128397, 89841, 115001, 124240, 96713, 71134, 88308, 80914, 62864, 69226, 66889, 96046, 75459, 57036, 97263, 111121, 73263, 94186, 68622, 45259, 62828, 76466, 89228, 29845, 29983, 68206, 73860, 84017, 44654, 49272, 52939, 46804, 43075, 45509, 42867, 34100, 39185, 31763, 21402, -3616, 28359, 24652, -2181, 14387, 30152, 47552, 55470, 27516, 27528, 51204, 29428, 39945, 63344, 24702, 21425, 29269, 53567, 66608, 64816, 82211, 76921, 65216, 85420, 75656, 65908, 47763, 58565, 71086, 68906, 17538, 17907, 29841, 56732, 53103, 42488, 38740, 54961, 78514, 58780, 67000, 62125, 72884, 66714, 61359, 60494, 56054, 75278, 75356, 92473, 98776, 81570, 40763]
5832D0763k1959L6973L191k1228j8951J3959q106M0051j6581j355L1439k1025
5820E7171k8200j3621P222L2024L1188n04q874l7743K0875K6982l098j6640j1908
5807E4874Q080j4250j4296q549M725N626J3253J1310k9536j2945K396L3234J8384
5794G2306J4282J3960k2154k6079k2759j4557J455K9395J5983L5751k9594m1306
5782B6683j2506L7625J5666q379p473P500k697j2951L614J3546k0817j75K9671
5769F9307J3124O43k7233J1091M704k4635K6604L854j6036J0257j1641J5409J0162
5756H5610k2918J490K1905l0596j5886l6265N3266J5877k2743K8185j6116j4385
5744D7424p716K674N27J689J5353p641m599k7052M835P867Q857j2853J8489j1289
$$ y = [40763, 18804, 55777, 58968, 37740, 18789, 32748, 24642, 64693, 48112, 46757, 78196, 57171, 28971, 15350, 22572, 54596, 85784, 85280, 76406, 38663, 59538, 86520, 83422, 66782, 54874, 62954, 48704, 34408, 25859, 30584, 36210, 49463, 60773, 31237, 18292, 20688, 53922, 72306, 86588, 100548, 78394, 52315, 29556, 14999, 16454, 45849, 61832, 97583, 67989, 26683, 14177, 51802, 67468, 59089, 51616, 59116, 56419, 43468, 47082, 60628, 39811, 39636, 69307, 82431, 83074, 55841, 66932, 71636, 47001, 73605, 77459, 61423, 71680, 60039, 75448, 85610, 62692, 64182, 86087, 55491, 39605, 3340, 56606, 72483, 49740, 77925, 61809, 47424, 39708, 42382, 42909, 44598, 59951, 52310, 47711, 20659, 25494, 33361, 42218, 29365, 47854, 36565]
5730C6565J4950J5363k0277R601J7602k9296Q061L0072k3555R474r695l7478J7502
5717C8889j3679r504L0002K5255K4320q91J2505j0250m5511l763M83j5636L3234
5704F5454k9763L787R158O692k50K1596J0953m5360L157R717N874Q709r984N242
5690F4982j8947L3551K8200j941m1472r091K5557j1097j5242L901k233K213q139
5677E0242P417k4928M6909n958k2425L1065J3099k1702j7865O416j12K1K740L1448
5663I6367j3800K3038k0272J8988j9209J7629n885j5951J0143J9186P14J1328
5651A22276j2427J0291O683j156N145n4935L6305J4016k9931K434O0253K2304
5639A81258r765q715Q688L1073r859K95J8550k5715K0971L1028L0786R999j1381
$$ y = [36565, 51515, 66878, 46601, 56202, 73804, 44508, 52569, 82641, 59086, 68560, 58865, 21387, 38889, 25210, 15706, 45708, 70963, 95283, 94392, 106897, 96647, 51136, 47373, 47856, 32220, 65454, 35691, 39478, 48636, 55328, 55078, 76674, 87627, 42267, 45424, 55141, 61015, 69724, 59740, 64982, 46035, 79586, 107786, 105845, 64373, 55282, 80839, 69742, 54500, 58401, 56168, 58381, 50242, 57659, 32731, 79640, 73682, 51257, 82322, 95421, 73719, 55854, 62270, 62158, 62179, 64919, 96367, 82567, 105605, 85333, 104321, 85112, 102741, 96856, 80905, 91048, 110234, 110948, 122276, 109849, 120140, 126823, 125667, 130812, 75877, 112182, 126198, 96267, 98701, 158954, 181258, 171493, 162778, 171466, 202539, 192680, 192975, 211525, 185810, 206781, 237809, 268595, 278594, 267213]
5626B67213l0538J7801N012l8420k6712Q441K5992q238o4619M9034k921r74P757
5613B08828J3048K161j7103J292J0265L9294L8613m107J4557J6234J0711K8232
5601C62025K5542M5818K8809P4758M8705O1375J2274p0343j04541l9759k2309
5590D22354k2722k3384l0635J0890J8985q595j9652r853R527r013K7837J8071
5578C83810L545j5790J975N2907P5201K5956J2150j8032L3576L8753M9832P571
5566F51454M3390N1495K2702N0689l3324j06983m9144j2810l6607n0041L1087
5555E61908j570K1907J3917j5147m751J1043j9856j0095M0878L3730j115K2497
5543F53346J297L1757M2563J156l7381l8479K2712K8521L7242K4053L5832J7932
$$ y = [267213, 236675, 254476, 259488, 221068, 194356, 202797, 228789, 220551, 155932, 204966, 202045, 201071, 208828, 221876, 224037, 206934, 208226, 218491, 257785, 296398, 292291, 306848, 323082, 333793, 362025, 387567, 433385, 462194, 536952, 585657, 647032, 659306, 588963, 484422, 444663, 422354, 399632, 376248, 345613, 356503, 375488, 366893, 347241, 337388, 346915, 337902, 365739, 383810, 387355, 371565, 373540, 426447, 501648, 527604, 539754, 521722, 555298, 594051, 643883, 651454, 694844, 746339, 769041, 819730, 786406, 679423, 630279, 617469, 580862, 530821, 561908, 560338, 582245, 596162, 581015, 576264, 587307, 567451, 557356, 598234, 631964, 630849, 653346, 654643, 686400, 728963, 730119, 692738, 654259, 676971, 705492, 742734, 766787, 802619, 820551]
5531H20551j4952l4383n1475M157q391J1697L0740p272L4183r4N571j6606J1237
5518G84963K7200J8591j9012L3131k1073O2330O975L583O277K0015K2912J6749
5506I62641m1384O063j7486R558J3558P39j1980o393R421n1057J3861O599r74
5493H93166p876J0075K3125j3445j3802L0805L2555q564m6335m1985K7879J9761
5481I05359Q845Q740k8765j1266R170L1216M983P152Q452N414q622K66l2871J868
5467I09941J2673J1389j5116k3376J5060K4532J975N708j2094K3888M5532k1737
5455I78375k1854j9696k024R186Q0l1283L429K7472J0985L355J4527J2027k8965
5442I55614l0009l503p460k3991n2259p33L5920l5567l6116J2287J0418L1397
$$ y = [820551, 805599, 771216, 719741, 723898, 715507, 727204, 757944, 750672, 784855, 784761, 790332, 773726, 784963, 812163, 830754, 811742, 844873, 823800, 886130, 893105, 896688, 902965, 922980, 945892, 962641, 921257, 927320, 909834, 919392, 932950, 933689, 921709, 915316, 924737, 873680, 887541, 894140, 893166, 885290, 895365, 918490, 905045, 891243, 922048, 954603, 946039, 899704, 857719, 885598, 905359, 914204, 922944, 894179, 882913, 892083, 923299, 928282, 935434, 943886, 949300, 940678, 940944, 908073, 909941, 922614, 934003, 918887, 895511, 910571, 935103, 937078, 942786, 930692, 954580, 1000112, 978375, 956521, 936825, 934801, 943987, 944067, 912784, 916213, 943685, 954670, 958025, 972552, 984579, 955614, 925605, 922102, 914642, 890651, 838392, 837659, 873579, 838012, 801896, 814183, 824601, 855998]
5430H55998N3903j0141k0297O617M2152k9461J779K3491R888j3342M0392L6174
5418I97153J8701L5559Q019j7912k244p896q012j2107N870j7696l9171j3440Q468
5405I55292L2006l5959j1381L2742j6287J7132k589K5633n688n131J6581J2046
5393A014397R913m029K8636L5621J5449p008l412P162N637K598k5954M6466J4679
5380A140155k8732K7644j5133J7482J3443M6797J86l331L0888M2497M133K4518
5368A300547Q444L5562j5385k6501M705J7983M548m227K0214l850J955K35O472
5355A350702M4443K5679K6060j1388J7432L3292P9815N7108N9773M3528L0132
5344A756576J3682k9696J5244K3148L1826K4551J0040L531k8072J758N879n4536
$$ y = [855998, 909901, 899760, 879463, 886080, 928232, 898771, 900550, 924041, 933929, 920587, 960979, 997153, 1015854, 1051413, 1059432, 1041520, 1039276, 1031380, 1023368, 1011261, 1017131, 999435, 960264, 946824, 955292, 987298, 951339, 939958, 972700, 956413, 973545, 970956, 996589, 990901, 985770, 1002351, 1014397, 1024310, 1020281, 1048917, 1084538, 1099987, 1092979, 1089567, 1096729, 1102366, 1104964, 1079010, 1125476, 1140155, 1111423, 1139067, 1123934, 1141416, 1154859, 1201656, 1201842, 1198511, 1229399, 1271896, 1276029, 1300547, 1308991, 1344553, 1329168, 1302667, 1307372, 1325355, 1329903, 1325676, 1345890, 1342040, 1343995, 1344230, 1350702, 1395145, 1420824, 1446884, 1435496, 1452928, 1486220, 1566035, 1623143, 1682916, 1726444, 1756576, 1770258, 1740562, 1755806, 1778954, 1810780, 1835331, 1845371, 1848902, 1820830, 1822588, 1828467, 1773931]
5332A773931j8214r703k7255k0411K4288K4238L8802N319J764J8516J1216n84
5320A821907L9933J0335K6498L0240O751M8917L9215L5618J2589J3488M1943L0988
5308B158422K7748L2761L1409J0581r876J7170N3711L777M111P6081L6804K7635
5296B470334K5276L7255M6611N8763M5728P6338L4787L6686J00493M3134N9065
5285C034470N8812L9228Q0826P5346M6193Q8841R4582J11291J10862Q1708P8393
5274C900552R9670J27594O8781J13995J45558J23229J15677J31981J49502J11966
5264E088505J32547J53934J72565J51386K08644J63735J83947J70791K22305K20755
5254F869114K41371K33647K56947K77393L18643L34305L24203L38425L77936M10880
$$ y = [1773931, 1755717, 1746014, 1718759, 1698348, 1722636, 1746874, 1785676, 1790995, 1792759, 1811275, 1822491, 1821907, 1861840, 1872175, 1898673, 1928913, 1935664, 1984581, 2023796, 2059414, 2072003, 2085491, 2127434, 2158422, 2186170, 2218931, 2250340, 2260921, 2251045, 2268215, 2321926, 2325703, 2329814, 2405895, 2442699, 2470334, 2495610, 2532865, 2579476, 2638239, 2683967, 2760305, 2795092, 2831778, 2932271, 2975405, 3034470, 3093282, 3132510, 3213336, 3288682, 3334875, 3423716, 3518298, 3629589, 3740451, 3822159, 3900552, 4000222, 4127816, 4196597, 4310592, 4456150, 4579379, 4695056, 4827037, 4976539, 5088505, 5221052, 5374986, 5547551, 5698937, 5907581, 6071316, 6255263, 6426054, 6648359, 6869114, 7110485, 7344132, 7601079, 7878472, 8197115, 8531420, 8855623, 9194048, 9571984, 9982864]
5244I982864L97356M69596M80700N04544N35316N51728O14597O41323O43704P07175
5234A5528903P64082Q30824Q36988Q69768Q80807R15614J010212J050966J061335
5225B3749499J143959J159535J134437J163479J212797J154687J130225J088034
5217C2936652J012891R43359Q80668Q26134Q12337P19842O78858P17441P16009
5208D0244191P69225P54089P98000Q41927R28273R79433R72150J049428J085293
5199D8422009J132420J157154J171953J238478J199748J209456J203802J149390
5191E7884410J124075J044526R58192Q22288O64609M45276K00940n7847k79551
5182F2806918n02973p31920q74693r62755j062579j135296j200654j196826j202900
$$ y = [9982864, 10380220, 10849816, 11330516, 11835060, 12370376, 12922104, 13536701, 14178024, 14821728, 15528903, 16292985, 17123809, 17960797, 18830565, 19711372, 20626986, 21637198, 22688164, 23749499, 24893458, 26052993, 27187430, 28350909, 29563706, 30718393, 31848618, 32936652, 33949543, 34892902, 35773570, 36599704, 37412041, 38131883, 38810741, 39528182, 40244191, 41013416, 41767505, 42565505, 43407432, 44335705, 45315138, 46287288, 47336716, 48422009, 49554429, 50711583, 51883536, 53122014, 54321762, 55531218, 56735020, 57884410, 59008485, 60053011, 61011203, 61833491, 62498100, 62943376, 63144316, 63086469, 62806918, 62303945, 61572025, 60697332, 59734577, 58671998, 57536702, 56336048, 55139222, 53936322]
5173E3936322j151494j104082j068411j069786j008492r41861q99940q36657q52404
5164D5003195p90507p49195p00392o86041o80436o31027o65698p14317p52930
5155C8632652q06546q57479q83745r93276j105329j126442j176010j228544j178464
5146B9276817j177940j153635j142880j084003j051300j022150r45317q89427
5138B0810165q69983q35251p78086p23004o78375o96047o17043o00573n92608
5129A4419195n41492n08830m81213m75461m03509m15779l74758l38499l86246
5120A0493408l25880k96686k76318k89815k67498k88025k49376k12980k50539
5111H036291j89564j97013k02994j52525j63829j78330k31011j49191j46779j83540
$$ y = [53936322, 52784828, 51680746, 50612335, 49542549, 48534057, 47592196, 46692256, 45855599, 45003195, 44212688, 43463493, 42763101, 42077060, 41396624, 40765597, 40099899, 39385582, 38632652, 37826106, 36968627, 36084882, 35091606, 33986277, 32859835, 31683825, 30455281, 29276817, 28098877, 26945242, 25802362, 24718359, 23667059, 22644909, 21699592, 20810165, 19940182, 19104931, 18326845, 17603841, 16925466, 16229419, 15612376, 15011803, 14419195, 13877703, 13368873, 12887660, 12412199, 12008690, 11592911, 11218153, 10879654, 10493408, 10167528, 9870842, 9594524, 9304709, 9037211, 8749186, 8499810, 8286830, 8036291, 7846727, 7649714, 7446720, 7294195, 7130366, 6952036, 6721025, 6571834, 6425055, 6241515]
5101F241515j28314j39054j84449j32516j34095j26954j12952j01858j23337j35966
5091D922020j27678j34773p8842j04627j07547j00235j14985p7795o4290p7307
5081C933941q2239o9191o8004p7040r2658o5044p7794p4883r1254p7836l8429
5070C119569k4413n8409m9910o0297q5228l6152m9159n4883p9875n8832m6811
5059B515600j414n4258m4659k7345k3378q824l3936n9256q730n0365n3694m9965
5047B099776o7611q46l8940j3436k3614k2145o583m1337l0219l5211k9005o526
5035A784303j4477m1851j4993k0965r673k1288n8641J0913P073R149m8944j0477
5023A570129l6114j676j2125k8262j4375j7174j6292l1233J3765q083l6217k0320
$$ y = [6241515, 6113201, 5974147, 5789698, 5657182, 5523087, 5396133, 5283181, 5181323, 5057986, 4922020, 4794342, 4659569, 4580727, 4476100, 4368553, 4268318, 4153333, 4075538, 4011248, 3933941, 3851702, 3782511, 3714507, 3637467, 3544809, 3479765, 3401971, 3327088, 3235834, 3157998, 3119569, 3095156, 3036747, 2986837, 2926540, 2841312, 2805160, 2756001, 2701118, 2621243, 2562411, 2515600, 2514186, 2459928, 2415269, 2387924, 2364546, 2355722, 2321786, 2262530, 2253800, 2203435, 2149741, 2099776, 2032165, 2031319, 1992379, 1978943, 1955329, 1933184, 1926601, 1885264, 1855045, 1819834, 1790829, 1784303, 1769826, 1727975, 1712982, 1692017, 1682344, 1661056, 1602415, 1613328, 1620401, 1629550, 1580606, 1570129, 1534015, 1532339, 1520214, 1491952, 1477577, 1460403, 1444111, 1412878, 1426643, 1418560, 1382343, 1362023]
5011A362023r865l8042j8072j9596K6665K3306l752m3116l9405K2535o0129k4756
4999A177796L4619n190K605j6820P005k8525M17K0576R439l7932m199J9656k9280
4986A150167q04l1823l088K0273j1346k5232j1972k6497J52J1080O760J2841j4648
4973A075863m9973j1165j4483J3631K8133K0455j6097k1700o556K9060k8541l2156
4961I86471M2475J3393k3580J4817J5772n9445O724N634p816l5559L6363K6323
4949A021572M1209J2448q596m5196J0309K241j8894m886k1990l874K20j5745q526
4936I60292j4032m953j4399K0369j582J8990l3027k1637l317o661N5277M901K0170
4923I80391K63R679K6672N3321K4152J9636J6335m060R351m0424n4190K7521q934
$$ y = [1362023, 1352158, 1314116, 1296044, 1276448, 1303113, 1326419, 1322667, 1279551, 1240146, 1262681, 1202552, 1177796, 1212415, 1207225, 1209830, 1193010, 1200015, 1171490, 1171907, 1192483, 1201922, 1163990, 1159791, 1179447, 1150167, 1149363, 1117540, 1114452, 1134725, 1123379, 1098147, 1086175, 1059678, 1059830, 1070910, 1077670, 1090511, 1075863, 1025890, 1014725, 1000242, 1013873, 1042006, 1062461, 1046364, 1024664, 1018108, 1047168, 1018627, 986471, 1028946, 1042339, 1018759, 1033576, 1049348, 989903, 996627, 1002261, 994445, 958886, 995249, 1021572, 1062781, 1075229, 1066633, 1021437, 1031746, 1033987, 1015093, 1010207, 988217, 984343, 984563, 968818, 960292, 946260, 941307, 926908, 947277, 945695, 964685, 931658, 910021, 906704, 900043, 955320, 960221, 980391, 980654, 990333, 1017005, 1070326, 1094478, 1114114, 1130449, 1126389, 1135740, 1095316, 1041126, 1068647, 1059713]
4910A059713r481J241j9332J2113N381k1865n027J1438k8202L750J1893j349K4095
4897A044368l7749J7571k802M350O281L3461J1432J4421k7890m8422L989N589
4885A024599M183L5024L2585q471K4804K3516j5931R451K6093k024P957K0686
4873A182472K0717j6435J2202J5098M1715j7765J780N9662K221k515K0096J2292
4861A331540n999J8393L0900J4314M0731P1681o472j0843q358n5339o8654l1631
4849A320263l5136n3131n4243r443K5889P934m3424k3837j2525k4088k7025k0387
4837A050847K107L1289L167k0673r197p118k1386m5671j8426L990l3847l4549
4825I00533j5898k851P128l7680k3279m1699M704l9364M471j6804m1942l4744
$$ y = [1059713, 1050232, 1051473, 1032141, 1044254, 1049635, 1027770, 1022743, 1034181, 1005979, 1009729, 1021622, 1020273, 1044368, 1006619, 1024190, 1021388, 1025738, 1032019, 1065480, 1076912, 1091333, 1063443, 1015021, 1019010, 1024599, 1028782, 1063806, 1096391, 1087920, 1112724, 1136240, 1120309, 1129760, 1155853, 1153829, 1161786, 1182472, 1203189, 1186754, 1198956, 1214054, 1255769, 1238004, 1239784, 1299446, 1301667, 1299152, 1319248, 1331540, 1325541, 1343934, 1374834, 1389148, 1429879, 1501560, 1495088, 1484245, 1475887, 1420548, 1351894, 1320263, 1285127, 1231996, 1177753, 1168310, 1194199, 1202133, 1158709, 1134872, 1122347, 1098259, 1071234, 1050847, 1052954, 1084243, 1087410, 1066737, 1057540, 1050422, 1029036, 983365, 964939, 968929, 935082, 900533, 884635, 881784, 888912, 851232, 827953, 786254, 790958, 751594, 756065, 739261, 697319, 662575]
4813F62575j1758K5724q118j9806k8316m3724K4677L025j4618J4218m7122j4703
4801E42054N679j1454j5816m0520l3979j491l987L497o8558K0293K4110O127p817
4788D18138k7332J9926P932k2216O658j2537K2268k2260k4195J3180K0567l0563
4776C69566j1727j523o097K1892j2786K1899j9633j209L3666k4690k3689k0281
4764C25388k4339K7059m62K0812J3302q768k8603J1433J0571m435k5782k2794
4752B93382J6393L8570J0751m6073J3639j2879n327r973j8858R105j3135Q76o325
4739B70146L2927K1558J469j5104m213j1817l2065M515N916k4821j848Q625K2055
4726B77343n853r593q475L1219l804J5849k5688j8629J1422M832J4973q439O122
$$ y = [662575, 650817, 676541, 668423, 648617, 620301, 576577, 601254, 604279, 589661, 603879, 556757, 542054, 547733, 536279, 520463, 479943, 445964, 444473, 440486, 443983, 375425, 395718, 419828, 425955, 418138, 390806, 410732, 418664, 396448, 403106, 390569, 412837, 390577, 366382, 379562, 400129, 369566, 357839, 356316, 350219, 372111, 359325, 381224, 361591, 360382, 394048, 369358, 345669, 325388, 301049, 328108, 327646, 348458, 361760, 352992, 324389, 335822, 346393, 341958, 316176, 293382, 309775, 348345, 359096, 313023, 326662, 313783, 308456, 298483, 279625, 288730, 275595, 276471, 270146, 303073, 324631, 326100, 310996, 306783, 294966, 262901, 267416, 273332, 248511, 246663, 255288, 277343, 271490, 261897, 253422, 284641, 280837, 296686, 270998, 252369, 263791, 268623, 283596, 275157, 281279]
4713B81279k7184j6631j443p262m46j6393K4507L0442j1897r635K154N61J597
4700B49649j0694j4612k0178J8952P255j0702Q144L1486n635k2675m983j670n590
4687B18747J9048L5106k1302k6450l4861L1773J80j4118j4763K0914p759j6600
4675A89915L0427L112J887J006K972j5682M853o846r694K5597k5912K1432q372
4662B14695o982J5940k9731K986L8406p853j3419J199j9159M3390j7385o5058
4650A57029R19M7193m784K9261k5930n0554K8667j076J6350R378K8716l864l2269
4637A99036P928K6832n612K7981k9035k1357J9954j2j7489J8049m2743Q021L484
4624A95037J3380J5881J2225K152j4699L5140o455j9191K4746k5960k9652K2775
$$ y = [281279, 254095, 237464, 236021, 228759, 228313, 211920, 236427, 266869, 254972, 245337, 247491, 248052, 249649, 238955, 224343, 204165, 223117, 230372, 219670, 227814, 259300, 253665, 230990, 226007, 224337, 218747, 237795, 272901, 251599, 225149, 190288, 222061, 222241, 208123, 193360, 214274, 206515, 189915, 220342, 223454, 225341, 226347, 229319, 213637, 218490, 211644, 201950, 227547, 201635, 223067, 214695, 207713, 223653, 193922, 196908, 235314, 227461, 214042, 215241, 196082, 239472, 222087, 157029, 157948, 205141, 200357, 229618, 203688, 153134, 181801, 180725, 197075, 206453, 235169, 231305, 199036, 206964, 233796, 228184, 256165, 227130, 205773, 225727, 225715, 208226, 226275, 183532, 191553, 195037, 208417, 224298, 236523, 238675, 223976, 259116, 252661, 233470, 258216, 232256, 202604, 225379]
4612B25379J6400R794j4677q900J6092J1508k1353J6830r677l2506J1135J0631
4600B30656L6078J11p68J9189M818N192m5741j31K3355J1399l4402O92P660Q235
4586B66343m353j2602J0573L0571R356j1184l766K859l7330l0064L0563J3382
4574B64348L568J5464k3501j0186j2689K0883j0417p696o264M4798l6478j2918
4562B28912K4406l114j6611q732j572k510L4841j4341n859l1467j3380M1517L4084
4549B66174j5832r338l5997k8348K3890M1417j1923J2636k2400l217j4665K7271
4537B29668J6972l927o160J5386O393k0987K792r446J2612q549M0434M1698J637
4524C18523l9350r774k1842K680J5151o728N0862L6723j8849J776k3523O418M7201
$$ y = [225379, 241779, 251573, 236896, 227996, 244088, 255596, 234243, 251073, 241396, 208890, 220025, 230656, 266734, 266845, 266077, 285266, 290084, 295276, 249535, 249404, 272759, 284158, 249756, 250448, 258108, 266343, 261990, 249388, 259961, 290532, 299888, 288704, 284938, 287797, 250467, 220403, 250966, 264348, 267916, 283380, 259879, 249693, 237004, 257887, 247470, 239774, 233510, 278308, 241830, 228912, 253318, 250204, 233593, 224861, 223289, 220779, 255620, 241279, 235420, 203953, 190573, 232090, 266174, 250342, 241004, 205007, 176659, 200549, 241966, 230043, 242679, 220279, 217062, 202397, 229668, 246640, 242713, 236553, 251939, 258332, 237345, 240137, 230691, 243303, 234754, 275188, 316886, 318523, 279173, 269399, 247557, 250237, 265388, 258660, 309522, 346245, 327396, 329172, 305649, 312067, 359268]
4511C59268p865P867j4571p853L557p001J5435L6680j0184j3943J8796J3476J7004
4498D10666k3362K7211K4410j2873j657m235o253J5116p418j874j09L6782L7840
4485D94244j8886j9506m798K8121P978P849M4682p128K545J4893K0539M1396m2246
4472E69683J7823p26R884K9582K0473l037J0959Q292q861j5996J0246K8441J7162
4459F93925L461j2522p676k218N1243n410l089R031l9591k5780L0529J8402K4575
4446G34880k2453O780K385L7578j993j7052N9261k1994n905J1987J5817J1494
4434H10785K742j6393M0428J9094L477L7501K4119K8280j2006k9000j3236K0395
4422I16186P27Q747l2819j6777J958p713jL221R254q286r911j0729k2449O036
$$ y = [359268, 351403, 359270, 344699, 336846, 340403, 333402, 348837, 385517, 375333, 361390, 380186, 393662, 410666, 387304, 414515, 438925, 426052, 424395, 420160, 413907, 429023, 421605, 419731, 419622, 456404, 494244, 475358, 455852, 451054, 479175, 487153, 495002, 539684, 532556, 535101, 549994, 570533, 611929, 569683, 587506, 586780, 596664, 626246, 646719, 643682, 654641, 662933, 654072, 638076, 648322, 676763, 693925, 697386, 684864, 677188, 674970, 726213, 720803, 717714, 726745, 687154, 661374, 691903, 710305, 734880, 712427, 719207, 721592, 759170, 757177, 740125, 799386, 777392, 771487, 783474, 799291, 810785, 813527, 797134, 837562, 856656, 860133, 897634, 921753, 950033, 938027, 909027, 895791, 916186, 916913, 925660, 892841, 876064, 878022, 870309, 870308, 873529, 882783, 874497, 864586, 853857, 831408, 837444]
4408H37444J6431J8444K3877N249J8629J3090K7201k2660k2450K3964N8853N6732
4396A054804M6795J5987L354R92j4814L930J1183J6224o535l8150k8014K7586
4384A093342r137l463J6366J8224K0470N335J4792J1152M9537J0949n009R369
4372A231927L4945P549M7400L7018N5839L2025K4671N6181O5841O0334L7350L2552
4360A723632m467N3457L1492K3906O4770L0936M2939L0614O9278Q3050O3329J06635
4348B319571R6017L9525P7637R1419R8411J04477J04631J47939J56305K02852
4338C438784J99620J95374K22740K10529K07073K27465K27886K60993K60055K71957
4328E722476L11259L42835M02465M45556M87768N56818N58965N24867M72305M29289
$$ y = [837444, 853875, 872319, 896196, 901445, 920074, 933164, 960365, 937705, 915255, 939219, 998072, 1054804, 1101599, 1117586, 1120940, 1121932, 1107118, 1111048, 1122231, 1138455, 1131920, 1093770, 1065756, 1093342, 1084205, 1080742, 1097108, 1115332, 1135802, 1141137, 1155929, 1167081, 1216618, 1227567, 1222558, 1231927, 1266872, 1274421, 1321821, 1358839, 1414678, 1446703, 1471374, 1527555, 1593396, 1653730, 1691080, 1723632, 1719165, 1772622, 1804114, 1828020, 1892790, 1923726, 1966665, 1997279, 2066557, 2149607, 2212936, 2319571, 2415588, 2455113, 2532750, 2624169, 2722580, 2827057, 2931688, 3079627, 3235932, 3438784, 3638404, 3833778, 4056518, 4267047, 4474120, 4701585, 4929471, 5190464, 5450519, 5722476, 6033735, 6376570, 6779035, 7224591, 7712359, 8269177, 8828142, 9353009, 9825314, 10254603]
4318A0254603L55765K88278L11344L35249L79172M61094N98465P41518Q00443
4309A4525931Q79123R25310R39517P65023N27820K64151L362j32202j51709n4566
4299A8491760O6931K43605M54905N48487P14785Q78117Q47918P53549M09834n9813
4289B3350078m39890p52546q39193p67435o52198m66515k68377o9353R3596K17608
4279A9405775K95800K75761R4808k25696n19175q29762r59463r27621p84097o66224
4269A5160106n10819m07110m18952m40569m15117k86742l00418l77774m01098
4260A1601507n47620o06731o09848n97802m52100m55967l97740l25904k53097
4251G354698k13123j71653j76626j53194j58395j55496j69590j62389j54681j44192
$$ y = [10254603, 10610368, 10898646, 11209990, 11545239, 11924411, 12385505, 12983970, 13725488, 14525931, 15405054, 16330364, 17269881, 18034904, 18562724, 18826875, 18830237, 18698035, 18546326, 18491760, 18558691, 18802296, 19257201, 19805688, 20520473, 21398590, 22246508, 23000057, 23409891, 23350078, 22910188, 22157642, 21318449, 20551014, 19898816, 19432301, 19163924, 19094571, 19188167, 19405775, 19701575, 19977336, 20072144, 19846448, 19327273, 18497511, 17538048, 16610427, 15826330, 15160106, 14649287, 14242177, 13823225, 13382656, 12967539, 12680797, 12380379, 12002605, 11601507, 11053887, 10447156, 9837308, 9239506, 8787406, 8331439, 7933699, 7607795, 7354698, 7141575, 6969922, 6793296, 6640102, 6481707, 6326211, 6156621, 5994232, 5839551, 5695359]
4241E695359r1041j02643q7467r9344N373j3695P057n790j1730j9419J4376L7351
4229E328387J1204K0679K8440P5155N2991M4029O0694P3880M9915Q4446O0067
4218E889887Q0069O8646M8122K5539M0723L0598M2448N9104N2750K2346M524L7131
4206F401887M8240J8063k7831p199m6925m2041j9082m6331m9482r318k8610k1996
4194F169375M43o4550o1637m6762n3937n4725m4769p2859k8399k2742o6780J7979
4182E670637o221l7508K1109M9877L6195M4675M8240L9406L4070O9226M6514M7382
4170F063602P8236P7538O8904R1345J34839Q4117N6019J27354J69677J21578J33115
4159G206324J57306J55092J85795K37582K20750K55436K39635K87632L02287K73163
$$ y = [5695359, 5604318, 5501675, 5414208, 5314864, 5320237, 5306542, 5313599, 5307809, 5296079, 5276660, 5291036, 5328387, 5339591, 5360270, 5388710, 5463865, 5516856, 5560885, 5621579, 5695459, 5745374, 5829820, 5889887, 5969956, 6038602, 6086724, 6112263, 6152986, 6183584, 6226032, 6285136, 6337886, 6360232, 6364756, 6401887, 6450127, 6468190, 6440359, 6433160, 6386235, 6344194, 6325112, 6278781, 6229299, 6219981, 6191371, 6169375, 6169818, 6105268, 6043631, 5996869, 5942932, 5888207, 5843438, 5770579, 5742180, 5719438, 5652658, 5670637, 5664416, 5626908, 5648017, 5697894, 5734089, 5778764, 5827004, 5866410, 5900480, 5969706, 6016220, 6063602, 6141838, 6219376, 6288280, 6379625, 6514464, 6598581, 6654600, 6781954, 6951631, 7073209, 7206324, 7363630, 7518722, 7704517, 7942099, 8162849, 8418285, 8657920, 8945552, 9247839, 9521002]
4149I521002L04427L74096L20504L17377L63544L85546L86994M19274M83099N17165
4139A3393028N19993N95159O71394P47956P85716Q63758R81481J080483J189211
4130B0828179J233310J342648J416284J553522J619683J775827J832504J835707
4122C3437664J818177J723373J452773J207080R35871O65405M59544M33591M99751
4113D2633229O00038P96744R61566J143896J248246J328648J379113J403188J409876
4104E2904544J386520J384475J251223J252409J242508J235711J277843J293734
4096F3228967J359555J498990J757988J965945K175923K304406K256245J972558
4088G8520577J293593L03636q26290j830337k567219k900664k842667k595619
$$ y = [9521002, 9825429, 10199525, 10520029, 10837406, 11200950, 11586496, 11973490, 12392764, 12875863, 13393028, 13913021, 14508180, 15179574, 15927530, 16713246, 17577004, 18558485, 19638968, 20828179, 22061489, 23404137, 24820421, 26373943, 27993626, 29769453, 31601957, 33437664, 35255841, 36979214, 38431987, 39639067, 40574938, 41240343, 41699887, 42133478, 42633229, 43233267, 44030011, 44991577, 46135473, 47383719, 48712367, 50091480, 51494668, 52904544, 54291064, 55675539, 56926762, 58179171, 59421679, 60657390, 61935233, 63228967, 64588522, 66087512, 67845500, 69811445, 71987368, 74291774, 76548019, 78520577, 79814170, 80117806, 79291516, 77461179, 74893960, 71993296, 69150629, 66555010]
4080F6555010k270549j958408j557256j325022j163722j042442r73600j023468
4072E5240543j083898j121554j199920j244563j311291j357687j345705j279232
4064D5296693j193342j106465r49373q27222o54916n73295n33746n71653o95080
4055C8191601r46626j232614j486602j675478j801311j771080j685355j633707
4047B5958828j524930j273299j126822j056166r53019q40691q14662p33570o28598
4038A7007071n99874n59874m88639m20219m80287m02519l70193l43759k90107
4029A3051600k63240k61118l09970l14589k81256l19952k57934l02993k92390
4020A0448158k77105k64965k07933k07697j99988j71324j82691j85053r0724q3391
$$ y = [66555010, 64284461, 62326053, 60768797, 59443775, 58280053, 57237611, 56264011, 55240543, 54156645, 53035091, 51835171, 50590608, 49279317, 47921630, 46575925, 45296693, 44103351, 42996886, 42047513, 41220291, 40565375, 39992080, 39458334, 38886681, 38191601, 37244975, 36012361, 34525759, 32850281, 31048970, 29277890, 27592535, 25958828, 24433898, 23160599, 22033777, 20977611, 20024592, 19183901, 18369239, 17635669, 17007071, 16407197, 15847323, 15358684, 14938465, 14458178, 14055659, 13685466, 13341707, 13051600, 12788360, 12527242, 12217272, 11902683, 11621427, 11301475, 11043541, 10740548, 10448158, 10171053, 9906088, 9698155, 9490458, 9290470, 9119146, 8936455, 8751402, 8660678, 8577287]
4010H577287j01257j31486p3954o9638j10951r0088p2470p3683r3646o5590o2484
3999G632040n3284q3602o4918n6181o8054j10015k7491o2351k6207m2945o1128
3988F975864j5000l8709J8178O968l8914p334j980J7557j5427K6007K6639p438
3976F946411L5095L4311K7413j355K4053M7885P9596J07973Q8410R8037J14003
3965G601832J44978J25568J59497J54529J81546K10724K15555K54982L00722L17007
3955I666940L16295M19117M20250M70442N36259N90008O30207P23547P69794Q49056
3945A5391915R84672J093208J190444J351617J442760J622106J796304J933848
3937B6806874K116717K312992K506156K706895K971227L158014L295669L359361
$$ y = [8577287, 8476030, 8344544, 8270590, 8200952, 8090001, 7999913, 7927443, 7853760, 7760114, 7694524, 7632040, 7578756, 7495154, 7430236, 7374055, 7306001, 7195986, 7168495, 7106144, 7079937, 7036992, 6975864, 6960864, 6922155, 6940333, 6947301, 6908387, 6901053, 6899073, 6916630, 6901203, 6927210, 6953849, 6946411, 6981506, 7015817, 7043230, 7041875, 7065928, 7113813, 7193409, 7301382, 7389792, 7487829, 7601832, 7746810, 7872378, 8031875, 8186404, 8367950, 8578674, 8794229, 9049211, 9349933, 9666940, 9983235, 10402352, 10822602, 11293044, 11829303, 12419311, 13049518, 13773065, 14542859, 15391915, 16376587, 17469795, 18660239, 20011856, 21454616, 23076722, 24873026, 26806874, 28923591, 31236583, 33742739, 36449634, 39420861, 42578875, 45874544, 49233905]
3929D9233905L345091L204913K911883K480867J952665J395119P85395K38266
3921F5548104j76736m49737o87689o95175n74327m03718k76573j41600q6288j81514
3911F1874747m54410q70644j321519j776189k248031k608308k982464l244242
3903D6368940l284111l211775l106566k945112k698870k430598k185542j948202
3895B4558164j706899j536011j390910j186863j089551j001186q84885q43414
3887A4918445p41160o55836n97123n68976m90589m43653m54301l91738l40192
3878A0234877l21084k65196k49321k63502k29548k02736k30950j86234j63576
3869H122730j62920j40511j70430j69658j12568r7179j04958r8166j22705m6653
$$ y = [49233905, 52578996, 55783909, 58695792, 61176659, 63129324, 64524443, 65309838, 65548104, 65371368, 64921631, 64233942, 63538767, 62964440, 62560722, 62284149, 62142549, 62056261, 61874747, 61420337, 60549693, 59228174, 57451985, 55203954, 52595646, 49613182, 46368940, 43084829, 39873054, 36766488, 33821376, 31122506, 28691908, 26506366, 24558164, 22851265, 21315254, 19924344, 18737481, 17647930, 16646744, 15761859, 14918445, 14177285, 13521449, 12924326, 12355350, 11864761, 11421108, 10966807, 10575069, 10234877, 9913793, 9648597, 9399276, 9135774, 8906226, 8703490, 8472540, 8286306, 8122730, 7959810, 7819299, 7648869, 7479211, 7366643, 7269464, 7164506, 7066340, 6943635, 6896982]
3859F896982q2398p8110p4767q2005m1482r0097o5158l2721p6628n8887k3780
3848F190949n4413n4736n7449k6871K96j0847m5973M797n828j3274J2554J9300
3836E958505K5593Q4222L0831K8990O6507J02185P3003J09063J20580J25367J25164
3825F850010J40108J21126J17338J38773J83697J50346J43541J47873J33633R2202
3815H218647J03291R6278O9673J04912N6137O8804O5591K2458L3784P44L3290
3804H873609M0495L3863M4409M7878P0957N5145P4004Q1902J30075J13627J43476
3793I709440J99638K11627K42842K76403L35407L36844L52680L96189M20231M40748
3783A2922049N16394O03867O10873N95692O77877O84751O59080O81153O04425
$$ y = [6896982, 6814584, 6736474, 6661707, 6579702, 6538220, 6448123, 6382965, 6350244, 6273616, 6214729, 6190949, 6136536, 6081800, 6024351, 5997480, 5997776, 5986929, 5940956, 5945753, 5939925, 5926651, 5939205, 5958505, 5984098, 6068320, 6099151, 6128141, 6194648, 6296833, 6369836, 6478899, 6599479, 6724846, 6850010, 6990118, 7111244, 7228582, 7367355, 7551052, 7701398, 7844939, 7992812, 8126445, 8218647, 8321938, 8418216, 8487889, 8592801, 8648938, 8717742, 8783333, 8805791, 8839575, 8840319, 8873609, 8914104, 8947967, 8992376, 9040254, 9111211, 9166356, 9240360, 9322262, 9452337, 9565964, 9709440, 9909078, 10120705, 10363547, 10639950, 10975357, 11312201, 11664881, 12061070, 12481301, 12922049, 13438443, 14042310, 14653183, 15248875, 15926752, 16611503, 17270583, 17951736, 18556161]
3774A8556161N10210L70940K58169J72700J1967l5732j099n344O6530J30310K33631
3763B0268443K86704L56599M69928M98259N73364O34161N87381O37920O63223
3754B4975982O33022N98602O19478O78368O76929O79900O89962P83836Q45571
3745C1181650R92691J083870J213729J355248J533271J730853J884930K141131
3737D3117373K342895K649333K911186L244959L536743L906895M343514M801303
3729G0854201N184889N642900N902911O028621N954077N652107N165097M516864
3721A14901667L827979L038815K192980J289192L34814o20431j492531k238651
3713A21233834k861352l338915l665277l841361m062137m244314m418220m603556
$$ y = [18556161, 19066371, 19437311, 19695480, 19868180, 19880147, 19844415, 19843316, 19837972, 19904502, 20034812, 20268443, 20555147, 20911746, 21381674, 21879933, 22453297, 23087458, 23674839, 24312759, 24975982, 25609004, 26207606, 26827084, 27505452, 28182381, 28862281, 29552243, 30336079, 31181650, 32174341, 33258211, 34471940, 35827188, 37360459, 39091312, 40976242, 43117373, 45460268, 48109601, 51020787, 54265746, 57802489, 61709384, 66052898, 70854201, 76039090, 81681990, 87584901, 93613522, 99567599, 105219706, 110384803, 114901667, 118729646, 121768461, 123961441, 125250633, 125585447, 124965016, 123472485, 121233834, 118372482, 115033567, 111368290, 107526929, 103464792, 99220478, 94802258, 90198702]
3705I0198702m781695m907726m997696n003113m844763m716193m467576m159716
3697E2320224l892587l581404l228114k913396k631594k301805k085280j911453
3689B9774591j687459j498262j325231j210132j102907j013019q91768q02320
3681B0243493p49946p24913n67265n96286m95080m04456m56321l95448l88869
3672A5464909k82327k14524j82939j22910j5895J8133L6154O9110P7474R8476
3662A4945661J13631J73776J42449M6442M7596Q115r2597j55076k45726l16636
3652A4667635m13574m26270m91225n23504n14171n33138n00708m76588m33857
3643A0354600l89420l69185l63386l25850l46419l08629k21700k06137k32334
$$ y = [90198702, 85417007, 80509281, 75511585, 70508472, 65663709, 60947516, 56479940, 52320224, 48427637, 44846233, 41618119, 38704723, 36073129, 33771324, 31686044, 29774591, 28087132, 26588870, 25263639, 24053507, 22950600, 21937581, 21045813, 20243493, 19493547, 18768634, 18201369, 17605083, 17110003, 16705547, 16249226, 15853778, 15464909, 15182582, 14968058, 14785119, 14662209, 14646314, 14664447, 14700601, 14769711, 14847185, 14945661, 15059292, 15233068, 15375517, 15421959, 15469555, 15477670, 15385073, 15229997, 14984271, 14667635, 14254061, 13827791, 13336566, 12813062, 12298891, 11765753, 11265045, 10788457, 10354600, 9965180, 9595995, 9232609, 8906759, 8560340, 8251711, 8030011, 7823874, 7591540]
3634G591540k03012j70283j66640j83725j39637j05692j14884o8913j04611j13658
3624F220485p9562p7584q5163n7667p3159l5339k8715l2938l8631k7864l0188
3613E653675m6116k2074j0422l2568k6336m9263k3483k4061j2624o1571p0027
3602E275130q3344j3498j8820r3191o2687n0991m3551j2834n8160m8726k0065
3591D769263o4400m6894K94m5906m0966k4120k1487j4458m6451j7864K311k1696
3579D427626l8724J1630K2666K3379k53m3J626j3387N296L8673K3377L5158K0240
3566D557264J7927L6419N6320M2124N0703P9160N2183P4134J30217Q0853Q7376
3555E264680J63180J60709J55202J60175J94901K47995J94732K84030K52446L11900
$$ y = [7591540, 7388528, 7218245, 7051605, 6867880, 6728243, 6622551, 6507667, 6438754, 6334143, 6220485, 6140923, 6063339, 5978176, 5920509, 5847350, 5812011, 5783296, 5750358, 5711727, 5683863, 5653675, 5607559, 5585485, 5575063, 5542495, 5516159, 5466896, 5443413, 5419352, 5406728, 5345157, 5275130, 5191786, 5178288, 5159468, 5066277, 5003590, 4952599, 4909048, 4896214, 4838054, 4789328, 4769263, 4704863, 4657969, 4658263, 4612357, 4571391, 4547271, 4525784, 4511326, 4464875, 4447011, 4449322, 4427626, 4388902, 4400532, 4423198, 4446577, 4446324, 4446281, 4447907, 4434520, 4439816, 4478489, 4501866, 4537024, 4557264, 4575191, 4611610, 4667930, 4710054, 4760757, 4839917, 4892100, 4966234, 5096451, 5177304, 5264680, 5427860, 5588569, 5743771, 5903946, 6098847, 6346842, 6541574, 6825604, 7078050, 7389950]
3545G389950L44341L50636M26578L91342L97491M05603L57096L11426K32109K60895
3535A0867467K31888J19150J31956J00308P9366J12324J53177K25698K31127K37845
3525A2490306K08029J82528J94888J70744O1233J5430j5884m647j5764J9533R3838
3514A3400234P2416J06894K10426K46446K46495L26284L65474M45325N37635N35773
3504A6493402N89646O74341P43726Q75895R19781J061572J213947J315952J499047
3495B5387309J664476J873633K072491K324099K609335K826981L122473L454687
3487D5335484L755089M090944M405802M497641M654196M649825M503163M242786
3479H0134930L832150L451023L178910K946294K808036K736841K750233K763323
$$ y = [7389950, 7734291, 8084927, 8511505, 8902847, 9300338, 9705941, 10063037, 10374463, 10606572, 10867467, 11099355, 11218505, 11350461, 11450769, 11530135, 11642459, 11795636, 12021334, 12252461, 12490306, 12698335, 12880863, 13075751, 13246495, 13307728, 13323158, 13307274, 13302627, 13286863, 13306396, 13400234, 13472650, 13579544, 13789970, 14036416, 14282911, 14609195, 14974669, 15419994, 15957629, 16493402, 17083048, 17757389, 18501115, 19377010, 20296791, 21358363, 22572310, 23888262, 25387309, 27051785, 28925418, 30997909, 33322008, 35931343, 38758324, 41880797, 45335484, 49090573, 53181517, 57587319, 62084960, 66739156, 71388981, 75892144, 80134930, 83967080, 87418103, 90597013, 93543307, 96351343, 99088184, 101838417, 104601740]
3471A04601740K659117K524940K275357J817556J169581M25141m00439j238076
3463A13834917j891367k385577k726429k974719l093853l063602l086135l111916
3455I1501319l217275l316245l492648l686555l870216m023804m106646m083583
3447F1704347l968471l843247l597911l255893k989666k700570k365033k074846
3439C6908710j802003j585118j408885j248146j087611r18647q26885p15958o52983
3430B6662474n47466m20202l60631l24887k67060k35724j62750j21054j33602
3421B4089098j07514r8594n0820k3554j3554l6393J7777N3052M6716R23k9234
3410B3847903o2384j24628j79121k12027k89140l27914l02132l09487k71327k58785
$$ y = [104601740, 107260857, 109785797, 112061154, 113878710, 115048291, 115473432, 115072993, 113834917, 111943550, 109557973, 106831544, 103856825, 100762972, 97699370, 94613235, 91501319, 88284044, 84967799, 81475151, 77788596, 73918380, 69894576, 65787930, 61704347, 57735876, 53892629, 50294718, 47038825, 44049159, 41348589, 38983556, 36908710, 35106707, 33521589, 32112704, 30864558, 29776947, 28858300, 28031415, 27315457, 26662474, 26115008, 25694806, 25334175, 25009288, 24742228, 24506504, 24343754, 24222700, 24089098, 23981584, 23882990, 23832170, 23808616, 23795062, 23758669, 23776446, 23829498, 23876214, 23877137, 23847903, 23785519, 23660891, 23481770, 23269743, 22980603, 22652689, 22350557, 22041070, 21769743, 21510958]
3400B1510958l13285l60733l75201l49401l77111l86605l39886l00097l85793
3391A8322846l73947l55093k74703k18433j66005j55057m6361L3674l653L2512
3381A6795780P3079J29878J45835K10051K78090L33493M05579M38911M79774N09179
3371A9799649M71847M81959N28895N88060O56300O03937M77999L97420L33002
3362B4339068K67668J48450Q686j00658k31021k90999l14807l42723l03043k72794
3352B2907827k23552j84337j00812j08605j14609j84784j32960m7424J7498L1732
3342B1859974J32274K39520L35632M31351N41582O87071Q70588J051589J166599
3333B7316180J195542J313276J600670J844192K141102K362578K547238K766528
$$ y = [21510958, 21197673, 20836940, 20461739, 20112338, 19735227, 19348622, 19008736, 18708639, 18322846, 17948899, 17593806, 17319103, 17100670, 16934665, 16779608, 16733247, 16766921, 16763268, 16795780, 16868859, 16998737, 17144572, 17354623, 17632713, 17966206, 18371785, 18810696, 19290470, 19799649, 20271496, 20753455, 21282350, 21870410, 22526710, 23130647, 23608646, 24006066, 24339068, 24606736, 24755186, 24763872, 24663214, 24432193, 24141194, 23826387, 23483664, 23180621, 22907827, 22684275, 22499938, 22399126, 22290521, 22175912, 21991128, 21858168, 21810744, 21828242, 21859974, 21992248, 22231768, 22567400, 22998751, 23540333, 24227404, 25097992, 26149581, 27316180, 28511722, 29824998, 31425668, 33269860, 35410962, 37773540, 40320778, 43087306]
3325D3087306L045120L321366L658765L947327M261508M485008M524210M428148
3317G4758758M076436L480816K681202J631242M67355o93075j951800l052079
3309H1398855l934886m553956m922013n017579m891412m607286m218897l749348
3301D5503478l360125k988186k586620k234944j909533j666553j475630j323359
3293B7958528j140042j047860r32931q53904p75526p05017o41579n77968n73697
3284B0710004n54786m91236m45224m15922l64049l61753m11739l54445l20410
3275A6990440k94020k35984k21329j69604k07395l70435n42988o09936o14463
3266A3724286n60307n08608n03516m81777m27974l57212l43683l01883k80922
$$ y = [43087306, 46132426, 49453792, 53112557, 57059884, 61321392, 65806400, 70330610, 74758758, 78835194, 82316010, 84997212, 86628454, 87095809, 86402734, 84450934, 81398855, 77463969, 72910013, 67988000, 62970421, 58079009, 53471723, 49252826, 45503478, 42143353, 39155167, 36568547, 34333603, 32424070, 30757517, 29281887, 27958528, 26818486, 25770626, 24837695, 23983791, 23208265, 22503248, 21861669, 21283701, 20710004, 20155218, 19663982, 19218758, 18802836, 18438787, 18077034, 17665295, 17310850, 16990440, 16696420, 16460436, 16239107, 16069503, 15862108, 15491673, 14948685, 14338749, 13724286, 13163979, 12655371, 12151855, 11670078, 11242104, 10884892, 10541209, 10239326, 9958404]
3257I958404k81560k14973k14266j93107j72856j99055j77321j60550j63062j28319
3247H053335p3235o8269o0642m2510m1326k12205l24293l69311l24489k13843
3237F323212j78882j79980j59844q8443j28966j46236j20815n7757q2136q2435
3227E097718n1070l8617q542n3496q39j1176l0158j4239l1754N4284M175r901
3215D906385l1258m1512k2652o4221n683l3183p4916n7460l8088j6354r6923q9561
3203D334574j5629l9422q4489n0875q80j2268J815N249K691j2667J8030l9818
3191D106311n6783j8216N13O133p722M6667j9033l78O87O451l7563m5675r80K2595
3177D003007J4536L440K0482N4956k9581o482J5499n7656k844K5223K6636O515
$$ y = [9958404, 9676844, 9461871, 9247605, 9054498, 8881642, 8682587, 8505266, 8344716, 8181654, 8053335, 7980100, 7911831, 7851189, 7808679, 7767353, 7555148, 7230855, 6861544, 6537055, 6323212, 6144330, 5964350, 5804506, 5716063, 5587097, 5440861, 5320046, 5262289, 5180153, 5097718, 5046648, 5008031, 4999489, 4945993, 4945154, 4933978, 4903820, 4889581, 4857827, 4912111, 4916286, 4906385, 4875127, 4833615, 4810963, 4746742, 4741059, 4707876, 4632960, 4575500, 4537412, 4521058, 4424135, 4334574, 4318945, 4279523, 4195034, 4144159, 4143279, 4131011, 4132826, 4138075, 4140766, 4128099, 4146129, 4106311, 4049528, 4031312, 4031825, 4037958, 4030236, 4076903, 4057870, 4057492, 4058179, 4064630, 4027067, 3981392, 3980412, 4003007, 4017543, 4020983, 4041465, 4096421, 4066840, 4060358, 4075857, 4018201, 4015357, 4040580, 4067216, 4073731]
3165D073731j8456L0946j9134l8105j4180m224r428m1022j021m703q060k814o3622
3152C879908m4904K3680l2018k9565m4311q068j4825L1363J8473L9444R1370J10378
3140D020925Q7940J31505J23681Q4689O3104P5395O3312O5272O620N3971L3723
3129D810137J9560Q980N4476J03006J01835J06465Q2737J12410R5181O7330R5708
3118E657825P3354O7852Q6049Q8887O7818N4586J43086J27734J61430J55766K20490
3107F904877K32462K39253K89652L69025L81562L99191L77482L23929L44947L29990
3097A0192370L65055L80047M15789M22925N13157O17263O44171O51345P33818
3088A4935940P49516Q00600Q59694R10141R66541R79864J100831J169697J258151
$$ y = [4073731, 4055275, 4086221, 4067087, 4028982, 4014802, 4010578, 4001150, 3960128, 3959107, 3954404, 3946344, 3943530, 3879908, 3835004, 3858684, 3826666, 3797101, 3752790, 3744722, 3729897, 3761260, 3779733, 3819177, 3910547, 4020925, 4108865, 4240370, 4364051, 4448740, 4511844, 4587239, 4650551, 4715823, 4722443, 4776414, 4810137, 4829697, 4838677, 4893153, 4996159, 5097994, 5204459, 5287196, 5399606, 5494787, 5562117, 5657825, 5731179, 5799031, 5885080, 5973967, 6041785, 6096371, 6239457, 6367191, 6528621, 6684387, 6904877, 7137339, 7376592, 7666244, 8035269, 8416831, 8816022, 9193504, 9517433, 9862380, 10192370, 10557425, 10937472, 11353261, 11776186, 12289343, 12906606, 13550777, 14202122, 14935940, 15685456, 16486056, 17345750, 18255891, 19222432, 20202296, 21303127, 22472824, 23730975]
3079B3730975J330453J511595J645770J832791K066366K246024K345920K491936
3071C9201830K552886K617936K641941K906802L334735L833042M354088M962871
3063F6406131N717692O605000P574729Q648961R794363J0893550J1882799J2446284
3055A39969509J2537983J2760523J4044269J6807425K0896963K5384872K8822030
3048B71223574K8991858K2646650P444762j3454466l0316013l6238653l3634774
3041B16662938k7952408k2284345j7702301j4305787j1706805r771701q335614
3034A04603977p379768o599669n991699n411149m811864m326279l735668l220665
3026F3127216k687706k192327j853380j550780j361146j209038j121602r72301
$$ y = [23730975, 25061428, 26573023, 28218793, 30051584, 32117950, 34363974, 36709894, 39201830, 41754716, 44372652, 47014593, 49921395, 53256130, 57089172, 61443260, 66406131, 72123823, 78728823, 86303552, 94952513, 104746876, 115640426, 127523225, 139969509, 152507492, 165268015, 179312284, 196119709, 217016672, 242401544, 271223574, 300215432, 322862082, 330306844, 316852378, 286536365, 250297712, 216662938, 188710530, 166426185, 148723884, 134418097, 122711292, 112939591, 104603977, 97224209, 90624540, 84632841, 79221692, 74409828, 70083549, 66347881, 63127216, 60439510, 58247183, 56393803, 54843023, 53481877, 52272839, 51151237, 50178936]
3018E0178936p51339n84432l29645j36915m1656j5167k68402p79708j203863j121823
3008D4945986p66271m75079j14542J13012M17855N95655P84649J056123J161526
2999D7718914J328436J415855J360646J065111O02735j76976j034019j876015
2991E0404687k440096k664996k634013k512454k300227k054282j879115j714494
2983C2205010j538444j467259j413646j362460j374458j374437j311163j171492
2975B1191651j069068r84550r38972q36173p86822o72479o15667n45496n12788
2966A4229636n57021m98069n10446n22664m55198l68059l85750l89141l08214
2957A0235074l31850k79313k22421k07921j89233j89178j86018k08244j95099
$$ y = [50178936, 49427597, 48843165, 48513520, 48376605, 48334949, 48319782, 48051380, 47271672, 46067809, 44945986, 44179715, 43704636, 43590094, 43703106, 44120961, 44716616, 45501265, 46557388, 47718914, 49047350, 50463205, 51823851, 52888962, 53491697, 53314721, 52280702, 50404687, 47964591, 45299595, 42665582, 40153128, 37852901, 35798619, 33919504, 32205010, 30666566, 29199307, 27785661, 26423201, 25048743, 23674306, 22363143, 21191651, 20122583, 19138033, 18199061, 17362888, 16576066, 15903587, 15287920, 14742424, 14229636, 13672615, 13174546, 12664100, 12141436, 11686238, 11318179, 10932429, 10543288, 10235074, 9903224, 9623911, 9401490, 9193569, 9004336, 8815158, 8629140, 8420896, 8225797]
2948H225797k11022k26146k59143k53152j89617k16821j94457j99077j66895j62768
2938F146699j97589j57799j02018j34856j44951j37878j19772q8668j40221j13570
2928D809377r7576p8182r0027r2350j04448n5195k1531k6122n7967r3954j14716
2917C977309l2793k4743m6781n3103q8137o4997q9382j04276r0894r3888q8606
2906C199709o0117n1618l0014p93m4679o6500l9988n3900o6914n3105m8822m0318
2894B642941k3852m7478n3825j7635r433m5092m6239k5762k7566m4206m3481m0335
2882B218037k1741k8204l5729k1905K707M52k5895O870J1159j1520p110m1273
2870B045848J2520J4012m00j1481k0561m4420m7447N177K414m7256P94j5609m1324
$$ y = [8225797, 8014775, 7788629, 7529486, 7276334, 7086717, 6869896, 6675439, 6476362, 6309467, 6146699, 5949110, 5791311, 5689293, 5554437, 5409486, 5271608, 5151836, 5063168, 4922947, 4809377, 4711801, 4633619, 4543592, 4451242, 4346794, 4291599, 4270068, 4243946, 4185979, 4092025, 3977309, 3944516, 3919773, 3872992, 3819889, 3731752, 3666755, 3577373, 3473097, 3382203, 3288315, 3199709, 3139592, 3087974, 3057960, 3057167, 3012488, 2945988, 2906000, 2852100, 2785186, 2732081, 2683259, 2642941, 2619089, 2571611, 2517786, 2500151, 2490718, 2445626, 2399387, 2373625, 2346059, 2301853, 2258372, 2218037, 2196296, 2168092, 2132363, 2110458, 2113165, 2113617, 2087722, 2094592, 2105751, 2094231, 2087121, 2045848, 2058368, 2072380, 2071980, 2060499, 2039938, 1995518, 1948071, 1953248, 1955662, 1908406, 1909200, 1893591, 1852267]
2857A852267j7008k459k6949n5273m8582k7880j5370j0685j2332l23k9856k3498
2845A582052j1905m4844j6222k0099j1648M4317J4940J7187Q667l3817j8876k523
2833A507229l6844n9755k8094o591m7372k9449J1123l4943j6540J1735K9442k018
2821A297923j5181m597k6067l2472J1529l4058n0626n098L2621k4974N305K2674
2809A176979J211j1833l549j172j7720M7387R184p4830k8214q177p025L2814k69
2796A114786j6166k3299K658R166k3506j5831p510M8470J3408K5750J3438J5193
2784A156557L815L0463L5824L9856M122K2422K9176Q647L6354L3003N4460K5679
2772A480378M6834O3881N4086M0839R1192O0808Q8167J15512J16621J41815R0098
$$ y = [1852267, 1835259, 1832800, 1805851, 1750578, 1701996, 1674116, 1658746, 1648061, 1635729, 1635406, 1605550, 1582052, 1570147, 1525303, 1509081, 1488982, 1477334, 1521651, 1536591, 1553778, 1562445, 1528628, 1509752, 1507229, 1470385, 1410630, 1382536, 1375945, 1328573, 1299124, 1310247, 1275304, 1258764, 1270499, 1299941, 1297923, 1282742, 1278145, 1252078, 1219606, 1231135, 1197077, 1146451, 1141353, 1173974, 1149000, 1154305, 1176979, 1178190, 1166357, 1162808, 1161636, 1143916, 1191303, 1200487, 1125657, 1097443, 1089266, 1082241, 1115055, 1114786, 1098620, 1075321, 1077979, 1087145, 1063639, 1047808, 1040298, 1088768, 1102176, 1127926, 1141364, 1156557, 1160372, 1190835, 1226659, 1266515, 1270637, 1293059, 1322235, 1330882, 1367236, 1400239, 1454699, 1480378, 1527212, 1591093, 1645179, 1686018, 1777210, 1838018, 1926185, 2041697, 2158318, 2300133, 2390231]
2761B390231L7315n6772j21770j67312j44571r6200j23413j11434r5612r1799
2751A418663k9891o4224o6964j6137l7602l0379l3673j8484l4580k2092j2797
2740A051840k2362l7078N5n913j4226k1321J6910J039n742k5685P684O85j0281
2727I35605j450r746j2508j3502o463m3345o776J1687l074J3564j7573J138j5062
2714H32495K567k0446j3313m374M9505p403o8778m095j1882m2411j7782n45k3516
2701F70022k7065j299J2816j5859m0199R016j748n2812J1518r101j9369k633R382
2688E42669l2730j4123o675J0715r985j2319k831J7327l4815j0906J2333j106
2676D57554l7941j4105J7660L6487k19m1645j0951j526m1335r742K0842Q834k1626
$$ y = [2390231, 2427546, 2370774, 2249004, 2081692, 1937121, 1840921, 1717508, 1606074, 1510462, 1418663, 1388772, 1324548, 1257584, 1241447, 1203845, 1173466, 1139793, 1121309, 1086729, 1064637, 1051840, 1029478, 992400, 992455, 986542, 972316, 950995, 967905, 968944, 963202, 937517, 945201, 945886, 935605, 934155, 924409, 911901, 898399, 891936, 848591, 841815, 853502, 850428, 863992, 846419, 847557, 832495, 835062, 814616, 801303, 796929, 846434, 839031, 770253, 766158, 754276, 711865, 694083, 693538, 670022, 642957, 641658, 654474, 638615, 598416, 607432, 605684, 552872, 564390, 555289, 535920, 533287, 542669, 509939, 495816, 489141, 499856, 489871, 477552, 474721, 492048, 457233, 446327, 458660, 457554, 419613, 405508, 423168, 459655, 459436, 417791, 406840, 405314, 363979, 354237, 375079, 383913, 362287]
2663C62287j4124j9332l6913l199M3046L9595p407K473o385k0057J9156J3374
2651C72514j305N463k564j0528j961p296k0843k2523K7971k858R77q183m9117
2638B79747N856K3566J9171m3989k0041m666M6444j219j0247K2040n835j1609
2626B99218M735k733k4749K3121L7148J1349k0707k2449N481j017l616j5093K9850
2613C20538K8478j8463k2908j963J6004l0613j5246K3231p942j2404Q743j8434
2601B69021j4224J6305K3596K0150k36l4862r618P860k5448M143j3665J7079L8215
2588B98316m0019j6746J4980l2389m380O563P534o392j5238K7773j6034k8017
2576A95951J4071L9858k826m5176j7778R765l4191K2370K7782J550r223O643k444
$$ y = [362287, 348163, 328831, 291918, 288719, 331765, 371360, 363953, 366426, 360041, 339984, 359140, 372514, 371209, 376672, 374108, 363580, 361619, 354323, 333480, 310957, 338928, 336070, 337047, 328864, 279747, 285603, 309169, 328340, 284351, 264310, 259644, 306088, 304869, 294622, 316662, 310827, 299218, 303953, 301220, 276471, 299592, 336740, 348089, 327382, 304933, 310414, 309397, 305781, 290688, 320538, 349016, 330553, 307645, 305682, 321686, 291073, 275827, 299058, 291116, 278712, 287455, 269021, 254797, 271102, 294698, 314848, 314612, 279750, 270132, 277992, 252544, 256687, 243022, 260101, 298316, 258297, 241551, 256531, 224142, 219762, 226325, 233859, 227467, 212229, 240002, 223968, 195951, 210022, 249880, 247054, 201878, 184100, 193865, 159674, 182044, 209826, 211376, 202153, 208796, 206352]
2563B06352l5870K5803j4241N038L261R38j4518j1279J6219K7545o049j12O622
2550B09709k475j0621k8804J784q427q008O042J0110J452j7679J2070J1005O38
2537A76796P999j3512o943m1146l704J6276j6479j465J7369m486J29J4869j6449
2524A29254K1492j2644L1010l2710m205K3387p992q431r252O924j1728m318j7766
2511A03021L287N106n3J3712o334m475j1001k2083r523K452J3310J0363K2216
2498A19998j438J717L3623N376k7556k4577j1727l7r045L8697j7227j3290j8230
2485G6284P586M920O258n637L5225M1591k3943k4701j8409L708l5710j644N9379
2472A24907l8233K6982o938P289j4740k602M323J5070k826j6527J2503k3486L25
$$ y = [206352, 170482, 196285, 182044, 187082, 190343, 191281, 176763, 165484, 181703, 209248, 203199, 203087, 209709, 207234, 196613, 167809, 169593, 161166, 153158, 159200, 169310, 170762, 153083, 165153, 176158, 176796, 184795, 171283, 164340, 123194, 119490, 135766, 119287, 117822, 135191, 130705, 130834, 145703, 129254, 150746, 138102, 169112, 136402, 132197, 155584, 147592, 139161, 129909, 136833, 125105, 120787, 103021, 106308, 111414, 111361, 125073, 118739, 114264, 103263, 81180, 71657, 74109, 87419, 97782, 119998, 118560, 120277, 153900, 159276, 131720, 107143, 95416, 95379, 86334, 125031, 107804, 94514, 76284, 83870, 88790, 95048, 89411, 124636, 166227, 142284, 117583, 99174, 102882, 67172, 65528, 124907, 86674, 113656, 106718, 114007, 99267, 96665, 100988, 116058, 113232, 96705, 109208, 85722, 86047]
2459H6047r026J6122r65K0164j6259r745R944l1504l5899O9953R958j0390O699
2446A05099L823k583j4378j6059J4845l960l5088J4595K5480L4604j0939k7055
2434H8384m340j4008K2677k9146j4687L0948j2911l5167J5559J1836J1671K7024
2422I7840o416k0160Q390j574L242k1989O320J5034L066J806j6477Q498r049K617
2408G1148j0457k1679J8161R376K8967R63k2503l1110l2833M1564j402J5981l0108
2395C6068l980J8566l922K7321N89j510N947o740k1377K9575M099m8284J5604
2382E1956q879K4860l48K1821J0327K3668l471O794j3225o780K5349O310k7981
2369A10401O248N405k4462R20j7547P153K359P104m038L219J4143P844l0267J4966
$$ y = [86047, 77021, 93143, 92178, 112342, 96083, 86338, 96282, 64778, 28879, 98832, 108790, 98400, 105099, 108922, 106339, 91961, 75902, 90747, 86787, 51699, 66294, 91774, 126378, 115439, 88384, 84044, 70036, 92713, 63567, 48880, 79828, 66917, 31750, 47309, 59145, 70816, 97840, 91424, 71264, 79654, 78080, 81322, 59333, 65653, 80687, 83753, 85559, 69082, 77580, 68531, 71148, 60691, 39012, 57173, 66549, 95516, 96479, 73976, 42866, 10033, 51597, 50195, 66176, 36068, 32088, 50654, 46732, 74053, 74642, 73132, 79079, 72339, 50962, 80537, 84636, 36352, 51956, 43077, 67937, 67589, 89410, 99737, 123405, 119934, 126728, 113503, 106723, 132072, 138382, 110401, 116649, 122054, 97592, 98512, 80965, 88118, 90477, 97581, 93543, 96762, 110905, 118749, 88482, 103448]
2355A03448j5190O189l8368K6504l520j4362j162P289P919l1820L7418K5550j3172
2342I6723j5077j5106R663J0468M651J4347j4737r243j7403J6757L3739q371j1132
2329I5279M457O163k2503k7054o261M926J558L4934o696K901J8880J951j2240
2316I6295n2360J3602J348N58J5162J6260J6113k1261L908n820K3153j4852p266
2303H4840J430j9088M943l6019O737J1308k1796M5471k532o400L722K1992J7326
2290A11934l1942J1814l15L557K7187J2823l4158j5260J1953J3023j4760M380
2278A00236K0221K395p090l852J5790K7704M328m4581Q27J0008L973J7833k391
2265A45401o26K3361K1739K0190M1135j3783o781J6697J9643K3658n472J5264
$$ y = [103448, 88258, 94447, 56079, 82583, 79063, 64701, 63539, 70828, 78747, 46927, 84345, 109895, 96723, 81646, 66540, 76203, 86671, 91322, 105669, 90932, 81689, 64286, 81043, 114782, 106411, 95279, 99736, 105899, 83396, 56342, 50081, 55007, 56565, 91499, 84803, 87704, 106584, 108535, 96295, 43935, 57537, 58885, 59443, 74605, 90865, 106978, 85717, 89625, 83805, 106958, 92106, 84840, 86270, 67182, 72125, 36106, 42843, 54151, 32355, 77826, 75294, 68894, 72616, 94608, 111934, 79992, 91806, 91491, 95048, 122235, 135058, 100900, 85640, 97593, 110616, 95856, 100236, 120457, 122852, 115762, 111910, 127700, 155404, 159732, 115151, 115978, 125986, 129959, 147792, 145401, 144775, 168136, 189875, 210065, 251200, 237417, 230636, 247333, 266976, 290634, 285162, 300426]
2253C00426J4561K2876q24M927K2489P002J9833J2769N576J7006N0936N6910L5413
2240E69900N7199O5056J7932P5987M6934N1776Q7521Q5238O7097J12080J36218
2229A372938J64670J64755J90656J82411J94762J93057K64962L01662M36782L28938
2219C795593K32823K85492M32812O73657R32163J144767J478159J604776P49093
2210A1329335j304851k439255j719119j064649o73112n37993m60035l88582k68398
2201B473341k32915j30689j53284p0663p3151j41855j19418j48453j66214j50876
2191A085823p2846J80p2231n5652j4483p6738m6848k7701m7951k8072q8665m6958
2179E07858J5332l8577m5037J4994J4761q501p6648p1287O682r23K0798j160q875
$$ y = [300426, 314987, 337863, 337039, 341966, 364455, 371457, 391290, 404059, 409635, 426641, 477577, 534487, 569900, 627099, 692155, 710087, 786074, 833008, 884784, 972305, 1057543, 1124640, 1236720, 1372938, 1537608, 1702363, 1893019, 2075430, 2270192, 2463249, 2728211, 3029873, 3466655, 3795593, 4028416, 4313908, 4746720, 5420377, 6352540, 7497307, 8975466, 10580242, 11329335, 10024484, 7585229, 5866110, 4801461, 4128349, 3590356, 3130321, 2741739, 2473341, 2240426, 2109737, 1956453, 1885790, 1812639, 1670784, 1551366, 1402913, 1236699, 1085823, 1012977, 1013157, 940926, 885274, 870791, 794053, 747205, 719504, 671553, 643481, 554816, 507858, 523190, 484613, 439576, 454570, 469331, 460830, 384182, 312895, 319577, 318654, 339452, 338292, 329417]
2166C29417j7156Q568K2929l3160p651l0818K16l0871l6573K0246j3041Q489j0895
2153B09700n466m407j6665j5125K3181j5399p74j2371j8602r160J9682J7501J8722
2140A90817r141l9311k9447J3756J2786j312k895r647k1272K1024Q918j676M749
2127A37349l5589j6697m114J9038k606J596l0272O084K331J7758J8556q009j0910
2114I4515J161l3863j0104k456L4168j48j5369j8478k9065J9820k6440M2987j569
2101E5159N302j0268o756j5610J0607r614r640M8441j7671j1525j8595J0884J8741
2088D9455j6403m643K1733k7280K5037J5521o065J5563k7423l4481q40N4825P879
2075G2878k2679l9251r842Q814q473j807M091J5099n7350J0084j6817M4117k8326
$$ y = [329417, 312261, 320829, 343758, 310598, 302947, 272129, 272345, 241474, 204901, 225147, 212106, 220595, 209700, 204234, 199827, 183162, 168037, 191218, 175819, 175045, 162674, 144072, 134912, 154594, 172095, 190817, 181676, 142365, 112918, 126674, 139460, 138148, 135253, 125606, 104334, 125358, 134276, 132600, 137349, 101760, 85063, 80949, 99987, 97381, 98977, 68705, 74789, 77120, 94878, 113434, 105425, 94515, 95676, 61813, 51709, 49253, 83421, 83273, 67904, 49426, 20361, 40181, 13741, 56728, 55159, 60461, 50193, 43437, 27827, 38434, 28820, 19180, 67621, 49950, 38425, 19830, 30714, 49455, 33052, 28409, 50142, 22862, 47899, 63420, 57355, 72918, 45495, 11014, 10174, 64999, 72878, 50199, 10948, 1106, 9920, 1447, -360, 3731, 18830, -38520, -28436, -45253, -1136, -29462]
2062b9462J0796N0457k4073J1812M0298l4015l0392j1269k5268M0401M012r210
2050e913K307J0552r19K5606m0390l85r772J292k4013K1310K7134J7902J229q978
2036A6962l0036k807J7113j5305N20J8208l4943J0507K8009K9798K1087j8910
2024D0203j3618l0285j110L5384J716J1977p211l9885k37O274J5669J7421k4321
2011A1977k2834J1560l1623k7948K1365K9484Q839j328J5731J2057j6675J1424
1999B2029O234m049n2052K0849M5204j8189q977k2458J2971j5802j6171k2297
1987e2708P549k219r828M6816R516r823M380k3141J6003j5118K114Q600j3573
1974c1432l162L4524M6772l6679j7646j6473K0146m8744p198N3762%o608m224
$$ y = [-29462, -18666, 31791, 7718, 19530, 59828, 25813, -4579, -15848, -41116, -715, 3297, -5913, -3606, 6946, 6027, 31633, -8757, -9142, -18914, -17622, -41635, -20325, 6809, 24711, 25940, 16962, -13074, -15881, 1232, -14073, -13553, 4655, -30288, -19781, 8228, 38026, 59113, 40203, 26585, -3700, -4810, 30574, 32290, 44267, 37056, -2829, -3066, 3208, 18877, 36298, 11977, -10857, 703, -30920, -58868, -37503, -8019, 820, -508, 15223, 27280, 10605, 22029, 28263, 24214, -27838, -6989, 38215, 20026, 11049, -11409, 1562, -14240, -30411, -52708, -45159, -47378, -57206, -10390, -874, -10697, -6317, -29458, -13455, -28573, -26459, -17859, -31432, -34594, -70, 46702, 10023, -7623, -24096, -3950, -52694, -59892, -6130, -6130, -12738, -16962]
1961a6962j1701j001j8210J1840N586j711O398k5007N555L3303J3920k1289M714
1948a4565N996j1395J8334K9M0681J6189n871r665j8558j3026K0497K9540n136
1935E3050k6002j5861J4398r541l9276J4815n707l1549K0833J4733j6799J5793
1923a1113k513K714J465k3193J2945R793j8912J2998M31K3946K1308l6628k4285
1910c1044K291n870k1476K5584j5917J0738K0741j7003o640O265K4227M146n016
1897h974J835r07K959j4927j1088j6943N721K0508j2928J430k2488L3316J4123
1884h363j6933j3512J7075r456k8650M0194k0377J6200J6014j9355k4943Q467
1872d3639R334k395r849K6723j8841K3493j616j0716L4056n040p594l8369l673
$$ y = [-16962, -28663, -29664, -47874, -36034, -30448, -32159, -25761, -50768, -45213, -11910, 2010, -19279, -14565, -8569, -19964, -1630, -1601, 39080, 55269, 49398, 39733, 21175, 8149, 28646, 58186, 53050, 27048, 11187, 25585, 16044, -23232, -8417, -14124, -45673, -24840, -10107, -26906, -11113, -13626, -10912, -9447, -32640, -19695, -9902, -28814, -15816, -15385, 8561, 29869, -6759, -31044, -28753, -34623, -56099, -30515, -46432, -35694, -14953, -31956, -38596, -32331, -8104, -3958, -8974, -7139, -8046, -5087, -20014, -31102, -48045, -42324, -21816, -34744, -33314, -55802, -22486, -8363, -25296, -38808, -21733, -31189, -59839, -19645, -40022, -23822, -7808, -27163, -52106, -43639, -34305, -36700, -46549, -19826, -38667, -15174, -16790, -27506, 6550, 1510, -6084, -44453, -48126]
1859d8126P050m045L059J2092j7269l983P13J1542j9738j1805K9685J4714j8897
1846d5008m8904L187K5802o349o720M0401M371J3388m934m629j7052l8765K2471
1833f2741N7091j4517l0524J2146L486k0203J4842K2116j849k5916r443K3217
1821c2295j0878K860J2342j7353J6518j4085l869J4198l1152j0207r8L6185J217
1808c6617J3027O227l9114J2923K8311l803j7770K3943q440l9339N504P113J6362
1795c1673k6579J2787J7240R087j4461k1225J3137m273p79R455J4059j9103n622
1782d7950n832J9040K5243m497j4193k3849J6562K5874M580J974j1389k1370L4595
1769a212O940k2438n1234J0776K3771O427k495j7608j7941J421J8056p067k028
$$ y = [-48126, -41076, -45121, -42062, -29970, -47239, -51222, -50509, -38967, -58705, -70510, -40825, -26111, -45008, -93912, -90725, -64923, -71272, -77992, -37591, -33220, -19832, -24766, -29395, -46447, -85212, -62741, -5650, -20167, -50691, -38545, -35059, -55262, -40420, -18304, -20153, -46069, -55512, -32295, -43173, -40313, -27971, -45324, -28806, -42891, -46760, -32562, -63714, -73921, -74019, -37834, -36617, -23590, -17363, -56477, -43554, -15243, -19046, -36816, -12873, -21313, -60652, -55148, -48035, -31673, -58252, -45465, -28225, -19138, -33599, -54824, -41687, -45960, -46739, -37284, -23225, -42328, -47950, -53782, -34742, -9499, -13996, -28189, -52038, -35476, -9602, -5022, -3048, -14437, -35807, -1212, 5728, -16710, -67944, -57168, -33397, -26970, -29465, -47073, -65014, -63593, -45537, -52604, -54632]
1756e4632M2163k2773J106j5212J9847J8112k4511r062k2417K6621p802j1970
1744f0530J6371M3161L2505j1553k0800j2590j9627j2882K4998K4672k0788K7070
1732A0007l9251p808K6072j1009Q095J6718K070q976k2920M3686J179l4334j4943
1719c1414O075l125j7042m6223J8034J0037K3245j353j1302K3112J3194m7061
1707f3823k7191L6167r823L2054J2792j2822j5674k299O37N177L1946m3345K516
1694e3688M2941j5432k1885l8103L8874J1112k8J2394R455k4080l062j3986P815
1681d7673K204K5187r716l832O258J0292k2027J561J964k647q541j5064k6218
1668h8252j2019K3248j7254n554L7376K0451J9692J4897j4595j2385j4352j6989
$$ y = [-54632, -12469, -35242, -34136, -49348, -29501, -11389, -35900, -44962, -67379, -40758, -48560, -60530, -44159, -998, 31507, 19954, -846, -13436, -33063, -45945, -20947, 3725, -17063, 10007, -29244, -37052, -10980, -21989, -13894, 2824, 4894, -4082, -27002, 16684, 17863, -16471, -31414, -25339, -28464, -45506, -91729, -73695, -63658, -40413, -41766, -53068, -29956, -16762, -63823, -91014, -54847, -64670, -32616, -19824, -32646, -48320, -50619, -49982, -44805, -12859, -56204, -53688, -10747, -26179, -48064, -86167, -47293, -36181, -36209, -23815, -14360, -38440, -41502, -55488, -47673, -45469, -20282, -29998, -33830, -27572, -17280, -39307, -37746, -35782, -38429, -46970, -62034, -88252, -100271, -77023, -94277, -99831, -62455, -42004, -22312, -7415, -22010, -34395, -48747, -65736]
1656f5736J3674O039j2756R094m640j3000j8446M0065J2444k8550K4338j2290
1644d9764j4366K2010Q984J6140m3359j2675K2353k6746k6160L4748J1602J2463
1632d4770m5720K9876O204m996J9454j1641J59N385P201L6878j7382k6129j6117
1619f1598j4536l5958M3274K6680j0801K2946J1230K1711j9105p026k5418K3930
1607b4671l9009j5444J5887J6996L416j9859j4596J9406J4380j5654Q114J4894
1595c6140J3698Q837j3417l1160O151Q909m293j645J354k4247L1515j222j4201
1582e5861L2083M574j7981R993k7700J3043J8304M348J0871l0210j6051j842K5120
1569c1309j811j731O712j3581K6341K5476k2695k4729j9241L1001l8251M28p079
$$ y = [-65736, -52062, -46023, -58779, -49685, -54325, -67325, -85771, -45706, -33262, -61812, -37474, -49764, -64130, -42120, -33136, -16996, -60355, -73030, -50677, -77423, -103583, -68835, -57233, -44770, -90490, -60614, -54410, -59406, -39952, -51593, -51434, -46049, -38848, -1970, -19352, -45481, -61598, -76134, -112092, -68818, -42138, -52939, -29993, -18763, 2948, -16157, -23183, -48601, -24671, -63680, -79124, -63237, -46241, -42825, -62684, -77280, -57874, -43494, -59148, -51034, -36140, -22442, -13605, -27022, -58182, -52031, -43122, -47415, -49060, -47706, -71953, -40438, -41660, -55861, -23778, -19204, -37185, -27192, -54892, -41849, -23545, -19197, -8326, -38536, -54587, -56429, -31309, -33120, -34851, -28139, -41720, -15379, 10097, -12598, -37327, -56568, -25567, -63818, -63390, -70469]
1556g0469J1361L8875j785r484j8558j6613K3300J4241k372j9040J7624K404K0436
1543a0080k1435j3304r514n994O330k2385J70n374L8973l0918L929K5821o361
1530e0142l728K8799j2943J0673J9621k4870M499k3317l3505J4334K970j2616
1518h0225L8267r382J5989j9560l545K7834j4211l7281j2558K9294L9670K0516
1506e192l1518p372J4126k662n947K0065p827l1708k9071M1016j5520q587K5627
1493d4570M8403J3419o0076J5127j1411j5611J5422m970J4754l4772l771O943
1481f1113K331N280K7596k3382N76J8618r361j7909J6452o496n108J7778o783
1468d1521L2735L791O733j9188k515K0041k4714l7337K6361l033j7772K4042k376
$$ y = [-70469, -59108, -20233, -22018, -31502, -50060, -66673, -43373, -29132, -31504, -50544, -32920, -30516, -10080, -31515, -44819, -54333, -60327, -53997, -76382, -76212, -81586, -42613, -73531, -69602, -43781, -50142, -53870, -25071, -38014, -27341, -7720, -32590, -28091, -51408, -84913, -70579, -67609, -80225, -41958, -51340, -35351, -54911, -58456, -30622, -44833, -82114, -94672, -65378, -25708, -5192, -36710, -44082, -29956, -32618, -38565, -18500, -26327, -58035, -87106, -46090, -61610, -70197, -44570, 3833, 17252, -42824, -27697, -39108, -54719, -39297, -44267, -29513, -64285, -68056, -61113, -58782, -53502, -25906, -49288, -48712, -30094, -39455, -57364, -40912, -47408, -52516, -34738, -41521, -8786, -4995, 1738, -17450, -19965, 76, -24638, -61975, -35614, -38647, -56419, -32377, -34753]
1455c4753k4172j4143N255J0368J3271K2235m7453q715n603K7238J1326j7533
1443f2679j3639J5126K5213J1184O088p852o824j3652m923r684p993J9138j5905
1430f6402l4494L0849M0509j1083k6823Q800L3361j9167k5040n786K4498J1538
1418c9240Q850o673k6775J7928N034J3772r734P886j6666m303L159K7305k5337
1405d4794L088j1395L0729K7003k3750j2553l2284k1823M594J4871K8112j0407
1393d8609j4533l3892M469L2431R92M8923l208P850l6202j3455J0384k3865J3777
1380e4938J7444L1493j4008l2176j171J1597J2488k7942j3873P031J6429Q977
1368c8649j3597l621N493l930O045K5787J3825N3r613q081J3645l700n50j9887
$$ y = [-34753, -58925, -73068, -67813, -57445, -44174, -21939, -69392, -78107, -83710, -56472, -45146, -62679, -76318, -61192, -35979, -24795, -18707, -26559, -33383, -47035, -51958, -61642, -69635, -50497, -66402, -100896, -70047, -29538, -40621, -67444, -58644, -25283, -44450, -69490, -75276, -50778, -39240, -30390, -37063, -63838, -45910, -40876, -27104, -36838, -28952, -45618, -49921, -46762, -19457, -44794, -41706, -53101, -22372, 4631, -19119, -31672, -63956, -85779, -81185, -66314, -38202, -48609, -63142, -97034, -92565, -60134, -59142, -10219, -13427, -5577, -41779, -55234, -44850, -68715, -54938, -37494, -6001, -20009, -52185, -53356, -41759, -29271, -57213, -71086, -64055, -47626, -38649, -52246, -55867, -50374, -54304, -48259, -22472, -8647, -8594, -18207, -26288, -12643, -16343, -16893, -36780]
1354c6780K422j0909Q645R877m3375j7795J3672K1539M4010N388m5348j4521Q875
1341e4300l774r188j114K792M2763J1688k4962j6008l064M1677j583J2988j7668
1328a9753m5775J9567J0349O484o116P288j65l2569j5051L2802J4999K0633R239
1315A932l5482k2020J2634P790k5667L5449O021M319q273J7301m1354j6897L7194
1302b7053K2077l2820k3850m240K524L1091j9057j9554O149J0909J749N069J6559
1289c0447m149l0790J8619O727O297p592O15L830J2705n301j4167l80J4517j2755
1275d2271q946J2024K0250K4714l4293R998J3627k2202Q83k2470J4247J677k0431
1262e3193J0786J2994k7073k774l0277K740J9230r953K3302J8138m2691k59L1790
$$ y = [-36780, -34358, -45267, -36622, -26745, -70120, -87915, -74243, -52704, -8694, -3306, -48654, -63175, -54300, -58074, -67262, -68376, -65584, -22821, -11133, -36095, -52103, -55167, -13490, -15073, -2085, -19753, -65528, -45961, -35612, -29128, -35244, -27956, -28121, -60690, -75741, -42939, -27940, -7307, 1932, -33550, -55570, -42936, -35146, -60813, -25364, -19343, -15024, -23297, -5996, -47350, -64247, -27053, -4976, -37796, -61646, -65886, -63362, -32271, -51328, -70882, -64733, -53824, -52075, -47006, -30447, -34596, -65386, -46767, -40040, -33743, -41335, -40720, -36890, -24185, -29486, -43653, -44033, -29516, -42271, -51217, -39193, -18943, 5771, -28522, -18524, -4897, -27099, -26216, -48686, -34439, -32762, -53193, -42407, -29413, -56486, -59260, -89537, -86797, -67567, -77520, -54218, -36080, -78771, -79030, -47240]
1249d7240n2611J656K7486M7219r769j4222J6952L310k349n621R626j1545J1173
1236b5935o489K8562j3699r850p543J9269J1244j6033k3916l0060K3932K6868
1224b3650j4748J2986P400j8486J9459m5955N744K8775j0883K9701j2804j3753
1212c6214o375l0314L4840L5459l0840j3708K9419k8989j8934L4159n593l0187
1200f7277J3927P875L803J1445m796l73q312K1763n189j1872M13J4440Q452k4919
1186d0620N253K4946j3690k8227N084L6036J0940p745j6431q985J7764n776r957
1173c1408K0030J5306n4399M252l269j0140k175l4491K0616L0626J000l016Q31
1160d6237J4279J1877j703J0127j8679k313l960L7586K1348n2178o253Q53k7623
$$ y = [-47240, -99851, -98195, -70709, -23490, -33259, -47481, -30529, -27219, -29568, -35189, -25563, -37108, -25935, -32424, -3862, -17561, -27411, -34954, -15685, -4441, -20474, -44390, -74450, -50518, -23650, -38398, -25412, -18012, -36498, -17039, -62994, -57250, -28475, -39358, -9657, -22461, -36214, -42589, -72903, -38063, -2604, -33444, -47152, -17733, -46722, -65656, -31497, -37090, -67277, -53350, -45475, -41672, -30227, -35023, -35396, -43708, -21945, -27134, -39006, -38593, -24153, -15701, -40620, -35367, -10421, -24111, -52338, -47254, -11218, -278, -8023, -24454, -33439, -15675, -21451, -31408, -11378, 3928, -50471, -46219, -49488, -59628, -61803, -96294, -75678, -45052, -44052, -47068, -46237, -31958, -20081, -21784, -11657, -30336, -32649, -36609, 977, 22325, -29853, -36106, -35253, -62876]
1147f2876J1089K922j2126J5037J3238K716j3918j3054L0305J6226m3097k3906
1135g7444j5514M5372K8618J2902j3267j1115j451M140J0069N266j4779R586l7450
1122e5067k1577J0930K180J1796N371j6451L2070L6362J2220r741j7178k4110
1110c3195L0819q039l1461m929K0530K1544j0478l8913o874L421j7894j2047J6862
1097g0654J8938K5305L163l8949K4931k1175j5647K169J3320K63L6583K4425p63
1084A909j6470R599k8746J6397O833k8012j3577M578L3944J1777m2354j9603L3726
1071b9999o389j4898J65J6062J3336J5710J8459k3536j1188k3205L199K1642o763
1058b7405k0858p396K4495O785m1174K0106p993r311J2291J3365k1868j3451K5238
$$ y = [-62876, -51787, -48865, -60991, -45954, -32716, -30000, -43918, -56972, -26667, -10441, -53538, -77444, -92958, -47586, -18968, -6066, -19333, -30448, -31899, -27759, -17690, -12424, -27203, -17617, -55067, -76644, -65714, -63534, -51738, -46367, -62818, -30748, 5614, 17834, 8093, -9085, -33195, -2376, -10415, -41876, -46805, -26275, -4731, -15209, -54122, -60996, -57575, -75469, -87516, -70654, -51716, -26411, -23248, -62197, -37266, -58441, -74088, -71919, -58599, -58336, -21753, 2672, 1909, -14561, -4962, -33708, -17311, -10478, -38490, -52067, -47489, -13545, -1768, -44122, -63725, -29999, -36388, -51286, -51121, -35059, -21723, -6013, 12446, -11090, -22278, -45483, -42284, -20642, -27405, -48263, -55659, -31164, -24379, -65553, -45447, -53440, -62751, -50460, -37095, -58963, -72414, -47176]
1045d7176L0830k8517L513J6510j639o853N703l731K6810j1008p17P310j4662
1032b3627p725R947l1725k2449J7502K8609K3565l396j249j4595q843J0530K3136
1019c20j1900j2022l8374k692J2047K3469J7489K429j0814r360K617k4417q847
1006f0695L6442k5067M6960J9423R505n2413J9047q204J723p737J1007j4904l481
993b8394K0219l736K0037l7599L6694j2583k453J18j4492J2501j2597n085P108
980b0262L8294j5500p865l034m3671K616K1233n548q843j5627M630M9838m568
967h307l8081k4535J0238M6605L3961N011k5979R882k9555r006J0523j0874J5014
954a5103j2334K0888p155l6942L737L3768j9834J4622J9785J4992m853j6295L223
$$ y = [-47176, -16346, -44863, -41350, -24840, -26479, -33332, -27629, -31360, -4550, -15558, -16275, -8965, -23627, -31352, -21405, -53130, -75579, -58077, -29468, -5903, -9299, -10548, -25143, -33986, -23456, -320, -12220, -24242, -62616, -65308, -53261, -29792, -12303, -9874, -20688, -30048, -27431, -51848, -60695, -24253, -49320, -2360, 17063, 26568, -25845, -6798, -15002, -13279, -21016, -10009, -24913, -28394, -8175, -11911, 8126, -29473, 7221, -5362, -7815, -7697, -22189, -9688, -22285, -27370, -20262, 18032, 2532, -5333, -8367, -52038, -49422, -28189, -33737, -42580, -58207, -53577, -3739, -8307, -46388, -70923, -60685, -14080, 19881, 24892, -1087, 8795, -20760, -29766, -19243, -30117, -15103, -27437, -6549, -13704, -50646, -46909, -13141, -32975, -18353, 1432, 16424, 11571, -4724, -1501]
941a501J8847j6670l0162K6940j5453j1654j857K4830O469k4868j1357k5460K3024
928c8872N2565o276j8363j5758j3035K3249M532k2372k0683j869J956k1907M3586
915c3247K5530j4723j4137Q47P233K0464o495j5671J2888k2663p606M035m851
902d8396L8027L2480j1541j6984k0895J61K0073m969K066k188k441j0472k3197
889d8276l182j4173L147K080M1629J6497J7520k8537Q046j6052k8832r3L6993
876a3233j7321Q587J4866j2135P336j0731j1903J2478M2456j7941Q999p462o298
863b302n298j9286n540K7230k4527j5652J9109o8K9614k907k8996J6491k4738
850c6870j708K6344k0327j428l074k683k3099J9539j562J9521L8962L0376o631
$$ y = [-1501, 17346, 676, -29486, -2546, -17999, -29653, -31510, -6680, -211, -25079, -36436, -61896, -38872, 13693, 7417, -10946, -26704, -39739, -16490, -11958, -34330, -55013, -56882, -54926, -76833, -33247, -7717, -22440, -36577, -35730, -28497, -8033, -14528, -30199, -17311, -39974, -47580, -43545, -48396, -10369, 22111, 10570, -6414, -27309, -27148, -7075, -12044, -9978, -12166, -14607, -25079, -48276, -51458, -65631, -62484, -60404, -18775, -2278, 15242, -13295, -5249, -21301, -50133, -50226, -13233, -30554, -21967, -7101, -19236, -11900, -22631, -34534, -22056, 20400, 2459, 11458, 3996, -2302, -7600, -26886, -32426, -5196, -29723, -45375, -26266, -26334, 3280, 373, -28623, -12132, -36870, -38578, -12234, -32561, -33989, -37063, -39746, -62845, -43306, -44868, -25347, 13615, 43991, 37360]
837C7360k7747j0102L169k353n518o82J6478q758k0952j06l572j0342K5182j2983
823b0926R176L4625m3302K7453J8958m4738P350J2237j8433M700K3659m920p304
810a465R707q176K459k1255m565N614K3446j1404L6467N855n7165R483n862q458
796b5319J4649K5718L0978m9281k6649j6637R529J5781K394j6928r763n779k89
783e1596j001K3094L9505K4077q087k6841r333r754j9640R771J3322l644k5698
770d5825K5676l6557l421r86l068L3811K5732k6743r624J8353K5147J5098l460
757A4133m2697j9801K6561J966j0849j9285K2116L1503j1174n095l43J3786L2393
744C3214l9476k5531j4644J5534k2899K7876J6661K7539l4087m771J966k280o242
$$ y = [37360, 9613, -489, 2680, 327, -5191, -5873, 10605, 1847, -19105, -19211, -22783, -33125, -7943, -20926, -11750, 22875, -20427, 7026, 25984, -18754, -11404, 833, -17600, -12900, 10759, 5839, -1465, 8242, 66, 2525, -18730, -23295, -17681, 5765, -5639, 30828, 36683, -20482, -10999, -16861, -25319, -10670, 15048, 46026, -3255, -29904, -46541, -37012, -21231, -18837, -35765, -45528, -51307, -51596, -52597, -29503, 10002, 34079, 25992, -849, -10182, -19936, -39576, -29805, -16483, -20127, -45825, -20149, -56706, -60127, -61113, -64181, -30370, -4638, -31381, -41005, -22652, 2495, 17593, 14133, -28564, -48365, -21804, -19838, -30687, -49972, -27856, 3647, -7527, -12622, -12965, 821, 33214, -6262, -31793, -46437, -30903, -53802, -25926, -9265, 18274, -15813, -20584, -18618, -20898, -27140]
731b7140K563j698K3018J853l7426J9456J9633o725J3019M612Q623k2386k1528
718b4126k9977K3953k0167R769J3840K4500K1788k4950o789l2495J3158J8084
706a3412l795R742K0875J895J1576k5631k1291J2837K083L4627k168k1713j4775
693i150k208j6522q089L0908n528J0299M220J6607K414R990j2064j5216o222J4333
679A3772L738j7029k4285o476j2271M2298Q260j825J8924k255k6078N777k0069
666a7519k0280L5330K5995l6204L3682J0787m0745k1090l765J9687Q041o680K0697
653G936R84L12K8781j6974j605l344J1464p08j8631j9745O220J1003k6058k047
639b2412J0299K7494r871j1604K0823l212k5423j9932K6182p394k2900J2982M2775
$$ y = [-27140, -24577, -26275, -3257, -1404, -38830, -19374, 259, -6466, 6553, 11165, 19788, -2598, -24126, -54103, -30150, -50317, -40548, -26708, -2208, 19580, -5370, -12159, -44654, -31496, -13412, -17207, -7465, 13410, 15305, 26881, 1250, -20041, -7204, -5121, 29506, 27338, 5625, -9150, -11358, -27880, -35969, -5061, -10589, -290, 3930, 20537, 22951, 32941, 20877, 5661, -561, 13772, 17510, 481, -23804, -30280, -42551, -253, 8007, 6182, 25106, 22851, -3227, 2550, -17519, -37799, -2469, 23526, -12678, 21004, 31791, -8954, -30044, -33809, -14122, -6081, -12761, 7936, 8920, 9232, 38013, 21039, 19434, 16090, 27554, 26846, 8215, -11530, -5310, 5693, -20365, -22412, -12113, 15381, 5510, -6094, 14729, 11517, -13906, -33838, -7656, -15050, -37950, -24968, 17807]
626A7807k351j4796j3354J7565l2548m904R836O012J0603k9287O31J8865j9361
613c5282J5762K6656j2903p031Q212K1884L175J858k6398j3926J4976J5161j2191
600d7k283K2211j5486J0451M068N592J6839k816k0923j1313J9954N137r984k8611
586g211j1305R296K4963K5030l916r656J5095m933m5443p802N7170l7191q142
573d045J2196l7222L0595k071j3036K2133M295R75J1967J4972R655j9616m4327
560a3529j2766L5046J7968l7581k7531J9M3647L4603L044K5763l1841p897R881
547C8826n885J3053J0274l6976M515R696k4932j1189J2389l157j9857M407K464
534f372m496L9724Q664r852K3837n070j9561J3476J9682k8658R687K592j6421
$$ y = [17807, 15456, 660, -12694, 4871, -27677, -32581, -22745, -16733, -6130, -35417, -34786, -15921, -35282, -19520, 7136, -5767, -12798, -4586, 17298, 20473, 22331, -4067, -17993, -3017, 12144, -47, -2330, 19881, 4395, 14846, 18914, 24506, 41345, 38529, 17606, 6293, 26247, 31384, 21400, -7211, -18516, -9220, 15743, 40773, 36857, 27201, 42296, 37363, -8080, -15882, 41288, 4097, -4045, 8151, -29071, 1524, -547, -13583, 8550, 12845, 13820, 25787, 40759, 50414, 30798, -13529, -26295, 8751, 26719, -10862, -38393, -38374, 5273, 39876, 42920, 68683, 36842, 28945, 38826, 32941, 45994, 56268, 19292, 23807, 33503, 8571, -2618, 9771, 6614, -13243, -8836, -6372, -10868, 28856, 37520, 27668, 51505, 46435, 26874, 40350, 60032, 31374, 41061, 43653, 27232]
521B7232K6920L7833l4028r296m7019q488K76J5922k2442m381K2042j1154J3666
508G083l8331J2361M1761J4457j8958j9909P234M365K337j6677o815N1674r248
495C1334K2099k5206K8489L636k5267J3985l7044j6708J5817L0586j9850j5917
483E954l364K9598j7176p230K5788j2310r833k2663k1639j0800J2860J9173L8807
470B7165J5785m0126K296N694R930R864M119q667J0036J4525k6431j411K3165
457D5944l4164r330J371P538K5821r06j7173J4498p027k1189J80n070J587j0906
443h826K1398j3305N080l841J9080l089J0203j2460J3288J4629K219r055K0717
430E6038r822j2803j5016l7241L3903J1410p943P927P841k4574K3971J033l4696
$$ y = [27232, 54152, 91985, 57957, 48661, 1642, -6846, -6570, 9352, -13090, -17471, 4571, -6583, 7083, -31248, -18887, 22874, 37331, 18373, -1536, 5698, 10063, 12400, -4277, -11092, 40582, 31334, 53433, 28227, 56716, 60352, 35085, 49070, 12026, -4682, 11135, 41721, 21871, 5954, 2590, 32188, 15012, 7782, 33570, 21260, 11427, -11236, -32875, -43675, -30815, -11642, 27165, 42950, 2824, 5120, 10814, 20744, 30608, 34727, 26060, 36096, 50621, 24190, 22779, 45944, 11780, 2450, 3821, 11359, 37180, 36274, 19101, 33599, 26572, 5383, 5563, 493, 2080, -8826, 12572, -733, 4347, 506, 19586, 16497, 26700, 14240, 27528, 42157, 44376, 35321, 56038, 46216, 33413, 18397, -18844, 15059, 26469, 18526, 26453, 34294, 9720, 33691, 34724, 28]
417B8R831K3661j375L2626l0725m6800O654N4777l102j5878j9067j348j7124J894
403e948J4249K859p220j4717R948J3579L0628r818Q158K230k9035K8130j2314
390C0729R167j356k8187k5160Q65m200r871J1534L0542N126m215k050r492K2202
376B5634k1664j2277J5878O600P630j4579k206N7217j4986r379k2814j8219J8154
363A4989p800J5037Q324L812K46l9849K7912k019P88J5391m1320Q840M2461J3255
349F0067j9670l1488l485M747L0191n982Q47o253o550j0448N188j495J6628o03
335C1694m289R692k2783J0403K4109k5324j1006J3191O420j344J119J3133q413
322C6602J451j9507j4306J5260J3599P790J6108k5175j7092K3258m720J0437M398
$$ y = [28, 9859, 33520, 32145, 64771, 34046, -12754, -6100, 48677, 45575, 29697, 10630, 9282, -7842, -5948, 8301, 11160, 3940, -10777, -829, 12750, 43378, 33560, 41718, 43948, 14913, 43043, 30729, 39896, 38540, 10353, -14807, -13942, -18142, -28013, -16479, 14063, 19189, 14974, 12924, 3432, 25634, 3970, -8307, 7571, 14171, 21801, 7222, 5016, 62233, 47247, 37868, 15054, -3165, 14989, 7189, 22226, 30550, 34362, 34608, -5241, 22671, 20652, 21440, 36831, -4489, 4351, 46812, 60067, 40397, 8909, 5424, 10171, 40362, 34380, 35227, 28974, 22424, 11976, 17164, 15669, 32297, 31694, 27405, 37097, 14314, 24717, 48826, 23502, 12496, 25687, 32107, 30763, 31882, 45015, 36602, 38053, 18546, 4240, 19500, 33099, 40889, 56997, 31822, 14730, 37988, 33268, 43705, 48103]
309D8103l4178J4553j1295p451J7925k2113m607j598M882L6073K968J2166j884
296E3544k6957j413L2777M956k5570l1096k261J1641j504j8653K4498K1756j9702
283B2016m155l9115O161J6695J6069N706Q538J5475k0762n634K7416J9280l4047
270C3643L813m678q548K6472k795j1053J5769l1840N296j3550j1819K898K8802
257C2410J6660k8575l1820J5725J4972J6856o563l1674K8575L959J7114M0381
245H8020j6764k0999K0557k5478N676l46j021k224J0949j6556k4581P900L4138
232E9271J8031j1617r833j1474l3668m63K1164K817j0918j4116P306J0945q836
219A8609P991k7993j7434J9909J2369J337j2989J9099K017K3421N3749n528n021
$$ y = [48103, 13925, 28478, 17183, 9732, 27657, 5544, 937, -661, 4221, 40294, 43262, 55428, 53544, 26587, 25174, 57951, 62907, 37337, 6241, 3980, 15621, 14117, -4536, 19962, 41718, 22016, 17861, -21254, -15093, 1602, 17671, 23377, 31915, 47390, 26628, 20994, 48410, 67690, 33643, 37456, 32778, 24230, 50702, 47907, 36854, 52623, 20783, 26079, 12529, 710, 3608, 32410, 49070, 20495, -11325, 4400, 19372, 36228, 29665, -2009, 26566, 30525, 47639, 88020, 71256, 50257, 70814, 45336, 51012, 50666, 49645, 47421, 58370, 41814, 17233, 25133, 59271, 77302, 65685, 55852, 44378, 10710, 10247, 31411, 34228, 23310, 9194, 16500, 27445, 18609, 26600, -1393, -18827, 1082, 13451, 14788, 1799, 20898, 22915, 46336, 100085, 94557, 89536]
206H9536k229l7922J5140K242j4160K7442J344l1906J1420j0249K523l6214p3
193A6894K653q74K502J3705N9287k4034R912m932o016j7882m086j2382q678K1541
179D7610K1111L6099k9325q660L0011J1584j8408j5206j9499L3231J533K2547
167A12628k8466k1791n457j7871J6305p129J5368q517L438J3967J2200J815j9126
154F7364L679J9602k7122L082R967j5073J1776n097q574j092J3576O221J5682
141I3991L1768o1441j3953K9517j3353j0602j2546j1270K1447j7638J4581J4818
129F5319J128n452L1597k0295l833j219R525K1716j063q983j264j9050k3350K929
115D7705J0806K1219j5435O623K9759J1739k3701P307M24k2022N109M900M915
$$ y = [89536, 87307, 49385, 64525, 66767, 52607, 80049, 81393, 49487, 60907, 50658, 53181, 16967, 16894, 19547, 18673, 21175, 34880, 94167, 70133, 80045, 75113, 69097, 51215, 47129, 34747, 26069, 47610, 68721, 104820, 75495, 66835, 96846, 108430, 90022, 74816, 55317, 88548, 90081, 112628, 84162, 62371, 56914, 39043, 55348, 48219, 63587, 55070, 58508, 72475, 84675, 86490, 67364, 71043, 90645, 63523, 66605, 76572, 61499, 73275, 68178, 59604, 58512, 72088, 78309, 93991, 125759, 64318, 50365, 79882, 66529, 55927, 43381, 32111, 53558, 35920, 50501, 65319, 66447, 60995, 92592, 72297, 68464, 67245, 76770, 98486, 97423, 88440, 87176, 68126, 44776, 47705, 58511, 79730, 64295, 70918, 100677, 112416, 88715, 96022, 96446, 74424, 79533, 84433, 89348]
102H9348m138L95M4505k7400j7818J1738Q968K3418k2992Q888P760N294j7955
89A10011j3679m184l7025M6161j0481M22n657j0418K5591L8561l687k4015K8730
76A40330j5071j0707M33q489l852J771j2533m2908l045K2926L4324R774J1560
63A24513r756P40Q958k1435J1677K3750j6170k015o337r06J7578J3823j8463k1525
49A04432K1558J8245j8770K2857j4835k0980J556j9673L0354R895r55r097J7179
36A41766J589R607k872P877J0259k3000n2r420P672j3467j839P683R928p456P634
21A45909k630k417J9449r77m96p920o782j0184L0464L311k8086j7716J9739J3770
7A55434j1219n644J6359M608K5021j1543p474
$$ y = [89348, 85210, 85605, 130110, 102710, 84892, 96630, 105598, 129016, 106024, 114912, 122672, 127966, 110011, 96332, 92148, 55123, 101284, 90803, 91225, 85568, 75150, 100741, 139302, 135615, 111600, 140330, 125259, 114552, 114985, 106496, 102644, 104415, 91882, 48974, 45929, 68855, 103179, 112953, 124513, 114757, 115497, 124455, 103020, 114697, 138447, 122277, 120262, 113925, 113019, 130597, 144420, 125957, 104432, 125990, 144235, 125465, 148322, 133487, 112507, 114063, 94390, 124744, 134639, 133684, 124587, 141766, 143355, 152962, 150090, 157967, 168226, 145226, 145174, 135754, 143426, 129959, 128120, 135803, 145731, 138275, 145909, 143279, 140862, 160311, 159334, 158838, 150918, 144136, 133952, 164416, 167727, 139641, 121925, 141664, 155434, 144215, 138571, 154930, 159538, 184559, 173016, 165542]
0A65542
$$ y = [165542]
$$ Imaginary data points
##PAGE= N=2
##DATA TABLE= (X++(I..I)), XYDATA
16383a251470L6004J6097P967K5787M253J6252K1757P947M5715J6384N238K3784
16371a024285K5743L901L5783K0252n62J0371j1862K0758J5334L685K7401L1361
16359h42120m513K9033K9335J2564j7468R758J9788L6818K8749J1499K9387k630
16347f59800Q242L4874J2841P529K8019L8041J3290k3191J545K0805M6057J195
16335d70553Q876L8850K1007J764J5070J6902O277K4862K8425O380R21J5156K4449
16322b61614K1615k5229N436K2773K6608L6236O158M973M1749J2622Q632J5089
16310h4952L4812J7290k1364P270K5889K6993j1147K0975K3049K3842P106L3470
16298A03233M573J4831K2104j9934J5786M1323o564j6067L2940L2025N733J075
$$ y = [-1251470, -1215466, -1199369, -1191402, -1165615, -1161362, -1145110, -1123353, -1115406, -1069691, -1053307, -1048069, -1024285, -998542, -994641, -958858, -938606, -939168, -928797, -940659, -919901, -904567, -900882, -873481, -842120, -846633, -817600, -788265, -775701, -793169, -783411, -763623, -726805, -698056, -686557, -657170, -659800, -651558, -616684, -603843, -596314, -568295, -530254, -516964, -540155, -538610, -517805, -471748, -470553, -461677, -422827, -401820, -400056, -384986, -368084, -361807, -336945, -308520, -302140, -301219, -286063, -261614, -239999, -265228, -259792, -237019, -210411, -174175, -168017, -163044, -121295, -108673, -100041, -84952, -50140, -32850, -54214, -46944, -21055, 5938, -5209, 15766, 38815, 62657, 69763, 103233, 107806, 122637, 144741, 124807, 140593, 181916, 175352, 159285, 192225, 224250, 229983, 231058]
16286B31058K0258m632J5661K6227J8992J2519J6686O659l854J427K5377J6828
16274C83206o333n75L4653J4057K0600K5211K45p494q710K6262J3571K873J6731
16261E14297J1435L7017O479j0630J8158J4689P937N991o538J5605J8009L588
16249F36037M0879L629J63j5032J2142K629K0826o748k666K5126J6818k3939J9031
16236G28895N5008J2499m382J8817J64j166J2129J8148R505r041k882j3327J3699
16223H38066M0358n729l6255N78L2818K2073j1209L3408k5462J4316M5373K712
16211I51047k375K1058P050J2900j0139k5729l3493M2285J0093K648K7139j427
16199A001057K278J3098L8167j5222l361K6687J4032o530J9496K5042J3871k5038
$$ y = [231058, 251316, 246684, 262345, 288572, 307564, 320083, 336769, 343428, 339574, 341001, 366378, 383206, 376873, 376298, 410951, 425008, 445608, 470819, 471064, 463570, 454860, 481122, 494693, 497566, 514297, 525732, 562749, 569228, 558598, 576756, 591445, 599382, 605373, 598835, 614440, 632449, 636037, 676916, 680545, 680708, 665676, 677818, 680447, 701273, 694525, 691859, 716985, 733803, 709864, 728895, 783903, 796402, 792020, 810837, 811001, 809835, 821964, 840112, 849617, 840576, 837694, 824367, 838066, 878424, 872695, 836440, 837018, 869836, 891909, 880700, 914108, 888646, 902962, 948335, 951047, 948672, 969730, 976780, 989680, 979541, 953812, 920319, 962604, 972697, 975345, 1002484, 1001057, 1003335, 1016433, 1054600, 1039378, 1036017, 1062704, 1076736, 1070206, 1089702, 1114744, 1128615, 1103577]
16187A103577j1722L1147k698l8915J8117J125l8044j110J5274J2998K6954J6806
16175A133509k170r203K1274J0715L028J635q004J8999k6871L1766J0811j3432
16163A172057J0876P095P49L4747Q043m0605O818j7053j433K0652J1560j3637
16151A199869K0348K6779k1749m911K9440R242j0073L1688J5834k0350j6159L5649
16139A295607J8520k0683p979j5518R821n183k9491L1540O825o011m100j1934
16127A261414J6578j6594J7922n130K9225L0058j1883j7149K3809m667k2599K4740
16115A325724J1839L273J320R261j9995k8479J018N2494o167k5916J0793j1814
16103A323351j6982J5404J6108J2832p827J4325j4115K2751K8172j8654k1598
$$ y = [1103577, 1091855, 1123002, 1120304, 1081389, 1099506, 1100631, 1062587, 1061477, 1076751, 1089749, 1116703, 1133509, 1131339, 1122136, 1143410, 1154125, 1157153, 1158788, 1150784, 1169783, 1142912, 1174678, 1185489, 1172057, 1182933, 1190028, 1190777, 1225524, 1233567, 1192962, 1199780, 1182727, 1181294, 1201946, 1213506, 1199869, 1220217, 1246996, 1225247, 1220336, 1249776, 1259018, 1248945, 1280633, 1296467, 1276117, 1259958, 1295607, 1314127, 1293444, 1285465, 1269947, 1279768, 1274585, 1245094, 1276634, 1283459, 1277448, 1273348, 1261414, 1277992, 1261398, 1279320, 1274190, 1303415, 1333473, 1321590, 1304441, 1328250, 1323583, 1300984, 1325724, 1337563, 1340836, 1342156, 1351417, 1331422, 1302943, 1303961, 1356455, 1350288, 1324372, 1335165, 1323351, 1306369, 1321773, 1337881, 1350713, 1342886, 1357211, 1343096, 1365847, 1394019, 1375365, 1353767]
16092A353767K2611L302o747K4689r661m93j0707J642Q347l980m394K9021k108
16079A405289l1251K1155K706l9402K7171k995k8921K2007J2463J5619l2924j5129
16067A355788N498K7915j2006j0440K0192J489k9374O672K0495j1293J1209P710
16055A393855j2978j4196l864l5251M5382m263o551L90R155j5365M5551k1061
16043A380804q353N306l6495K4320k3162R353J0559J0721K4369j4621Q56K5314
16031A408971K7839l8585k421P942j6369l456L6862J8256k7189k7712j9936J9146
16019A383348j7092P880J5365J1970L9558j402j7510K6632P781o633k3430k9544
16007A396923j2592k5948o980N0969N3415k6488k2753P714o398j4078J933M507
$$ y = [1353767, 1376378, 1379680, 1372933, 1397622, 1387961, 1387468, 1376761, 1378403, 1386750, 1382770, 1378376, 1407397, 1405289, 1374038, 1395193, 1397899, 1358497, 1385668, 1382673, 1353752, 1375759, 1388222, 1403841, 1370917, 1355788, 1361286, 1389201, 1377195, 1366755, 1386947, 1388436, 1359062, 1365734, 1386229, 1374936, 1386145, 1393855, 1380877, 1366681, 1362817, 1327566, 1372948, 1368685, 1362134, 1362524, 1371679, 1356314, 1401865, 1380804, 1372451, 1377757, 1341262, 1365582, 1342420, 1351773, 1362332, 1373053, 1397422, 1382801, 1383657, 1408971, 1436810, 1398225, 1395804, 1403746, 1387377, 1383921, 1420783, 1439039, 1411850, 1384138, 1364202, 1383348, 1366256, 1374136, 1389501, 1401471, 1441029, 1439627, 1422117, 1448749, 1456530, 1449897, 1426467, 1396923, 1384331, 1358383, 1351403, 1402372, 1455787, 1429299, 1406546, 1414260, 1407862, 1393784, 1395717, 1400224]
15995A400224M766K6468q537j5219l1519N260m524K2468J3971m074j8314r231
15983A381739j3777Q534M0799R323k5099Q880j0304J3501l3198j7268K0634N1583
15971A435347j801l7510J1438k3089j2084J6968L3323j825j7317k7961l895M5459
15959A417053J610oj5248m136q833K404K9136j1943J1732j8424j0014L2726J2237
15946A438294l0019j0400P139J6782n664l394j8014K4068K3546j7783j0572K0505
$$ y = [1400224, 1404990, 1431458, 1422921, 1407702, 1376183, 1381443, 1376919, 1399387, 1413358, 1409284, 1390970, 1381739, 1367962, 1376496, 1417295, 1426618, 1401519, 1410399, 1400095, 1413596, 1380398, 1363130, 1383764, 1435347, 1433546, 1396036, 1407474, 1384385, 1372301, 1389269, 1422592, 1420767, 1403450, 1375489, 1371594, 1417053, 1418663, 1418657, 1403409, 1399273, 1390440, 1392844, 1421980, 1410037, 1421769, 1403345, 1393331, 1426057, 1438294, 1408275, 1397875, 1405014, 1421796, 1416132, 1412738, 1394724, 1418792, 1442338, 1424555, 1413983, 1434488]
$$ [...]
##END NTUPLES=NMR SPECTRUM
##END=
